lucene-dev mailing list archives

Site index · List index
Message view « Date » · « Thread »
Top « Date » · « Thread »
From Policeman Jenkins Server <jenk...@thetaphi.de>
Subject [JENKINS] Lucene-Solr-6.x-Solaris (64bit/jdk1.8.0) - Build # 39 - Still Failing!
Date Tue, 29 Mar 2016 00:37:50 GMT
Build: http://jenkins.thetaphi.de/job/Lucene-Solr-6.x-Solaris/39/
Java: 64bit/jdk1.8.0 -XX:+UseCompressedOops -XX:+UseParallelGC

1 tests failed.
FAILED:  org.apache.solr.core.TestArbitraryIndexDir.testLoadNewIndexDir

Error Message:
Exception during query

Stack Trace:
java.lang.RuntimeException: Exception during query
	at __randomizedtesting.SeedInfo.seed([6A3168754C350B07:836BD34DD2AC9BAF]:0)
	at org.apache.solr.SolrTestCaseJ4.assertQ(SolrTestCaseJ4.java:765)
	at org.apache.solr.core.TestArbitraryIndexDir.testLoadNewIndexDir(TestArbitraryIndexDir.java:107)
	at sun.reflect.NativeMethodAccessorImpl.invoke0(Native Method)
	at sun.reflect.NativeMethodAccessorImpl.invoke(NativeMethodAccessorImpl.java:62)
	at sun.reflect.DelegatingMethodAccessorImpl.invoke(DelegatingMethodAccessorImpl.java:43)
	at java.lang.reflect.Method.invoke(Method.java:498)
	at com.carrotsearch.randomizedtesting.RandomizedRunner.invoke(RandomizedRunner.java:1764)
	at com.carrotsearch.randomizedtesting.RandomizedRunner$8.evaluate(RandomizedRunner.java:871)
	at com.carrotsearch.randomizedtesting.RandomizedRunner$9.evaluate(RandomizedRunner.java:907)
	at com.carrotsearch.randomizedtesting.RandomizedRunner$10.evaluate(RandomizedRunner.java:921)
	at com.carrotsearch.randomizedtesting.rules.SystemPropertiesRestoreRule$1.evaluate(SystemPropertiesRestoreRule.java:57)
	at com.carrotsearch.randomizedtesting.rules.SystemPropertiesRestoreRule$1.evaluate(SystemPropertiesRestoreRule.java:57)
	at org.apache.lucene.util.TestRuleSetupTeardownChained$1.evaluate(TestRuleSetupTeardownChained.java:49)
	at org.apache.lucene.util.AbstractBeforeAfterRule$1.evaluate(AbstractBeforeAfterRule.java:45)
	at org.apache.lucene.util.TestRuleThreadAndTestName$1.evaluate(TestRuleThreadAndTestName.java:48)
	at org.apache.lucene.util.TestRuleIgnoreAfterMaxFailures$1.evaluate(TestRuleIgnoreAfterMaxFailures.java:64)
	at org.apache.lucene.util.TestRuleMarkFailure$1.evaluate(TestRuleMarkFailure.java:47)
	at com.carrotsearch.randomizedtesting.rules.StatementAdapter.evaluate(StatementAdapter.java:36)
	at com.carrotsearch.randomizedtesting.ThreadLeakControl$StatementRunner.run(ThreadLeakControl.java:367)
	at com.carrotsearch.randomizedtesting.ThreadLeakControl.forkTimeoutingTask(ThreadLeakControl.java:809)
	at com.carrotsearch.randomizedtesting.ThreadLeakControl$3.evaluate(ThreadLeakControl.java:460)
	at com.carrotsearch.randomizedtesting.RandomizedRunner.runSingleTest(RandomizedRunner.java:880)
	at com.carrotsearch.randomizedtesting.RandomizedRunner$5.evaluate(RandomizedRunner.java:781)
	at com.carrotsearch.randomizedtesting.RandomizedRunner$6.evaluate(RandomizedRunner.java:816)
	at com.carrotsearch.randomizedtesting.RandomizedRunner$7.evaluate(RandomizedRunner.java:827)
	at com.carrotsearch.randomizedtesting.rules.StatementAdapter.evaluate(StatementAdapter.java:36)
	at com.carrotsearch.randomizedtesting.rules.SystemPropertiesRestoreRule$1.evaluate(SystemPropertiesRestoreRule.java:57)
	at org.apache.lucene.util.AbstractBeforeAfterRule$1.evaluate(AbstractBeforeAfterRule.java:45)
	at com.carrotsearch.randomizedtesting.rules.StatementAdapter.evaluate(StatementAdapter.java:36)
	at org.apache.lucene.util.TestRuleStoreClassName$1.evaluate(TestRuleStoreClassName.java:41)
	at com.carrotsearch.randomizedtesting.rules.NoShadowingOrOverridesOnMethodsRule$1.evaluate(NoShadowingOrOverridesOnMethodsRule.java:40)
	at com.carrotsearch.randomizedtesting.rules.NoShadowingOrOverridesOnMethodsRule$1.evaluate(NoShadowingOrOverridesOnMethodsRule.java:40)
	at com.carrotsearch.randomizedtesting.rules.StatementAdapter.evaluate(StatementAdapter.java:36)
	at com.carrotsearch.randomizedtesting.rules.StatementAdapter.evaluate(StatementAdapter.java:36)
	at com.carrotsearch.randomizedtesting.rules.StatementAdapter.evaluate(StatementAdapter.java:36)
	at org.apache.lucene.util.TestRuleAssertionsRequired$1.evaluate(TestRuleAssertionsRequired.java:53)
	at org.apache.lucene.util.TestRuleMarkFailure$1.evaluate(TestRuleMarkFailure.java:47)
	at org.apache.lucene.util.TestRuleIgnoreAfterMaxFailures$1.evaluate(TestRuleIgnoreAfterMaxFailures.java:64)
	at org.apache.lucene.util.TestRuleIgnoreTestSuites$1.evaluate(TestRuleIgnoreTestSuites.java:54)
	at com.carrotsearch.randomizedtesting.rules.StatementAdapter.evaluate(StatementAdapter.java:36)
	at com.carrotsearch.randomizedtesting.ThreadLeakControl$StatementRunner.run(ThreadLeakControl.java:367)
	at java.lang.Thread.run(Thread.java:745)
Caused by: java.lang.RuntimeException: REQUEST FAILED: xpath=*[count(//doc)=1]
	xml response was: <?xml version="1.0" encoding="UTF-8"?>
<response>
<lst name="responseHeader"><int name="status">0</int><int name="QTime">6</int></lst><result name="response" numFound="0" start="0"></result>
</response>

	request was:q=id:2&qt=standard&start=0&rows=20&version=2.2
	at org.apache.solr.SolrTestCaseJ4.assertQ(SolrTestCaseJ4.java:758)
	... 41 more




Build Log:
[...truncated 10534 lines...]
   [junit4] Suite: org.apache.solr.core.TestArbitraryIndexDir
   [junit4]   2> Creating dataDir: /export/home/jenkins/workspace/Lucene-Solr-6.x-Solaris/solr/build/solr-core/test/J0/temp/solr.core.TestArbitraryIndexDir_6A3168754C350B07-001/init-core-data-001
   [junit4]   2> 46200 INFO  (SUITE-TestArbitraryIndexDir-seed#[6A3168754C350B07]-worker) [    ] o.a.s.SolrTestCaseJ4 Randomized ssl (false) and clientAuth (false)
   [junit4]   2> 46206 INFO  (TEST-TestArbitraryIndexDir.testLoadNewIndexDir-seed#[6A3168754C350B07]) [    ] o.a.s.SolrTestCaseJ4 ###Starting testLoadNewIndexDir
   [junit4]   2> 46207 INFO  (TEST-TestArbitraryIndexDir.testLoadNewIndexDir-seed#[6A3168754C350B07]) [    ] o.a.s.SolrTestCaseJ4 ####initCore
   [junit4]   2> 46208 INFO  (TEST-TestArbitraryIndexDir.testLoadNewIndexDir-seed#[6A3168754C350B07]) [    ] o.a.s.c.SolrResourceLoader new SolrResourceLoader for directory: '/export/home/jenkins/workspace/Lucene-Solr-6.x-Solaris/solr/core/src/test-files/solr/collection1'
   [junit4]   2> 46208 INFO  (TEST-TestArbitraryIndexDir.testLoadNewIndexDir-seed#[6A3168754C350B07]) [    ] o.a.s.c.SolrResourceLoader JNDI not configured for solr (NoInitialContextEx)
   [junit4]   2> 46208 INFO  (TEST-TestArbitraryIndexDir.testLoadNewIndexDir-seed#[6A3168754C350B07]) [    ] o.a.s.c.SolrResourceLoader using system property solr.solr.home: /export/home/jenkins/workspace/Lucene-Solr-6.x-Solaris/solr/core/src/test-files/solr
   [junit4]   2> 46208 INFO  (TEST-TestArbitraryIndexDir.testLoadNewIndexDir-seed#[6A3168754C350B07]) [    ] o.a.s.c.SolrResourceLoader Adding 'file:/export/home/jenkins/workspace/Lucene-Solr-6.x-Solaris/solr/core/src/test-files/solr/collection1/lib/classes/' to classloader
   [junit4]   2> 46208 INFO  (TEST-TestArbitraryIndexDir.testLoadNewIndexDir-seed#[6A3168754C350B07]) [    ] o.a.s.c.SolrResourceLoader Adding 'file:/export/home/jenkins/workspace/Lucene-Solr-6.x-Solaris/solr/core/src/test-files/solr/collection1/lib/README' to classloader
   [junit4]   2> 46272 INFO  (TEST-TestArbitraryIndexDir.testLoadNewIndexDir-seed#[6A3168754C350B07]) [    ] o.a.s.c.SolrConfig current version of requestparams : -1
   [junit4]   2> 46297 WARN  (TEST-TestArbitraryIndexDir.testLoadNewIndexDir-seed#[6A3168754C350B07]) [    ] o.a.s.c.Config Beginning with Solr 5.5, <mergePolicy> is deprecated, use <mergePolicyFactory> instead.
   [junit4]   2> 46303 INFO  (TEST-TestArbitraryIndexDir.testLoadNewIndexDir-seed#[6A3168754C350B07]) [    ] o.a.s.c.SolrConfig Using Lucene MatchVersion: 6.1.0
   [junit4]   2> 46352 INFO  (TEST-TestArbitraryIndexDir.testLoadNewIndexDir-seed#[6A3168754C350B07]) [    ] o.a.s.c.SolrConfig Loaded SolrConfig: solrconfig.xml
   [junit4]   2> 46362 INFO  (TEST-TestArbitraryIndexDir.testLoadNewIndexDir-seed#[6A3168754C350B07]) [    ] o.a.s.s.IndexSchema [null] Schema name=test
   [junit4]   2> 46472 INFO  (TEST-TestArbitraryIndexDir.testLoadNewIndexDir-seed#[6A3168754C350B07]) [    ] o.a.s.s.IndexSchema default search field in schema is text
   [junit4]   2> 46473 INFO  (TEST-TestArbitraryIndexDir.testLoadNewIndexDir-seed#[6A3168754C350B07]) [    ] o.a.s.s.IndexSchema unique key field: id
   [junit4]   2> 46474 WARN  (TEST-TestArbitraryIndexDir.testLoadNewIndexDir-seed#[6A3168754C350B07]) [    ] o.a.s.s.IndexSchema Field text is not multivalued and destination for multiple copyFields (2)
   [junit4]   2> 46485 INFO  (TEST-TestArbitraryIndexDir.testLoadNewIndexDir-seed#[6A3168754C350B07]) [    ] o.a.s.s.FileExchangeRateProvider Reloading exchange rates from file currency.xml
   [junit4]   2> 46489 INFO  (TEST-TestArbitraryIndexDir.testLoadNewIndexDir-seed#[6A3168754C350B07]) [    ] o.a.s.s.FileExchangeRateProvider Reloading exchange rates from file currency.xml
   [junit4]   2> 46493 INFO  (TEST-TestArbitraryIndexDir.testLoadNewIndexDir-seed#[6A3168754C350B07]) [    ] o.a.s.c.SolrResourceLoader JNDI not configured for solr (NoInitialContextEx)
   [junit4]   2> 46493 INFO  (TEST-TestArbitraryIndexDir.testLoadNewIndexDir-seed#[6A3168754C350B07]) [    ] o.a.s.c.SolrResourceLoader using system property solr.solr.home: /export/home/jenkins/workspace/Lucene-Solr-6.x-Solaris/solr/core/src/test-files/solr
   [junit4]   2> 46493 INFO  (TEST-TestArbitraryIndexDir.testLoadNewIndexDir-seed#[6A3168754C350B07]) [    ] o.a.s.c.SolrResourceLoader new SolrResourceLoader for directory: '/export/home/jenkins/workspace/Lucene-Solr-6.x-Solaris/solr/core/src/test-files/solr'
   [junit4]   2> 46493 INFO  (TEST-TestArbitraryIndexDir.testLoadNewIndexDir-seed#[6A3168754C350B07]) [    ] o.a.s.c.SolrResourceLoader JNDI not configured for solr (NoInitialContextEx)
   [junit4]   2> 46493 INFO  (TEST-TestArbitraryIndexDir.testLoadNewIndexDir-seed#[6A3168754C350B07]) [    ] o.a.s.c.SolrResourceLoader using system property solr.solr.home: /export/home/jenkins/workspace/Lucene-Solr-6.x-Solaris/solr/core/src/test-files/solr
   [junit4]   2> 46493 INFO  (TEST-TestArbitraryIndexDir.testLoadNewIndexDir-seed#[6A3168754C350B07]) [    ] o.a.s.c.CoreContainer New CoreContainer 645437198
   [junit4]   2> 46493 INFO  (TEST-TestArbitraryIndexDir.testLoadNewIndexDir-seed#[6A3168754C350B07]) [    ] o.a.s.c.CoreContainer Loading cores into CoreContainer [instanceDir=/export/home/jenkins/workspace/Lucene-Solr-6.x-Solaris/solr/core/src/test-files/solr]
   [junit4]   2> 46494 WARN  (TEST-TestArbitraryIndexDir.testLoadNewIndexDir-seed#[6A3168754C350B07]) [    ] o.a.s.c.CoreContainer Couldn't add files from /export/home/jenkins/workspace/Lucene-Solr-6.x-Solaris/solr/core/src/test-files/solr/lib to classpath: /export/home/jenkins/workspace/Lucene-Solr-6.x-Solaris/solr/core/src/test-files/solr/lib
   [junit4]   2> 46494 INFO  (TEST-TestArbitraryIndexDir.testLoadNewIndexDir-seed#[6A3168754C350B07]) [    ] o.a.s.h.c.HttpShardHandlerFactory created with socketTimeout : 600000,connTimeout : 60000,maxConnectionsPerHost : 20,maxConnections : 10000,corePoolSize : 0,maximumPoolSize : 2147483647,maxThreadIdleTime : 5,sizeOfQueue : -1,fairnessPolicy : false,useRetries : false,
   [junit4]   2> 46497 INFO  (TEST-TestArbitraryIndexDir.testLoadNewIndexDir-seed#[6A3168754C350B07]) [    ] o.a.s.u.UpdateShardHandler Creating UpdateShardHandler HTTP client with params: socketTimeout=30000&connTimeout=30000&retry=true
   [junit4]   2> 46498 INFO  (TEST-TestArbitraryIndexDir.testLoadNewIndexDir-seed#[6A3168754C350B07]) [    ] o.a.s.l.LogWatcher SLF4J impl is org.slf4j.impl.Log4jLoggerFactory
   [junit4]   2> 46498 INFO  (TEST-TestArbitraryIndexDir.testLoadNewIndexDir-seed#[6A3168754C350B07]) [    ] o.a.s.l.LogWatcher Registering Log Listener [Log4j (org.slf4j.impl.Log4jLoggerFactory)]
   [junit4]   2> 46498 INFO  (TEST-TestArbitraryIndexDir.testLoadNewIndexDir-seed#[6A3168754C350B07]) [    ] o.a.s.c.CoreContainer Security conf doesn't exist. Skipping setup for authorization module.
   [junit4]   2> 46498 INFO  (TEST-TestArbitraryIndexDir.testLoadNewIndexDir-seed#[6A3168754C350B07]) [    ] o.a.s.c.CoreContainer No authentication plugin used.
   [junit4]   2> 46501 INFO  (TEST-TestArbitraryIndexDir.testLoadNewIndexDir-seed#[6A3168754C350B07]) [    ] o.a.s.c.CoreDescriptor Created CoreDescriptor: {name=collection1, config=solrconfig.xml, transient=false, schema=schema12.xml, loadOnStartup=true, configSetProperties=configsetprops.json, collection=collection1, dataDir=/export/home/jenkins/workspace/Lucene-Solr-6.x-Solaris/solr/build/solr-core/test/J0/temp/solr.core.TestArbitraryIndexDir_6A3168754C350B07-001/init-core-data-001, shard=shard1}
   [junit4]   2> 46505 INFO  (coreLoadExecutor-69-thread-1) [    ] o.a.s.c.SolrResourceLoader new SolrResourceLoader for directory: '/export/home/jenkins/workspace/Lucene-Solr-6.x-Solaris/solr/core/src/test-files/solr/collection1'
   [junit4]   2> 46506 INFO  (coreLoadExecutor-69-thread-1) [    ] o.a.s.c.SolrResourceLoader JNDI not configured for solr (NoInitialContextEx)
   [junit4]   2> 46506 INFO  (coreLoadExecutor-69-thread-1) [    ] o.a.s.c.SolrResourceLoader using system property solr.solr.home: /export/home/jenkins/workspace/Lucene-Solr-6.x-Solaris/solr/core/src/test-files/solr
   [junit4]   2> 46507 INFO  (coreLoadExecutor-69-thread-1) [    ] o.a.s.c.SolrResourceLoader Adding 'file:/export/home/jenkins/workspace/Lucene-Solr-6.x-Solaris/solr/core/src/test-files/solr/collection1/lib/classes/' to classloader
   [junit4]   2> 46507 INFO  (coreLoadExecutor-69-thread-1) [    ] o.a.s.c.SolrResourceLoader Adding 'file:/export/home/jenkins/workspace/Lucene-Solr-6.x-Solaris/solr/core/src/test-files/solr/collection1/lib/README' to classloader
   [junit4]   2> 46555 INFO  (coreLoadExecutor-69-thread-1) [    ] o.a.s.c.SolrConfig current version of requestparams : -1
   [junit4]   2> 46566 WARN  (coreLoadExecutor-69-thread-1) [    ] o.a.s.c.Config Beginning with Solr 5.5, <mergePolicy> is deprecated, use <mergePolicyFactory> instead.
   [junit4]   2> 46568 INFO  (coreLoadExecutor-69-thread-1) [    ] o.a.s.c.SolrConfig Using Lucene MatchVersion: 6.1.0
   [junit4]   2> 46595 INFO  (coreLoadExecutor-69-thread-1) [    ] o.a.s.c.SolrConfig Loaded SolrConfig: solrconfig.xml
   [junit4]   2> 46609 INFO  (coreLoadExecutor-69-thread-1) [    ] o.a.s.s.IndexSchema [collection1] Schema name=test
   [junit4]   2> 46699 INFO  (coreLoadExecutor-69-thread-1) [    ] o.a.s.s.IndexSchema default search field in schema is text
   [junit4]   2> 46700 INFO  (coreLoadExecutor-69-thread-1) [    ] o.a.s.s.IndexSchema unique key field: id
   [junit4]   2> 46700 WARN  (coreLoadExecutor-69-thread-1) [    ] o.a.s.s.IndexSchema Field text is not multivalued and destination for multiple copyFields (2)
   [junit4]   2> 46708 INFO  (coreLoadExecutor-69-thread-1) [    ] o.a.s.s.FileExchangeRateProvider Reloading exchange rates from file currency.xml
   [junit4]   2> 46711 INFO  (coreLoadExecutor-69-thread-1) [    ] o.a.s.s.FileExchangeRateProvider Reloading exchange rates from file currency.xml
   [junit4]   2> 46714 INFO  (coreLoadExecutor-69-thread-1) [    ] o.a.s.c.ConfigSetProperties Did not find ConfigSet properties, assuming default properties: Can't find resource 'configsetprops.json' in classpath or '/export/home/jenkins/workspace/Lucene-Solr-6.x-Solaris/solr/core/src/test-files/solr/collection1'
   [junit4]   2> 46715 INFO  (coreLoadExecutor-69-thread-1) [    ] o.a.s.c.CoreContainer Creating SolrCore 'collection1' using configuration from instancedir /export/home/jenkins/workspace/Lucene-Solr-6.x-Solaris/solr/core/src/test-files/solr/collection1
   [junit4]   2> 46715 INFO  (coreLoadExecutor-69-thread-1) [    x:collection1] o.a.s.c.SolrCore org.apache.solr.core.MockFSDirectoryFactory
   [junit4]   2> 46717 INFO  (coreLoadExecutor-69-thread-1) [    x:collection1] o.a.s.c.SolrCore [[collection1] ] Opening new SolrCore at [/export/home/jenkins/workspace/Lucene-Solr-6.x-Solaris/solr/core/src/test-files/solr/collection1], dataDir=[/export/home/jenkins/workspace/Lucene-Solr-6.x-Solaris/solr/build/solr-core/test/J0/temp/solr.core.TestArbitraryIndexDir_6A3168754C350B07-001/init-core-data-001/]
   [junit4]   2> 46719 INFO  (coreLoadExecutor-69-thread-1) [    x:collection1] o.a.s.c.JmxMonitoredMap No JMX servers found, not exposing Solr information with JMX.
   [junit4]   2> 46725 INFO  (coreLoadExecutor-69-thread-1) [    x:collection1] o.a.s.c.CachingDirectoryFactory return new directory for /export/home/jenkins/workspace/Lucene-Solr-6.x-Solaris/solr/build/solr-core/test/J0/temp/solr.core.TestArbitraryIndexDir_6A3168754C350B07-001/init-core-data-001
   [junit4]   2> 46726 INFO  (coreLoadExecutor-69-thread-1) [    x:collection1] o.a.s.c.SolrCore New index directory detected: old=null new=/export/home/jenkins/workspace/Lucene-Solr-6.x-Solaris/solr/build/solr-core/test/J0/temp/solr.core.TestArbitraryIndexDir_6A3168754C350B07-001/init-core-data-001/index/
   [junit4]   2> 46726 WARN  (coreLoadExecutor-69-thread-1) [    x:collection1] o.a.s.c.SolrCore [collection1] Solr index directory '/export/home/jenkins/workspace/Lucene-Solr-6.x-Solaris/solr/build/solr-core/test/J0/temp/solr.core.TestArbitraryIndexDir_6A3168754C350B07-001/init-core-data-001/index' doesn't exist. Creating new index...
   [junit4]   2> 46740 INFO  (coreLoadExecutor-69-thread-1) [    x:collection1] o.a.s.c.CachingDirectoryFactory return new directory for /export/home/jenkins/workspace/Lucene-Solr-6.x-Solaris/solr/build/solr-core/test/J0/temp/solr.core.TestArbitraryIndexDir_6A3168754C350B07-001/init-core-data-001/index
   [junit4]   2> 46741 INFO  (coreLoadExecutor-69-thread-1) [    x:collection1] o.a.s.u.RandomMergePolicy RandomMergePolicy wrapping class org.apache.lucene.index.TieredMergePolicy: [TieredMergePolicy: maxMergeAtOnce=45, maxMergeAtOnceExplicit=23, maxMergedSegmentMB=60.8154296875, floorSegmentMB=1.724609375, forceMergeDeletesPctAllowed=15.731720304086918, segmentsPerTier=42.0, maxCFSSegmentSizeMB=8.796093022207999E12, noCFSRatio=0.0
   [junit4]   2> 46799 INFO  (coreLoadExecutor-69-thread-1) [    x:collection1] o.a.s.c.SolrDeletionPolicy SolrDeletionPolicy.onCommit: commits: num=1
   [junit4]   2> 	commit{dir=MockDirectoryWrapper(MMapDirectory@/export/home/jenkins/workspace/Lucene-Solr-6.x-Solaris/solr/build/solr-core/test/J0/temp/solr.core.TestArbitraryIndexDir_6A3168754C350B07-001/init-core-data-001/index lockFactory=org.apache.lucene.store.SingleInstanceLockFactory@23035d28),segFN=segments_1,generation=1}
   [junit4]   2> 46799 INFO  (coreLoadExecutor-69-thread-1) [    x:collection1] o.a.s.c.SolrDeletionPolicy newest commit generation = 1
   [junit4]   2> 46800 INFO  (OldIndexDirectoryCleanupThreadForCore-collection1) [    x:collection1] o.a.s.c.SolrCore Looking for old index directories to cleanup for core collection1 in /export/home/jenkins/workspace/Lucene-Solr-6.x-Solaris/solr/build/solr-core/test/J0/temp/solr.core.TestArbitraryIndexDir_6A3168754C350B07-001/init-core-data-001/
   [junit4]   2> 46861 INFO  (coreLoadExecutor-69-thread-1) [    x:collection1] o.a.s.u.p.UpdateRequestProcessorChain creating updateRequestProcessorChain "dedupe"
   [junit4]   2> 46868 INFO  (coreLoadExecutor-69-thread-1) [    x:collection1] o.a.s.u.p.UpdateRequestProcessorChain inserting DistributedUpdateProcessorFactory into updateRequestProcessorChain "dedupe"
   [junit4]   2> 46868 INFO  (coreLoadExecutor-69-thread-1) [    x:collection1] o.a.s.u.p.UpdateRequestProcessorChain creating updateRequestProcessorChain "dedupe-allfields"
   [junit4]   2> 46868 INFO  (coreLoadExecutor-69-thread-1) [    x:collection1] o.a.s.u.p.UpdateRequestProcessorChain inserting DistributedUpdateProcessorFactory into updateRequestProcessorChain "dedupe-allfields"
   [junit4]   2> 46868 INFO  (coreLoadExecutor-69-thread-1) [    x:collection1] o.a.s.u.p.UpdateRequestProcessorChain creating updateRequestProcessorChain "stored_sig"
   [junit4]   2> 46868 INFO  (coreLoadExecutor-69-thread-1) [    x:collection1] o.a.s.u.p.UpdateRequestProcessorChain inserting DistributedUpdateProcessorFactory into updateRequestProcessorChain "stored_sig"
   [junit4]   2> 46868 INFO  (coreLoadExecutor-69-thread-1) [    x:collection1] o.a.s.u.p.UpdateRequestProcessorChain creating updateRequestProcessorChain "uniq-fields"
   [junit4]   2> 46876 INFO  (coreLoadExecutor-69-thread-1) [    x:collection1] o.a.s.u.p.UpdateRequestProcessorChain inserting DistributedUpdateProcessorFactory into updateRequestProcessorChain "uniq-fields"
   [junit4]   2> 46876 INFO  (coreLoadExecutor-69-thread-1) [    x:collection1] o.a.s.u.p.UpdateRequestProcessorChain creating updateRequestProcessorChain "distrib-dup-test-chain-explicit"
   [junit4]   2> 46910 INFO  (coreLoadExecutor-69-thread-1) [    x:collection1] o.a.s.u.p.UpdateRequestProcessorChain creating updateRequestProcessorChain "distrib-dup-test-chain-implicit"
   [junit4]   2> 46910 INFO  (coreLoadExecutor-69-thread-1) [    x:collection1] o.a.s.u.p.UpdateRequestProcessorChain inserting DistributedUpdateProcessorFactory into updateRequestProcessorChain "distrib-dup-test-chain-implicit"
   [junit4]   2> 46910 INFO  (coreLoadExecutor-69-thread-1) [    x:collection1] o.a.s.c.SolrCore no updateRequestProcessorChain defined as default, creating implicit default
   [junit4]   2> 46915 INFO  (coreLoadExecutor-69-thread-1) [    x:collection1] o.a.s.h.l.XMLLoader xsltCacheLifetimeSeconds=60
   [junit4]   2> 46916 INFO  (coreLoadExecutor-69-thread-1) [    x:collection1] o.a.s.h.l.XMLLoader xsltCacheLifetimeSeconds=60
   [junit4]   2> 46918 INFO  (coreLoadExecutor-69-thread-1) [    x:collection1] o.a.s.h.l.XMLLoader xsltCacheLifetimeSeconds=60
   [junit4]   2> 46919 INFO  (coreLoadExecutor-69-thread-1) [    x:collection1] o.a.s.h.l.XMLLoader xsltCacheLifetimeSeconds=60
   [junit4]   2> 46923 INFO  (coreLoadExecutor-69-thread-1) [    x:collection1] o.a.s.c.PluginBag requestHandler : 'lazy' created with startup=lazy 
   [junit4]   2> 46942 INFO  (coreLoadExecutor-69-thread-1) [    x:collection1] o.a.s.c.RequestHandlers Registered paths: /admin/mbeans,standard,spellCheckCompRH,lazy,/update/json/docs,/admin/luke,/export,spellCheckWithWordbreak_Direct,tvrh,/get,/admin/properties,/update/json,mltrh,/admin/threads,/search-facet-def,/update/csv,/sql,/search-facet-invariants,/admin/segments,spellCheckCompRH1,/mlt,/admin/system,/replication,dismax,defaults,/config,/stream,/schema,/admin/plugins,/admin/logging,spellCheckWithWordbreak,mock,/admin/ping,/update,/admin/file,/terms,spellCheckCompRH_Direct,/debug/dump
   [junit4]   2> 46942 INFO  (coreLoadExecutor-69-thread-1) [    x:collection1] o.a.s.c.SolrCore Using default statsCache cache: org.apache.solr.search.stats.LocalStatsCache
   [junit4]   2> 46943 INFO  (coreLoadExecutor-69-thread-1) [    x:collection1] o.a.s.u.CommitTracker Hard AutoCommit: disabled
   [junit4]   2> 46943 INFO  (coreLoadExecutor-69-thread-1) [    x:collection1] o.a.s.u.CommitTracker Soft AutoCommit: disabled
   [junit4]   2> 46944 INFO  (coreLoadExecutor-69-thread-1) [    x:collection1] o.a.s.u.RandomMergePolicy RandomMergePolicy wrapping class org.apache.lucene.index.LogByteSizeMergePolicy: [LogByteSizeMergePolicy: minMergeSize=1677721, mergeFactor=16, maxMergeSize=2147483648, maxMergeSizeForForcedMerge=9223372036854775807, calibrateSizeByDeletes=false, maxMergeDocs=2147483647, maxCFSSegmentSizeMB=8.796093022207999E12, noCFSRatio=1.0]
   [junit4]   2> 46960 INFO  (coreLoadExecutor-69-thread-1) [    x:collection1] o.a.s.c.SolrDeletionPolicy SolrDeletionPolicy.onInit: commits: num=1
   [junit4]   2> 	commit{dir=MockDirectoryWrapper(MMapDirectory@/export/home/jenkins/workspace/Lucene-Solr-6.x-Solaris/solr/build/solr-core/test/J0/temp/solr.core.TestArbitraryIndexDir_6A3168754C350B07-001/init-core-data-001/index lockFactory=org.apache.lucene.store.SingleInstanceLockFactory@23035d28),segFN=segments_1,generation=1}
   [junit4]   2> 46960 INFO  (coreLoadExecutor-69-thread-1) [    x:collection1] o.a.s.c.SolrDeletionPolicy newest commit generation = 1
   [junit4]   2> 46961 INFO  (coreLoadExecutor-69-thread-1) [    x:collection1] o.a.s.s.SolrIndexSearcher Opening [Searcher@4049f566[collection1] main]
   [junit4]   2> 46961 INFO  (coreLoadExecutor-69-thread-1) [    x:collection1] o.a.s.r.RestManager Initializing RestManager with initArgs: {storageIO=org.apache.solr.rest.ManagedResourceStorage$InMemoryStorageIO}
   [junit4]   2> 46961 INFO  (coreLoadExecutor-69-thread-1) [    x:collection1] o.a.s.r.ManagedResourceStorage Reading _rest_managed.json using InMemoryStorage
   [junit4]   2> 46961 INFO  (coreLoadExecutor-69-thread-1) [    x:collection1] o.a.s.r.RestManager Initializing 0 registered ManagedResources
   [junit4]   2> 46961 INFO  (coreLoadExecutor-69-thread-1) [    x:collection1] o.a.s.h.c.SpellCheckComponent Initializing spell checkers
   [junit4]   2> 47021 INFO  (coreLoadExecutor-69-thread-1) [    x:collection1] o.a.s.s.DirectSolrSpellChecker init: {name=direct,classname=DirectSolrSpellChecker,field=lowerfilt,minQueryLength=3}
   [junit4]   2> 47229 INFO  (coreLoadExecutor-69-thread-1) [    x:collection1] o.a.s.h.ReplicationHandler Commits will be reserved for  10000
   [junit4]   2> 47229 INFO  (coreLoadExecutor-69-thread-1) [    x:collection1] o.a.s.c.CoreContainer registering core: collection1
   [junit4]   2> 47230 INFO  (searcherExecutor-70-thread-1-processing-x:collection1) [    x:collection1] o.a.s.h.c.SpellCheckComponent Loading spell index for spellchecker: default
   [junit4]   2> 47241 INFO  (TEST-TestArbitraryIndexDir.testLoadNewIndexDir-seed#[6A3168754C350B07]) [    ] o.a.s.SolrTestCaseJ4 ####initCore end
   [junit4]   2> 47243 INFO  (searcherExecutor-70-thread-1-processing-x:collection1) [    x:collection1] o.a.s.h.c.SpellCheckComponent Loading spell index for spellchecker: direct
   [junit4]   2> 47243 INFO  (searcherExecutor-70-thread-1-processing-x:collection1) [    x:collection1] o.a.s.h.c.SpellCheckComponent Loading spell index for spellchecker: wordbreak
   [junit4]   2> 47243 INFO  (searcherExecutor-70-thread-1-processing-x:collection1) [    x:collection1] o.a.s.h.c.SpellCheckComponent Loading spell index for spellchecker: multipleFields
   [junit4]   2> 47244 INFO  (searcherExecutor-70-thread-1-processing-x:collection1) [    x:collection1] o.a.s.h.c.SpellCheckComponent Loading spell index for spellchecker: jarowinkler
   [junit4]   2> 47246 INFO  (searcherExecutor-70-thread-1-processing-x:collection1) [    x:collection1] o.a.s.h.c.SpellCheckComponent Loading spell index for spellchecker: external
   [junit4]   2> 47248 INFO  (searcherExecutor-70-thread-1-processing-x:collection1) [    x:collection1] o.a.s.h.c.SpellCheckComponent Loading spell index for spellchecker: freq
   [junit4]   2> 47258 INFO  (searcherExecutor-70-thread-1-processing-x:collection1) [    x:collection1] o.a.s.h.c.SpellCheckComponent Loading spell index for spellchecker: fqcn
   [junit4]   2> 47261 INFO  (TEST-TestArbitraryIndexDir.testLoadNewIndexDir-seed#[6A3168754C350B07]) [    ] o.a.s.u.p.LogUpdateProcessorFactory [collection1]  webapp=null path=null params={}{add=[1]} 0 12
   [junit4]   2> 47263 INFO  (searcherExecutor-70-thread-1-processing-x:collection1) [    x:collection1] o.a.s.h.c.SpellCheckComponent Loading spell index for spellchecker: perDict
   [junit4]   2> 47263 INFO  (searcherExecutor-70-thread-1-processing-x:collection1) [    x:collection1] o.a.s.c.SolrCore [collection1] Registered new searcher Searcher@4049f566[collection1] main{ExitableDirectoryReader(UninvertingDirectoryReader())}
   [junit4]   2> 47324 INFO  (TEST-TestArbitraryIndexDir.testLoadNewIndexDir-seed#[6A3168754C350B07]) [    ] o.a.s.u.DirectUpdateHandler2 start commit{,optimize=false,openSearcher=true,waitSearcher=true,expungeDeletes=false,softCommit=false,prepareCommit=false}
   [junit4]   2> 47353 INFO  (TEST-TestArbitraryIndexDir.testLoadNewIndexDir-seed#[6A3168754C350B07]) [    ] o.a.s.c.SolrDeletionPolicy SolrDeletionPolicy.onCommit: commits: num=2
   [junit4]   2> 	commit{dir=MockDirectoryWrapper(MMapDirectory@/export/home/jenkins/workspace/Lucene-Solr-6.x-Solaris/solr/build/solr-core/test/J0/temp/solr.core.TestArbitraryIndexDir_6A3168754C350B07-001/init-core-data-001/index lockFactory=org.apache.lucene.store.SingleInstanceLockFactory@23035d28),segFN=segments_1,generation=1}
   [junit4]   2> 	commit{dir=MockDirectoryWrapper(MMapDirectory@/export/home/jenkins/workspace/Lucene-Solr-6.x-Solaris/solr/build/solr-core/test/J0/temp/solr.core.TestArbitraryIndexDir_6A3168754C350B07-001/init-core-data-001/index lockFactory=org.apache.lucene.store.SingleInstanceLockFactory@23035d28),segFN=segments_2,generation=2}
   [junit4]   2> 47355 INFO  (TEST-TestArbitraryIndexDir.testLoadNewIndexDir-seed#[6A3168754C350B07]) [    ] o.a.s.c.SolrDeletionPolicy newest commit generation = 2
   [junit4]   2> 47363 INFO  (TEST-TestArbitraryIndexDir.testLoadNewIndexDir-seed#[6A3168754C350B07]) [    ] o.a.s.c.SolrCore New index directory detected: old=/export/home/jenkins/workspace/Lucene-Solr-6.x-Solaris/solr/build/solr-core/test/J0/temp/solr.core.TestArbitraryIndexDir_6A3168754C350B07-001/init-core-data-001/index/ new=/export/home/jenkins/workspace/Lucene-Solr-6.x-Solaris/solr/build/solr-core/test/J0/temp/solr.core.TestArbitraryIndexDir_6A3168754C350B07-001/init-core-data-001/index_temp
   [junit4]   2> 47366 INFO  (TEST-TestArbitraryIndexDir.testLoadNewIndexDir-seed#[6A3168754C350B07]) [    ] o.a.s.s.SolrIndexSearcher Opening [Searcher@2790d327[collection1] main]
   [junit4]   2> 47367 INFO  (TEST-TestArbitraryIndexDir.testLoadNewIndexDir-seed#[6A3168754C350B07]) [    ] o.a.s.u.DirectUpdateHandler2 end_commit_flush
   [junit4]   2> 47368 INFO  (searcherExecutor-70-thread-1) [    ] o.a.s.c.SolrCore [collection1] Registered new searcher Searcher@2790d327[collection1] main{ExitableDirectoryReader(UninvertingDirectoryReader(Uninverting(_0(6.1.0):c1)))}
   [junit4]   2> 47368 INFO  (TEST-TestArbitraryIndexDir.testLoadNewIndexDir-seed#[6A3168754C350B07]) [    ] o.a.s.u.p.LogUpdateProcessorFactory [collection1]  webapp=null path=null params={}{commit=} 0 44
   [junit4]   2> 47370 INFO  (TEST-TestArbitraryIndexDir.testLoadNewIndexDir-seed#[6A3168754C350B07]) [    ] o.a.s.c.SolrResourceLoader new SolrResourceLoader for directory: '/export/home/jenkins/workspace/Lucene-Solr-6.x-Solaris/solr/core/src/test-files/solr/collection1'
   [junit4]   2> 47370 INFO  (TEST-TestArbitraryIndexDir.testLoadNewIndexDir-seed#[6A3168754C350B07]) [    ] o.a.s.c.SolrResourceLoader JNDI not configured for solr (NoInitialContextEx)
   [junit4]   2> 47370 INFO  (TEST-TestArbitraryIndexDir.testLoadNewIndexDir-seed#[6A3168754C350B07]) [    ] o.a.s.c.SolrResourceLoader using system property solr.solr.home: /export/home/jenkins/workspace/Lucene-Solr-6.x-Solaris/solr/core/src/test-files/solr
   [junit4]   2> 47370 INFO  (TEST-TestArbitraryIndexDir.testLoadNewIndexDir-seed#[6A3168754C350B07]) [    ] o.a.s.c.SolrResourceLoader Adding 'file:/export/home/jenkins/workspace/Lucene-Solr-6.x-Solaris/solr/core/src/test-files/solr/collection1/lib/classes/' to classloader
   [junit4]   2> 47370 INFO  (TEST-TestArbitraryIndexDir.testLoadNewIndexDir-seed#[6A3168754C350B07]) [    ] o.a.s.c.SolrResourceLoader Adding 'file:/export/home/jenkins/workspace/Lucene-Solr-6.x-Solaris/solr/core/src/test-files/solr/collection1/lib/README' to classloader
   [junit4]   2> 47409 INFO  (TEST-TestArbitraryIndexDir.testLoadNewIndexDir-seed#[6A3168754C350B07]) [    ] o.a.s.c.SolrConfig current version of requestparams : -1
   [junit4]   2> 47414 WARN  (TEST-TestArbitraryIndexDir.testLoadNewIndexDir-seed#[6A3168754C350B07]) [    ] o.a.s.c.Config Beginning with Solr 5.5, <mergePolicy> is deprecated, use <mergePolicyFactory> instead.
   [junit4]   2> 47416 INFO  (TEST-TestArbitraryIndexDir.testLoadNewIndexDir-seed#[6A3168754C350B07]) [    ] o.a.s.c.SolrConfig Using Lucene MatchVersion: 6.1.0
   [junit4]   2> 47437 INFO  (TEST-TestArbitraryIndexDir.testLoadNewIndexDir-seed#[6A3168754C350B07]) [    ] o.a.s.c.SolrConfig Loaded SolrConfig: solrconfig.xml
   [junit4]   2> 47446 INFO  (TEST-TestArbitraryIndexDir.testLoadNewIndexDir-seed#[6A3168754C350B07]) [    ] o.a.s.s.IndexSchema [collection1] Schema name=test
   [junit4]   2> 47533 INFO  (TEST-TestArbitraryIndexDir.testLoadNewIndexDir-seed#[6A3168754C350B07]) [    ] o.a.s.s.IndexSchema default search field in schema is text
   [junit4]   2> 47534 INFO  (TEST-TestArbitraryIndexDir.testLoadNewIndexDir-seed#[6A3168754C350B07]) [    ] o.a.s.s.IndexSchema unique key field: id
   [junit4]   2> 47534 WARN  (TEST-TestArbitraryIndexDir.testLoadNewIndexDir-seed#[6A3168754C350B07]) [    ] o.a.s.s.IndexSchema Field text is not multivalued and destination for multiple copyFields (2)
   [junit4]   2> 47542 INFO  (TEST-TestArbitraryIndexDir.testLoadNewIndexDir-seed#[6A3168754C350B07]) [    ] o.a.s.s.FileExchangeRateProvider Reloading exchange rates from file currency.xml
   [junit4]   2> 47545 INFO  (TEST-TestArbitraryIndexDir.testLoadNewIndexDir-seed#[6A3168754C350B07]) [    ] o.a.s.s.FileExchangeRateProvider Reloading exchange rates from file currency.xml
   [junit4]   2> 47548 INFO  (TEST-TestArbitraryIndexDir.testLoadNewIndexDir-seed#[6A3168754C350B07]) [    ] o.a.s.c.ConfigSetProperties Did not find ConfigSet properties, assuming default properties: Can't find resource 'configsetprops.json' in classpath or '/export/home/jenkins/workspace/Lucene-Solr-6.x-Solaris/solr/core/src/test-files/solr/collection1'
   [junit4]   2> 47548 INFO  (TEST-TestArbitraryIndexDir.testLoadNewIndexDir-seed#[6A3168754C350B07]) [    ] o.a.s.c.CoreContainer Reloading SolrCore 'collection1' using configuration from instancedir /export/home/jenkins/workspace/Lucene-Solr-6.x-Solaris/solr/core/src/test-files/solr/collection1
   [junit4]   2> 47549 INFO  (TEST-TestArbitraryIndexDir.testLoadNewIndexDir-seed#[6A3168754C350B07]) [    x:collection1] o.a.s.c.SolrCore [[collection1] ] Opening new SolrCore at [/export/home/jenkins/workspace/Lucene-Solr-6.x-Solaris/solr/core/src/test-files/solr/collection1], dataDir=[/export/home/jenkins/workspace/Lucene-Solr-6.x-Solaris/solr/build/solr-core/test/J0/temp/solr.core.TestArbitraryIndexDir_6A3168754C350B07-001/init-core-data-001/]
   [junit4]   2> 47549 INFO  (TEST-TestArbitraryIndexDir.testLoadNewIndexDir-seed#[6A3168754C350B07]) [    x:collection1] o.a.s.c.JmxMonitoredMap No JMX servers found, not exposing Solr information with JMX.
   [junit4]   2> 47550 INFO  (TEST-TestArbitraryIndexDir.testLoadNewIndexDir-seed#[6A3168754C350B07]) [    x:collection1] o.a.s.c.SolrCore New index directory detected: old=null new=/export/home/jenkins/workspace/Lucene-Solr-6.x-Solaris/solr/build/solr-core/test/J0/temp/solr.core.TestArbitraryIndexDir_6A3168754C350B07-001/init-core-data-001/index_temp
   [junit4]   2> 47550 INFO  (OldIndexDirectoryCleanupThreadForCore-collection1) [    x:collection1] o.a.s.c.SolrCore Looking for old index directories to cleanup for core collection1 in /export/home/jenkins/workspace/Lucene-Solr-6.x-Solaris/solr/build/solr-core/test/J0/temp/solr.core.TestArbitraryIndexDir_6A3168754C350B07-001/init-core-data-001/
   [junit4]   2> 47551 INFO  (OldIndexDirectoryCleanupThreadForCore-collection1) [    x:collection1] o.a.s.c.DirectoryFactory Found 1 old index directories to clean-up under /export/home/jenkins/workspace/Lucene-Solr-6.x-Solaris/solr/build/solr-core/test/J0/temp/solr.core.TestArbitraryIndexDir_6A3168754C350B07-001/init-core-data-001/
   [junit4]   2> 47551 WARN  (OldIndexDirectoryCleanupThreadForCore-collection1) [    x:collection1] o.a.s.c.CachingDirectoryFactory Cannot delete directory /export/home/jenkins/workspace/Lucene-Solr-6.x-Solaris/solr/build/solr-core/test/J0/temp/solr.core.TestArbitraryIndexDir_6A3168754C350B07-001/init-core-data-001/index as it is still being referenced in the cache!
   [junit4]   2> 47551 WARN  (OldIndexDirectoryCleanupThreadForCore-collection1) [    x:collection1] o.a.s.c.DirectoryFactory Delete old index directory /export/home/jenkins/workspace/Lucene-Solr-6.x-Solaris/solr/build/solr-core/test/J0/temp/solr.core.TestArbitraryIndexDir_6A3168754C350B07-001/init-core-data-001/index failed.
   [junit4]   2> 47553 INFO  (TEST-TestArbitraryIndexDir.testLoadNewIndexDir-seed#[6A3168754C350B07]) [    x:collection1] o.a.s.u.p.UpdateRequestProcessorChain creating updateRequestProcessorChain "dedupe"
   [junit4]   2> 47553 INFO  (TEST-TestArbitraryIndexDir.testLoadNewIndexDir-seed#[6A3168754C350B07]) [    x:collection1] o.a.s.u.p.UpdateRequestProcessorChain inserting DistributedUpdateProcessorFactory into updateRequestProcessorChain "dedupe"
   [junit4]   2> 47554 INFO  (TEST-TestArbitraryIndexDir.testLoadNewIndexDir-seed#[6A3168754C350B07]) [    x:collection1] o.a.s.u.p.UpdateRequestProcessorChain creating updateRequestProcessorChain "dedupe-allfields"
   [junit4]   2> 47554 INFO  (TEST-TestArbitraryIndexDir.testLoadNewIndexDir-seed#[6A3168754C350B07]) [    x:collection1] o.a.s.u.p.UpdateRequestProcessorChain inserting DistributedUpdateProcessorFactory into updateRequestProcessorChain "dedupe-allfields"
   [junit4]   2> 47554 INFO  (TEST-TestArbitraryIndexDir.testLoadNewIndexDir-seed#[6A3168754C350B07]) [    x:collection1] o.a.s.u.p.UpdateRequestProcessorChain creating updateRequestProcessorChain "stored_sig"
   [junit4]   2> 47554 INFO  (TEST-TestArbitraryIndexDir.testLoadNewIndexDir-seed#[6A3168754C350B07]) [    x:collection1] o.a.s.u.p.UpdateRequestProcessorChain inserting DistributedUpdateProcessorFactory into updateRequestProcessorChain "stored_sig"
   [junit4]   2> 47554 INFO  (TEST-TestArbitraryIndexDir.testLoadNewIndexDir-seed#[6A3168754C350B07]) [    x:collection1] o.a.s.u.p.UpdateRequestProcessorChain creating updateRequestProcessorChain "uniq-fields"
   [junit4]   2> 47554 INFO  (TEST-TestArbitraryIndexDir.testLoadNewIndexDir-seed#[6A3168754C350B07]) [    x:collection1] o.a.s.u.p.UpdateRequestProcessorChain inserting DistributedUpdateProcessorFactory into updateRequestProcessorChain "uniq-fields"
   [junit4]   2> 47554 INFO  (TEST-TestArbitraryIndexDir.testLoadNewIndexDir-seed#[6A3168754C350B07]) [    x:collection1] o.a.s.u.p.UpdateRequestProcessorChain creating updateRequestProcessorChain "distrib-dup-test-chain-explicit"
   [junit4]   2> 47554 INFO  (TEST-TestArbitraryIndexDir.testLoadNewIndexDir-seed#[6A3168754C350B07]) [    x:collection1] o.a.s.u.p.UpdateRequestProcessorChain creating updateRequestProcessorChain "distrib-dup-test-chain-implicit"
   [junit4]   2> 47554 INFO  (TEST-TestArbitraryIndexDir.testLoadNewIndexDir-seed#[6A3168754C350B07]) [    x:collection1] o.a.s.u.p.UpdateRequestProcessorChain inserting DistributedUpdateProcessorFactory into updateRequestProcessorChain "distrib-dup-test-chain-implicit"
   [junit4]   2> 47554 INFO  (TEST-TestArbitraryIndexDir.testLoadNewIndexDir-seed#[6A3168754C350B07]) [    x:collection1] o.a.s.c.SolrCore no updateRequestProcessorChain defined as default, creating implicit default
   [junit4]   2> 47556 INFO  (TEST-TestArbitraryIndexDir.testLoadNewIndexDir-seed#[6A3168754C350B07]) [    x:collection1] o.a.s.h.l.XMLLoader xsltCacheLifetimeSeconds=60
   [junit4]   2> 47557 INFO  (TEST-TestArbitraryIndexDir.testLoadNewIndexDir-seed#[6A3168754C350B07]) [    x:collection1] o.a.s.h.l.XMLLoader xsltCacheLifetimeSeconds=60
   [junit4]   2> 47559 INFO  (TEST-TestArbitraryIndexDir.testLoadNewIndexDir-seed#[6A3168754C350B07]) [    x:collection1] o.a.s.h.l.XMLLoader xsltCacheLifetimeSeconds=60
   [junit4]   2> 47560 INFO  (TEST-TestArbitraryIndexDir.testLoadNewIndexDir-seed#[6A3168754C350B07]) [    x:collection1] o.a.s.h.l.XMLLoader xsltCacheLifetimeSeconds=60
   [junit4]   2> 47562 INFO  (TEST-TestArbitraryIndexDir.testLoadNewIndexDir-seed#[6A3168754C350B07]) [    x:collection1] o.a.s.c.PluginBag requestHandler : 'lazy' created with startup=lazy 
   [junit4]   2> 47563 INFO  (TEST-TestArbitraryIndexDir.testLoadNewIndexDir-seed#[6A3168754C350B07]) [    x:collection1] o.a.s.c.RequestHandlers Registered paths: /admin/mbeans,standard,spellCheckCompRH,lazy,/update/json/docs,/admin/luke,/export,spellCheckWithWordbreak_Direct,tvrh,/get,/admin/properties,/update/json,mltrh,/admin/threads,/search-facet-def,/update/csv,/sql,/search-facet-invariants,/admin/segments,spellCheckCompRH1,/mlt,/admin/system,/replication,dismax,defaults,/config,/stream,/schema,/admin/plugins,/admin/logging,spellCheckWithWordbreak,mock,/admin/ping,/update,/admin/file,/terms,spellCheckCompRH_Direct,/debug/dump
   [junit4]   2> 47563 INFO  (TEST-TestArbitraryIndexDir.testLoadNewIndexDir-seed#[6A3168754C350B07]) [    x:collection1] o.a.s.c.SolrCore Using default statsCache cache: org.apache.solr.search.stats.LocalStatsCache
   [junit4]   2> 47563 INFO  (TEST-TestArbitraryIndexDir.testLoadNewIndexDir-seed#[6A3168754C350B07]) [    x:collection1] o.a.s.u.CommitTracker Hard AutoCommit: disabled
   [junit4]   2> 47563 INFO  (TEST-TestArbitraryIndexDir.testLoadNewIndexDir-seed#[6A3168754C350B07]) [    x:collection1] o.a.s.u.CommitTracker Soft AutoCommit: disabled
   [junit4]   2> 47565 INFO  (TEST-TestArbitraryIndexDir.testLoadNewIndexDir-seed#[6A3168754C350B07]) [    x:collection1] o.a.s.s.SolrIndexSearcher Opening [Searcher@36a83f5a[collection1] main]
   [junit4]   2> 47565 INFO  (TEST-TestArbitraryIndexDir.testLoadNewIndexDir-seed#[6A3168754C350B07]) [    x:collection1] o.a.s.r.RestManager Initializing RestManager with initArgs: {storageIO=org.apache.solr.rest.ManagedResourceStorage$InMemoryStorageIO}
   [junit4]   2> 47565 INFO  (TEST-TestArbitraryIndexDir.testLoadNewIndexDir-seed#[6A3168754C350B07]) [    x:collection1] o.a.s.r.ManagedResourceStorage Reading _rest_managed.json using InMemoryStorage
   [junit4]   2> 47565 INFO  (TEST-TestArbitraryIndexDir.testLoadNewIndexDir-seed#[6A3168754C350B07]) [    x:collection1] o.a.s.r.RestManager Initializing 0 registered ManagedResources
   [junit4]   2> 47565 INFO  (TEST-TestArbitraryIndexDir.testLoadNewIndexDir-seed#[6A3168754C350B07]) [    x:collection1] o.a.s.h.c.SpellCheckComponent Initializing spell checkers
   [junit4]   2> 47566 INFO  (TEST-TestArbitraryIndexDir.testLoadNewIndexDir-seed#[6A3168754C350B07]) [    x:collection1] o.a.s.s.DirectSolrSpellChecker init: {name=direct,classname=DirectSolrSpellChecker,field=lowerfilt,minQueryLength=3}
   [junit4]   2> 47574 INFO  (TEST-TestArbitraryIndexDir.testLoadNewIndexDir-seed#[6A3168754C350B07]) [    x:collection1] o.a.s.h.ReplicationHandler Commits will be reserved for  10000
   [junit4]   2> 47575 INFO  (searcherExecutor-74-thread-1-processing-x:collection1) [    x:collection1] o.a.s.h.c.SpellCheckComponent Loading spell index for spellchecker: default
   [junit4]   2> 47575 INFO  (TEST-TestArbitraryIndexDir.testLoadNewIndexDir-seed#[6A3168754C350B07]) [    x:collection1] o.a.s.u.DefaultSolrCoreState Closing old IndexWriter... core=collection1
   [junit4]   2> 47576 INFO  (TEST-TestArbitraryIndexDir.testLoadNewIndexDir-seed#[6A3168754C350B07]) [    x:collection1] o.a.s.c.CachingDirectoryFactory return new directory for /export/home/jenkins/workspace/Lucene-Solr-6.x-Solaris/solr/build/solr-core/test/J0/temp/solr.core.TestArbitraryIndexDir_6A3168754C350B07-001/init-core-data-001/index_temp
   [junit4]   2> 47576 INFO  (TEST-TestArbitraryIndexDir.testLoadNewIndexDir-seed#[6A3168754C350B07]) [    x:collection1] o.a.s.u.RandomMergePolicy RandomMergePolicy wrapping class org.apache.lucene.index.TieredMergePolicy: [TieredMergePolicy: maxMergeAtOnce=28, maxMergeAtOnceExplicit=31, maxMergedSegmentMB=25.49609375, floorSegmentMB=2.1591796875, forceMergeDeletesPctAllowed=13.884699888512323, segmentsPerTier=16.0, maxCFSSegmentSizeMB=8.796093022207999E12, noCFSRatio=1.0
   [junit4]   2> 47577 INFO  (searcherExecutor-74-thread-1-processing-x:collection1) [    x:collection1] o.a.s.h.c.SpellCheckComponent Loading spell index for spellchecker: direct
   [junit4]   2> 47577 INFO  (searcherExecutor-74-thread-1-processing-x:collection1) [    x:collection1] o.a.s.h.c.SpellCheckComponent Loading spell index for spellchecker: wordbreak
   [junit4]   2> 47577 INFO  (searcherExecutor-74-thread-1-processing-x:collection1) [    x:collection1] o.a.s.h.c.SpellCheckComponent Loading spell index for spellchecker: multipleFields
   [junit4]   2> 47579 INFO  (TEST-TestArbitraryIndexDir.testLoadNewIndexDir-seed#[6A3168754C350B07]) [    x:collection1] o.a.s.c.SolrDeletionPolicy SolrDeletionPolicy.onInit: commits: num=1
   [junit4]   2> 	commit{dir=MockDirectoryWrapper(SimpleFSDirectory@/export/home/jenkins/workspace/Lucene-Solr-6.x-Solaris/solr/build/solr-core/test/J0/temp/solr.core.TestArbitraryIndexDir_6A3168754C350B07-001/init-core-data-001/index_temp lockFactory=org.apache.lucene.store.SingleInstanceLockFactory@6e01a007),segFN=segments_1,generation=1}
   [junit4]   2> 47579 INFO  (TEST-TestArbitraryIndexDir.testLoadNewIndexDir-seed#[6A3168754C350B07]) [    x:collection1] o.a.s.c.SolrDeletionPolicy newest commit generation = 1
   [junit4]   2> 47580 INFO  (TEST-TestArbitraryIndexDir.testLoadNewIndexDir-seed#[6A3168754C350B07]) [    x:collection1] o.a.s.u.DefaultSolrCoreState New IndexWriter is ready to be used.
   [junit4]   2> 47580 WARN  (TEST-TestArbitraryIndexDir.testLoadNewIndexDir-seed#[6A3168754C350B07]) [    x:collection1] o.a.s.c.SolrCore [collection1] PERFORMANCE WARNING: Overlapping onDeckSearchers=2
   [junit4]   2> 47583 INFO  (TEST-TestArbitraryIndexDir.testLoadNewIndexDir-seed#[6A3168754C350B07]) [    x:collection1] o.a.s.s.SolrIndexSearcher Opening [Searcher@70180e1b[collection1] main]
   [junit4]   2> 47583 INFO  (TEST-TestArbitraryIndexDir.testLoadNewIndexDir-seed#[6A3168754C350B07]) [    x:collection1] o.a.s.c.CoreContainer replacing core: collection1
   [junit4]   2> 47583 INFO  (TEST-TestArbitraryIndexDir.testLoadNewIndexDir-seed#[6A3168754C350B07]) [    x:collection1] o.a.s.c.SolrCore [collection1]  CLOSING SolrCore org.apache.solr.core.SolrCore@55ac7a09
   [junit4]   2> 47584 INFO  (TEST-TestArbitraryIndexDir.testLoadNewIndexDir-seed#[6A3168754C350B07]) [    x:collection1] o.a.s.u.DirectUpdateHandler2 closing DirectUpdateHandler2{commits=1,autocommits=0,soft autocommits=0,optimizes=0,rollbacks=0,expungeDeletes=0,docsPending=0,adds=0,deletesById=0,deletesByQuery=0,errors=0,cumulative_adds=1,cumulative_deletesById=0,cumulative_deletesByQuery=0,cumulative_errors=0}
   [junit4]   2> 47584 INFO  (TEST-TestArbitraryIndexDir.testLoadNewIndexDir-seed#[6A3168754C350B07]) [    x:collection1] o.a.s.c.SolrCore [collection1] Closing main searcher on request.
   [junit4]   2> 47585 INFO  (searcherExecutor-74-thread-1-processing-x:collection1) [    x:collection1] o.a.s.h.c.SpellCheckComponent Loading spell index for spellchecker: jarowinkler
   [junit4]   2> 47586 INFO  (searcherExecutor-74-thread-1-processing-x:collection1) [    x:collection1] o.a.s.h.c.SpellCheckComponent Loading spell index for spellchecker: external
   [junit4]   2> 47587 INFO  (searcherExecutor-74-thread-1-processing-x:collection1) [    x:collection1] o.a.s.h.c.SpellCheckComponent Loading spell index for spellchecker: freq
   [junit4]   2> 47587 INFO  (searcherExecutor-74-thread-1-processing-x:collection1) [    x:collection1] o.a.s.h.c.SpellCheckComponent Loading spell index for spellchecker: fqcn
   [junit4]   2> 47588 INFO  (searcherExecutor-74-thread-1-processing-x:collection1) [    x:collection1] o.a.s.h.c.SpellCheckComponent Loading spell index for spellchecker: perDict
   [junit4]   2> 47588 INFO  (searcherExecutor-74-thread-1-processing-x:collection1) [    x:collection1] o.a.s.c.SolrCore [collection1] Registered new searcher Searcher@36a83f5a[collection1] main{ExitableDirectoryReader(UninvertingDirectoryReader(Uninverting(_0(6.1.0):c1)))}
   [junit4]   2> 47588 INFO  (searcherExecutor-74-thread-1-processing-x:collection1) [    x:collection1] o.a.s.h.c.SpellCheckComponent Loading spell index for spellchecker: default
   [junit4]   2> 47590 INFO  (searcherExecutor-74-thread-1-processing-x:collection1) [    x:collection1] o.a.s.h.c.SpellCheckComponent Loading spell index for spellchecker: direct
   [junit4]   2> 47590 INFO  (searcherExecutor-74-thread-1-processing-x:collection1) [    x:collection1] o.a.s.h.c.SpellCheckComponent Loading spell index for spellchecker: wordbreak
   [junit4]   2> 47590 INFO  (searcherExecutor-74-thread-1-processing-x:collection1) [    x:collection1] o.a.s.h.c.SpellCheckComponent Loading spell index for spellchecker: multipleFields
   [junit4]   2> 47591 INFO  (TEST-TestArbitraryIndexDir.testLoadNewIndexDir-seed#[6A3168754C350B07]) [    x:collection1] o.a.s.c.S.Request [collection1]  webapp=null path=null params={q=id:2&qt=standard&start=0&rows=20&version=2.2} hits=0 status=0 QTime=6
   [junit4]   2> 47592 ERROR (TEST-TestArbitraryIndexDir.testLoadNewIndexDir-seed#[6A3168754C350B07]) [    x:collection1] o.a.s.SolrTestCaseJ4 REQUEST FAILED: xpath=*[count(//doc)=1]
   [junit4]   2> 	xml response was: <?xml version="1.0" encoding="UTF-8"?>
   [junit4]   2> <response>
   [junit4]   2> <lst name="responseHeader"><int name="status">0</int><int name="QTime">6</int></lst><result name="response" numFound="0" start="0"></result>
   [junit4]   2> </response>
   [junit4]   2> 
   [junit4]   2> 	request was:q=id:2&qt=standard&start=0&rows=20&version=2.2
   [junit4]   2> 47592 ERROR (TEST-TestArbitraryIndexDir.testLoadNewIndexDir-seed#[6A3168754C350B07]) [    x:collection1] o.a.s.SolrTestCaseJ4 REQUEST FAILED: q=id:2&qt=standard&start=0&rows=20&version=2.2:java.lang.RuntimeException: REQUEST FAILED: xpath=*[count(//doc)=1]
   [junit4]   2> 	xml response was: <?xml version="1.0" encoding="UTF-8"?>
   [junit4]   2> <response>
   [junit4]   2> <lst name="responseHeader"><int name="status">0</int><int name="QTime">6</int></lst><result name="response" numFound="0" start="0"></result>
   [junit4]   2> </response>
   [junit4]   2> 
   [junit4]   2> 	request was:q=id:2&qt=standard&start=0&rows=20&version=2.2
   [junit4]   2> 	at org.apache.solr.SolrTestCaseJ4.assertQ(SolrTestCaseJ4.java:758)
   [junit4]   2> 	at org.apache.solr.core.TestArbitraryIndexDir.testLoadNewIndexDir(TestArbitraryIndexDir.java:107)
   [junit4]   2> 	at sun.reflect.NativeMethodAccessorImpl.invoke0(Native Method)
   [junit4]   2> 	at sun.reflect.NativeMethodAccessorImpl.invoke(NativeMethodAccessorImpl.java:62)
   [junit4]   2> 	at sun.reflect.DelegatingMethodAccessorImpl.invoke(DelegatingMethodAccessorImpl.java:43)
   [junit4]   2> 	at java.lang.reflect.Method.invoke(Method.java:498)
   [junit4]   2> 	at com.carrotsearch.randomizedtesting.RandomizedRunner.invoke(RandomizedRunner.java:1764)
   [junit4]   2> 	at com.carrotsearch.randomizedtesting.RandomizedRunner$8.evaluate(RandomizedRunner.java:871)
   [junit4]   2> 	at com.carrotsearch.randomizedtesting.RandomizedRunner$9.evaluate(RandomizedRunner.java:907)
   [junit4]   2> 	at com.carrotsearch.randomizedtesting.RandomizedRunner$10.evaluate(RandomizedRunner.java:921)
   [junit4]   2> 	at com.carrotsearch.randomizedtesting.rules.SystemPropertiesRestoreRule$1.evaluate(SystemPropertiesRestoreRule.java:57)
   [junit4]   2> 	at com.carrotsearch.randomizedtesting.rules.SystemPropertiesRestoreRule$1.evaluate(SystemPropertiesRestoreRule.java:57)
   [junit4]   2> 	at org.apache.lucene.util.TestRuleSetupTeardownChained$1.evaluate(TestRuleSetupTeardownChained.java:49)
   [junit4]   2> 	at org.apache.lucene.util.AbstractBeforeAfterRule$1.evaluate(AbstractBeforeAfterRule.java:45)
   [junit4]   2> 	at org.apache.lucene.util.TestRuleThreadAndTestName$1.evaluate(TestRuleThreadAndTestName.java:48)
   [junit4]   2> 	at org.apache.lucene.util.TestRuleIgnoreAfterMaxFailures$1.evaluate(TestRuleIgnoreAfterMaxFailures.java:64)
   [junit4]   2> 	at org.apache.lucene.util.TestRuleMarkFailure$1.evaluate(TestRuleMarkFailure.java:47)
   [junit4]   2> 	at com.carrotsearch.randomizedtesting.rules.StatementAdapter.evaluate(StatementAdapter.java:36)
   [junit4]   2> 	at com.carrotsearch.randomizedtesting.ThreadLeakControl$StatementRunner.run(ThreadLeakControl.java:367)
   [junit4]   2> 	at com.carrotsearch.randomizedtesting.ThreadLeakControl.forkTimeoutingTask(ThreadLeakControl.java:809)
   [junit4]   2> 	at com.carrotsearch.randomizedtesting.ThreadLeakControl$3.evaluate(ThreadLeakControl.java:460)
   [junit4]   2> 	at com.carrotsearch.randomizedtesting.RandomizedRunner.runSingleTest(RandomizedRunner.java:880)
   [junit4]   2> 	at com.carrotsearch.randomizedtesting.RandomizedRunner$5.evaluate(RandomizedRunner.java:781)
   [junit4]   2> 	at com.carrotsearch.randomizedtesting.RandomizedRunner$6.evaluate(RandomizedRunner.java:816)
   [junit4]   2> 	at com.carrotsearch.randomizedtesting.RandomizedRunner$7.evaluate(RandomizedRunner.java:827)
   [junit4]   2> 	at com.carrotsearch.randomizedtesting.rules.StatementAdapter.evaluate(StatementAdapter.java:36)
   [junit4]   2> 	at com.carrotsearch.randomizedtesting.rules.SystemPropertiesRestoreRule$1.evaluate(SystemPropertiesRestoreRule.java:57)
   [junit4]   2> 	at org.apache.lucene.util.AbstractBeforeAfterRule$1.evaluate(AbstractBeforeAfterRule.java:45)
   [junit4]   2> 	at com.carrotsearch.randomizedtesting.rules.StatementAdapter.evaluate(StatementAdapter.java:36)
   [junit4]   2> 	at org.apache.lucene.util.TestRuleStoreClassName$1.evaluate(TestRuleStoreClassName.java:41)
   [junit4]   2> 	at com.carrotsearch.randomizedtesting.rules.NoShadowingOrOverridesOnMethodsRule$1.evaluate(NoShadowingOrOverridesOnMethodsRule.java:40)
   [junit4]   2> 	at com.carrotsearch.randomizedtesting.rules.NoShadowingOrOverridesOnMethodsRule$1.evaluate(NoShadowingOrOverridesOnMethodsRule.java:40)
   [junit4]   2> 	at com.carrotsearch.randomizedtesting.rules.StatementAdapter.evaluate(StatementAdapter.java:36)
   [junit4]   2> 	at com.carrotsearch.randomizedtesting.rules.StatementAdapter.evaluate(StatementAdapter.java:36)
   [junit4]   2> 	at com.carrotsearch.randomizedtesting.rules.StatementAdapter.evaluate(StatementAdapter.java:36)
   [junit4]   2> 	at org.apache.lucene.util.TestRuleAssertionsRequired$1.evaluate(TestRuleAssertionsRequired.java:53)
   [junit4]   2> 	at org.apache.lucene.util.TestRuleMarkFailure$1.evaluate(TestRuleMarkFailure.java:47)
   [junit4]   2> 	at org.apache.lucene.util.TestRuleIgnoreAfterMaxFailures$1.evaluate(TestRuleIgnoreAfterMaxFailures.java:64)
   [junit4]   2> 	at org.apache.lucene.util.TestRuleIgnoreTestSuites$1.evaluate(TestRuleIgnoreTestSuites.java:54)
   [junit4]   2> 	at com.carrotsearch.randomizedtesting.rules.StatementAdapter.evaluate(StatementAdapter.java:36)
   [junit4]   2> 	at com.carrotsearch.randomizedtesting.ThreadLeakControl$StatementRunner.run(ThreadLeakControl.java:367)
   [junit4]   2> 	at java.lang.Thread.run(Thread.java:745)
   [junit4]   2> 
   [junit4]   2> 47593 INFO  (TEST-TestArbitraryIndexDir.testLoadNewIndexDir-seed#[6A3168754C350B07]) [    x:collection1] o.a.s.SolrTestCaseJ4 ###Ending testLoadNewIndexDir
   [junit4]   2> 47596 INFO  (searcherExecutor-74-thread-1-processing-x:collection1) [    x:collection1] o.a.s.h.c.SpellCheckComponent Loading spell index for spellchecker: jarowinkler
   [junit4]   2> 47596 INFO  (searcherExecutor-74-thread-1-processing-x:collection1) [    x:collection1] o.a.s.h.c.SpellCheckComponent Loading spell index for spellchecker: external
   [junit4]   2> 47597 INFO  (searcherExecutor-74-thread-1-processing-x:collection1) [    x:collection1] o.a.s.h.c.SpellCheckComponent Loading spell index for spellchecker: freq
   [junit4]   2> 47598 INFO  (searcherExecutor-74-thread-1-processing-x:collection1) [    x:collection1] o.a.s.h.c.SpellCheckComponent Loading spell index for spellchecker: fqcn
   [junit4]   2> 47599 INFO  (searcherExecutor-74-thread-1-processing-x:collection1) [    x:collection1] o.a.s.h.c.SpellCheckComponent Loading spell index for spellchecker: perDict
   [junit4]   2> 47601 INFO  (searcherExecutor-74-thread-1-processing-x:collection1) [    x:collection1] o.a.s.c.SolrCore [collection1] Registered new searcher Searcher@70180e1b[collection1] main{ExitableDirectoryReader(UninvertingDirectoryReader(Uninverting(_0(6.1.0):c1)))}
   [junit4]   2> NOTE: reproduce with: ant test  -Dtestcase=TestArbitraryIndexDir -Dtests.method=testLoadNewIndexDir -Dtests.seed=6A3168754C350B07 -Dtests.slow=true -Dtests.locale=en-SG -Dtests.timezone=Africa/Nairobi -Dtests.asserts=true -Dtests.file.encoding=UTF-8
   [junit4] ERROR   1.40s J0 | TestArbitraryIndexDir.testLoadNewIndexDir <<<
   [junit4]    > Throwable #1: java.lang.RuntimeException: Exception during query
   [junit4]    > 	at __randomizedtesting.SeedInfo.seed([6A3168754C350B07:836BD34DD2AC9BAF]:0)
   [junit4]    > 	at org.apache.solr.SolrTestCaseJ4.assertQ(SolrTestCaseJ4.java:765)
   [junit4]    > 	at org.apache.solr.core.TestArbitraryIndexDir.testLoadNewIndexDir(TestArbitraryIndexDir.java:107)
   [junit4]    > 	at java.lang.Thread.run(Thread.java:745)
   [junit4]    > Caused by: java.lang.RuntimeException: REQUEST FAILED: xpath=*[count(//doc)=1]
   [junit4]    > 	xml response was: <?xml version="1.0" encoding="UTF-8"?>
   [junit4]    > <response>
   [junit4]    > <lst name="responseHeader"><int name="status">0</int><int name="QTime">6</int></lst><result name="response" numFound="0" start="0"></result>
   [junit4]    > </response>
   [junit4]    > 	request was:q=id:2&qt=standard&start=0&rows=20&version=2.2
   [junit4]    > 	at org.apache.solr.SolrTestCaseJ4.assertQ(SolrTestCaseJ4.java:758)
   [junit4]    > 	... 41 more
   [junit4]   2> 47602 INFO  (SUITE-TestArbitraryIndexDir-seed#[6A3168754C350B07]-worker) [    x:collection1] o.a.s.SolrTestCaseJ4 ###deleteCore
   [junit4]   2> 47602 INFO  (SUITE-TestArbitraryIndexDir-seed#[6A3168754C350B07]-worker) [    x:collection1] o.a.s.c.CoreContainer Shutting down CoreContainer instance=645437198
   [junit4]   2> 47603 INFO  (coreCloseExecutor-78-thread-1-processing-x:collection1) [    x:collection1] o.a.s.c.SolrCore [collection1]  CLOSING SolrCore org.apache.solr.core.SolrCore@769d9cf0
   [junit4]   2> 47603 INFO  (coreCloseExecutor-78-thread-1-processing-x:collection1) [    x:collection1] o.a.s.u.DirectUpdateHandler2 closing DirectUpdateHandler2{commits=0,autocommits=0,soft autocommits=0,optimizes=0,rollbacks=0,expungeDeletes=0,docsPending=0,adds=0,deletesById=0,deletesByQuery=0,errors=0,cumulative_adds=0,cumulative_deletesById=0,cumulative_deletesByQuery=0,cumulative_errors=0}
   [junit4]   2> 47604 INFO  (coreCloseExecutor-78-thread-1-processing-x:collection1) [    x:collection1] o.a.s.u.SolrCoreState Closing SolrCoreState
   [junit4]   2> 47604 INFO  (coreCloseExecutor-78-thread-1-processing-x:collection1) [    x:collection1] o.a.s.u.DefaultSolrCoreState SolrCoreState ref count has reached 0 - closing IndexWriter
   [junit4]   2> 47604 INFO  (coreCloseExecutor-78-thread-1-processing-x:collection1) [    x:collection1] o.a.s.u.DefaultSolrCoreState closing IndexWriter with IndexWriterCloser
   [junit4]   2> 47608 INFO  (coreCloseExecutor-78-thread-1-processing-x:collection1) [    x:collection1] o.a.s.c.SolrCore [collection1] Closing main searcher on request.
   [junit4]   2> 47609 INFO  (coreCloseExecutor-78-thread-1-processing-x:collection1) [    x:collection1] o.a.s.c.CachingDirectoryFactory Closing MockFSDirectoryFactory - 3 directories currently being tracked
   [junit4]   2> 47609 INFO  (coreCloseExecutor-78-thread-1-processing-x:collection1) [    x:collection1] o.a.s.c.CachingDirectoryFactory looking to close /export/home/jenkins/workspace/Lucene-Solr-6.x-Solaris/solr/build/solr-core/test/J0/temp/solr.core.TestArbitraryIndexDir_6A3168754C350B07-001/init-core-data-001/index_temp [CachedDir<<refCount=0;path=/export/home/jenkins/workspace/Lucene-Solr-6.x-Solaris/solr/build/solr-core/test/J0/temp/solr.core.TestArbitraryIndexDir_6A3168754C350B07-001/init-core-data-001/index_temp;done=false>>]
   [junit4]   2> 47609 INFO  (coreCloseExecutor-78-thread-1-processing-x:collection1) [    x:collection1] o.a.s.c.CachingDirectoryFactory Closing directory: /export/home/jenkins/workspace/Lucene-Solr-6.x-Solaris/solr/build/solr-core/test/J0/temp/solr.core.TestArbitraryIndexDir_6A3168754C350B07-001/init-core-data-001/index_temp
   [junit4]   2> 47640 INFO  (coreCloseExecutor-78-thread-1-processing-x:collection1) [    x:collection1] o.a.s.c.CachingDirectoryFactory looking to close /export/home/jenkins/workspace/Lucene-Solr-6.x-Solaris/solr/build/solr-core/test/J0/temp/solr.core.TestArbitraryIndexDir_6A3168754C350B07-001/init-core-data-001/index [CachedDir<<refCount=0;path=/export/home/jenkins/workspace/Lucene-Solr-6.x-Solaris/solr/build/solr-core/test/J0/temp/solr.core.TestArbitraryIndexDir_6A3168754C350B07-001/init-core-data-001/index;done=false>>]
   [junit4]   2> 47640 INFO  (coreCloseExecutor-78-thread-1-processing-x:collection1) [    x:collection1] o.a.s.c.CachingDirectoryFactory Closing directory: /export/home/jenkins/workspace/Lucene-Solr-6.x-Solaris/solr/build/solr-core/test/J0/temp/solr.core.TestArbitraryIndexDir_6A3168754C350B07-001/init-core-data-001/index
   [junit4]   2> 47647 INFO  (coreCloseExecutor-78-thread-1-processing-x:collection1) [    x:collection1] o.a.s.c.CachingDirectoryFactory looking to close /export/home/jenkins/workspace/Lucene-Solr-6.x-Solaris/solr/build/solr-core/test/J0/temp/solr.core.TestArbitraryIndexDir_6A3168754C350B07-001/init-core-data-001 [CachedDir<<refCount=0;path=/export/home/jenkins/workspace/Lucene-Solr-6.x-Solaris/solr/build/solr-core/test/J0/temp/solr.core.TestArbitraryIndexDir_6A3168754C350B07-001/init-core-data-001;done=false>>]
   [junit4]   2> 47647 INFO  (coreCloseExecutor-78-thread-1-processing-x:collection1) [    x:collection1] o.a.s.c.CachingDirectoryFactory Closing directory: /export/home/jenkins/workspace/Lucene-Solr-6.x-Solaris/solr/build/solr-core/test/J0/temp/solr.core.TestArbitraryIndexDir_6A3168754C350B07-001/init-core-data-001
   [junit4]   2> NOTE: leaving temporary files on disk at: /export/home/jenkins/workspace/Lucene-Solr-6.x-Solaris/solr/build/solr-core/test/J0/temp/solr.core.TestArbitraryIndexDir_6A3168754C350B07-001
   [junit4]   2> NOTE: test params are: codec=Asserting(Lucene60): {name=FST50, id=FST50}, docValues:{}, maxPointsInLeafNode=943, maxMBSortInHeap=5.230054798584266, sim=RandomSimilarity(queryNorm=false,coord=no): {}, locale=en-SG, timezone=Africa/Nairobi
   [junit4]   2> NOTE: SunOS 5.11 amd64/Oracle Corporation 1.8.0_72 (64-bit)/cpus=3,threads=1,free=81196416,total=222298112
   [junit4]   2> NOTE: All tests run in this JVM: [TestReplicationHandlerBackup, TestDocBasedVersionConstraints, TestSortingResponseWriter, TestLFUCache, TestArbitraryIndexDir]
   [junit4] Completed [8/585 (1!)] on J0 in 1.47s, 1 test, 1 error <<< FAILURES!

[...truncated 1873 lines...]
BUILD FAILED
/export/home/jenkins/workspace/Lucene-Solr-6.x-Solaris/build.xml:740: The following error occurred while executing this line:
/export/home/jenkins/workspace/Lucene-Solr-6.x-Solaris/build.xml:684: The following error occurred while executing this line:
/export/home/jenkins/workspace/Lucene-Solr-6.x-Solaris/build.xml:59: The following error occurred while executing this line:
/export/home/jenkins/workspace/Lucene-Solr-6.x-Solaris/solr/build.xml:233: The following error occurred while executing this line:
/export/home/jenkins/workspace/Lucene-Solr-6.x-Solaris/solr/common-build.xml:529: The following error occurred while executing this line:
/export/home/jenkins/workspace/Lucene-Solr-6.x-Solaris/lucene/common-build.xml:1457: The following error occurred while executing this line:
/export/home/jenkins/workspace/Lucene-Solr-6.x-Solaris/lucene/common-build.xml:1014: There were test failures: 585 suites (10 ignored), 2364 tests, 1 error, 86 ignored (70 assumptions) [seed: 6A3168754C350B07]

Total time: 77 minutes 17 seconds
Build step 'Invoke Ant' marked build as failure
Archiving artifacts
[WARNINGS] Skipping publisher since build result is FAILURE
Recording test results
Email was triggered for: Failure - Any
Sending email for trigger: Failure - Any



Mime
View raw message