lucene-dev mailing list archives

Site index · List index
Message view « Date » · « Thread »
Top « Date » · « Thread »
From Policeman Jenkins Server <jenk...@thetaphi.de>
Subject [JENKINS-EA] Lucene-Solr-5.5-Linux (64bit/jdk-9-ea+107) - Build # 196 - Still Failing!
Date Wed, 02 Mar 2016 21:38:05 GMT
Build: http://jenkins.thetaphi.de/job/Lucene-Solr-5.5-Linux/196/
Java: 64bit/jdk-9-ea+107 -XX:+UseCompressedOops -XX:+UseG1GC

1 tests failed.
FAILED:  org.apache.lucene.search.TestMinShouldMatch2.testAdvanceAllTerms

Error Message:


Stack Trace:
java.lang.AssertionError
	at __randomizedtesting.SeedInfo.seed([96E4EC55F351970B:36AF6AC481638F0]:0)
	at org.apache.lucene.search.BooleanScorer.scoreWindowIntoBitSetAndReplay(BooleanScorer.java:218)
	at org.apache.lucene.search.BooleanScorer.scoreWindowMultipleScorers(BooleanScorer.java:266)
	at org.apache.lucene.search.BooleanScorer.scoreWindow(BooleanScorer.java:311)
	at org.apache.lucene.search.BooleanScorer.score(BooleanScorer.java:335)
	at org.apache.lucene.search.BulkScorerWrapperScorer.refill(BulkScorerWrapperScorer.java:52)
	at org.apache.lucene.search.BulkScorerWrapperScorer.access$500(BulkScorerWrapperScorer.java:25)
	at org.apache.lucene.search.BulkScorerWrapperScorer$2.advance(BulkScorerWrapperScorer.java:101)
	at org.apache.lucene.search.TestMinShouldMatch2.assertAdvance(TestMinShouldMatch2.java:176)
	at org.apache.lucene.search.TestMinShouldMatch2.testAdvanceAllTerms(TestMinShouldMatch2.java:257)
	at sun.reflect.NativeMethodAccessorImpl.invoke0(Native Method)
	at sun.reflect.NativeMethodAccessorImpl.invoke(NativeMethodAccessorImpl.java:62)
	at sun.reflect.DelegatingMethodAccessorImpl.invoke(DelegatingMethodAccessorImpl.java:43)
	at java.lang.reflect.Method.invoke(Method.java:520)
	at com.carrotsearch.randomizedtesting.RandomizedRunner.invoke(RandomizedRunner.java:1764)
	at com.carrotsearch.randomizedtesting.RandomizedRunner$8.evaluate(RandomizedRunner.java:871)
	at com.carrotsearch.randomizedtesting.RandomizedRunner$9.evaluate(RandomizedRunner.java:907)
	at com.carrotsearch.randomizedtesting.RandomizedRunner$10.evaluate(RandomizedRunner.java:921)
	at org.apache.lucene.util.TestRuleSetupTeardownChained$1.evaluate(TestRuleSetupTeardownChained.java:49)
	at org.apache.lucene.util.AbstractBeforeAfterRule$1.evaluate(AbstractBeforeAfterRule.java:45)
	at org.apache.lucene.util.TestRuleThreadAndTestName$1.evaluate(TestRuleThreadAndTestName.java:48)
	at org.apache.lucene.util.TestRuleIgnoreAfterMaxFailures$1.evaluate(TestRuleIgnoreAfterMaxFailures.java:64)
	at org.apache.lucene.util.TestRuleMarkFailure$1.evaluate(TestRuleMarkFailure.java:47)
	at com.carrotsearch.randomizedtesting.rules.StatementAdapter.evaluate(StatementAdapter.java:36)
	at com.carrotsearch.randomizedtesting.ThreadLeakControl$StatementRunner.run(ThreadLeakControl.java:367)
	at com.carrotsearch.randomizedtesting.ThreadLeakControl.forkTimeoutingTask(ThreadLeakControl.java:809)
	at com.carrotsearch.randomizedtesting.ThreadLeakControl$3.evaluate(ThreadLeakControl.java:460)
	at com.carrotsearch.randomizedtesting.RandomizedRunner.runSingleTest(RandomizedRunner.java:880)
	at com.carrotsearch.randomizedtesting.RandomizedRunner$5.evaluate(RandomizedRunner.java:781)
	at com.carrotsearch.randomizedtesting.RandomizedRunner$6.evaluate(RandomizedRunner.java:816)
	at com.carrotsearch.randomizedtesting.RandomizedRunner$7.evaluate(RandomizedRunner.java:827)
	at org.apache.lucene.util.AbstractBeforeAfterRule$1.evaluate(AbstractBeforeAfterRule.java:45)
	at com.carrotsearch.randomizedtesting.rules.StatementAdapter.evaluate(StatementAdapter.java:36)
	at org.apache.lucene.util.TestRuleStoreClassName$1.evaluate(TestRuleStoreClassName.java:41)
	at com.carrotsearch.randomizedtesting.rules.NoShadowingOrOverridesOnMethodsRule$1.evaluate(NoShadowingOrOverridesOnMethodsRule.java:40)
	at com.carrotsearch.randomizedtesting.rules.NoShadowingOrOverridesOnMethodsRule$1.evaluate(NoShadowingOrOverridesOnMethodsRule.java:40)
	at com.carrotsearch.randomizedtesting.rules.StatementAdapter.evaluate(StatementAdapter.java:36)
	at com.carrotsearch.randomizedtesting.rules.StatementAdapter.evaluate(StatementAdapter.java:36)
	at com.carrotsearch.randomizedtesting.rules.StatementAdapter.evaluate(StatementAdapter.java:36)
	at org.apache.lucene.util.TestRuleAssertionsRequired$1.evaluate(TestRuleAssertionsRequired.java:53)
	at org.apache.lucene.util.TestRuleMarkFailure$1.evaluate(TestRuleMarkFailure.java:47)
	at org.apache.lucene.util.TestRuleIgnoreAfterMaxFailures$1.evaluate(TestRuleIgnoreAfterMaxFailures.java:64)
	at org.apache.lucene.util.TestRuleIgnoreTestSuites$1.evaluate(TestRuleIgnoreTestSuites.java:54)
	at com.carrotsearch.randomizedtesting.rules.StatementAdapter.evaluate(StatementAdapter.java:36)
	at com.carrotsearch.randomizedtesting.ThreadLeakControl$StatementRunner.run(ThreadLeakControl.java:367)
	at java.lang.Thread.run(Thread.java:804)




Build Log:
[...truncated 1553 lines...]
   [junit4] Suite: org.apache.lucene.search.TestMinShouldMatch2
   [junit4]   2> NOTE: reproduce with: ant test  -Dtestcase=TestMinShouldMatch2 -Dtests.method=testAdvanceAllTerms
-Dtests.seed=96E4EC55F351970B -Dtests.multiplier=3 -Dtests.slow=true -Dtests.locale=smn -Dtests.timezone=Atlantic/Cape_Verde
-Dtests.asserts=true -Dtests.file.encoding=UTF-8
   [junit4] FAILURE 0.00s J1 | TestMinShouldMatch2.testAdvanceAllTerms <<<
   [junit4]    > Throwable #1: java.lang.AssertionError
   [junit4]    > 	at __randomizedtesting.SeedInfo.seed([96E4EC55F351970B:36AF6AC481638F0]:0)
   [junit4]    > 	at org.apache.lucene.search.BooleanScorer.scoreWindowIntoBitSetAndReplay(BooleanScorer.java:218)
   [junit4]    > 	at org.apache.lucene.search.BooleanScorer.scoreWindowMultipleScorers(BooleanScorer.java:266)
   [junit4]    > 	at org.apache.lucene.search.BooleanScorer.scoreWindow(BooleanScorer.java:311)
   [junit4]    > 	at org.apache.lucene.search.BooleanScorer.score(BooleanScorer.java:335)
   [junit4]    > 	at org.apache.lucene.search.BulkScorerWrapperScorer.refill(BulkScorerWrapperScorer.java:52)
   [junit4]    > 	at org.apache.lucene.search.BulkScorerWrapperScorer.access$500(BulkScorerWrapperScorer.java:25)
   [junit4]    > 	at org.apache.lucene.search.BulkScorerWrapperScorer$2.advance(BulkScorerWrapperScorer.java:101)
   [junit4]    > 	at org.apache.lucene.search.TestMinShouldMatch2.assertAdvance(TestMinShouldMatch2.java:176)
   [junit4]    > 	at org.apache.lucene.search.TestMinShouldMatch2.testAdvanceAllTerms(TestMinShouldMatch2.java:257)
   [junit4]    > 	at java.lang.Thread.run(Thread.java:804)
   [junit4]   2> NOTE: test params are: codec=Asserting(Lucene54): {field=PostingsFormat(name=Direct)},
docValues:{dv=DocValuesFormat(name=Memory)}, sim=RandomSimilarity(queryNorm=false,coord=crazy):
{}, locale=smn, timezone=Atlantic/Cape_Verde
   [junit4]   2> NOTE: Linux 3.19.0-51-generic amd64/Oracle Corporation 9-ea (64-bit)/cpus=12,threads=1,free=162012584,total=514850816
   [junit4]   2> NOTE: All tests run in this JVM: [TestMatchAllDocsQuery, TestBinaryTerms,
TestSimpleFSLockFactory, TestPrefixRandom, TestSpansAdvanced2, TestSpanTermQuery, TestSpanSearchEquivalence,
TestIndexWriterOnDiskFull, TestUnicodeUtil, TestStressDeletes, TestStressAdvance, TestFixedBitSet,
TestPositionIncrement, TestMathUtil, TestTermsEnum2, TestForceMergeForever, TestIntBlockPool,
TestByteBlockPool, TestTimSorterWorstCase, TestSearchAfter, TestSmallFloat, TestByteSlices,
TestManyFields, TestNewestSegment, TestMutableValues, TestRollback, TestUpgradeIndexMergePolicy,
TestFlex, TestSimpleAttributeImpl, TestLRUQueryCache, TestMergeSchedulerExternal, TestPrefixFilter,
TestDocument, TestAllFilesHaveChecksumFooter, TestReadOnlyIndex, TestReaderClosed, TestPayloads,
TestLockFactory, TestNRTReaderWithThreads, TestFieldCacheRewriteMethod, TestDocumentsWriterStallControl,
TestPackedInts, TestSortedSetSelector, TestSpanMultiTermQueryWrapper, TestNativeFSLockFactory,
TestTransactionRollback, Test2BTerms, TestBoolean2, TestDocValuesScoring, TestNoMergePolicy,
TestCharsRefBuilder, TestLucene50StoredFieldsFormatHighCompression, TestSparseFixedBitSet,
TestFieldsReader, TestLucene50FieldInfoFormat, TestNRTReaderCleanup, TestTerms, TestAllFilesHaveCodecHeader,
TestRecyclingIntBlockAllocator, TestMultiCollector, TestStressIndexing, TestCodecs, TestBlendedTermQuery,
TestNeedsScores, TestWeakIdentityMap, TestFieldMaskingSpanQuery, TestNamedSPILoader, TestTermScorer,
TestAddIndexes, TestBytesRefAttImpl, TestMultiMMap, TestSearcherManager, TestDeletionPolicy,
TestBasics, TestNRTThreads, TestPersistentSnapshotDeletionPolicy, TestAtomicUpdate, TestDirectoryReaderReopen,
TestTimeLimitingCollector, TestHighCompressionMode, TestNeverDelete, TestMinimize, TestRollingUpdates,
TestIndexWriterUnicode, TestIndexWriterForceMerge, TestArrayUtil, TestLevenshteinAutomata,
TestSimpleExplanations, TestDirectoryReader, TestCollectionUtil, TestCrash, TestSegmentTermDocs,
TestPerFieldPostingsFormat2, TestToken, TestCustomSearcherSort, TestBooleanMinShouldMatch,
TestStressIndexing2, TestRAMDirectory, TestLazyProxSkipping, TestOmitPositions, TestIndexInput,
TestTermRangeQuery, TestDocumentsWriterDeleteQueue, TestDocumentWriter, TestScorerPerf, TestPriorityQueue,
TestAttributeSource, TestRamUsageEstimator, TestIndexWriterLockRelease, TestAssertions, MultiCollectorTest,
TestTermdocPerf, TestTerm, Test2BNumericDocValues, TestBlockPostingsFormat2, TestBlockPostingsFormat3,
TestLucene50CompoundFormat, TestLucene50TermVectorsFormat, Test2BSortedDocValuesOrds, TestAllFilesDetectTruncation,
TestCodecUtil, TestDemoParallelLeafReader, TestDocInverterPerFieldErrorInfo, TestDocValues,
TestDuelingCodecsAtNight, TestExceedMaxTermLength, TestFieldReuse, TestFilterDirectoryReader,
TestIndexReaderClose, TestIndexWriterDeleteByQuery, TestIndexWriterExceptions2, TestIndexWriterFromReader,
TestIndexWriterMaxDocs, TestIndexWriterThreadsToSegments, TestInfoStream, TestLogMergePolicy,
TestMaxPosition, TestMergePolicyWrapper, TestMergeRateLimiter, TestMixedDocValuesUpdates,
TestMultiTermsEnum, TestNumericDocValuesUpdates, TestOrdinalMap, TestSegmentInfos, TestTragicIndexWriterDeadlock,
TestApproximationSearchEquivalence, TestBooleanRewrites, TestBoostQuery, TestConjunctionDISI,
TestControlledRealTimeReopenThread, TestDocValuesRewriteMethod, TestFieldValueQuery, TestLRUFilterCache,
TestMinShouldMatch2]
   [junit4] Completed [391/421 (1!)] on J1 in 2.02s, 6 tests, 1 failure <<< FAILURES!

[...truncated 200 lines...]
BUILD FAILED
/home/jenkins/workspace/Lucene-Solr-5.5-Linux/build.xml:750: The following error occurred
while executing this line:
/home/jenkins/workspace/Lucene-Solr-5.5-Linux/build.xml:694: The following error occurred
while executing this line:
/home/jenkins/workspace/Lucene-Solr-5.5-Linux/build.xml:59: The following error occurred while
executing this line:
/home/jenkins/workspace/Lucene-Solr-5.5-Linux/lucene/build.xml:50: The following error occurred
while executing this line:
/home/jenkins/workspace/Lucene-Solr-5.5-Linux/lucene/common-build.xml:1477: The following
error occurred while executing this line:
/home/jenkins/workspace/Lucene-Solr-5.5-Linux/lucene/common-build.xml:1033: There were test
failures: 421 suites (1 ignored), 3386 tests, 1 failure, 143 ignored (139 assumptions) [seed:
96E4EC55F351970B]

Total time: 7 minutes 50 seconds
Build step 'Invoke Ant' marked build as failure
Archiving artifacts
[WARNINGS] Skipping publisher since build result is FAILURE
Recording test results
Email was triggered for: Failure - Any
Sending email for trigger: Failure - Any



Mime
View raw message