lucene-dev mailing list archives

Site index · List index
Message view « Date » · « Thread »
Top « Date » · « Thread »
From Apache Jenkins Server <jenk...@builds.apache.org>
Subject [JENKINS] Lucene-Solr-Tests-trunk-Java8 - Build # 936 - Still Failing
Date Wed, 02 Mar 2016 22:46:41 GMT
Build: https://builds.apache.org/job/Lucene-Solr-Tests-trunk-Java8/936/

1 tests failed.
FAILED:  org.apache.solr.cloud.CollectionsAPIDistributedZkTest.test

Error Message:
some core start times did not change on reload

Stack Trace:
java.lang.AssertionError: some core start times did not change on reload
	at __randomizedtesting.SeedInfo.seed([1B239A1DEF9ABFE4:9377A5C74166D21C]:0)
	at org.junit.Assert.fail(Assert.java:93)
	at org.junit.Assert.assertTrue(Assert.java:43)
	at org.apache.solr.cloud.CollectionsAPIDistributedZkTest.testCollectionsAPI(CollectionsAPIDistributedZkTest.java:835)
	at org.apache.solr.cloud.CollectionsAPIDistributedZkTest.test(CollectionsAPIDistributedZkTest.java:167)
	at sun.reflect.NativeMethodAccessorImpl.invoke0(Native Method)
	at sun.reflect.NativeMethodAccessorImpl.invoke(NativeMethodAccessorImpl.java:62)
	at sun.reflect.DelegatingMethodAccessorImpl.invoke(DelegatingMethodAccessorImpl.java:43)
	at java.lang.reflect.Method.invoke(Method.java:497)
	at com.carrotsearch.randomizedtesting.RandomizedRunner.invoke(RandomizedRunner.java:1764)
	at com.carrotsearch.randomizedtesting.RandomizedRunner$8.evaluate(RandomizedRunner.java:871)
	at com.carrotsearch.randomizedtesting.RandomizedRunner$9.evaluate(RandomizedRunner.java:907)
	at com.carrotsearch.randomizedtesting.RandomizedRunner$10.evaluate(RandomizedRunner.java:921)
	at org.apache.solr.BaseDistributedSearchTestCase$ShardsRepeatRule$ShardsFixedStatement.callStatement(BaseDistributedSearchTestCase.java:996)
	at org.apache.solr.BaseDistributedSearchTestCase$ShardsRepeatRule$ShardsStatement.evaluate(BaseDistributedSearchTestCase.java:971)
	at com.carrotsearch.randomizedtesting.rules.SystemPropertiesRestoreRule$1.evaluate(SystemPropertiesRestoreRule.java:57)
	at org.apache.lucene.util.TestRuleSetupTeardownChained$1.evaluate(TestRuleSetupTeardownChained.java:49)
	at org.apache.lucene.util.AbstractBeforeAfterRule$1.evaluate(AbstractBeforeAfterRule.java:45)
	at org.apache.lucene.util.TestRuleThreadAndTestName$1.evaluate(TestRuleThreadAndTestName.java:48)
	at org.apache.lucene.util.TestRuleIgnoreAfterMaxFailures$1.evaluate(TestRuleIgnoreAfterMaxFailures.java:64)
	at org.apache.lucene.util.TestRuleMarkFailure$1.evaluate(TestRuleMarkFailure.java:47)
	at com.carrotsearch.randomizedtesting.rules.StatementAdapter.evaluate(StatementAdapter.java:36)
	at com.carrotsearch.randomizedtesting.ThreadLeakControl$StatementRunner.run(ThreadLeakControl.java:367)
	at com.carrotsearch.randomizedtesting.ThreadLeakControl.forkTimeoutingTask(ThreadLeakControl.java:809)
	at com.carrotsearch.randomizedtesting.ThreadLeakControl$3.evaluate(ThreadLeakControl.java:460)
	at com.carrotsearch.randomizedtesting.RandomizedRunner.runSingleTest(RandomizedRunner.java:880)
	at com.carrotsearch.randomizedtesting.RandomizedRunner$5.evaluate(RandomizedRunner.java:781)
	at com.carrotsearch.randomizedtesting.RandomizedRunner$6.evaluate(RandomizedRunner.java:816)
	at com.carrotsearch.randomizedtesting.RandomizedRunner$7.evaluate(RandomizedRunner.java:827)
	at com.carrotsearch.randomizedtesting.rules.StatementAdapter.evaluate(StatementAdapter.java:36)
	at com.carrotsearch.randomizedtesting.rules.SystemPropertiesRestoreRule$1.evaluate(SystemPropertiesRestoreRule.java:57)
	at org.apache.lucene.util.AbstractBeforeAfterRule$1.evaluate(AbstractBeforeAfterRule.java:45)
	at com.carrotsearch.randomizedtesting.rules.StatementAdapter.evaluate(StatementAdapter.java:36)
	at org.apache.lucene.util.TestRuleStoreClassName$1.evaluate(TestRuleStoreClassName.java:41)
	at com.carrotsearch.randomizedtesting.rules.NoShadowingOrOverridesOnMethodsRule$1.evaluate(NoShadowingOrOverridesOnMethodsRule.java:40)
	at com.carrotsearch.randomizedtesting.rules.NoShadowingOrOverridesOnMethodsRule$1.evaluate(NoShadowingOrOverridesOnMethodsRule.java:40)
	at com.carrotsearch.randomizedtesting.rules.StatementAdapter.evaluate(StatementAdapter.java:36)
	at com.carrotsearch.randomizedtesting.rules.StatementAdapter.evaluate(StatementAdapter.java:36)
	at com.carrotsearch.randomizedtesting.rules.StatementAdapter.evaluate(StatementAdapter.java:36)
	at org.apache.lucene.util.TestRuleAssertionsRequired$1.evaluate(TestRuleAssertionsRequired.java:53)
	at org.apache.lucene.util.TestRuleMarkFailure$1.evaluate(TestRuleMarkFailure.java:47)
	at org.apache.lucene.util.TestRuleIgnoreAfterMaxFailures$1.evaluate(TestRuleIgnoreAfterMaxFailures.java:64)
	at org.apache.lucene.util.TestRuleIgnoreTestSuites$1.evaluate(TestRuleIgnoreTestSuites.java:54)
	at com.carrotsearch.randomizedtesting.rules.StatementAdapter.evaluate(StatementAdapter.java:36)
	at com.carrotsearch.randomizedtesting.ThreadLeakControl$StatementRunner.run(ThreadLeakControl.java:367)
	at java.lang.Thread.run(Thread.java:745)




Build Log:
[...truncated 10539 lines...]
   [junit4] Suite: org.apache.solr.cloud.CollectionsAPIDistributedZkTest
   [junit4]   2> Creating dataDir: /x1/jenkins/jenkins-slave/workspace/Lucene-Solr-Tests-trunk-Java8/solr/build/solr-core/test/J1/temp/solr.cloud.CollectionsAPIDistributedZkTest_1B239A1DEF9ABFE4-001/init-core-data-001
   [junit4]   2> 50714 INFO  (SUITE-CollectionsAPIDistributedZkTest-seed#[1B239A1DEF9ABFE4]-worker) [    ] o.a.s.SolrTestCaseJ4 Randomized ssl (false) and clientAuth (false)
   [junit4]   2> 50714 INFO  (SUITE-CollectionsAPIDistributedZkTest-seed#[1B239A1DEF9ABFE4]-worker) [    ] o.a.s.BaseDistributedSearchTestCase Setting hostContext system property: /
   [junit4]   2> 50733 INFO  (TEST-CollectionsAPIDistributedZkTest.test-seed#[1B239A1DEF9ABFE4]) [    ] o.a.s.c.ZkTestServer STARTING ZK TEST SERVER
   [junit4]   2> 50737 INFO  (Thread-87) [    ] o.a.s.c.ZkTestServer client port:0.0.0.0/0.0.0.0:0
   [junit4]   2> 50737 INFO  (Thread-87) [    ] o.a.s.c.ZkTestServer Starting server
   [junit4]   2> 50837 INFO  (TEST-CollectionsAPIDistributedZkTest.test-seed#[1B239A1DEF9ABFE4]) [    ] o.a.s.c.ZkTestServer start zk server on port:55905
   [junit4]   2> 50837 INFO  (TEST-CollectionsAPIDistributedZkTest.test-seed#[1B239A1DEF9ABFE4]) [    ] o.a.s.c.c.SolrZkClient Using default ZkCredentialsProvider
   [junit4]   2> 50838 INFO  (TEST-CollectionsAPIDistributedZkTest.test-seed#[1B239A1DEF9ABFE4]) [    ] o.a.s.c.c.ConnectionManager Waiting for client to connect to ZooKeeper
   [junit4]   2> 50848 INFO  (zkCallback-38-thread-1) [    ] o.a.s.c.c.ConnectionManager Watcher org.apache.solr.common.cloud.ConnectionManager@1b46be4 name:ZooKeeperConnection Watcher:127.0.0.1:55905 got event WatchedEvent state:SyncConnected type:None path:null path:null type:None
   [junit4]   2> 50848 INFO  (TEST-CollectionsAPIDistributedZkTest.test-seed#[1B239A1DEF9ABFE4]) [    ] o.a.s.c.c.ConnectionManager Client is connected to ZooKeeper
   [junit4]   2> 50849 INFO  (TEST-CollectionsAPIDistributedZkTest.test-seed#[1B239A1DEF9ABFE4]) [    ] o.a.s.c.c.SolrZkClient Using default ZkACLProvider
   [junit4]   2> 50849 INFO  (TEST-CollectionsAPIDistributedZkTest.test-seed#[1B239A1DEF9ABFE4]) [    ] o.a.s.c.c.SolrZkClient makePath: /solr
   [junit4]   2> 50856 INFO  (TEST-CollectionsAPIDistributedZkTest.test-seed#[1B239A1DEF9ABFE4]) [    ] o.a.s.c.c.SolrZkClient Using default ZkCredentialsProvider
   [junit4]   2> 50856 INFO  (TEST-CollectionsAPIDistributedZkTest.test-seed#[1B239A1DEF9ABFE4]) [    ] o.a.s.c.c.ConnectionManager Waiting for client to connect to ZooKeeper
   [junit4]   2> 50859 INFO  (zkCallback-39-thread-1) [    ] o.a.s.c.c.ConnectionManager Watcher org.apache.solr.common.cloud.ConnectionManager@7b7a98f0 name:ZooKeeperConnection Watcher:127.0.0.1:55905/solr got event WatchedEvent state:SyncConnected type:None path:null path:null type:None
   [junit4]   2> 50859 INFO  (TEST-CollectionsAPIDistributedZkTest.test-seed#[1B239A1DEF9ABFE4]) [    ] o.a.s.c.c.ConnectionManager Client is connected to ZooKeeper
   [junit4]   2> 50859 INFO  (TEST-CollectionsAPIDistributedZkTest.test-seed#[1B239A1DEF9ABFE4]) [    ] o.a.s.c.c.SolrZkClient Using default ZkACLProvider
   [junit4]   2> 50859 INFO  (TEST-CollectionsAPIDistributedZkTest.test-seed#[1B239A1DEF9ABFE4]) [    ] o.a.s.c.c.SolrZkClient makePath: /collections/collection1
   [junit4]   2> 50865 INFO  (TEST-CollectionsAPIDistributedZkTest.test-seed#[1B239A1DEF9ABFE4]) [    ] o.a.s.c.c.SolrZkClient makePath: /collections/collection1/shards
   [junit4]   2> 50866 INFO  (TEST-CollectionsAPIDistributedZkTest.test-seed#[1B239A1DEF9ABFE4]) [    ] o.a.s.c.c.SolrZkClient makePath: /collections/control_collection
   [junit4]   2> 50867 INFO  (TEST-CollectionsAPIDistributedZkTest.test-seed#[1B239A1DEF9ABFE4]) [    ] o.a.s.c.c.SolrZkClient makePath: /collections/control_collection/shards
   [junit4]   2> 50869 INFO  (TEST-CollectionsAPIDistributedZkTest.test-seed#[1B239A1DEF9ABFE4]) [    ] o.a.s.c.AbstractZkTestCase put /x1/jenkins/jenkins-slave/workspace/Lucene-Solr-Tests-trunk-Java8/solr/core/src/test-files/solr/collection1/conf/solrconfig-tlog.xml to /configs/conf1/solrconfig.xml
   [junit4]   2> 50869 INFO  (TEST-CollectionsAPIDistributedZkTest.test-seed#[1B239A1DEF9ABFE4]) [    ] o.a.s.c.c.SolrZkClient makePath: /configs/conf1/solrconfig.xml
   [junit4]   2> 50872 INFO  (TEST-CollectionsAPIDistributedZkTest.test-seed#[1B239A1DEF9ABFE4]) [    ] o.a.s.c.AbstractZkTestCase put /x1/jenkins/jenkins-slave/workspace/Lucene-Solr-Tests-trunk-Java8/solr/core/src/test-files/solr/collection1/conf/schema.xml to /configs/conf1/schema.xml
   [junit4]   2> 50872 INFO  (TEST-CollectionsAPIDistributedZkTest.test-seed#[1B239A1DEF9ABFE4]) [    ] o.a.s.c.c.SolrZkClient makePath: /configs/conf1/schema.xml
   [junit4]   2> 50874 INFO  (TEST-CollectionsAPIDistributedZkTest.test-seed#[1B239A1DEF9ABFE4]) [    ] o.a.s.c.AbstractZkTestCase put /x1/jenkins/jenkins-slave/workspace/Lucene-Solr-Tests-trunk-Java8/solr/core/src/test-files/solr/collection1/conf/solrconfig.snippet.randomindexconfig.xml to /configs/conf1/solrconfig.snippet.randomindexconfig.xml
   [junit4]   2> 50874 INFO  (TEST-CollectionsAPIDistributedZkTest.test-seed#[1B239A1DEF9ABFE4]) [    ] o.a.s.c.c.SolrZkClient makePath: /configs/conf1/solrconfig.snippet.randomindexconfig.xml
   [junit4]   2> 50876 INFO  (TEST-CollectionsAPIDistributedZkTest.test-seed#[1B239A1DEF9ABFE4]) [    ] o.a.s.c.AbstractZkTestCase put /x1/jenkins/jenkins-slave/workspace/Lucene-Solr-Tests-trunk-Java8/solr/core/src/test-files/solr/collection1/conf/stopwords.txt to /configs/conf1/stopwords.txt
   [junit4]   2> 50876 INFO  (TEST-CollectionsAPIDistributedZkTest.test-seed#[1B239A1DEF9ABFE4]) [    ] o.a.s.c.c.SolrZkClient makePath: /configs/conf1/stopwords.txt
   [junit4]   2> 50878 INFO  (TEST-CollectionsAPIDistributedZkTest.test-seed#[1B239A1DEF9ABFE4]) [    ] o.a.s.c.AbstractZkTestCase put /x1/jenkins/jenkins-slave/workspace/Lucene-Solr-Tests-trunk-Java8/solr/core/src/test-files/solr/collection1/conf/protwords.txt to /configs/conf1/protwords.txt
   [junit4]   2> 50878 INFO  (TEST-CollectionsAPIDistributedZkTest.test-seed#[1B239A1DEF9ABFE4]) [    ] o.a.s.c.c.SolrZkClient makePath: /configs/conf1/protwords.txt
   [junit4]   2> 50879 INFO  (TEST-CollectionsAPIDistributedZkTest.test-seed#[1B239A1DEF9ABFE4]) [    ] o.a.s.c.AbstractZkTestCase put /x1/jenkins/jenkins-slave/workspace/Lucene-Solr-Tests-trunk-Java8/solr/core/src/test-files/solr/collection1/conf/currency.xml to /configs/conf1/currency.xml
   [junit4]   2> 50879 INFO  (TEST-CollectionsAPIDistributedZkTest.test-seed#[1B239A1DEF9ABFE4]) [    ] o.a.s.c.c.SolrZkClient makePath: /configs/conf1/currency.xml
   [junit4]   2> 50881 INFO  (TEST-CollectionsAPIDistributedZkTest.test-seed#[1B239A1DEF9ABFE4]) [    ] o.a.s.c.AbstractZkTestCase put /x1/jenkins/jenkins-slave/workspace/Lucene-Solr-Tests-trunk-Java8/solr/core/src/test-files/solr/collection1/conf/enumsConfig.xml to /configs/conf1/enumsConfig.xml
   [junit4]   2> 50881 INFO  (TEST-CollectionsAPIDistributedZkTest.test-seed#[1B239A1DEF9ABFE4]) [    ] o.a.s.c.c.SolrZkClient makePath: /configs/conf1/enumsConfig.xml
   [junit4]   2> 50882 INFO  (TEST-CollectionsAPIDistributedZkTest.test-seed#[1B239A1DEF9ABFE4]) [    ] o.a.s.c.AbstractZkTestCase put /x1/jenkins/jenkins-slave/workspace/Lucene-Solr-Tests-trunk-Java8/solr/core/src/test-files/solr/collection1/conf/open-exchange-rates.json to /configs/conf1/open-exchange-rates.json
   [junit4]   2> 50883 INFO  (TEST-CollectionsAPIDistributedZkTest.test-seed#[1B239A1DEF9ABFE4]) [    ] o.a.s.c.c.SolrZkClient makePath: /configs/conf1/open-exchange-rates.json
   [junit4]   2> 50884 INFO  (TEST-CollectionsAPIDistributedZkTest.test-seed#[1B239A1DEF9ABFE4]) [    ] o.a.s.c.AbstractZkTestCase put /x1/jenkins/jenkins-slave/workspace/Lucene-Solr-Tests-trunk-Java8/solr/core/src/test-files/solr/collection1/conf/mapping-ISOLatin1Accent.txt to /configs/conf1/mapping-ISOLatin1Accent.txt
   [junit4]   2> 50884 INFO  (TEST-CollectionsAPIDistributedZkTest.test-seed#[1B239A1DEF9ABFE4]) [    ] o.a.s.c.c.SolrZkClient makePath: /configs/conf1/mapping-ISOLatin1Accent.txt
   [junit4]   2> 50887 INFO  (TEST-CollectionsAPIDistributedZkTest.test-seed#[1B239A1DEF9ABFE4]) [    ] o.a.s.c.AbstractZkTestCase put /x1/jenkins/jenkins-slave/workspace/Lucene-Solr-Tests-trunk-Java8/solr/core/src/test-files/solr/collection1/conf/old_synonyms.txt to /configs/conf1/old_synonyms.txt
   [junit4]   2> 50887 INFO  (TEST-CollectionsAPIDistributedZkTest.test-seed#[1B239A1DEF9ABFE4]) [    ] o.a.s.c.c.SolrZkClient makePath: /configs/conf1/old_synonyms.txt
   [junit4]   2> 50894 INFO  (TEST-CollectionsAPIDistributedZkTest.test-seed#[1B239A1DEF9ABFE4]) [    ] o.a.s.c.AbstractZkTestCase put /x1/jenkins/jenkins-slave/workspace/Lucene-Solr-Tests-trunk-Java8/solr/core/src/test-files/solr/collection1/conf/synonyms.txt to /configs/conf1/synonyms.txt
   [junit4]   2> 50895 INFO  (TEST-CollectionsAPIDistributedZkTest.test-seed#[1B239A1DEF9ABFE4]) [    ] o.a.s.c.c.SolrZkClient makePath: /configs/conf1/synonyms.txt
   [junit4]   2> 51017 INFO  (TEST-CollectionsAPIDistributedZkTest.test-seed#[1B239A1DEF9ABFE4]) [    ] o.a.s.SolrTestCaseJ4 Writing core.properties file to /x1/jenkins/jenkins-slave/workspace/Lucene-Solr-Tests-trunk-Java8/solr/build/solr-core/test/J1/temp/solr.cloud.CollectionsAPIDistributedZkTest_1B239A1DEF9ABFE4-001/control-001/cores/collection1
   [junit4]   2> 51019 INFO  (TEST-CollectionsAPIDistributedZkTest.test-seed#[1B239A1DEF9ABFE4]) [    ] o.e.j.s.Server jetty-9.3.6.v20151106
   [junit4]   2> 51023 INFO  (TEST-CollectionsAPIDistributedZkTest.test-seed#[1B239A1DEF9ABFE4]) [    ] o.e.j.s.h.ContextHandler Started o.e.j.s.ServletContextHandler@479b812e{/,null,AVAILABLE}
   [junit4]   2> 51027 INFO  (TEST-CollectionsAPIDistributedZkTest.test-seed#[1B239A1DEF9ABFE4]) [    ] o.e.j.s.ServerConnector Started ServerConnector@5ea2dea3{HTTP/1.1,[http/1.1]}{127.0.0.1:54297}
   [junit4]   2> 51027 INFO  (TEST-CollectionsAPIDistributedZkTest.test-seed#[1B239A1DEF9ABFE4]) [    ] o.e.j.s.Server Started @54062ms
   [junit4]   2> 51027 INFO  (TEST-CollectionsAPIDistributedZkTest.test-seed#[1B239A1DEF9ABFE4]) [    ] o.a.s.c.s.e.JettySolrRunner Jetty properties: {solr.data.dir=/x1/jenkins/jenkins-slave/workspace/Lucene-Solr-Tests-trunk-Java8/solr/build/solr-core/test/J1/temp/solr.cloud.CollectionsAPIDistributedZkTest_1B239A1DEF9ABFE4-001/tempDir-001/control/data, hostContext=/, hostPort=54297, coreRootDirectory=/x1/jenkins/jenkins-slave/workspace/Lucene-Solr-Tests-trunk-Java8/solr/build/solr-core/test/J1/temp/solr.cloud.CollectionsAPIDistributedZkTest_1B239A1DEF9ABFE4-001/control-001/cores}
   [junit4]   2> 51028 INFO  (TEST-CollectionsAPIDistributedZkTest.test-seed#[1B239A1DEF9ABFE4]) [    ] o.a.s.s.SolrDispatchFilter SolrDispatchFilter.init(): sun.misc.Launcher$AppClassLoader@4e0e2f2a
   [junit4]   2> 51028 INFO  (TEST-CollectionsAPIDistributedZkTest.test-seed#[1B239A1DEF9ABFE4]) [    ] o.a.s.c.SolrResourceLoader new SolrResourceLoader for directory: '/x1/jenkins/jenkins-slave/workspace/Lucene-Solr-Tests-trunk-Java8/solr/build/solr-core/test/J1/temp/solr.cloud.CollectionsAPIDistributedZkTest_1B239A1DEF9ABFE4-001/control-001'
   [junit4]   2> 51028 INFO  (TEST-CollectionsAPIDistributedZkTest.test-seed#[1B239A1DEF9ABFE4]) [    ] o.a.s.c.SolrResourceLoader JNDI not configured for solr (NoInitialContextEx)
   [junit4]   2> 51028 INFO  (TEST-CollectionsAPIDistributedZkTest.test-seed#[1B239A1DEF9ABFE4]) [    ] o.a.s.c.SolrResourceLoader solr home defaulted to 'solr/' (could not find system property or JNDI)
   [junit4]   2> 51029 INFO  (TEST-CollectionsAPIDistributedZkTest.test-seed#[1B239A1DEF9ABFE4]) [    ] o.a.s.c.c.SolrZkClient Using default ZkCredentialsProvider
   [junit4]   2> 51034 INFO  (TEST-CollectionsAPIDistributedZkTest.test-seed#[1B239A1DEF9ABFE4]) [    ] o.a.s.c.c.ConnectionManager Waiting for client to connect to ZooKeeper
   [junit4]   2> 51039 INFO  (zkCallback-40-thread-1) [    ] o.a.s.c.c.ConnectionManager Watcher org.apache.solr.common.cloud.ConnectionManager@36320e2d name:ZooKeeperConnection Watcher:127.0.0.1:55905/solr got event WatchedEvent state:SyncConnected type:None path:null path:null type:None
   [junit4]   2> 51039 INFO  (TEST-CollectionsAPIDistributedZkTest.test-seed#[1B239A1DEF9ABFE4]) [    ] o.a.s.c.c.ConnectionManager Client is connected to ZooKeeper
   [junit4]   2> 51039 INFO  (TEST-CollectionsAPIDistributedZkTest.test-seed#[1B239A1DEF9ABFE4]) [    ] o.a.s.c.c.SolrZkClient Using default ZkACLProvider
   [junit4]   2> 51043 INFO  (TEST-CollectionsAPIDistributedZkTest.test-seed#[1B239A1DEF9ABFE4]) [    ] o.a.s.s.SolrDispatchFilter Loading solr.xml from SolrHome (not found in ZooKeeper)
   [junit4]   2> 51043 INFO  (TEST-CollectionsAPIDistributedZkTest.test-seed#[1B239A1DEF9ABFE4]) [    ] o.a.s.c.SolrXmlConfig Loading container configuration from /x1/jenkins/jenkins-slave/workspace/Lucene-Solr-Tests-trunk-Java8/solr/build/solr-core/test/J1/temp/solr.cloud.CollectionsAPIDistributedZkTest_1B239A1DEF9ABFE4-001/control-001/solr.xml
   [junit4]   2> 51052 INFO  (TEST-CollectionsAPIDistributedZkTest.test-seed#[1B239A1DEF9ABFE4]) [    ] o.a.s.c.CorePropertiesLocator Config-defined core root directory: /x1/jenkins/jenkins-slave/workspace/Lucene-Solr-Tests-trunk-Java8/solr/build/solr-core/test/J1/temp/solr.cloud.CollectionsAPIDistributedZkTest_1B239A1DEF9ABFE4-001/control-001/cores
   [junit4]   2> 51052 INFO  (TEST-CollectionsAPIDistributedZkTest.test-seed#[1B239A1DEF9ABFE4]) [    ] o.a.s.c.CoreContainer New CoreContainer 1938233326
   [junit4]   2> 51052 INFO  (TEST-CollectionsAPIDistributedZkTest.test-seed#[1B239A1DEF9ABFE4]) [    ] o.a.s.c.CoreContainer Loading cores into CoreContainer [instanceDir=/x1/jenkins/jenkins-slave/workspace/Lucene-Solr-Tests-trunk-Java8/solr/build/solr-core/test/J1/temp/solr.cloud.CollectionsAPIDistributedZkTest_1B239A1DEF9ABFE4-001/control-001]
   [junit4]   2> 51052 WARN  (TEST-CollectionsAPIDistributedZkTest.test-seed#[1B239A1DEF9ABFE4]) [    ] o.a.s.c.CoreContainer Couldn't add files from /x1/jenkins/jenkins-slave/workspace/Lucene-Solr-Tests-trunk-Java8/solr/build/solr-core/test/J1/temp/solr.cloud.CollectionsAPIDistributedZkTest_1B239A1DEF9ABFE4-001/control-001/lib to classpath: /x1/jenkins/jenkins-slave/workspace/Lucene-Solr-Tests-trunk-Java8/solr/build/solr-core/test/J1/temp/solr.cloud.CollectionsAPIDistributedZkTest_1B239A1DEF9ABFE4-001/control-001/lib
   [junit4]   2> 51053 INFO  (TEST-CollectionsAPIDistributedZkTest.test-seed#[1B239A1DEF9ABFE4]) [    ] o.a.s.h.c.HttpShardHandlerFactory created with socketTimeout : 90000,urlScheme : ,connTimeout : 15000,maxConnectionsPerHost : 20,maxConnections : 10000,corePoolSize : 0,maximumPoolSize : 2147483647,maxThreadIdleTime : 5,sizeOfQueue : -1,fairnessPolicy : false,useRetries : false,
   [junit4]   2> 51054 INFO  (TEST-CollectionsAPIDistributedZkTest.test-seed#[1B239A1DEF9ABFE4]) [    ] o.a.s.u.UpdateShardHandler Creating UpdateShardHandler HTTP client with params: socketTimeout=340000&connTimeout=45000&retry=true
   [junit4]   2> 51055 INFO  (TEST-CollectionsAPIDistributedZkTest.test-seed#[1B239A1DEF9ABFE4]) [    ] o.a.s.l.LogWatcher SLF4J impl is org.slf4j.impl.Log4jLoggerFactory
   [junit4]   2> 51055 INFO  (TEST-CollectionsAPIDistributedZkTest.test-seed#[1B239A1DEF9ABFE4]) [    ] o.a.s.l.LogWatcher Registering Log Listener [Log4j (org.slf4j.impl.Log4jLoggerFactory)]
   [junit4]   2> 51055 INFO  (TEST-CollectionsAPIDistributedZkTest.test-seed#[1B239A1DEF9ABFE4]) [    ] o.a.s.c.ZkContainer Zookeeper client=127.0.0.1:55905/solr
   [junit4]   2> 51055 INFO  (TEST-CollectionsAPIDistributedZkTest.test-seed#[1B239A1DEF9ABFE4]) [    ] o.a.s.c.ZkController zkHost includes chroot
   [junit4]   2> 51055 INFO  (TEST-CollectionsAPIDistributedZkTest.test-seed#[1B239A1DEF9ABFE4]) [    ] o.a.s.c.c.SolrZkClient Using default ZkCredentialsProvider
   [junit4]   2> 51056 INFO  (TEST-CollectionsAPIDistributedZkTest.test-seed#[1B239A1DEF9ABFE4]) [    ] o.a.s.c.c.ConnectionManager Waiting for client to connect to ZooKeeper
   [junit4]   2> 51065 INFO  (zkCallback-43-thread-1) [    ] o.a.s.c.c.ConnectionManager Watcher org.apache.solr.common.cloud.ConnectionManager@3a842269 name:ZooKeeperConnection Watcher:127.0.0.1:55905 got event WatchedEvent state:SyncConnected type:None path:null path:null type:None
   [junit4]   2> 51065 INFO  (TEST-CollectionsAPIDistributedZkTest.test-seed#[1B239A1DEF9ABFE4]) [    ] o.a.s.c.c.ConnectionManager Client is connected to ZooKeeper
   [junit4]   2> 51066 INFO  (TEST-CollectionsAPIDistributedZkTest.test-seed#[1B239A1DEF9ABFE4]) [    ] o.a.s.c.c.SolrZkClient Using default ZkACLProvider
   [junit4]   2> 51077 INFO  (TEST-CollectionsAPIDistributedZkTest.test-seed#[1B239A1DEF9ABFE4]) [n:127.0.0.1:54297_    ] o.a.s.c.c.ConnectionManager Waiting for client to connect to ZooKeeper
   [junit4]   2> 51080 INFO  (zkCallback-44-thread-1-processing-n:127.0.0.1:54297_) [n:127.0.0.1:54297_    ] o.a.s.c.c.ConnectionManager Watcher org.apache.solr.common.cloud.ConnectionManager@393522d7 name:ZooKeeperConnection Watcher:127.0.0.1:55905/solr got event WatchedEvent state:SyncConnected type:None path:null path:null type:None
   [junit4]   2> 51080 INFO  (TEST-CollectionsAPIDistributedZkTest.test-seed#[1B239A1DEF9ABFE4]) [n:127.0.0.1:54297_    ] o.a.s.c.c.ConnectionManager Client is connected to ZooKeeper
   [junit4]   2> 51082 INFO  (TEST-CollectionsAPIDistributedZkTest.test-seed#[1B239A1DEF9ABFE4]) [n:127.0.0.1:54297_    ] o.a.s.c.c.SolrZkClient makePath: /overseer/queue
   [junit4]   2> 51083 INFO  (TEST-CollectionsAPIDistributedZkTest.test-seed#[1B239A1DEF9ABFE4]) [n:127.0.0.1:54297_    ] o.a.s.c.c.SolrZkClient makePath: /overseer/collection-queue-work
   [junit4]   2> 51087 INFO  (TEST-CollectionsAPIDistributedZkTest.test-seed#[1B239A1DEF9ABFE4]) [n:127.0.0.1:54297_    ] o.a.s.c.c.SolrZkClient makePath: /overseer/collection-map-running
   [junit4]   2> 51090 INFO  (TEST-CollectionsAPIDistributedZkTest.test-seed#[1B239A1DEF9ABFE4]) [n:127.0.0.1:54297_    ] o.a.s.c.c.SolrZkClient makePath: /overseer/collection-map-completed
   [junit4]   2> 51092 INFO  (TEST-CollectionsAPIDistributedZkTest.test-seed#[1B239A1DEF9ABFE4]) [n:127.0.0.1:54297_    ] o.a.s.c.c.SolrZkClient makePath: /overseer/collection-map-failure
   [junit4]   2> 51094 INFO  (TEST-CollectionsAPIDistributedZkTest.test-seed#[1B239A1DEF9ABFE4]) [n:127.0.0.1:54297_    ] o.a.s.c.c.SolrZkClient makePath: /live_nodes
   [junit4]   2> 51096 INFO  (TEST-CollectionsAPIDistributedZkTest.test-seed#[1B239A1DEF9ABFE4]) [n:127.0.0.1:54297_    ] o.a.s.c.c.SolrZkClient makePath: /aliases.json
   [junit4]   2> 51097 INFO  (TEST-CollectionsAPIDistributedZkTest.test-seed#[1B239A1DEF9ABFE4]) [n:127.0.0.1:54297_    ] o.a.s.c.c.SolrZkClient makePath: /clusterstate.json
   [junit4]   2> 51099 INFO  (TEST-CollectionsAPIDistributedZkTest.test-seed#[1B239A1DEF9ABFE4]) [n:127.0.0.1:54297_    ] o.a.s.c.c.SolrZkClient makePath: /security.json
   [junit4]   2> 51100 INFO  (TEST-CollectionsAPIDistributedZkTest.test-seed#[1B239A1DEF9ABFE4]) [n:127.0.0.1:54297_    ] o.a.s.c.c.ZkStateReader Updating cluster state from ZooKeeper... 
   [junit4]   2> 51102 INFO  (TEST-CollectionsAPIDistributedZkTest.test-seed#[1B239A1DEF9ABFE4]) [n:127.0.0.1:54297_    ] o.a.s.c.c.ZkStateReader Updated live nodes from ZooKeeper... (0) -> (0)
   [junit4]   2> 51104 INFO  (TEST-CollectionsAPIDistributedZkTest.test-seed#[1B239A1DEF9ABFE4]) [n:127.0.0.1:54297_    ] o.a.s.c.c.SolrZkClient makePath: /overseer_elect
   [junit4]   2> 51105 INFO  (TEST-CollectionsAPIDistributedZkTest.test-seed#[1B239A1DEF9ABFE4]) [n:127.0.0.1:54297_    ] o.a.s.c.c.SolrZkClient makePath: /overseer_elect/election
   [junit4]   2> 51107 INFO  (TEST-CollectionsAPIDistributedZkTest.test-seed#[1B239A1DEF9ABFE4]) [n:127.0.0.1:54297_    ] o.a.s.c.Overseer Overseer (id=null) closing
   [junit4]   2> 51108 INFO  (TEST-CollectionsAPIDistributedZkTest.test-seed#[1B239A1DEF9ABFE4]) [n:127.0.0.1:54297_    ] o.a.s.c.LeaderElector Joined leadership election with path: /overseer_elect/election/95483113292234756-127.0.0.1:54297_-n_0000000000
   [junit4]   2> 51108 INFO  (TEST-CollectionsAPIDistributedZkTest.test-seed#[1B239A1DEF9ABFE4]) [n:127.0.0.1:54297_    ] o.a.s.c.OverseerElectionContext I am going to be the leader 127.0.0.1:54297_
   [junit4]   2> 51108 INFO  (TEST-CollectionsAPIDistributedZkTest.test-seed#[1B239A1DEF9ABFE4]) [n:127.0.0.1:54297_    ] o.a.s.c.c.SolrZkClient makePath: /overseer_elect/leader
   [junit4]   2> 51110 INFO  (TEST-CollectionsAPIDistributedZkTest.test-seed#[1B239A1DEF9ABFE4]) [n:127.0.0.1:54297_    ] o.a.s.c.Overseer Overseer (id=95483113292234756-127.0.0.1:54297_-n_0000000000) starting
   [junit4]   2> 51112 INFO  (TEST-CollectionsAPIDistributedZkTest.test-seed#[1B239A1DEF9ABFE4]) [n:127.0.0.1:54297_    ] o.a.s.c.c.SolrZkClient makePath: /overseer/queue-work
   [junit4]   2> 51118 INFO  (TEST-CollectionsAPIDistributedZkTest.test-seed#[1B239A1DEF9ABFE4]) [n:127.0.0.1:54297_    ] o.a.s.c.OverseerAutoReplicaFailoverThread Starting OverseerAutoReplicaFailoverThread autoReplicaFailoverWorkLoopDelay=10000 autoReplicaFailoverWaitAfterExpiration=10000 autoReplicaFailoverBadNodeExpiration=60000
   [junit4]   2> 51131 INFO  (OverseerCollectionConfigSetProcessor-95483113292234756-127.0.0.1:54297_-n_0000000000) [n:127.0.0.1:54297_    ] o.a.s.c.OverseerTaskProcessor Process current queue of overseer operations
   [junit4]   2> 51133 INFO  (TEST-CollectionsAPIDistributedZkTest.test-seed#[1B239A1DEF9ABFE4]) [n:127.0.0.1:54297_    ] o.a.s.c.ZkController Register node as live in ZooKeeper:/live_nodes/127.0.0.1:54297_
   [junit4]   2> 51131 INFO  (OverseerStateUpdate-95483113292234756-127.0.0.1:54297_-n_0000000000) [n:127.0.0.1:54297_    ] o.a.s.c.Overseer Starting to work on the main queue
   [junit4]   2> 51137 INFO  (TEST-CollectionsAPIDistributedZkTest.test-seed#[1B239A1DEF9ABFE4]) [n:127.0.0.1:54297_    ] o.a.s.c.c.SolrZkClient makePath: /live_nodes/127.0.0.1:54297_
   [junit4]   2> 51139 INFO  (OverseerStateUpdate-95483113292234756-127.0.0.1:54297_-n_0000000000) [n:127.0.0.1:54297_    ] o.a.s.c.c.ZkStateReader Updated live nodes from ZooKeeper... (0) -> (0)
   [junit4]   2> 51139 INFO  (zkCallback-44-thread-1-processing-n:127.0.0.1:54297_) [n:127.0.0.1:54297_    ] o.a.s.c.c.ZkStateReader A live node change: [WatchedEvent state:SyncConnected type:NodeChildrenChanged path:/live_nodes], has occurred - updating... (live nodes size: [0])
   [junit4]   2> 51140 INFO  (zkCallback-44-thread-1-processing-n:127.0.0.1:54297_) [n:127.0.0.1:54297_    ] o.a.s.c.c.ZkStateReader Updated live nodes from ZooKeeper... (0) -> (1)
   [junit4]   2> 51158 INFO  (TEST-CollectionsAPIDistributedZkTest.test-seed#[1B239A1DEF9ABFE4]) [n:127.0.0.1:54297_    ] o.a.s.c.CoreContainer Security conf doesn't exist. Skipping setup for authorization module.
   [junit4]   2> 51158 INFO  (TEST-CollectionsAPIDistributedZkTest.test-seed#[1B239A1DEF9ABFE4]) [n:127.0.0.1:54297_    ] o.a.s.c.CoreContainer No authentication plugin used.
   [junit4]   2> 51159 INFO  (TEST-CollectionsAPIDistributedZkTest.test-seed#[1B239A1DEF9ABFE4]) [n:127.0.0.1:54297_    ] o.a.s.c.CorePropertiesLocator Looking for core definitions underneath /x1/jenkins/jenkins-slave/workspace/Lucene-Solr-Tests-trunk-Java8/solr/build/solr-core/test/J1/temp/solr.cloud.CollectionsAPIDistributedZkTest_1B239A1DEF9ABFE4-001/control-001/cores
   [junit4]   2> 51160 INFO  (TEST-CollectionsAPIDistributedZkTest.test-seed#[1B239A1DEF9ABFE4]) [n:127.0.0.1:54297_    ] o.a.s.c.CoreDescriptor Created CoreDescriptor: {name=collection1, config=solrconfig.xml, transient=false, schema=schema.xml, loadOnStartup=true, configSetProperties=configsetprops.json, collection=control_collection, coreNodeName=, dataDir=data/, shard=}
   [junit4]   2> 51160 INFO  (TEST-CollectionsAPIDistributedZkTest.test-seed#[1B239A1DEF9ABFE4]) [n:127.0.0.1:54297_    ] o.a.s.c.CorePropertiesLocator Found core collection1 in /x1/jenkins/jenkins-slave/workspace/Lucene-Solr-Tests-trunk-Java8/solr/build/solr-core/test/J1/temp/solr.cloud.CollectionsAPIDistributedZkTest_1B239A1DEF9ABFE4-001/control-001/cores/collection1
   [junit4]   2> 51160 INFO  (TEST-CollectionsAPIDistributedZkTest.test-seed#[1B239A1DEF9ABFE4]) [n:127.0.0.1:54297_    ] o.a.s.c.CorePropertiesLocator Found 1 core definitions
   [junit4]   2> 51162 INFO  (TEST-CollectionsAPIDistributedZkTest.test-seed#[1B239A1DEF9ABFE4]) [n:127.0.0.1:54297_    ] o.a.s.s.SolrDispatchFilter user.dir=/x1/jenkins/jenkins-slave/workspace/Lucene-Solr-Tests-trunk-Java8/solr/build/solr-core/test/J1
   [junit4]   2> 51162 INFO  (TEST-CollectionsAPIDistributedZkTest.test-seed#[1B239A1DEF9ABFE4]) [n:127.0.0.1:54297_    ] o.a.s.s.SolrDispatchFilter SolrDispatchFilter.init() done
   [junit4]   2> 51163 INFO  (coreLoadExecutor-118-thread-1-processing-n:127.0.0.1:54297_) [n:127.0.0.1:54297_ c:control_collection   x:collection1] o.a.s.c.ZkController publishing state=down
   [junit4]   2> 51163 INFO  (coreLoadExecutor-118-thread-1-processing-n:127.0.0.1:54297_) [n:127.0.0.1:54297_ c:control_collection   x:collection1] o.a.s.c.ZkController numShards not found on descriptor - reading it from system property
   [junit4]   2> 51166 INFO  (OverseerStateUpdate-95483113292234756-127.0.0.1:54297_-n_0000000000) [n:127.0.0.1:54297_    ] o.a.s.c.Overseer processMessage: queueSize: 1, message = {
   [junit4]   2>   "core":"collection1",
   [junit4]   2>   "roles":null,
   [junit4]   2>   "base_url":"http://127.0.0.1:54297",
   [junit4]   2>   "node_name":"127.0.0.1:54297_",
   [junit4]   2>   "numShards":"1",
   [junit4]   2>   "state":"down",
   [junit4]   2>   "shard":null,
   [junit4]   2>   "collection":"control_collection",
   [junit4]   2>   "operation":"state"} current state version: 0
   [junit4]   2> 51167 INFO  (OverseerStateUpdate-95483113292234756-127.0.0.1:54297_-n_0000000000) [n:127.0.0.1:54297_    ] o.a.s.c.o.ReplicaMutator Update state numShards=1 message={
   [junit4]   2>   "core":"collection1",
   [junit4]   2>   "roles":null,
   [junit4]   2>   "base_url":"http://127.0.0.1:54297",
   [junit4]   2>   "node_name":"127.0.0.1:54297_",
   [junit4]   2>   "numShards":"1",
   [junit4]   2>   "state":"down",
   [junit4]   2>   "shard":null,
   [junit4]   2>   "collection":"control_collection",
   [junit4]   2>   "operation":"state"}
   [junit4]   2> 51167 INFO  (OverseerStateUpdate-95483113292234756-127.0.0.1:54297_-n_0000000000) [n:127.0.0.1:54297_    ] o.a.s.c.o.ClusterStateMutator building a new cName: control_collection
   [junit4]   2> 51168 INFO  (OverseerStateUpdate-95483113292234756-127.0.0.1:54297_-n_0000000000) [n:127.0.0.1:54297_    ] o.a.s.c.o.ReplicaMutator Assigning new node to shard shard=shard1
   [junit4]   2> 51170 INFO  (zkCallback-44-thread-1-processing-n:127.0.0.1:54297_) [n:127.0.0.1:54297_    ] o.a.s.c.c.ZkStateReader A cluster state change: [WatchedEvent state:SyncConnected type:NodeDataChanged path:/clusterstate.json], has occurred - updating... (live nodes size: [1])
   [junit4]   2> 51171 INFO  (coreLoadExecutor-118-thread-1-processing-n:127.0.0.1:54297_) [n:127.0.0.1:54297_ c:control_collection   x:collection1] o.a.s.c.ZkController look for our core node name
   [junit4]   2> 51171 INFO  (coreLoadExecutor-118-thread-1-processing-n:127.0.0.1:54297_) [n:127.0.0.1:54297_ c:control_collection   x:collection1] o.a.s.c.ZkController waiting to find shard id in clusterstate for collection1
   [junit4]   2> 51171 INFO  (coreLoadExecutor-118-thread-1-processing-n:127.0.0.1:54297_) [n:127.0.0.1:54297_ c:control_collection   x:collection1] o.a.s.c.ZkController Check for collection zkNode:control_collection
   [junit4]   2> 51174 INFO  (coreLoadExecutor-118-thread-1-processing-n:127.0.0.1:54297_) [n:127.0.0.1:54297_ c:control_collection   x:collection1] o.a.s.c.ZkController Collection zkNode exists
   [junit4]   2> 51175 INFO  (coreLoadExecutor-118-thread-1-processing-n:127.0.0.1:54297_) [n:127.0.0.1:54297_ c:control_collection   x:collection1] o.a.s.c.c.ZkStateReader Load collection config from: [/collections/control_collection]
   [junit4]   2> 51176 INFO  (coreLoadExecutor-118-thread-1-processing-n:127.0.0.1:54297_) [n:127.0.0.1:54297_ c:control_collection   x:collection1] o.a.s.c.c.ZkStateReader path=[/collections/control_collection] [configName]=[conf1] specified config exists in ZooKeeper
   [junit4]   2> 51176 INFO  (coreLoadExecutor-118-thread-1-processing-n:127.0.0.1:54297_) [n:127.0.0.1:54297_ c:control_collection   x:collection1] o.a.s.c.SolrResourceLoader new SolrResourceLoader for directory: '/x1/jenkins/jenkins-slave/workspace/Lucene-Solr-Tests-trunk-Java8/solr/build/solr-core/test/J1/temp/solr.cloud.CollectionsAPIDistributedZkTest_1B239A1DEF9ABFE4-001/control-001/cores/collection1'
   [junit4]   2> 51176 INFO  (coreLoadExecutor-118-thread-1-processing-n:127.0.0.1:54297_) [n:127.0.0.1:54297_ c:control_collection   x:collection1] o.a.s.c.SolrResourceLoader JNDI not configured for solr (NoInitialContextEx)
   [junit4]   2> 51176 INFO  (coreLoadExecutor-118-thread-1-processing-n:127.0.0.1:54297_) [n:127.0.0.1:54297_ c:control_collection   x:collection1] o.a.s.c.SolrResourceLoader solr home defaulted to 'solr/' (could not find system property or JNDI)
   [junit4]   2> 51178 INFO  (coreLoadExecutor-118-thread-1-processing-n:127.0.0.1:54297_) [n:127.0.0.1:54297_ c:control_collection   x:collection1] o.a.s.c.Config loaded config solrconfig.xml with version 0 
   [junit4]   2> 51185 INFO  (coreLoadExecutor-118-thread-1-processing-n:127.0.0.1:54297_) [n:127.0.0.1:54297_ c:control_collection   x:collection1] o.a.s.c.SolrConfig current version of requestparams : -1
   [junit4]   2> 51189 WARN  (coreLoadExecutor-118-thread-1-processing-n:127.0.0.1:54297_) [n:127.0.0.1:54297_ c:control_collection   x:collection1] o.a.s.c.Config Beginning with Solr 5.5, <mergePolicy> is deprecated, use <mergePolicyFactory> instead.
   [junit4]   2> 51190 INFO  (coreLoadExecutor-118-thread-1-processing-n:127.0.0.1:54297_) [n:127.0.0.1:54297_ c:control_collection   x:collection1] o.a.s.c.SolrConfig Using Lucene MatchVersion: 7.0.0
   [junit4]   2> 51200 INFO  (coreLoadExecutor-118-thread-1-processing-n:127.0.0.1:54297_) [n:127.0.0.1:54297_ c:control_collection   x:collection1] o.a.s.c.SolrConfig Loaded SolrConfig: solrconfig.xml
   [junit4]   2> 51214 INFO  (coreLoadExecutor-118-thread-1-processing-n:127.0.0.1:54297_) [n:127.0.0.1:54297_ c:control_collection   x:collection1] o.a.s.s.IndexSchema [collection1] Schema name=test
   [junit4]   2> 51312 INFO  (coreLoadExecutor-118-thread-1-processing-n:127.0.0.1:54297_) [n:127.0.0.1:54297_ c:control_collection   x:collection1] o.a.s.s.OpenExchangeRatesOrgProvider Initialized with rates=open-exchange-rates.json, refreshInterval=1440.
   [junit4]   2> 51319 INFO  (coreLoadExecutor-118-thread-1-processing-n:127.0.0.1:54297_) [n:127.0.0.1:54297_ c:control_collection   x:collection1] o.a.s.s.IndexSchema default search field in schema is text
   [junit4]   2> 51320 INFO  (coreLoadExecutor-118-thread-1-processing-n:127.0.0.1:54297_) [n:127.0.0.1:54297_ c:control_collection   x:collection1] o.a.s.s.IndexSchema unique key field: id
   [junit4]   2> 51331 INFO  (coreLoadExecutor-118-thread-1-processing-n:127.0.0.1:54297_) [n:127.0.0.1:54297_ c:control_collection   x:collection1] o.a.s.s.FileExchangeRateProvider Reloading exchange rates from file currency.xml
   [junit4]   2> 51334 INFO  (coreLoadExecutor-118-thread-1-processing-n:127.0.0.1:54297_) [n:127.0.0.1:54297_ c:control_collection   x:collection1] o.a.s.s.FileExchangeRateProvider Reloading exchange rates from file currency.xml
   [junit4]   2> 51336 INFO  (coreLoadExecutor-118-thread-1-processing-n:127.0.0.1:54297_) [n:127.0.0.1:54297_ c:control_collection   x:collection1] o.a.s.s.OpenExchangeRatesOrgProvider Reloading exchange rates from open-exchange-rates.json
   [junit4]   2> 51337 INFO  (coreLoadExecutor-118-thread-1-processing-n:127.0.0.1:54297_) [n:127.0.0.1:54297_ c:control_collection   x:collection1] o.a.s.s.OpenExchangeRatesOrgProvider Reloading exchange rates from open-exchange-rates.json
   [junit4]   2> 51339 INFO  (coreLoadExecutor-118-thread-1-processing-n:127.0.0.1:54297_) [n:127.0.0.1:54297_ c:control_collection   x:collection1] o.a.s.c.ConfigSetProperties Did not find ConfigSet properties, assuming default properties: Can't find resource 'configsetprops.json' in classpath or '/configs/conf1', cwd=/x1/jenkins/jenkins-slave/workspace/Lucene-Solr-Tests-trunk-Java8/solr/build/solr-core/test/J1
   [junit4]   2> 51339 INFO  (coreLoadExecutor-118-thread-1-processing-n:127.0.0.1:54297_) [n:127.0.0.1:54297_ c:control_collection   x:collection1] o.a.s.c.CoreContainer Creating SolrCore 'collection1' using configuration from collection control_collection
   [junit4]   2> 51339 INFO  (coreLoadExecutor-118-thread-1-processing-n:127.0.0.1:54297_) [n:127.0.0.1:54297_ c:control_collection s:shard1 r:core_node1 x:collection1] o.a.s.c.SolrCore org.apache.solr.core.MockDirectoryFactory
   [junit4]   2> 51339 INFO  (coreLoadExecutor-118-thread-1-processing-n:127.0.0.1:54297_) [n:127.0.0.1:54297_ c:control_collection s:shard1 r:core_node1 x:collection1] o.a.s.c.SolrCore [[collection1] ] Opening new SolrCore at [/x1/jenkins/jenkins-slave/workspace/Lucene-Solr-Tests-trunk-Java8/solr/build/solr-core/test/J1/temp/solr.cloud.CollectionsAPIDistributedZkTest_1B239A1DEF9ABFE4-001/control-001/cores/collection1], dataDir=[/x1/jenkins/jenkins-slave/workspace/Lucene-Solr-Tests-trunk-Java8/solr/build/solr-core/test/J1/temp/solr.cloud.CollectionsAPIDistributedZkTest_1B239A1DEF9ABFE4-001/control-001/cores/collection1/data/]
   [junit4]   2> 51339 INFO  (coreLoadExecutor-118-thread-1-processing-n:127.0.0.1:54297_) [n:127.0.0.1:54297_ c:control_collection s:shard1 r:core_node1 x:collection1] o.a.s.c.JmxMonitoredMap JMX monitoring is enabled. Adding Solr mbeans to JMX Server: com.sun.jmx.mbeanserver.JmxMBeanServer@58ef0169
   [junit4]   2> 51340 INFO  (coreLoadExecutor-118-thread-1-processing-n:127.0.0.1:54297_) [n:127.0.0.1:54297_ c:control_collection s:shard1 r:core_node1 x:collection1] o.a.s.c.CachingDirectoryFactory return new directory for /x1/jenkins/jenkins-slave/workspace/Lucene-Solr-Tests-trunk-Java8/solr/build/solr-core/test/J1/temp/solr.cloud.CollectionsAPIDistributedZkTest_1B239A1DEF9ABFE4-001/control-001/cores/collection1/data
   [junit4]   2> 51340 INFO  (coreLoadExecutor-118-thread-1-processing-n:127.0.0.1:54297_) [n:127.0.0.1:54297_ c:control_collection s:shard1 r:core_node1 x:collection1] o.a.s.c.SolrCore New index directory detected: old=null new=/x1/jenkins/jenkins-slave/workspace/Lucene-Solr-Tests-trunk-Java8/solr/build/solr-core/test/J1/temp/solr.cloud.CollectionsAPIDistributedZkTest_1B239A1DEF9ABFE4-001/control-001/cores/collection1/data/index/
   [junit4]   2> 51340 WARN  (coreLoadExecutor-118-thread-1-processing-n:127.0.0.1:54297_) [n:127.0.0.1:54297_ c:control_collection s:shard1 r:core_node1 x:collection1] o.a.s.c.SolrCore [collection1] Solr index directory '/x1/jenkins/jenkins-slave/workspace/Lucene-Solr-Tests-trunk-Java8/solr/build/solr-core/test/J1/temp/solr.cloud.CollectionsAPIDistributedZkTest_1B239A1DEF9ABFE4-001/control-001/cores/collection1/data/index' doesn't exist. Creating new index...
   [junit4]   2> 51341 INFO  (coreLoadExecutor-118-thread-1-processing-n:127.0.0.1:54297_) [n:127.0.0.1:54297_ c:control_collection s:shard1 r:core_node1 x:collection1] o.a.s.c.CachingDirectoryFactory return new directory for /x1/jenkins/jenkins-slave/workspace/Lucene-Solr-Tests-trunk-Java8/solr/build/solr-core/test/J1/temp/solr.cloud.CollectionsAPIDistributedZkTest_1B239A1DEF9ABFE4-001/control-001/cores/collection1/data/index
   [junit4]   2> 51341 INFO  (coreLoadExecutor-118-thread-1-processing-n:127.0.0.1:54297_) [n:127.0.0.1:54297_ c:control_collection s:shard1 r:core_node1 x:collection1] o.a.s.u.RandomMergePolicy RandomMergePolicy wrapping class org.apache.lucene.index.TieredMergePolicy: [TieredMergePolicy: maxMergeAtOnce=27, maxMergeAtOnceExplicit=13, maxMergedSegmentMB=85.6015625, floorSegmentMB=1.0576171875, forceMergeDeletesPctAllowed=6.122082477484668, segmentsPerTier=10.0, maxCFSSegmentSizeMB=8.796093022207999E12, noCFSRatio=0.1971413302350749
   [junit4]   2> 51341 INFO  (coreLoadExecutor-118-thread-1-processing-n:127.0.0.1:54297_) [n:127.0.0.1:54297_ c:control_collection s:shard1 r:core_node1 x:collection1] o.a.s.c.SolrDeletionPolicy SolrDeletionPolicy.onCommit: commits: num=1
   [junit4]   2> 	commit{dir=MockDirectoryWrapper(RAMDirectory@2183e7b lockFactory=org.apache.lucene.store.SingleInstanceLockFactory@13f03d5f),segFN=segments_1,generation=1}
   [junit4]   2> 51342 INFO  (coreLoadExecutor-118-thread-1-processing-n:127.0.0.1:54297_) [n:127.0.0.1:54297_ c:control_collection s:shard1 r:core_node1 x:collection1] o.a.s.c.SolrDeletionPolicy newest commit generation = 1
   [junit4]   2> 51343 INFO  (OldIndexDirectoryCleanupThreadForCore-collection1) [n:127.0.0.1:54297_ c:control_collection s:shard1 r:core_node1 x:collection1] o.a.s.c.SolrCore Looking for old index directories to cleanup for core collection1 in /x1/jenkins/jenkins-slave/workspace/Lucene-Solr-Tests-trunk-Java8/solr/build/solr-core/test/J1/temp/solr.cloud.CollectionsAPIDistributedZkTest_1B239A1DEF9ABFE4-001/control-001/cores/collection1/data/
   [junit4]   2> 51346 INFO  (coreLoadExecutor-118-thread-1-processing-n:127.0.0.1:54297_) [n:127.0.0.1:54297_ c:control_collection s:shard1 r:core_node1 x:collection1] o.a.s.u.p.UpdateRequestProcessorChain creating updateRequestProcessorChain "nodistrib"
   [junit4]   2> 51347 INFO  (coreLoadExecutor-118-thread-1-processing-n:127.0.0.1:54297_) [n:127.0.0.1:54297_ c:control_collection s:shard1 r:core_node1 x:collection1] o.a.s.u.p.UpdateRequestProcessorChain creating updateRequestProcessorChain "dedupe"
   [junit4]   2> 51347 INFO  (coreLoadExecutor-118-thread-1-processing-n:127.0.0.1:54297_) [n:127.0.0.1:54297_ c:control_collection s:shard1 r:core_node1 x:collection1] o.a.s.u.p.UpdateRequestProcessorChain inserting DistributedUpdateProcessorFactory into updateRequestProcessorChain "dedupe"
   [junit4]   2> 51347 INFO  (coreLoadExecutor-118-thread-1-processing-n:127.0.0.1:54297_) [n:127.0.0.1:54297_ c:control_collection s:shard1 r:core_node1 x:collection1] o.a.s.u.p.UpdateRequestProcessorChain creating updateRequestProcessorChain "stored_sig"
   [junit4]   2> 51347 INFO  (coreLoadExecutor-118-thread-1-processing-n:127.0.0.1:54297_) [n:127.0.0.1:54297_ c:control_collection s:shard1 r:core_node1 x:collection1] o.a.s.u.p.UpdateRequestProcessorChain inserting DistributedUpdateProcessorFactory into updateRequestProcessorChain "stored_sig"
   [junit4]   2> 51347 INFO  (coreLoadExecutor-118-thread-1-processing-n:127.0.0.1:54297_) [n:127.0.0.1:54297_ c:control_collection s:shard1 r:core_node1 x:collection1] o.a.s.u.p.UpdateRequestProcessorChain creating updateRequestProcessorChain "distrib-dup-test-chain-explicit"
   [junit4]   2> 51347 INFO  (coreLoadExecutor-118-thread-1-processing-n:127.0.0.1:54297_) [n:127.0.0.1:54297_ c:control_collection s:shard1 r:core_node1 x:collection1] o.a.s.u.p.UpdateRequestProcessorChain creating updateRequestProcessorChain "distrib-dup-test-chain-implicit"
   [junit4]   2> 51348 INFO  (coreLoadExecutor-118-thread-1-processing-n:127.0.0.1:54297_) [n:127.0.0.1:54297_ c:control_collection s:shard1 r:core_node1 x:collection1] o.a.s.u.p.UpdateRequestProcessorChain inserting DistributedUpdateProcessorFactory into updateRequestProcessorChain "distrib-dup-test-chain-implicit"
   [junit4]   2> 51348 INFO  (coreLoadExecutor-118-thread-1-processing-n:127.0.0.1:54297_) [n:127.0.0.1:54297_ c:control_collection s:shard1 r:core_node1 x:collection1] o.a.s.c.SolrCore no updateRequestProcessorChain defined as default, creating implicit default
   [junit4]   2> 51348 WARN  (coreLoadExecutor-118-thread-1-processing-n:127.0.0.1:54297_) [n:127.0.0.1:54297_ c:control_collection s:shard1 r:core_node1 x:collection1] o.a.s.c.RequestHandlers INVALID paramSet a in requestHandler {type = requestHandler,name = /dump,class = DumpRequestHandler,args = {defaults={a=A,b=B}}}
   [junit4]   2> 51350 INFO  (coreLoadExecutor-118-thread-1-processing-n:127.0.0.1:54297_) [n:127.0.0.1:54297_ c:control_collection s:shard1 r:core_node1 x:collection1] o.a.s.h.l.XMLLoader xsltCacheLifetimeSeconds=60
   [junit4]   2> 51350 WARN  (OldIndexDirectoryCleanupThreadForCore-collection1) [n:127.0.0.1:54297_ c:control_collection s:shard1 r:core_node1 x:collection1] o.a.s.c.DirectoryFactory /x1/jenkins/jenkins-slave/workspace/Lucene-Solr-Tests-trunk-Java8/solr/build/solr-core/test/J1/temp/solr.cloud.CollectionsAPIDistributedZkTest_1B239A1DEF9ABFE4-001/control-001/cores/collection1/data/ does not point to a valid data directory; skipping clean-up of old index directories.
   [junit4]   2> 51352 INFO  (coreLoadExecutor-118-thread-1-processing-n:127.0.0.1:54297_) [n:127.0.0.1:54297_ c:control_collection s:shard1 r:core_node1 x:collection1] o.a.s.h.l.XMLLoader xsltCacheLifetimeSeconds=60
   [junit4]   2> 51353 INFO  (coreLoadExecutor-118-thread-1-processing-n:127.0.0.1:54297_) [n:127.0.0.1:54297_ c:control_collection s:shard1 r:core_node1 x:collection1] o.a.s.h.l.XMLLoader xsltCacheLifetimeSeconds=60
   [junit4]   2> 51354 INFO  (coreLoadExecutor-118-thread-1-processing-n:127.0.0.1:54297_) [n:127.0.0.1:54297_ c:control_collection s:shard1 r:core_node1 x:collection1] o.a.s.h.l.XMLLoader xsltCacheLifetimeSeconds=60
   [junit4]   2> 51359 INFO  (coreLoadExecutor-118-thread-1-processing-n:127.0.0.1:54297_) [n:127.0.0.1:54297_ c:control_collection s:shard1 r:core_node1 x:collection1] o.a.s.c.RequestHandlers Registered paths: /admin/mbeans,standard,/dump,/update/csv,/sql,/update/json/docs,/admin/luke,/export,/admin/segments,/get,/admin/system,/replication,/admin/properties,/config,/stream,/schema,/admin/plugins,/admin/logging,/update/json,/admin/ping,/admin/threads,/update,/admin/file
   [junit4]   2> 51359 INFO  (coreLoadExecutor-118-thread-1-processing-n:127.0.0.1:54297_) [n:127.0.0.1:54297_ c:control_collection s:shard1 r:core_node1 x:collection1] o.a.s.c.SolrCore Using default statsCache cache: org.apache.solr.search.stats.LocalStatsCache
   [junit4]   2> 51360 INFO  (coreLoadExecutor-118-thread-1-processing-n:127.0.0.1:54297_) [n:127.0.0.1:54297_ c:control_collection s:shard1 r:core_node1 x:collection1] o.a.s.u.UpdateHandler Using UpdateLog implementation: org.apache.solr.update.UpdateLog
   [junit4]   2> 51360 INFO  (coreLoadExecutor-118-thread-1-processing-n:127.0.0.1:54297_) [n:127.0.0.1:54297_ c:control_collection s:shard1 r:core_node1 x:collection1] o.a.s.u.UpdateLog Initializing UpdateLog: dataDir= defaultSyncLevel=FLUSH numRecordsToKeep=100 maxNumLogsToKeep=10 numVersionBuckets=65536
   [junit4]   2> 51361 INFO  (coreLoadExecutor-118-thread-1-processing-n:127.0.0.1:54297_) [n:127.0.0.1:54297_ c:control_collection s:shard1 r:core_node1 x:collection1] o.a.s.u.CommitTracker Hard AutoCommit: disabled
   [junit4]   2> 51361 INFO  (coreLoadExecutor-118-thread-1-processing-n:127.0.0.1:54297_) [n:127.0.0.1:54297_ c:control_collection s:shard1 r:core_node1 x:collection1] o.a.s.u.CommitTracker Soft AutoCommit: disabled
   [junit4]   2> 51362 INFO  (coreLoadExecutor-118-thread-1-processing-n:127.0.0.1:54297_) [n:127.0.0.1:54297_ c:control_collection s:shard1 r:core_node1 x:collection1] o.a.s.u.RandomMergePolicy RandomMergePolicy wrapping class org.apache.lucene.index.AlcoholicMergePolicy: [AlcoholicMergePolicy: minMergeSize=0, mergeFactor=10, maxMergeSize=616689083, maxMergeSizeForForcedMerge=9223372036854775807, calibrateSizeByDeletes=true, maxMergeDocs=2147483647, maxCFSSegmentSizeMB=8.796093022207999E12, noCFSRatio=0.1]
   [junit4]   2> 51363 INFO  (coreLoadExecutor-118-thread-1-processing-n:127.0.0.1:54297_) [n:127.0.0.1:54297_ c:control_collection s:shard1 r:core_node1 x:collection1] o.a.s.c.SolrDeletionPolicy SolrDeletionPolicy.onInit: commits: num=1
   [junit4]   2> 	commit{dir=MockDirectoryWrapper(RAMDirectory@2183e7b lockFactory=org.apache.lucene.store.SingleInstanceLockFactory@13f03d5f),segFN=segments_1,generation=1}
   [junit4]   2> 51363 INFO  (coreLoadExecutor-118-thread-1-processing-n:127.0.0.1:54297_) [n:127.0.0.1:54297_ c:control_collection s:shard1 r:core_node1 x:collection1] o.a.s.c.SolrDeletionPolicy newest commit generation = 1
   [junit4]   2> 51363 INFO  (coreLoadExecutor-118-thread-1-processing-n:127.0.0.1:54297_) [n:127.0.0.1:54297_ c:control_collection s:shard1 r:core_node1 x:collection1] o.a.s.s.SolrIndexSearcher Opening [Searcher@3b731760[collection1] main]
   [junit4]   2> 51363 INFO  (coreLoadExecutor-118-thread-1-processing-n:127.0.0.1:54297_) [n:127.0.0.1:54297_ c:control_collection s:shard1 r:core_node1 x:collection1] o.a.s.c.c.ZkStateReader Load collection config from: [/collections/control_collection]
   [junit4]   2> 51364 INFO  (coreLoadExecutor-118-thread-1-processing-n:127.0.0.1:54297_) [n:127.0.0.1:54297_ c:control_collection s:shard1 r:core_node1 x:collection1] o.a.s.c.c.ZkStateReader path=[/collections/control_collection] [configName]=[conf1] specified config exists in ZooKeeper
   [junit4]   2> 51365 INFO  (coreLoadExecutor-118-thread-1-processing-n:127.0.0.1:54297_) [n:127.0.0.1:54297_ c:control_collection s:shard1 r:core_node1 x:collection1] o.a.s.r.ManagedResourceStorage Setting up ZooKeeper-based storage for the RestManager with znodeBase: /configs/conf1
   [junit4]   2> 51365 INFO  (coreLoadExecutor-118-thread-1-processing-n:127.0.0.1:54297_) [n:127.0.0.1:54297_ c:control_collection s:shard1 r:core_node1 x:collection1] o.a.s.r.ManagedResourceStorage Configured ZooKeeperStorageIO with znodeBase: /configs/conf1
   [junit4]   2> 51365 INFO  (coreLoadExecutor-118-thread-1-processing-n:127.0.0.1:54297_) [n:127.0.0.1:54297_ c:control_collection s:shard1 r:core_node1 x:collection1] o.a.s.r.RestManager Initializing RestManager with initArgs: {}
   [junit4]   2> 51365 INFO  (coreLoadExecutor-118-thread-1-processing-n:127.0.0.1:54297_) [n:127.0.0.1:54297_ c:control_collection s:shard1 r:core_node1 x:collection1] o.a.s.r.ManagedResourceStorage Reading _rest_managed.json using ZooKeeperStorageIO:path=/configs/conf1
   [junit4]   2> 51366 INFO  (coreLoadExecutor-118-thread-1-processing-n:127.0.0.1:54297_) [n:127.0.0.1:54297_ c:control_collection s:shard1 r:core_node1 x:collection1] o.a.s.r.ManagedResourceStorage No data found for znode /configs/conf1/_rest_managed.json
   [junit4]   2> 51366 INFO  (coreLoadExecutor-118-thread-1-processing-n:127.0.0.1:54297_) [n:127.0.0.1:54297_ c:control_collection s:shard1 r:core_node1 x:collection1] o.a.s.r.ManagedResourceStorage Loaded null at path _rest_managed.json using ZooKeeperStorageIO:path=/configs/conf1
   [junit4]   2> 51366 INFO  (coreLoadExecutor-118-thread-1-processing-n:127.0.0.1:54297_) [n:127.0.0.1:54297_ c:control_collection s:shard1 r:core_node1 x:collection1] o.a.s.r.RestManager Initializing 0 registered ManagedResources
   [junit4]   2> 51366 INFO  (coreLoadExecutor-118-thread-1-processing-n:127.0.0.1:54297_) [n:127.0.0.1:54297_ c:control_collection s:shard1 r:core_node1 x:collection1] o.a.s.h.ReplicationHandler Commits will be reserved for  10000
   [junit4]   2> 51366 INFO  (coreLoadExecutor-118-thread-1-processing-n:127.0.0.1:54297_) [n:127.0.0.1:54297_ c:control_collection s:shard1 r:core_node1 x:collection1] o.a.s.u.UpdateLog Looking up max value of version field to seed version buckets
   [junit4]   2> 51366 INFO  (coreLoadExecutor-118-thread-1-processing-n:127.0.0.1:54297_) [n:127.0.0.1:54297_ c:control_collection s:shard1 r:core_node1 x:collection1] o.a.s.u.VersionInfo Refreshing highest value of _version_ for 65536 version buckets from index
   [junit4]   2> 51367 INFO  (coreLoadExecutor-118-thread-1-processing-n:127.0.0.1:54297_) [n:127.0.0.1:54297_ c:control_collection s:shard1 r:core_node1 x:collection1] o.a.s.u.VersionInfo No terms found for _version_, cannot seed version bucket highest value from index
   [junit4]   2> 51367 INFO  (coreLoadExecutor-118-thread-1-processing-n:127.0.0.1:54297_) [n:127.0.0.1:54297_ c:control_collection s:shard1 r:core_node1 x:collection1] o.a.s.u.UpdateLog Could not find max version in index or recent updates, using new clock 1527729813324824576
   [junit4]   2> 51369 INFO  (coreLoadExecutor-118-thread-1-processing-n:127.0.0.1:54297_) [n:127.0.0.1:54297_ c:control_collection s:shard1 r:core_node1 x:collection1] o.a.s.u.UpdateLog Took 2.0ms to seed version buckets with highest version 1527729813324824576
   [junit4]   2> 51369 INFO  (coreLoadExecutor-118-thread-1-processing-n:127.0.0.1:54297_) [n:127.0.0.1:54297_ c:control_collection s:shard1 r:core_node1 x:collection1] o.a.s.c.ZkController watch zkdir /configs/conf1
   [junit4]   2> 51370 INFO  (searcherExecutor-119-thread-1-processing-n:127.0.0.1:54297_ x:collection1 s:shard1 c:control_collection r:core_node1) [n:127.0.0.1:54297_ c:control_collection s:shard1 r:core_node1 x:collection1] o.a.s.c.SolrCore [collection1] Registered new searcher Searcher@3b731760[collection1] main{ExitableDirectoryReader(UninvertingDirectoryReader())}
   [junit4]   2> 51370 INFO  (coreLoadExecutor-118-thread-1-processing-n:127.0.0.1:54297_) [n:127.0.0.1:54297_ c:control_collection s:shard1 r:core_node1 x:collection1] o.a.s.c.CoreContainer registering core: collection1
   [junit4]   2> 51371 INFO  (coreZkRegister-112-thread-1-processing-n:127.0.0.1:54297_ x:collection1 s:shard1 c:control_collection r:core_node1) [n:127.0.0.1:54297_ c:control_collection s:shard1 r:core_node1 x:collection1] o.a.s.c.ZkController Register replica - core:collection1 address:http://127.0.0.1:54297 collection:control_collection shard:shard1
   [junit4]   2> 51372 INFO  (coreZkRegister-112-thread-1-processing-n:127.0.0.1:54297_ x:collection1 s:shard1 c:control_collection r:core_node1) [n:127.0.0.1:54297_ c:control_collection s:shard1 r:core_node1 x:collection1] o.a.s.c.c.SolrZkClient makePath: /collections/control_collection/leader_elect/shard1/election
   [junit4]   2> 51375 INFO  (coreZkRegister-112-thread-1-processing-n:127.0.0.1:54297_ x:collection1 s:shard1 c:control_collection r:core_node1) [n:127.0.0.1:54297_ c:control_collection s:shard1 r:core_node1 x:collection1] o.a.s.c.LeaderElector Joined leadership election with path: /collections/control_collection/leader_elect/shard1/election/95483113292234756-core_node1-n_0000000000
   [junit4]   2> 51376 INFO  (coreZkRegister-112-thread-1-processing-n:127.0.0.1:54297_ x:collection1 s:shard1 c:control_collection r:core_node1) [n:127.0.0.1:54297_ c:control_collection s:shard1 r:core_node1 x:collection1] o.a.s.c.ShardLeaderElectionContext Running the leader process for shard=shard1 and weAreReplacement=false and leaderVoteWait=180000
   [junit4]   2> 51378 INFO  (coreZkRegister-112-thread-1-processing-n:127.0.0.1:54297_ x:collection1 s:shard1 c:control_collection r:core_node1) [n:127.0.0.1:54297_ c:control_collection s:shard1 r:core_node1 x:collection1] o.a.s.c.ShardLeaderElectionContext Enough replicas found to continue.
   [junit4]   2> 51378 INFO  (coreZkRegister-112-thread-1-processing-n:127.0.0.1:54297_ x:collection1 s:shard1 c:control_collection r:core_node1) [n:127.0.0.1:54297_ c:control_collection s:shard1 r:core_node1 x:collection1] o.a.s.c.ShardLeaderElectionContext I may be the new leader - try and sync
   [junit4]   2> 51378 INFO  (coreZkRegister-112-thread-1-processing-n:127.0.0.1:54297_ x:collection1 s:shard1 c:control_collection r:core_node1) [n:127.0.0.1:54297_ c:control_collection s:shard1 r:core_node1 x:collection1] o.a.s.c.SyncStrategy Sync replicas to http://127.0.0.1:54297/collection1/
   [junit4]   2> 51378 INFO  (coreZkRegister-112-thread-1-processing-n:127.0.0.1:54297_ x:collection1 s:shard1 c:control_collection r:core_node1) [n:127.0.0.1:54297_ c:control_collection s:shard1 r:core_node1 x:collection1] o.a.s.c.SyncStrategy Sync Success - now sync replicas to me
   [junit4]   2> 51378 INFO  (coreZkRegister-112-thread-1-processing-n:127.0.0.1:54297_ x:collection1 s:shard1 c:control_collection r:core_node1) [n:127.0.0.1:54297_ c:control_collection s:shard1 r:core_node1 x:collection1] o.a.s.c.SyncStrategy http://127.0.0.1:54297/collection1/ has no replicas
   [junit4]   2> 51378 INFO  (OverseerStateUpdate-95483113292234756-127.0.0.1:54297_-n_0000000000) [n:127.0.0.1:54297_    ] o.a.s.c.Overseer processMessage: queueSize: 1, message = {
   [junit4]   2>   "operation":"leader",
   [junit4]   2>   "shard":"shard1",
   [junit4]   2>   "collection":"control_collection"} current state version: 1
   [junit4]   2> 51383 INFO  (coreZkRegister-112-thread-1-processing-n:127.0.0.1:54297_ x:collection1 s:shard1 c:control_collection r:core_node1) [n:127.0.0.1:54297_ c:control_collection s:shard1 r:core_node1 x:collection1] o.a.s.c.c.SolrZkClient makePath: /collections/control_collection/leaders/shard1
   [junit4]   2> 51387 INFO  (coreZkRegister-112-thread-1-processing-n:127.0.0.1:54297_ x:collection1 s:shard1 c:control_collection r:core_node1) [n:127.0.0.1:54297_ c:control_collection s:shard1 r:core_node1 x:collection1] o.a.s.c.ShardLeaderElectionContextBase Creating leader registration node /collections/control_collection/leaders/shard1/leader after winning as /collections/control_collection/leader_elect/shard1/election/95483113292234756-core_node1-n_0000000000
   [junit4]   2> 51390 INFO  (coreZkRegister-112-thread-1-processing-n:127.0.0.1:54297_ x:collection1 s:shard1 c:control_collection r:core_node1) [n:127.0.0.1:54297_ c:control_collection s:shard1 r:core_node1 x:collection1] o.a.s.c.ShardLeaderElectionContext I am the new leader: http://127.0.0.1:54297/collection1/ shard1
   [junit4]   2> 51390 INFO  (OverseerStateUpdate-95483113292234756-127.0.0.1:54297_-n_0000000000) [n:127.0.0.1:54297_    ] o.a.s.c.Overseer processMessage: queueSize: 1, message = {
   [junit4]   2>   "operation":"leader",
   [junit4]   2>   "shard":"shard1",
   [junit4]   2>   "collection":"control_collection",
   [junit4]   2>   "base_url":"http://127.0.0.1:54297",
   [junit4]   2>   "core":"collection1",
   [junit4]   2>   "state":"active"} current state version: 1
   [junit4]   2> 51493 INFO  (zkCallback-44-thread-1-processing-n:127.0.0.1:54297_) [n:127.0.0.1:54297_    ] o.a.s.c.c.ZkStateReader A cluster state change: [WatchedEvent state:SyncConnected type:NodeDataChanged path:/clusterstate.json], has occurred - updating... (live nodes size: [1])
   [junit4]   2> 51541 INFO  (coreZkRegister-112-thread-1-processing-n:127.0.0.1:54297_ x:collection1 s:shard1 c:control_collection r:core_node1) [n:127.0.0.1:54297_ c:control_collection s:shard1 r:core_node1 x:collection1] o.a.s.c.ZkController We are http://127.0.0.1:54297/collection1/ and leader is http://127.0.0.1:54297/collection1/
   [junit4]   2> 51541 INFO  (coreZkRegister-112-thread-1-processing-n:127.0.0.1:54297_ x:collection1 s:shard1 c:control_collection r:core_node1) [n:127.0.0.1:54297_ c:control_collection s:shard1 r:core_node1 x:collection1] o.a.s.c.ZkController No LogReplay needed for core=collection1 baseURL=http://127.0.0.1:54297
   [junit4]   2> 51541 INFO  (coreZkRegister-112-thread-1-processing-n:127.0.0.1:54297_ x:collection1 s:shard1 c:control_collection r:core_node1) [n:127.0.0.1:54297_ c:control_collection s:shard1 r:core_node1 x:collection1] o.a.s.c.ZkController I am the leader, no recovery necessary
   [junit4]   2> 51541 INFO  (coreZkRegister-112-thread-1-processing-n:127.0.0.1:54297_ x:collection1 s:shard1 c:control_collection r:core_node1) [n:127.0.0.1:54297_ c:control_collection s:shard1 r:core_node1 x:collection1] o.a.s.c.ZkController publishing state=active
   [junit4]   2> 51541 INFO  (coreZkRegister-112-thread-1-processing-n:127.0.0.1:54297_ x:collection1 s:shard1 c:control_collection r:core_node1) [n:127.0.0.1:54297_ c:control_collection s:shard1 r:core_node1 x:collection1] o.a.s.c.ZkController numShards not found on descriptor - reading it from system property
   [junit4]   2> 51544 INFO  (OverseerStateUpdate-95483113292234756-127.0.0.1:54297_-n_0000000000) [n:127.0.0.1:54297_    ] o.a.s.c.Overseer processMessage: queueSize: 1, message = {
   [junit4]   2>   "core":"collection1",
   [junit4]   2>   "core_node_name":"core_node1",
   [junit4]   2>   "roles":null,
   [junit4]   2>   "base_url":"http://127.0.0.1:54297",
   [junit4]   2>   "node_name":"127.0.0.1:54297_",
   [junit4]   2>   "numShards":"1",
   [junit4]   2>   "state":"active",
   [junit4]   2>   "shard":"shard1",
   [junit4]   2>   "collection":"control_collection",
   [junit4]   2>   "operation":"state"} current state version: 2
   [junit4]   2> 51544 INFO  (OverseerStateUpdate-95483113292234756-127.0.0.1:54297_-n_0000000000) [n:127.0.0.1:54297_    ] o.a.s.c.o.ReplicaMutator Update state numShards=1 message={
   [junit4]   2>   "core":"collection1",
   [junit4]   2>   "core_node_name":"core_node1",
   [junit4]   2>   "roles":null,
   [junit4]   2>   "base_url":"http://127.0.0.1:54297",
   [junit4]   2>   "node_name":"127.0.0.1:54297_",
   [junit4]   2>   "numShards":"1",
   [junit4]   2>   "state":"active",
   [junit4]   2>   "shard":"shard1",
   [junit4]   2>   "collection":"control_collection",
   [junit4]   2>   "operation":"state"}
   [junit4]   2> 51545 INFO  (coreZkRegister-112-thread-1-processing-n:127.0.0.1:54297_ x:collection1 s:shard1 c:control_collection r:core_node1) [n:127.0.0.1:54297_ c:control_collection s:shard1 r:core_node1 x:collection1] o.a.s.c.c.ZkStateReader Updated live nodes from ZooKeeper... (1) -> (1)
   [junit4]   2> 51647 INFO  (zkCallback-44-thread-1-processing-n:127.0.0.1:54297_) [n:127.0.0.1:54297_    ] o.a.s.c.c.ZkStateReader A cluster state change: [WatchedEvent state:SyncConnected type:NodeDataChanged path:/clusterstate.json], has occurred - updating... (live nodes size: [1])
   [junit4]   2> 51664 INFO  (TEST-CollectionsAPIDistributedZkTest.test-seed#[1B239A1DEF9ABFE4]) [    ] o.a.s.c.c.SolrZkClient Using default ZkCredentialsProvider
   [junit4]   2> 51665 INFO  (TEST-CollectionsAPIDistributedZkTest.test-seed#[1B239A1DEF9ABFE4]) [    ] o.a.s.c.c.ConnectionManager Waiting for client to connect to ZooKeeper
   [junit4]   2> 51667 INFO  (zkCallback-46-thread-1) [    ] o.a.s.c.c.ConnectionManager Watcher org.apache.solr.common.cloud.ConnectionManager@2eade657 name:ZooKeeperConnection Watcher:127.0.0.1:55905/solr got event WatchedEvent state:SyncConnected type:None path:null path:null type:None
   [junit4]   2> 51668 INFO  (TEST-CollectionsAPIDistributedZkTest.test-seed#[1B239A1DEF9ABFE4]) [    ] o.a.s.c.c.ConnectionManager Client is connected to ZooKeeper
   [junit4]   2> 51668 INFO  (TEST-CollectionsAPIDistributedZkTest.test-seed#[1B239A1DEF9ABFE4]) [    ] o.a.s.c.c.SolrZkClient Using default ZkACLProvider
   [junit4]   2> 51668 INFO  (TEST-CollectionsAPIDistributedZkTest.test-seed#[1B239A1DEF9ABFE4]) [    ] o.a.s.c.c.ZkStateReader Updating cluster state from ZooKeeper... 
   [junit4]   2> 51670 INFO  (TEST-CollectionsAPIDistributedZkTest.test-seed#[1B239A1DEF9ABFE4]) [    ] o.a.s.c.c.ZkStateReader Updated live nodes from ZooKeeper... (0) -> (1)
   [junit4]   2> 51670 INFO  (TEST-CollectionsAPIDistributedZkTest.test-seed#[1B239A1DEF9ABFE4]) [    ] o.a.s.c.ChaosMonkey monkey: init - expire sessions:false cause connection loss:false
   [junit4]   2> 51770 INFO  (TEST-CollectionsAPIDistributedZkTest.test-seed#[1B239A1DEF9ABFE4]) [    ] o.a.s.SolrTestCaseJ4 Writing core.properties file to /x1/jenkins/jenkins-slave/workspace/Lucene-Solr-Tests-trunk-Java8/solr/build/solr-core/test/J1/temp/solr.cloud.CollectionsAPIDistributedZkTest_1B239A1DEF9ABFE4-001/shard-1-001/cores/collection1
   [junit4]   2> 51771 INFO  (TEST-CollectionsAPIDistributedZkTest.test-seed#[1B239A1DEF9ABFE4]) [    ] o.a.s.c.AbstractFullDistribZkTestBase create jetty 1 in directory /x1/jenkins/jenkins-slave/workspace/Lucene-Solr-Tests-trunk-Java8/solr/build/solr-core/test/J1/temp/solr.cloud.CollectionsAPIDistributedZkTest_1B239A1DEF9ABFE4-001/shard-1-001
   [junit4]   2> 51772 INFO  (TEST-CollectionsAPIDistributedZkTest.test-seed#[1B239A1DEF9ABFE4]) [    ] o.e.j.s.Server jetty-9.3.6.v20151106
   [junit4]   2> 51776 INFO  (TEST-CollectionsAPIDistributedZkTest.test-seed#[1B239A1DEF9ABFE4]) [    ] o.e.j.s.h.ContextHandler Started o.e.j.s.ServletContextHandler@728797ba{/,null,AVAILABLE}
   [junit4]   2> 51776 INFO  (TEST-CollectionsAPIDistributedZkTest.test-seed#[1B239A1DEF9ABFE4]) [    ] o.e.j.s.ServerConnector Started ServerConnector@1f88a37a{HTTP/1.1,[http/1.1]}{127.0.0.1:33258}
   [junit4]   2> 51777 INFO  (TEST-CollectionsAPIDistributedZkTest.test-seed#[1B239A1DEF9ABFE4]) [    ] o.e.j.s.Server Started @54811ms
   [junit4]   2> 51777 INFO  (TEST-CollectionsAPIDistributedZkTest.test-seed#[1B239A1DEF9ABFE4]) [    ] o.a.s.c.s.e.JettySolrRunner Jetty properties: {solr.data.dir=/x1/jenkins/jenkins-slave/workspace/Lucene-Solr-Tests-trunk-Java8/solr/build/solr-core/test/J1/temp/solr.cloud.CollectionsAPIDistributedZkTest_1B239A1DEF9ABFE4-001/tempDir-001/jetty1, solrconfig=solrconfig.xml, hostContext=/, hostPort=33258, coreRootDirectory=/x1/jenkins/jenkins-slave/workspace/Lucene-Solr-Tests-trunk-Java8/solr/build/solr-core/test/J1/../../../../../../../../../../x1/jenkins/jenkins-slave/workspace/Lucene-Solr-Tests-trunk-Java8/solr/build/solr-core/test/J1/temp/solr.cloud.CollectionsAPIDistributedZkTest_1B239A1DEF9ABFE4-001/shard-1-001/cores}
   [junit4]   2> 51777 INFO  (TEST-CollectionsAPIDistributedZkTest.test-seed#[1B239A1DEF9ABFE4]) [    ] o.a.s.s.SolrDispatchFilter SolrDispatchFilter.init(): sun.misc.Launcher$AppClassLoader@4e0e2f2a
   [junit4]   2> 51777 INFO  (TEST-CollectionsAPIDistributedZkTest.test-seed#[1B239A1DEF9ABFE4]) [    ] o.a.s.c.SolrResourceLoader new SolrResourceLoader for directory: '/x1/jenkins/jenkins-slave/workspace/Lucene-Solr-Tests-trunk-Java8/solr/build/solr-core/test/J1/temp/solr.cloud.CollectionsAPIDistributedZkTest_1B239A1DEF9ABFE4-001/shard-1-001'
   [junit4]   2> 51777 INFO  (TEST-CollectionsAPIDistributedZkTest.test-seed#[1B239A1DEF9ABFE4]) [    ] o.a.s.c.SolrResourceLoader JNDI not configured for solr (NoInitialContextEx)
   [junit4]   2> 51777 INFO  (TEST-CollectionsAPIDistributedZkTest.test-seed#[1B239A1DEF9ABFE4]) [    ] o.a.s.c.SolrResourceLoader solr home defaulted to 'solr/' (could not find system property or JNDI)
   [junit4]   2> 51778 INFO  (TEST-CollectionsAPIDistributedZkTest.test-seed#[1B239A1DEF9ABFE4]) [    ] o.a.s.c.c.SolrZkClient Using default ZkCredentialsProvider
   [junit4]   2> 51778 INFO  (TEST-CollectionsAPIDistributedZkTest.test-seed#[1B239A1DEF9ABFE4]) [    ] o.a.s.c.c.ConnectionManager Waiting for client to connect to ZooKeeper
   [junit4]   2> 51780 INFO  (zkCallback-47-thread-1) [    ] o.a.s.c.c.ConnectionManager Watcher org.apache.solr.common.cloud.ConnectionManager@3ea0fb81 name:ZooKeeperConnection Watcher:127.0.0.1:55905/solr got event WatchedEvent state:SyncConnected type:None path:null path:null type:None
   [junit4]   2> 51780 INFO  (TEST-CollectionsAPIDistributedZkTest.test-seed#[1B239A1DEF9ABFE4]) [    ] o.a.s.c.c.ConnectionManager Client is connected to ZooKeeper
   [junit4]   2> 51780 INFO  (TEST-CollectionsAPIDistributedZkTest.test-seed#[1B239A1DEF9ABFE4]) [    ] o.a.s.c.c.SolrZkClient Using default ZkACLProvider
   [junit4]   2> 51782 INFO  (TEST-CollectionsAPIDistributedZkTest.test-seed#[1B239A1DEF9ABFE4]) [    ] o.a.s.s.SolrDispatchFilter Loading solr.xml from SolrHome (not found in ZooKeeper)
   [junit4]   2> 51782 INFO  (TEST-CollectionsAPIDistributedZkTest.test-seed#[1B239A1DEF9ABFE4]) [    ] o.a.s.c.SolrXmlConfig Loading container configuration from /x1/jenkins/jenkins-slave/workspace/Lucene-Solr-Tests-trunk-Java8/solr/build/solr-core/test/J1/temp/solr.cloud.CollectionsAPIDistributedZkTest_1B239A1DEF9ABFE4-001/shard-1-001/solr.xml
   [junit4]   2> 51788 INFO  (TEST-CollectionsAPIDistributedZkTest.test-seed#[1B239A1DEF9ABFE4]) [    ] o.a.s.c.CorePropertiesLocator Config-defined core root directory: /x1/jenkins/jenkins-slave/workspace/Lucene-Solr-Tests-trunk-Java8/solr/build/solr-core/test/J1/../../../../../../../../../../x1/jenkins/jenkins-slave/workspace/Lucene-Solr-Tests-trunk-Java8/solr/build/solr-core/test/J1/temp/solr.cloud.CollectionsAPIDistributedZkTest_1B239A1DEF9ABFE4-001/shard-1-001/cores
   [junit4]   2> 51788 INFO  (TEST-CollectionsAPIDistributedZkTest.test-seed#[1B239A1DEF9ABFE4]) [    ] o.a.s.c.CoreContainer New CoreContainer 885603946
   [junit4]   2> 51788 INFO  (TEST-CollectionsAPIDistributedZkTest.test-seed#[1B239A1DEF9ABFE4]) [    ] o.a.s.c.CoreContainer Loading cores into CoreContainer [instanceDir=/x1/jenkins/jenkins-slave/workspace/Lucene-Solr-Tests-trunk-Java8/solr/build/solr-core/test/J1/temp/solr.cloud.CollectionsAPIDistributedZkTest_1B239A1DEF9ABFE4-001/shard-1-001]
   [junit4]   2> 51788 WARN  (TEST-CollectionsAPIDistributedZkTest.test-seed#[1B239A1DEF9ABFE4]) [    ] o.a.s.c.CoreContainer Couldn't add files from /x1/jenkins/jenkins-slave/workspace/Lucene-Solr-Tests-trunk-Java8/solr/build/solr-core/test/J1/temp/solr.cloud.CollectionsAPIDistributedZkTest_1B239A1DEF9ABFE4-001/shard-1-001/lib to classpath: /x1/jenkins/jenkins-slave/workspace/Lucene-Solr-Tests-trunk-Java8/solr/build/solr-core/test/J1/temp/solr.cloud.CollectionsAPIDistributedZkTest_1B239A1DEF9ABFE4-001/shard-1-001/lib
   [junit4]   2> 51789 INFO  (TEST-CollectionsAPIDistributedZkTest.test-seed#[1B239A1DEF9ABFE4]) [    ] o.a.s.h.c.HttpShardHandlerFactory created with socketTimeout : 90000,urlScheme : ,connTimeout : 15000,maxConnectionsPerHost : 20,maxConnections : 10000,corePoolSize : 0,maximumPoolSize : 2147483647,maxThreadIdleTime : 5,sizeOfQueue : -1,fairnessPolicy : false,useRetries : false,
   [junit4]   2> 51790 INFO  (TEST-CollectionsAPIDistributedZkTest.test-seed#[1B239A1DEF9ABFE4]) [    ] o.a.s.u.UpdateShardHandler Creating UpdateShardHandler HTTP client with params: socketTimeout=340000&connTimeout=45000&retry=true
   [junit4]   2> 51790 INFO  (TEST-CollectionsAPIDistributedZkTest.test-seed#[1B239A1DEF9ABFE4]) [    ] o.a.s.l.LogWatcher SLF4J impl is org.slf4j.impl.Log4jLoggerFactory
   [junit4]   2> 51790 INFO  (TEST-CollectionsAPIDistributedZkTest.test-seed#[1B239A1DEF9ABFE4]) [    ] o.a.s.l.LogWatcher Registering Log Listener [Log4j (org.slf4j.impl.Log4jLoggerFactory)]
   [junit4]   2> 51791 INFO  (TEST-CollectionsAPIDistributedZkTest.test-seed#[1B239A1DEF9ABFE4]) [    ] o.a.s.c.ZkContainer Zookeeper client=127.0.0.1:55905/solr
   [junit4]   2> 51791 INFO  (TEST-CollectionsAPIDistributedZkTest.test-seed#[1B239A1DEF9ABFE4]) [    ] o.a.s.c.ZkController zkHost includes chroot
   [junit4]   2> 51791 INFO  (TEST-CollectionsAPIDistributedZkTest.test-seed#[1B239A1DEF9ABFE4]) [    ] o.a.s.c.c.SolrZkClient Using default ZkCredentialsProvider
   [junit4]   2> 51791 INFO  (TEST-CollectionsAPIDistributedZkTest.test-seed#[1B239A1DEF9ABFE4]) [    ] o.a.s.c.c.ConnectionManager Waiting for client to connect to ZooKeeper
   [junit4]   2> 51793 INFO  (zkCallback-50-thread-1) [    ] o.a.s.c.c.ConnectionManager Watcher org.apache.solr.common.cloud.ConnectionManager@7c69fa41 name:ZooKeeperConnection Watcher:127.0.0.1:55905 got event WatchedEvent state:SyncConnected type:None path:null path:null type:None
   [junit4]   2> 51793 INFO  (TEST-CollectionsAPIDistributedZkTest.test-seed#[1B239A1DEF9ABFE4]) [    ] o.a.s.c.c.ConnectionManager Client is connected to ZooKeeper
   [junit4]   2> 51794 INFO  (TEST-CollectionsAPIDistributedZkTest.test-seed#[1B239A1DEF9ABFE4]) [    ] o.a.s.c.c.SolrZkClient Using default ZkACLProvider
   [junit4]   2> 51796 INFO  (TEST-CollectionsAPIDistributedZkTest.test-seed#[1B239A1DEF9ABFE4]) [n:127.0.0.1:33258_    ] o.a.s.c.c.ConnectionManager Waiting for client to connect to ZooKeeper
   [junit4]   2> 51798 INFO  (zkCallback-51-thread-1-processing-n:127.0.0.1:33258_) [n:127.0.0.1:33258_    ] o.a.s.c.c.ConnectionManager Watcher org.apache.solr.common.cloud.ConnectionManager@224562e7 name:ZooKeeperConnection Watcher:127.0.0.1:55905/solr got event WatchedEvent state:SyncConnected type:None path:null path:null type:None
   [junit4]   2> 51798 INFO  (TEST-CollectionsAPIDistributedZkTest.test-seed#[1B239A1DEF9ABFE4]) [n:127.0.0.1:33258_    ] o.a.s.c.c.ConnectionManager Client is connected to ZooKeeper
   [junit4]   2> 51804 INFO  (TEST-CollectionsAPIDistributedZkTest.test-seed#[1B239A1DEF9ABFE4]) [n:127.0.0.1:33258_    ] o.a.s.c.c.ZkStateReader Updating cluster state from ZooKeeper... 
   [junit4]   2> 51805 INFO  (TEST-CollectionsAPIDistributedZkTest.test-seed#[1B239A1DEF9ABFE4]) [n:127.0.0.1:33258_    ] o.a.s.c.c.ZkStateReader Updated live nodes from ZooKeeper... (0) -> (1)
   [junit4]   2> 51807 INFO  (TEST-CollectionsAPIDistributedZkTest.test-seed#[1B239A1DEF9ABFE4]) [n:127.0.0.1:33258_    ] o.a.s.c.Overseer Overseer (id=null) closing
   [junit4]   2> 51808 INFO  (TEST-CollectionsAPIDistributedZkTest.test-seed#[1B239A1DEF9ABFE4]) [n:127.0.0.1:33258_    ] o.a.s.c.LeaderElector Joined leadership election with path: /overseer_elect/election/95483113292234760-127.0.0.1:33258_-n_0000000001
   [junit4]   2> 51809 INFO  (TEST-CollectionsAPIDistributedZkTest.test-seed#[1B239A1DEF9ABFE4]) [n:127.0.0.1:33258_    ] o.a.s.c.LeaderElector Watching path /overseer_elect/election/95483113292234756-127.0.0.1:54297_-n_0000000000 to know if I could be the leader
   [junit4]   2> 51809 INFO  (TEST-CollectionsAPIDistributedZkTest.test-seed#[1B239A1DEF9ABFE4]) [n:127.0.0.1:33258_    ] o.a.s.c.ZkController Publish node=127.0.0.1:33258_ as DOWN
   [junit4]   2> 51811 INFO  (OverseerStateUpdate-95483113292234756-127.0.0.1:54297_-n_0000000000) [n:127.0.0.1:54297_    ] o.a.s.c.Overseer processMessage: queueSize: 1, message = {
   [junit4]   2>   "operation":"downnode",
   [junit4]   2>   "node_name":"127.0.0.1:33258_"} current state version: 3
   [junit4]   2> 51811 INFO  (OverseerStateUpdate-95483113292234756-127.0.0.1:54297_-n_0000000000) [n:127.0.0.1:54297_    ] o.a.s.c.o.NodeMutator DownNode state invoked for node: 127.0.0.1:33258_
   [junit4]   2> 51914 INFO  (zkCallback-44-thread-1-processing-n:127.0.0.1:54297_) [n:127.0.0.1:54297_    ] o.a.s.c.c.ZkStateReader A cluster state change: [WatchedEvent state:SyncConnected type:NodeDataChanged path:/clusterstate.json], has occurred - updating... (live nodes size: [1])
   [junit4]   2> 51914 INFO  (zkCallback-46-thread-1) [    ] o.a.s.c.c.ZkStateReader A cluster state change: [WatchedEvent state:SyncConnected type:NodeDataChanged path:/clusterstate.json], has occurred - updating... (live nodes size: [1])
   [junit4]   2> 51914 INFO  (zkCallback-51-thread-1-processing-n:127.0.0.1:33258_) [n:127.0.0.1:33258_    ] o.a.s.c.c.ZkStateReader A cluster state change: [WatchedEvent state:SyncConnected type:NodeDataChanged path:/clusterstate.json], has occurred - updating... (live nodes size: [1])
   [junit4]   2> 52812 INFO  (TEST-CollectionsAPIDistributedZkTest.test-seed#[1B239A1DEF9ABFE4]) [n:127.0.0.1:33258_    ] o.a.s.c.ZkController Register node as live in ZooKeeper:/live_nodes/127.0.0.1:33258_
   [junit4]   2> 52813 INFO  (TEST-CollectionsAPIDistributedZkTest.test-seed#[1B239A1DEF9ABFE4]) [n:127.0.0.1:33258_    ] o.a.s.c.c.SolrZkClient makePath: /live_nodes/127.0.0.1:33258_
   [junit4]   2> 52814 INFO  (zkCallback-46-thread-1) [    ] o.a.s.c.c.ZkStateReader A live node change: [WatchedEvent state:SyncConnected type:NodeChildrenChanged path:/live_nodes], has occurred - updating... (live nodes size: [1])
   [junit4]   2> 52814 INFO  (zkCallback-44-thread-1-processing-n:127.0.0.1:54297_) [n:127.0.0.1:54297_    ] o.a.s.c.c.ZkStateReader A live node change: [WatchedEvent state:SyncConnected type:NodeChildrenChanged path:/live_nodes], has occurred - updating... (live nodes size: [1])
   [junit4]   2> 52814 INFO  (zkCallback-51-thread-1-processing-n:127.0.0.1:33258_) [n:127.0.0.1:33258_    ] o.a.s.c.c.ZkStateReader A live node change: [WatchedEvent state:SyncConnected type:NodeChildrenChanged path:/live_nodes], has occurred - updating... (live nodes size: [1])
   [junit4]   2> 52814 INFO  (zkCallback-46-thread-1) [    ] o.a.s.c.c.ZkStateReader Updated live nodes from ZooKeeper... (1) -> (2)
   [junit4]   2> 52818 INFO  (zkCallback-44-thread-1-processing-n:127.0.0.1:54297_) [n:127.0.0.1:54297_    ] o.a.s.c.c.ZkStateReader Updated live nodes from ZooKeeper... (1) -> (2)
   [junit4]   2> 52818 INFO  (zkCallback-51-thread-1-processing-n:127.0.0.1:33258_) [n:127.0.0.1:33258_    ] o.a.s.c.c.ZkStateReader Updated live nodes from ZooKeeper... (1) -> (2)
   [junit4]   2> 52836 INFO  (TEST-CollectionsAPIDistributedZkTest.test-seed#[1B239A1DEF9ABFE4]) [n:127.0.0.1:33258_    ] o.a.s.c.CoreContainer Security conf doesn't exist. Skipping setup for authorization module.
   [junit4]   2> 52836 INFO  (TEST-CollectionsAPIDistributedZkTest.test-seed#[1B239A1DEF9ABFE4]) [n:127.0.0.1:33258_    ] o.a.s.c.CoreContainer No authentication plugin used.
   [junit4]   2> 52836 INFO  (TEST-CollectionsAPIDistributedZkTest.test-seed#[1B239A1DEF9ABFE4]) [n:127.0.0.1:33258_    ] o.a.s.c.CorePropertiesLocator Looking for core definitions underneath /x1/jenkins/jenkins-slave/workspace/Lucene-Solr-Tests-trunk-Java8/solr/build/solr-core/test/J1/../../../../../../../../../../x1/jenkins/jenkins-slave/workspace/Lucene-Solr-Tests-trunk-Java8/solr/build/solr-core/test/J1/temp/solr.cloud.CollectionsAPIDistributedZkTest_1B239A1DEF9ABFE4-001/shard-1-001/cores
   [junit4]   2> 52838 INFO  (TEST-CollectionsAPIDistributedZkTest.test-seed#[1B239A1DEF9ABFE4]) [n:127.0.0.1:33258_    ] o.a.s.c.CoreDescriptor Created CoreDescriptor: {name=collection1, config=solrconfig.xml, transient=false, schema=schema.xml, loadOnStartup=true, configSetProperties=configsetprops.json, collection=collection1, coreNodeName=, dataDir=data/, shard=}
   [junit4]   2> 52838 INFO  (TEST-CollectionsAPIDistributedZkTest.test-seed#[1B239A1DEF9ABFE4]) [n:127.0.0.1:33258_    ] o.a.s.c.CorePropertiesLocator Found core collection1 in /x1/jenkins/jenkins-slave/workspace/Lucene-Solr-Tests-trunk-Java8/solr/build/solr-core/test/J1/../../../../../../../../../../x1/jenkins/jenkins-slave/workspace/Lucene-Solr-Tests-trunk-Java8/solr/build/solr-core/test/J1/temp/solr.cloud.CollectionsAPIDistributedZkTest_1B239A1DEF9ABFE4-001/shard-1-001/cores/collection1
   [junit4]   2> 52838 INFO  (TEST-CollectionsAPIDistributedZkTest.test-seed#[1B239A1DEF9ABFE4]) [n:127.0.0.1:33258_    ] o.a.s.c.CorePropertiesLocator Found 1 core definitions
   [junit4]   2> 52842 INFO  (TEST-CollectionsAPIDistributedZkTest.test-seed#[1B239A1DEF9ABFE4]) [n:127.0.0.1:33258_    ] o.a.s.s.SolrDispatchFilter user.dir=/x1/jenkins/jenkins-slave/workspace/Lucene-Solr-Tests-trunk-Java8/solr/build/solr-core/test/J1
   [junit4]   2> 52842 INFO  (TEST-CollectionsAPIDistributedZkTest.test-seed#[1B239A1DEF9ABFE4]) [n:127.0.0.1:33258_    ] o.a.s.s.SolrDispatchFilter SolrDispatchFilter.init() done
   [junit4]   2> 52842 INFO  (coreLoadExecutor-129-thread-1-processing-n:127.0.0.1:33258_) [n:127.0.0.1:33258_ c:collection1   x:collection1] o.a.s.c.ZkController publishing state=down
   [junit4]   2> 52842 INFO  (coreLoadExecutor-129-thread-1-processing-n:127.0.0.1:33258_) [n:127.0.0.1:33258_ c:collection1   x:collection1] o.a.s.c.ZkController numShards not found on descriptor - reading it from system property
   [junit4]   2> 52845 INFO  (OverseerStateUpdate-95483113292234756-127.0.0.1:54297_-n_0000000000) [n:127.0.0.1:54297_    ] o.a.s.c.Overseer processMessage: queueSize: 1, message = {
   [junit4]   2>   "core":"collection1",
   [junit4]   2>   "roles":null,
   [junit4]   2>   "base_url":"http://127.0.0.1:33258",
   [junit4]   2>   "node_name":"127.0.0.1:33258_",
   [junit4]   2>   "numShards":"2",
   [junit4]   2>   "state":"down",
   [junit4]   2>   "shard":null,
   [junit4]   2>   "collection":"collection1",
   [junit4]   2>   "operation":"state"} current state version: 4
   [junit4]   2> 52845 INFO  (coreLoadExecutor-129-thread-1-processing-n:127.0.0.1:33258_) [n:127.0.0.1:33258_ c:collection1   x:collection1] o.a.s.c.ZkController look for our core node name
   [junit4]   2> 52845 INFO  (OverseerStateUpdate-95483113292234756-127.0.0.1:54297_-n_0000000000) [n:127.0.0.1:54297_    ] o.a.s.c.o.ReplicaMutator Update state numShards=2 message={
   [junit4]   2>   "core":"collection1",
   [junit4]   2>   "roles":null,
   [junit4]   2>   "base_url":"http://127.0.0.1:33258",
   [junit4]   2>   "node_name":"127.0.0.1:33258_",
   [junit4]   2>   "numShards":"2",
   [junit4]   2>   "state":"down",
   [junit4]   2>   "shard":null,
   [junit4]   2>   "collection":"collection1",
   [junit4]   2>   "operation":"state"}
   [junit4]   2> 52845 INFO  (OverseerStateUpdate-95483113292234756-127.0.0.1:54297_-n_0000000000) [n:127.0.0.1:54297_    ] o.a.s.c.o.ClusterStateMutator building a new cName: collection1
   [junit4]   2> 52846 INFO  (OverseerStateUpdate-95483113292234756-127.0.0.1:54297_-n_0000000000) [n:127.0.0.1:54297_    ] o.a.s.c.o.ReplicaMutator Assigning new node to shard shard=shard2
   [junit4]   2> 52951 INFO  (zkCallback-46-thread-1) [    ] o.a.s.c.c.ZkStateReader A cluster state change: [WatchedEvent state:SyncConnected type:NodeDataChanged path:/clusterstate.json], has occurred - updating... (live nodes size: [2])
   [junit4]   2> 52951 INFO  (zkCallback-44-thread-1-processing-n:127.0.0.1:54297_) [n:127.0.0.1:54297_    ] o.a.s.c.c.ZkStateReader A cluster state change: [WatchedEvent state:SyncConnected type:NodeDataChanged path:/clusterstate.json], has occurred - updating... (live nodes size: [2])
   [junit4]   2> 52951 INFO  (zkCallback-51-thread-1-processing-n:127.0.0.1:33258_) [n:127.0.0.1:33258_    ] o.a.s.c.c.ZkStateReader A cluster state change: [WatchedEvent state:SyncConnected type:NodeDataChanged path:/clusterstate.json], has occurred - updating... (live nodes size: [2])
   [junit4]   2> 53846 INFO  (coreLoadExecutor-129-thread-1-processing-n:127.0.0.1:33258_) [n:127.0.0.1:33258_ c:collection1   x:collection1] o.a.s.c.ZkController waiting to find shard id in clusterstate for collection1
   [junit4]   2> 53846 INFO  (coreLoadExecutor-129-thread-1-processing-n:127.0.0.1:33258_) [n:127.0.0.1:33258_ c:collection1   x:collection1] o.a.s.c.ZkController Check for collection zkNode:collection1
   [junit4]   2> 53847 INFO  (coreLoadExecutor-129-thread-1-processing-n:127.0.0.1:33258_) [n:127.0.0.1:33258_ c:collection1   x:collection1] o.a.s.c.ZkController Collection zkNode exists
   [junit4]   2> 53847 INFO  (coreLoadExecutor-129-thread-1-processing-n:127.0.0.1:33258_) [n:127.0.0.1:33258_ c:collection1   x:collection1] o.a.s.c.c.ZkStateReader Load collection config from: [/collections/collection1]
   [junit4]   2> 53847 INFO  (coreLoadExecutor-129-thread-1-processing-n:127.0.0.1:33258_) [n:127.0.0.1:33258_ c:collection1   x:collection1] o.a.s.c.c.ZkStateReader path=[/collections/collection1] [configName]=[conf1] specified config exists in ZooKeeper
   [junit4]   2> 53848 INFO  (coreLoadExecutor-129-thread-1-processing-n:127.0.0.1:33258_) [n:127.0.0.1:33258_ c:collection1   x:collection1] o.a.s.c.SolrResourceLoader new SolrResourceLoader for directory: '/x1/jenkins/jenkins-slave/workspace/Lucene-Solr-Tests-trunk-Java8/solr/build/solr-core/test/J1/temp/solr.cloud.CollectionsAPIDistributedZkTest_1B239A1DEF9ABFE4-001/shard-1-001/cores/collection1'
   [junit4]   2> 53848 INFO  (coreLoadExecutor-129-thread-1-processing-n:127.0.0.1:33258_) [n:127.0.0.1:33258_ c:collection1   x:collection1] o.a.s.c.SolrResourceLoader JNDI not configured for solr (NoInitialContextEx)
   [junit4]   2> 53848 INFO  (coreLoadExecutor-129-thread-1-processing-n:127.0.0.1:33258_) [n:127.0.0.1:33258_ c:collection1   x:collection1] o.a.s.c.SolrResourceLoader solr home defaulted to 'solr/' (could not find system property or JNDI)
   [junit4]   2> 53849 INFO  (coreLoadExecutor-129-thread-1-processing-n:127.0.0.1:33258_) [n:127.0.0.1:33258_ c:collection1   x:collection1] o.a.s.c.Config loaded config solrconfig.xml with version 0 
   [junit4]   2> 53856 INFO  (coreLoadExecutor-129-thread-1-processing-n:127.0.0.1:33258_) [n:127.0.0.1:33258_ c:collection1   x:collection1] o.a.s.c.SolrConfig current version of requestparams : -1
   [junit4]   2> 53860 WARN  (coreLoadExecutor-129-thread-1-processing-n:127.0.0.1:33258_) [n:127.0.0.1:33258_ c:collection1   x:collection1] o.a.s.c.Config Beginning with Solr 5.5, <mergePolicy> is deprecated, use <mergePolicyFactory> instead.
   [junit4]   2> 53861 INFO  (coreLoadExecutor-129-thread-1-processing-n:127.0.0.1:33258_) [n:127.0.0.1:33258_ c:collection1   x:collection1] o.a.s.c.SolrConfig Using Lucene MatchVersion: 7.0.0
   [junit4]   2> 53870 INFO  (coreLoadExecutor-129-thread-1-processing-n:127.0.0.1:33258_) [n:127.0.0.1:33258_ c:collection1   x:collection1] o.a.s.c.SolrConfig Loaded SolrConfig: solrconfig.xml
   [junit4]   2> 53880 INFO  (coreLoadExecutor-129-thread-1-processing-n:127.0.0.1:33258_) [n:127.0.0.1:33258_ c:collection1   x:collection1] o.a.s.s.IndexSchema [collection1] Schema name=test
   [junit4]   2> 53979 INFO  (coreLoadExecutor-129-thread-1-processing-n:127.0.0.1:33258_) [n:127.0.0.1:33258_ c:collection1   x:collection1] o.a.s.s.OpenExchangeRatesOrgProvider Initialized with rates=open-exchange-rates.json, refreshInterval=1440.
   [junit4]   2> 53986 INFO  (coreLoadExecutor-129-thread-1-processing-n:127.0.0.1:33258_) [n:127.0.0.1:33258_ c:collection1   x:collection1] o.a.s.s.IndexSchema default search field in schema is text
   [junit4]   2> 53987 INFO  (coreLoadExecutor-129-thread-1-processing-n:127.0.0.1:33258_) [n:127.0.0.1:33258_ c:collection1   x:collection1] o.a.s.s.IndexSchema unique key field: id
   [junit4]   2> 53998 INFO  (coreLoadExecutor-129-thread-1-processing-n:127.0.0.1:33258_) [n:127.0.0.1:33258_ c:collection1   x:collection1] o.a.s.s.FileExchangeRateProvider Reloading exchange rates from file currency.xml
   [junit4]   2> 54001 INFO  (coreLoadExecutor-129-thread-1-processing-n:127.0.0.1:33258_) [n:127.0.0.1:33258_ c:collection1   x:collection1] o.a.s.s.FileExchangeRateProvider Reloading exchange rates from file currency.xml
   [junit4]   2> 54003 INFO  (coreLoadExecutor-129-thread-1-processing-n:127.0.0.1:33258_) [n:127.0.0.1:33258_ c:collection1   x:collection1] o.a.s.s.OpenExchangeRatesOrgProvider Reloading exchange rates from open-exchange-rates.json
   [junit4]   2> 54004 INFO  (coreLoadExecutor-129-thread-1-processing-n:127.0.0.1:33258_) [n:127.0.0.1:33258_ c:collection1   x:collection1] o.a.s.s.OpenExchangeRatesOrgProvider Reloading exchange rates from open-exchange-rates.json
   [junit4]   2> 54006 INFO  (coreLoadExecutor-129-thread-1-processing-n:127.0.0.1:33258_) [n:127.0.0.1:33258_ c:collection1   x:collection1] o.a.s.c.ConfigSetProperties Did not find ConfigSet properties, assuming default properties: Can't find resource 'configsetprops.json' in classpath or '/configs/conf1', cwd=/x1/jenkins/jenkins-slave/workspace/Lucene-Solr-Tests-trunk-Java8/solr/build/solr-core/test/J1
   [junit4]   2> 54006 INFO  (coreLoadExecutor-129-thread-1-processing-n:127.0.0.1:33258_) [n:127.0.0.1:33258_ c:collection1   x:collection1] o.a.s.c.CoreContainer Creating SolrCore 'collection1' using configuration from collection collection1
   [junit4]   2> 54006 INFO  (coreLoadExecutor-129-thread-1-processing-n:127.0.0.1:33258_) [n:127.0.0.1:33258_ c:collection1 s:shard2 r:core_node1 x:collection1] o.a.s.c.SolrCore org.apache.solr.core.MockDirectoryFactory
   [junit4]   2> 54007 INFO  (coreLoadExecutor-129-thread-1-processing-n:127.0.0.1:33258_) [n:127.0.0.1:33258_ c:collection1 s:shard2 r:core_node1 x:collection1] o.a.s.c.SolrCore [[collection1] ] Opening new SolrCore at [/x1/jenkins/jenkins-slave/workspace/Lucene-Solr-Tests-trunk-Java8/solr/build/solr-core/test/J1/temp/solr.cloud.CollectionsAPIDistributedZkTest_1B239A1DEF9ABFE4-001/shard-1-001/cores/collection1], dataDir=[/x1/jenkins/jenkins-slave/workspace/Lucene-Solr-Tests-trunk-Java8/solr/build/solr-core/test/J1/../../../../../../../../../../x1/jenkins/jenkins-slave/workspace/Lucene-Solr-Tests-trunk-Java8/solr/build/solr-core/test/J1/temp/solr.cloud.CollectionsAPIDistributedZkTest_1B239A1DEF9ABFE4-001/shard-1-001/cores/collection1/data/]
   [junit4]   2> 54007 INFO  (coreLoadExecutor-129-thread-1-processing-n:127.0.0.1:33258_) [n:127.0.0.1:33258_ c:collection1 s:shard2 r:core_node1 x:collection1] o.a.s.c.JmxMonitoredMap JMX monitoring is enabled. Adding Solr mbeans to JMX Server: com.sun.jmx.mbeanserver.JmxMBeanServer@58ef0169
   [junit4]   2> 54007 INFO  (coreLoadExecutor-129-thread-1-processing-n:127.0.0.1:33258_) [n:127.0.0.1:33258_ c:collection1 s:shard2 r:core_node1 x:collection1] o.a.s.c.CachingDirectoryFactory return new directory for /x1/jenkins/jenkins-slave/workspace/Lucene-Solr-Tests-trunk-Java8/solr/build/solr-core/test/J1/../../../../../../../../../../x1/jenkins/jenkins-slave/workspace/Lucene-Solr-Tests-trunk-Java8/solr/build/solr-core/test/J1/temp/solr.cloud.CollectionsAPIDistributedZkTest_1B239A1DEF9ABFE4-001/shard-1-001/cores/collection1/data
   [junit4]   2> 54008 INFO  (coreLoadExecutor-129-thread-1-processing-n:127.0.0.1:33258_) [n:127.0.0.1:33258_ c:collection1 s:shard2 r:core_node1 x:collection1] o.a.

[...truncated too long message...]

lave/workspace/Lucene-Solr-Tests-trunk-Java8/solr/build/solr-core/test/J1/temp/solr.cloud.CollectionsAPIDistributedZkTest_1B239A1DEF9ABFE4-001/shard-4-001/cores/awholynewcollection_0_shard3_replica1/data/index;done=false>>]
   [junit4]   2> 170076 INFO  (coreCloseExecutor-358-thread-5) [n:127.0.0.1:52569_ c:awholynewcollection_0 s:shard3 r:core_node4 x:awholynewcollection_0_shard3_replica1] o.a.s.c.CachingDirectoryFactory Closing directory: /x1/jenkins/jenkins-slave/workspace/Lucene-Solr-Tests-trunk-Java8/solr/build/solr-core/test/J1/temp/solr.cloud.CollectionsAPIDistributedZkTest_1B239A1DEF9ABFE4-001/shard-4-001/cores/awholynewcollection_0_shard3_replica1/data/index
   [junit4]   2> 170078 INFO  (coreCloseExecutor-358-thread-4) [n:127.0.0.1:52569_ c:awholynewcollection_0 s:shard1 r:core_node3 x:awholynewcollection_0_shard1_replica2] o.a.s.c.CachingDirectoryFactory Closing MockDirectoryFactory - 2 directories currently being tracked
   [junit4]   2> 170078 INFO  (coreCloseExecutor-358-thread-4) [n:127.0.0.1:52569_ c:awholynewcollection_0 s:shard1 r:core_node3 x:awholynewcollection_0_shard1_replica2] o.a.s.c.CachingDirectoryFactory looking to close /x1/jenkins/jenkins-slave/workspace/Lucene-Solr-Tests-trunk-Java8/solr/build/solr-core/test/J1/temp/solr.cloud.CollectionsAPIDistributedZkTest_1B239A1DEF9ABFE4-001/shard-4-001/cores/awholynewcollection_0_shard1_replica2/data [CachedDir<<refCount=0;path=/x1/jenkins/jenkins-slave/workspace/Lucene-Solr-Tests-trunk-Java8/solr/build/solr-core/test/J1/temp/solr.cloud.CollectionsAPIDistributedZkTest_1B239A1DEF9ABFE4-001/shard-4-001/cores/awholynewcollection_0_shard1_replica2/data;done=false>>]
   [junit4]   2> 170078 INFO  (coreCloseExecutor-358-thread-4) [n:127.0.0.1:52569_ c:awholynewcollection_0 s:shard1 r:core_node3 x:awholynewcollection_0_shard1_replica2] o.a.s.c.CachingDirectoryFactory Closing directory: /x1/jenkins/jenkins-slave/workspace/Lucene-Solr-Tests-trunk-Java8/solr/build/solr-core/test/J1/temp/solr.cloud.CollectionsAPIDistributedZkTest_1B239A1DEF9ABFE4-001/shard-4-001/cores/awholynewcollection_0_shard1_replica2/data
   [junit4]   2> 170078 INFO  (coreCloseExecutor-358-thread-4) [n:127.0.0.1:52569_ c:awholynewcollection_0 s:shard1 r:core_node3 x:awholynewcollection_0_shard1_replica2] o.a.s.c.CachingDirectoryFactory looking to close /x1/jenkins/jenkins-slave/workspace/Lucene-Solr-Tests-trunk-Java8/solr/build/solr-core/test/J1/temp/solr.cloud.CollectionsAPIDistributedZkTest_1B239A1DEF9ABFE4-001/shard-4-001/cores/awholynewcollection_0_shard1_replica2/data/index [CachedDir<<refCount=0;path=/x1/jenkins/jenkins-slave/workspace/Lucene-Solr-Tests-trunk-Java8/solr/build/solr-core/test/J1/temp/solr.cloud.CollectionsAPIDistributedZkTest_1B239A1DEF9ABFE4-001/shard-4-001/cores/awholynewcollection_0_shard1_replica2/data/index;done=false>>]
   [junit4]   2> 170078 INFO  (coreCloseExecutor-358-thread-4) [n:127.0.0.1:52569_ c:awholynewcollection_0 s:shard1 r:core_node3 x:awholynewcollection_0_shard1_replica2] o.a.s.c.CachingDirectoryFactory Closing directory: /x1/jenkins/jenkins-slave/workspace/Lucene-Solr-Tests-trunk-Java8/solr/build/solr-core/test/J1/temp/solr.cloud.CollectionsAPIDistributedZkTest_1B239A1DEF9ABFE4-001/shard-4-001/cores/awholynewcollection_0_shard1_replica2/data/index
   [junit4]   2> 170079 INFO  (TEST-CollectionsAPIDistributedZkTest.test-seed#[1B239A1DEF9ABFE4]) [    ] o.a.s.c.Overseer Overseer (id=95483113292234769-127.0.0.1:52569_-n_0000000004) closing
   [junit4]   2> 170079 INFO  (OverseerStateUpdate-95483113292234769-127.0.0.1:52569_-n_0000000004) [n:127.0.0.1:52569_    ] o.a.s.c.Overseer Overseer Loop exiting : 127.0.0.1:52569_
   [junit4]   2> 170082 INFO  (zkCallback-67-thread-5-processing-n:127.0.0.1:52569_) [n:127.0.0.1:52569_    ] o.a.s.c.c.ZkStateReader A live node change: [WatchedEvent state:SyncConnected type:NodeChildrenChanged path:/live_nodes], has occurred - updating... (live nodes size: [1])
   [junit4]   2> 170082 WARN  (zkCallback-67-thread-5-processing-n:127.0.0.1:52569_) [n:127.0.0.1:52569_    ] o.a.s.c.c.ZkStateReader ZooKeeper watch triggered, but Solr cannot talk to ZK: [KeeperErrorCode = Session expired for /live_nodes]
   [junit4]   2> 170082 WARN  (NIOServerCxn.Factory:0.0.0.0/0.0.0.0:55905) [    ] o.a.z.s.NIOServerCnxn caught end of stream exception
   [junit4]   2> EndOfStreamException: Unable to read additional data from client sessionid 0x1533962b9d50011, likely client has closed socket
   [junit4]   2> 	at org.apache.zookeeper.server.NIOServerCnxn.doIO(NIOServerCnxn.java:228)
   [junit4]   2> 	at org.apache.zookeeper.server.NIOServerCnxnFactory.run(NIOServerCnxnFactory.java:208)
   [junit4]   2> 	at java.lang.Thread.run(Thread.java:745)
   [junit4]   2> 170084 INFO  (TEST-CollectionsAPIDistributedZkTest.test-seed#[1B239A1DEF9ABFE4]) [    ] o.e.j.s.ServerConnector Stopped ServerConnector@e1c9b78{HTTP/1.1,[http/1.1]}{127.0.0.1:0}
   [junit4]   2> 170084 INFO  (TEST-CollectionsAPIDistributedZkTest.test-seed#[1B239A1DEF9ABFE4]) [    ] o.e.j.s.h.ContextHandler Stopped o.e.j.s.ServletContextHandler@27804e0d{/,null,UNAVAILABLE}
   [junit4]   2> 170091 INFO  (TEST-CollectionsAPIDistributedZkTest.test-seed#[1B239A1DEF9ABFE4]) [    ] o.a.s.c.ZkTestServer connecting to 127.0.0.1:55905 55905
   [junit4]   2> 170467 INFO  (Thread-247) [    ] o.a.s.c.ZkTestServer connecting to 127.0.0.1:55905 55905
   [junit4]   2> 170469 WARN  (Thread-247) [    ] o.a.s.c.ZkTestServer Watch limit violations: 
   [junit4]   2> Maximum concurrent children watches above limit:
   [junit4]   2> 
   [junit4]   2> 	3	/solr/overseer/queue
   [junit4]   2> 	3	/solr/overseer/collection-queue-work
   [junit4]   2> 
   [junit4]   2> NOTE: reproduce with: ant test  -Dtestcase=CollectionsAPIDistributedZkTest -Dtests.method=test -Dtests.seed=1B239A1DEF9ABFE4 -Dtests.multiplier=2 -Dtests.slow=true -Dtests.locale=ja-JP -Dtests.timezone=Europe/Belgrade -Dtests.asserts=true -Dtests.file.encoding=UTF-8
   [junit4] FAILURE  120s J1 | CollectionsAPIDistributedZkTest.test <<<
   [junit4]    > Throwable #1: java.lang.AssertionError: some core start times did not change on reload
   [junit4]    > 	at __randomizedtesting.SeedInfo.seed([1B239A1DEF9ABFE4:9377A5C74166D21C]:0)
   [junit4]    > 	at org.apache.solr.cloud.CollectionsAPIDistributedZkTest.testCollectionsAPI(CollectionsAPIDistributedZkTest.java:835)
   [junit4]    > 	at org.apache.solr.cloud.CollectionsAPIDistributedZkTest.test(CollectionsAPIDistributedZkTest.java:167)
   [junit4]    > 	at org.apache.solr.BaseDistributedSearchTestCase$ShardsRepeatRule$ShardsFixedStatement.callStatement(BaseDistributedSearchTestCase.java:996)
   [junit4]    > 	at org.apache.solr.BaseDistributedSearchTestCase$ShardsRepeatRule$ShardsStatement.evaluate(BaseDistributedSearchTestCase.java:971)
   [junit4]    > 	at java.lang.Thread.run(Thread.java:745)
   [junit4]   2> 170472 INFO  (SUITE-CollectionsAPIDistributedZkTest-seed#[1B239A1DEF9ABFE4]-worker) [    ] o.a.s.SolrTestCaseJ4 ###deleteCore
   [junit4]   2> NOTE: leaving temporary files on disk at: /x1/jenkins/jenkins-slave/workspace/Lucene-Solr-Tests-trunk-Java8/solr/build/solr-core/test/J1/temp/solr.cloud.CollectionsAPIDistributedZkTest_1B239A1DEF9ABFE4-001
   [junit4]   2> Mar 02, 2016 10:13:24 PM com.carrotsearch.randomizedtesting.ThreadLeakControl checkThreadLeaks
   [junit4]   2> WARNING: Will linger awaiting termination of 1 leaked thread(s).
   [junit4]   2> NOTE: test params are: codec=Asserting(Lucene60): {other_tl1=BlockTreeOrds(blocksize=128), range_facet_l_dv=FST50, _version_=BlockTreeOrds(blocksize=128), multiDefault=PostingsFormat(name=MockRandom), a_t=PostingsFormat(name=MockRandom), intDefault=BlockTreeOrds(blocksize=128), a_i1=PostingsFormat(name=MockRandom), id=FST50, range_facet_i_dv=PostingsFormat(name=MockRandom), text=Lucene50(blocksize=128), range_facet_l=PostingsFormat(name=MockRandom), timestamp=PostingsFormat(name=MockRandom)}, docValues:{range_facet_l_dv=DocValuesFormat(name=Direct), range_facet_i_dv=DocValuesFormat(name=Memory), timestamp=DocValuesFormat(name=Memory)}, maxPointsInLeafNode=153, maxMBSortInHeap=4.4889139915712, sim=ClassicSimilarity, locale=ja-JP, timezone=Europe/Belgrade
   [junit4]   2> NOTE: Linux 3.13.0-52-generic amd64/Oracle Corporation 1.8.0_66 (64-bit)/cpus=4,threads=1,free=193206408,total=448790528
   [junit4]   2> NOTE: All tests run in this JVM: [TestClassicSimilarityFactory, TestQueryUtils, SpellPossibilityIteratorTest, TestUseDocValuesAsStored2, ChaosMonkeySafeLeaderTest, SolrCloudExampleTest, TestBM25SimilarityFactory, CollectionsAPIDistributedZkTest]
   [junit4] Completed [18/581 (1!)] on J1 in 120.55s, 1 test, 1 failure <<< FAILURES!

[...truncated 1831 lines...]
BUILD FAILED
/x1/jenkins/jenkins-slave/workspace/Lucene-Solr-Tests-trunk-Java8/build.xml:740: The following error occurred while executing this line:
/x1/jenkins/jenkins-slave/workspace/Lucene-Solr-Tests-trunk-Java8/build.xml:684: The following error occurred while executing this line:
/x1/jenkins/jenkins-slave/workspace/Lucene-Solr-Tests-trunk-Java8/build.xml:59: The following error occurred while executing this line:
/x1/jenkins/jenkins-slave/workspace/Lucene-Solr-Tests-trunk-Java8/solr/build.xml:233: The following error occurred while executing this line:
/x1/jenkins/jenkins-slave/workspace/Lucene-Solr-Tests-trunk-Java8/solr/common-build.xml:524: The following error occurred while executing this line:
/x1/jenkins/jenkins-slave/workspace/Lucene-Solr-Tests-trunk-Java8/lucene/common-build.xml:1457: The following error occurred while executing this line:
/x1/jenkins/jenkins-slave/workspace/Lucene-Solr-Tests-trunk-Java8/lucene/common-build.xml:1014: There were test failures: 581 suites (8 ignored), 2345 tests, 1 failure, 87 ignored (71 assumptions) [seed: 1B239A1DEF9ABFE4]

Total time: 60 minutes 47 seconds
Build step 'Invoke Ant' marked build as failure
Archiving artifacts
Recording test results
Email was triggered for: Failure - Any
Sending email for trigger: Failure - Any



Mime
View raw message