lucene-dev mailing list archives

Site index · List index
Message view « Date » · « Thread »
Top « Date » · « Thread »
From Policeman Jenkins Server <jenk...@thetaphi.de>
Subject [JENKINS] Lucene-Solr-master-Solaris (64bit/jdk1.8.0) - Build # 465 - Failure!
Date Sun, 20 Mar 2016 15:22:52 GMT
Build: http://jenkins.thetaphi.de/job/Lucene-Solr-master-Solaris/465/
Java: 64bit/jdk1.8.0 -XX:-UseCompressedOops -XX:+UseG1GC

1 tests failed.
FAILED:  org.apache.solr.handler.TestReqParamsAPI.test

Error Message:
Could not get expected value  'null' for path 'response/params/y/p' full output: {   "responseHeader":{     "status":0,     "QTime":0},   "response":{     "znodeVersion":4,     "params":{       "x":{         "a":"A val",         "b":"B val",         "_appends_":{"add":"first"},         "_invariants_":{"fixed":"f"},         "":{"v":1}},       "y":{         "p":"P val",         "q":"Q val",         "":{"v":2}}}}}

Stack Trace:
java.lang.AssertionError: Could not get expected value  'null' for path 'response/params/y/p' full output: {
  "responseHeader":{
    "status":0,
    "QTime":0},
  "response":{
    "znodeVersion":4,
    "params":{
      "x":{
        "a":"A val",
        "b":"B val",
        "_appends_":{"add":"first"},
        "_invariants_":{"fixed":"f"},
        "":{"v":1}},
      "y":{
        "p":"P val",
        "q":"Q val",
        "":{"v":2}}}}}
	at __randomizedtesting.SeedInfo.seed([3F4498CCD03B06F5:B710A7167EC76B0D]:0)
	at org.junit.Assert.fail(Assert.java:93)
	at org.junit.Assert.assertTrue(Assert.java:43)
	at org.apache.solr.core.TestSolrConfigHandler.testForResponseElement(TestSolrConfigHandler.java:458)
	at org.apache.solr.handler.TestReqParamsAPI.testReqParams(TestReqParamsAPI.java:264)
	at org.apache.solr.handler.TestReqParamsAPI.test(TestReqParamsAPI.java:67)
	at sun.reflect.NativeMethodAccessorImpl.invoke0(Native Method)
	at sun.reflect.NativeMethodAccessorImpl.invoke(NativeMethodAccessorImpl.java:62)
	at sun.reflect.DelegatingMethodAccessorImpl.invoke(DelegatingMethodAccessorImpl.java:43)
	at java.lang.reflect.Method.invoke(Method.java:498)
	at com.carrotsearch.randomizedtesting.RandomizedRunner.invoke(RandomizedRunner.java:1764)
	at com.carrotsearch.randomizedtesting.RandomizedRunner$8.evaluate(RandomizedRunner.java:871)
	at com.carrotsearch.randomizedtesting.RandomizedRunner$9.evaluate(RandomizedRunner.java:907)
	at com.carrotsearch.randomizedtesting.RandomizedRunner$10.evaluate(RandomizedRunner.java:921)
	at org.apache.solr.BaseDistributedSearchTestCase$ShardsRepeatRule$ShardsFixedStatement.callStatement(BaseDistributedSearchTestCase.java:996)
	at org.apache.solr.BaseDistributedSearchTestCase$ShardsRepeatRule$ShardsStatement.evaluate(BaseDistributedSearchTestCase.java:971)
	at com.carrotsearch.randomizedtesting.rules.SystemPropertiesRestoreRule$1.evaluate(SystemPropertiesRestoreRule.java:57)
	at org.apache.lucene.util.TestRuleSetupTeardownChained$1.evaluate(TestRuleSetupTeardownChained.java:49)
	at org.apache.lucene.util.AbstractBeforeAfterRule$1.evaluate(AbstractBeforeAfterRule.java:45)
	at org.apache.lucene.util.TestRuleThreadAndTestName$1.evaluate(TestRuleThreadAndTestName.java:48)
	at org.apache.lucene.util.TestRuleIgnoreAfterMaxFailures$1.evaluate(TestRuleIgnoreAfterMaxFailures.java:64)
	at org.apache.lucene.util.TestRuleMarkFailure$1.evaluate(TestRuleMarkFailure.java:47)
	at com.carrotsearch.randomizedtesting.rules.StatementAdapter.evaluate(StatementAdapter.java:36)
	at com.carrotsearch.randomizedtesting.ThreadLeakControl$StatementRunner.run(ThreadLeakControl.java:367)
	at com.carrotsearch.randomizedtesting.ThreadLeakControl.forkTimeoutingTask(ThreadLeakControl.java:809)
	at com.carrotsearch.randomizedtesting.ThreadLeakControl$3.evaluate(ThreadLeakControl.java:460)
	at com.carrotsearch.randomizedtesting.RandomizedRunner.runSingleTest(RandomizedRunner.java:880)
	at com.carrotsearch.randomizedtesting.RandomizedRunner$5.evaluate(RandomizedRunner.java:781)
	at com.carrotsearch.randomizedtesting.RandomizedRunner$6.evaluate(RandomizedRunner.java:816)
	at com.carrotsearch.randomizedtesting.RandomizedRunner$7.evaluate(RandomizedRunner.java:827)
	at com.carrotsearch.randomizedtesting.rules.StatementAdapter.evaluate(StatementAdapter.java:36)
	at com.carrotsearch.randomizedtesting.rules.SystemPropertiesRestoreRule$1.evaluate(SystemPropertiesRestoreRule.java:57)
	at org.apache.lucene.util.AbstractBeforeAfterRule$1.evaluate(AbstractBeforeAfterRule.java:45)
	at com.carrotsearch.randomizedtesting.rules.StatementAdapter.evaluate(StatementAdapter.java:36)
	at org.apache.lucene.util.TestRuleStoreClassName$1.evaluate(TestRuleStoreClassName.java:41)
	at com.carrotsearch.randomizedtesting.rules.NoShadowingOrOverridesOnMethodsRule$1.evaluate(NoShadowingOrOverridesOnMethodsRule.java:40)
	at com.carrotsearch.randomizedtesting.rules.NoShadowingOrOverridesOnMethodsRule$1.evaluate(NoShadowingOrOverridesOnMethodsRule.java:40)
	at com.carrotsearch.randomizedtesting.rules.StatementAdapter.evaluate(StatementAdapter.java:36)
	at com.carrotsearch.randomizedtesting.rules.StatementAdapter.evaluate(StatementAdapter.java:36)
	at com.carrotsearch.randomizedtesting.rules.StatementAdapter.evaluate(StatementAdapter.java:36)
	at org.apache.lucene.util.TestRuleAssertionsRequired$1.evaluate(TestRuleAssertionsRequired.java:53)
	at org.apache.lucene.util.TestRuleMarkFailure$1.evaluate(TestRuleMarkFailure.java:47)
	at org.apache.lucene.util.TestRuleIgnoreAfterMaxFailures$1.evaluate(TestRuleIgnoreAfterMaxFailures.java:64)
	at org.apache.lucene.util.TestRuleIgnoreTestSuites$1.evaluate(TestRuleIgnoreTestSuites.java:54)
	at com.carrotsearch.randomizedtesting.rules.StatementAdapter.evaluate(StatementAdapter.java:36)
	at com.carrotsearch.randomizedtesting.ThreadLeakControl$StatementRunner.run(ThreadLeakControl.java:367)
	at java.lang.Thread.run(Thread.java:745)




Build Log:
[...truncated 10981 lines...]
   [junit4] Suite: org.apache.solr.handler.TestReqParamsAPI
   [junit4]   2> Creating dataDir: /export/home/jenkins/workspace/Lucene-Solr-master-Solaris/solr/build/solr-core/test/J1/temp/solr.handler.TestReqParamsAPI_3F4498CCD03B06F5-001/init-core-data-001
   [junit4]   2> 919681 INFO  (SUITE-TestReqParamsAPI-seed#[3F4498CCD03B06F5]-worker) [    ] o.a.s.SolrTestCaseJ4 Randomized ssl (false) and clientAuth (false)
   [junit4]   2> 919681 INFO  (SUITE-TestReqParamsAPI-seed#[3F4498CCD03B06F5]-worker) [    ] o.a.s.BaseDistributedSearchTestCase Setting hostContext system property: /
   [junit4]   2> 919685 INFO  (TEST-TestReqParamsAPI.test-seed#[3F4498CCD03B06F5]) [    ] o.a.s.c.ZkTestServer STARTING ZK TEST SERVER
   [junit4]   2> 919685 INFO  (Thread-2562) [    ] o.a.s.c.ZkTestServer client port:0.0.0.0/0.0.0.0:0
   [junit4]   2> 919685 INFO  (Thread-2562) [    ] o.a.s.c.ZkTestServer Starting server
   [junit4]   2> 919791 INFO  (TEST-TestReqParamsAPI.test-seed#[3F4498CCD03B06F5]) [    ] o.a.s.c.ZkTestServer start zk server on port:64134
   [junit4]   2> 919791 INFO  (TEST-TestReqParamsAPI.test-seed#[3F4498CCD03B06F5]) [    ] o.a.s.c.c.SolrZkClient Using default ZkCredentialsProvider
   [junit4]   2> 919791 INFO  (TEST-TestReqParamsAPI.test-seed#[3F4498CCD03B06F5]) [    ] o.a.s.c.c.ConnectionManager Waiting for client to connect to ZooKeeper
   [junit4]   2> 919794 INFO  (zkCallback-1030-thread-1) [    ] o.a.s.c.c.ConnectionManager Watcher org.apache.solr.common.cloud.ConnectionManager@733838d2 name:ZooKeeperConnection Watcher:127.0.0.1:64134 got event WatchedEvent state:SyncConnected type:None path:null path:null type:None
   [junit4]   2> 919794 INFO  (TEST-TestReqParamsAPI.test-seed#[3F4498CCD03B06F5]) [    ] o.a.s.c.c.ConnectionManager Client is connected to ZooKeeper
   [junit4]   2> 919794 INFO  (TEST-TestReqParamsAPI.test-seed#[3F4498CCD03B06F5]) [    ] o.a.s.c.c.SolrZkClient Using default ZkACLProvider
   [junit4]   2> 919794 INFO  (TEST-TestReqParamsAPI.test-seed#[3F4498CCD03B06F5]) [    ] o.a.s.c.c.SolrZkClient makePath: /solr
   [junit4]   2> 919797 INFO  (TEST-TestReqParamsAPI.test-seed#[3F4498CCD03B06F5]) [    ] o.a.s.c.c.SolrZkClient Using default ZkCredentialsProvider
   [junit4]   2> 919798 INFO  (TEST-TestReqParamsAPI.test-seed#[3F4498CCD03B06F5]) [    ] o.a.s.c.c.ConnectionManager Waiting for client to connect to ZooKeeper
   [junit4]   2> 919799 INFO  (zkCallback-1031-thread-1) [    ] o.a.s.c.c.ConnectionManager Watcher org.apache.solr.common.cloud.ConnectionManager@e4b94c5 name:ZooKeeperConnection Watcher:127.0.0.1:64134/solr got event WatchedEvent state:SyncConnected type:None path:null path:null type:None
   [junit4]   2> 919799 INFO  (TEST-TestReqParamsAPI.test-seed#[3F4498CCD03B06F5]) [    ] o.a.s.c.c.ConnectionManager Client is connected to ZooKeeper
   [junit4]   2> 919799 INFO  (TEST-TestReqParamsAPI.test-seed#[3F4498CCD03B06F5]) [    ] o.a.s.c.c.SolrZkClient Using default ZkACLProvider
   [junit4]   2> 919800 INFO  (TEST-TestReqParamsAPI.test-seed#[3F4498CCD03B06F5]) [    ] o.a.s.c.c.SolrZkClient makePath: /collections/collection1
   [junit4]   2> 919802 INFO  (TEST-TestReqParamsAPI.test-seed#[3F4498CCD03B06F5]) [    ] o.a.s.c.c.SolrZkClient makePath: /collections/collection1/shards
   [junit4]   2> 919803 INFO  (TEST-TestReqParamsAPI.test-seed#[3F4498CCD03B06F5]) [    ] o.a.s.c.c.SolrZkClient makePath: /collections/control_collection
   [junit4]   2> 919804 INFO  (TEST-TestReqParamsAPI.test-seed#[3F4498CCD03B06F5]) [    ] o.a.s.c.c.SolrZkClient makePath: /collections/control_collection/shards
   [junit4]   2> 919806 INFO  (TEST-TestReqParamsAPI.test-seed#[3F4498CCD03B06F5]) [    ] o.a.s.c.AbstractZkTestCase put /export/home/jenkins/workspace/Lucene-Solr-master-Solaris/solr/core/src/test-files/solr/collection1/conf/solrconfig-tlog.xml to /configs/conf1/solrconfig.xml
   [junit4]   2> 919806 INFO  (TEST-TestReqParamsAPI.test-seed#[3F4498CCD03B06F5]) [    ] o.a.s.c.c.SolrZkClient makePath: /configs/conf1/solrconfig.xml
   [junit4]   2> 919808 INFO  (TEST-TestReqParamsAPI.test-seed#[3F4498CCD03B06F5]) [    ] o.a.s.c.AbstractZkTestCase put /export/home/jenkins/workspace/Lucene-Solr-master-Solaris/solr/core/src/test-files/solr/collection1/conf/schema.xml to /configs/conf1/schema.xml
   [junit4]   2> 919808 INFO  (TEST-TestReqParamsAPI.test-seed#[3F4498CCD03B06F5]) [    ] o.a.s.c.c.SolrZkClient makePath: /configs/conf1/schema.xml
   [junit4]   2> 919811 INFO  (TEST-TestReqParamsAPI.test-seed#[3F4498CCD03B06F5]) [    ] o.a.s.c.AbstractZkTestCase put /export/home/jenkins/workspace/Lucene-Solr-master-Solaris/solr/core/src/test-files/solr/collection1/conf/solrconfig.snippet.randomindexconfig.xml to /configs/conf1/solrconfig.snippet.randomindexconfig.xml
   [junit4]   2> 919811 INFO  (TEST-TestReqParamsAPI.test-seed#[3F4498CCD03B06F5]) [    ] o.a.s.c.c.SolrZkClient makePath: /configs/conf1/solrconfig.snippet.randomindexconfig.xml
   [junit4]   2> 919814 INFO  (TEST-TestReqParamsAPI.test-seed#[3F4498CCD03B06F5]) [    ] o.a.s.c.AbstractZkTestCase put /export/home/jenkins/workspace/Lucene-Solr-master-Solaris/solr/core/src/test-files/solr/collection1/conf/stopwords.txt to /configs/conf1/stopwords.txt
   [junit4]   2> 919814 INFO  (TEST-TestReqParamsAPI.test-seed#[3F4498CCD03B06F5]) [    ] o.a.s.c.c.SolrZkClient makePath: /configs/conf1/stopwords.txt
   [junit4]   2> 919817 INFO  (TEST-TestReqParamsAPI.test-seed#[3F4498CCD03B06F5]) [    ] o.a.s.c.AbstractZkTestCase put /export/home/jenkins/workspace/Lucene-Solr-master-Solaris/solr/core/src/test-files/solr/collection1/conf/protwords.txt to /configs/conf1/protwords.txt
   [junit4]   2> 919817 INFO  (TEST-TestReqParamsAPI.test-seed#[3F4498CCD03B06F5]) [    ] o.a.s.c.c.SolrZkClient makePath: /configs/conf1/protwords.txt
   [junit4]   2> 919819 INFO  (TEST-TestReqParamsAPI.test-seed#[3F4498CCD03B06F5]) [    ] o.a.s.c.AbstractZkTestCase put /export/home/jenkins/workspace/Lucene-Solr-master-Solaris/solr/core/src/test-files/solr/collection1/conf/currency.xml to /configs/conf1/currency.xml
   [junit4]   2> 919819 INFO  (TEST-TestReqParamsAPI.test-seed#[3F4498CCD03B06F5]) [    ] o.a.s.c.c.SolrZkClient makePath: /configs/conf1/currency.xml
   [junit4]   2> 919822 INFO  (TEST-TestReqParamsAPI.test-seed#[3F4498CCD03B06F5]) [    ] o.a.s.c.AbstractZkTestCase put /export/home/jenkins/workspace/Lucene-Solr-master-Solaris/solr/core/src/test-files/solr/collection1/conf/enumsConfig.xml to /configs/conf1/enumsConfig.xml
   [junit4]   2> 919822 INFO  (TEST-TestReqParamsAPI.test-seed#[3F4498CCD03B06F5]) [    ] o.a.s.c.c.SolrZkClient makePath: /configs/conf1/enumsConfig.xml
   [junit4]   2> 919824 INFO  (TEST-TestReqParamsAPI.test-seed#[3F4498CCD03B06F5]) [    ] o.a.s.c.AbstractZkTestCase put /export/home/jenkins/workspace/Lucene-Solr-master-Solaris/solr/core/src/test-files/solr/collection1/conf/open-exchange-rates.json to /configs/conf1/open-exchange-rates.json
   [junit4]   2> 919824 INFO  (TEST-TestReqParamsAPI.test-seed#[3F4498CCD03B06F5]) [    ] o.a.s.c.c.SolrZkClient makePath: /configs/conf1/open-exchange-rates.json
   [junit4]   2> 919826 INFO  (TEST-TestReqParamsAPI.test-seed#[3F4498CCD03B06F5]) [    ] o.a.s.c.AbstractZkTestCase put /export/home/jenkins/workspace/Lucene-Solr-master-Solaris/solr/core/src/test-files/solr/collection1/conf/mapping-ISOLatin1Accent.txt to /configs/conf1/mapping-ISOLatin1Accent.txt
   [junit4]   2> 919826 INFO  (TEST-TestReqParamsAPI.test-seed#[3F4498CCD03B06F5]) [    ] o.a.s.c.c.SolrZkClient makePath: /configs/conf1/mapping-ISOLatin1Accent.txt
   [junit4]   2> 919829 INFO  (TEST-TestReqParamsAPI.test-seed#[3F4498CCD03B06F5]) [    ] o.a.s.c.AbstractZkTestCase put /export/home/jenkins/workspace/Lucene-Solr-master-Solaris/solr/core/src/test-files/solr/collection1/conf/old_synonyms.txt to /configs/conf1/old_synonyms.txt
   [junit4]   2> 919829 INFO  (TEST-TestReqParamsAPI.test-seed#[3F4498CCD03B06F5]) [    ] o.a.s.c.c.SolrZkClient makePath: /configs/conf1/old_synonyms.txt
   [junit4]   2> 919831 INFO  (TEST-TestReqParamsAPI.test-seed#[3F4498CCD03B06F5]) [    ] o.a.s.c.AbstractZkTestCase put /export/home/jenkins/workspace/Lucene-Solr-master-Solaris/solr/core/src/test-files/solr/collection1/conf/synonyms.txt to /configs/conf1/synonyms.txt
   [junit4]   2> 919831 INFO  (TEST-TestReqParamsAPI.test-seed#[3F4498CCD03B06F5]) [    ] o.a.s.c.c.SolrZkClient makePath: /configs/conf1/synonyms.txt
   [junit4]   2> 920243 INFO  (TEST-TestReqParamsAPI.test-seed#[3F4498CCD03B06F5]) [    ] o.a.s.SolrTestCaseJ4 Writing core.properties file to /export/home/jenkins/workspace/Lucene-Solr-master-Solaris/solr/build/solr-core/test/J1/temp/solr.handler.TestReqParamsAPI_3F4498CCD03B06F5-001/control-001/cores/collection1
   [junit4]   2> 920245 INFO  (TEST-TestReqParamsAPI.test-seed#[3F4498CCD03B06F5]) [    ] o.e.j.s.Server jetty-9.3.8.v20160314
   [junit4]   2> 920246 INFO  (TEST-TestReqParamsAPI.test-seed#[3F4498CCD03B06F5]) [    ] o.e.j.s.h.ContextHandler Started o.e.j.s.ServletContextHandler@7daf7b4b{/,null,AVAILABLE}
   [junit4]   2> 920247 INFO  (TEST-TestReqParamsAPI.test-seed#[3F4498CCD03B06F5]) [    ] o.e.j.s.ServerConnector Started ServerConnector@3077fb36{HTTP/1.1,[http/1.1]}{127.0.0.1:35567}
   [junit4]   2> 920247 INFO  (TEST-TestReqParamsAPI.test-seed#[3F4498CCD03B06F5]) [    ] o.e.j.s.Server Started @923581ms
   [junit4]   2> 920247 INFO  (TEST-TestReqParamsAPI.test-seed#[3F4498CCD03B06F5]) [    ] o.a.s.c.s.e.JettySolrRunner Jetty properties: {solr.data.dir=/export/home/jenkins/workspace/Lucene-Solr-master-Solaris/solr/build/solr-core/test/J1/temp/solr.handler.TestReqParamsAPI_3F4498CCD03B06F5-001/tempDir-001/control/data, hostContext=/, hostPort=35567, coreRootDirectory=/export/home/jenkins/workspace/Lucene-Solr-master-Solaris/solr/build/solr-core/test/J1/temp/solr.handler.TestReqParamsAPI_3F4498CCD03B06F5-001/control-001/cores}
   [junit4]   2> 920248 INFO  (TEST-TestReqParamsAPI.test-seed#[3F4498CCD03B06F5]) [    ] o.a.s.s.SolrDispatchFilter SolrDispatchFilter.init(): sun.misc.Launcher$AppClassLoader@6d06d69c
   [junit4]   2> 920248 INFO  (TEST-TestReqParamsAPI.test-seed#[3F4498CCD03B06F5]) [    ] o.a.s.c.SolrResourceLoader new SolrResourceLoader for directory: '/export/home/jenkins/workspace/Lucene-Solr-master-Solaris/solr/build/solr-core/test/J1/temp/solr.handler.TestReqParamsAPI_3F4498CCD03B06F5-001/control-001'
   [junit4]   2> 920248 INFO  (TEST-TestReqParamsAPI.test-seed#[3F4498CCD03B06F5]) [    ] o.a.s.c.SolrResourceLoader JNDI not configured for solr (NoInitialContextEx)
   [junit4]   2> 920248 INFO  (TEST-TestReqParamsAPI.test-seed#[3F4498CCD03B06F5]) [    ] o.a.s.c.SolrResourceLoader solr home defaulted to 'solr/' (could not find system property or JNDI)
   [junit4]   2> 920248 INFO  (TEST-TestReqParamsAPI.test-seed#[3F4498CCD03B06F5]) [    ] o.a.s.c.c.SolrZkClient Using default ZkCredentialsProvider
   [junit4]   2> 920249 INFO  (TEST-TestReqParamsAPI.test-seed#[3F4498CCD03B06F5]) [    ] o.a.s.c.c.ConnectionManager Waiting for client to connect to ZooKeeper
   [junit4]   2> 920250 INFO  (zkCallback-1032-thread-1) [    ] o.a.s.c.c.ConnectionManager Watcher org.apache.solr.common.cloud.ConnectionManager@2c7feb9e name:ZooKeeperConnection Watcher:127.0.0.1:64134/solr got event WatchedEvent state:SyncConnected type:None path:null path:null type:None
   [junit4]   2> 920251 INFO  (TEST-TestReqParamsAPI.test-seed#[3F4498CCD03B06F5]) [    ] o.a.s.c.c.ConnectionManager Client is connected to ZooKeeper
   [junit4]   2> 920251 INFO  (TEST-TestReqParamsAPI.test-seed#[3F4498CCD03B06F5]) [    ] o.a.s.c.c.SolrZkClient Using default ZkACLProvider
   [junit4]   2> 920252 INFO  (TEST-TestReqParamsAPI.test-seed#[3F4498CCD03B06F5]) [    ] o.a.s.s.SolrDispatchFilter Loading solr.xml from SolrHome (not found in ZooKeeper)
   [junit4]   2> 920252 INFO  (TEST-TestReqParamsAPI.test-seed#[3F4498CCD03B06F5]) [    ] o.a.s.c.SolrXmlConfig Loading container configuration from /export/home/jenkins/workspace/Lucene-Solr-master-Solaris/solr/build/solr-core/test/J1/temp/solr.handler.TestReqParamsAPI_3F4498CCD03B06F5-001/control-001/solr.xml
   [junit4]   2> 920262 INFO  (TEST-TestReqParamsAPI.test-seed#[3F4498CCD03B06F5]) [    ] o.a.s.c.CorePropertiesLocator Config-defined core root directory: /export/home/jenkins/workspace/Lucene-Solr-master-Solaris/solr/build/solr-core/test/J1/temp/solr.handler.TestReqParamsAPI_3F4498CCD03B06F5-001/control-001/cores
   [junit4]   2> 920262 INFO  (TEST-TestReqParamsAPI.test-seed#[3F4498CCD03B06F5]) [    ] o.a.s.c.CoreContainer New CoreContainer 1459738785
   [junit4]   2> 920262 INFO  (TEST-TestReqParamsAPI.test-seed#[3F4498CCD03B06F5]) [    ] o.a.s.c.CoreContainer Loading cores into CoreContainer [instanceDir=/export/home/jenkins/workspace/Lucene-Solr-master-Solaris/solr/build/solr-core/test/J1/temp/solr.handler.TestReqParamsAPI_3F4498CCD03B06F5-001/control-001]
   [junit4]   2> 920262 WARN  (TEST-TestReqParamsAPI.test-seed#[3F4498CCD03B06F5]) [    ] o.a.s.c.CoreContainer Couldn't add files from /export/home/jenkins/workspace/Lucene-Solr-master-Solaris/solr/build/solr-core/test/J1/temp/solr.handler.TestReqParamsAPI_3F4498CCD03B06F5-001/control-001/lib to classpath: /export/home/jenkins/workspace/Lucene-Solr-master-Solaris/solr/build/solr-core/test/J1/temp/solr.handler.TestReqParamsAPI_3F4498CCD03B06F5-001/control-001/lib
   [junit4]   2> 920263 INFO  (TEST-TestReqParamsAPI.test-seed#[3F4498CCD03B06F5]) [    ] o.a.s.h.c.HttpShardHandlerFactory created with socketTimeout : 90000,urlScheme : ,connTimeout : 15000,maxConnectionsPerHost : 20,maxConnections : 10000,corePoolSize : 0,maximumPoolSize : 2147483647,maxThreadIdleTime : 5,sizeOfQueue : -1,fairnessPolicy : false,useRetries : false,
   [junit4]   2> 920264 INFO  (TEST-TestReqParamsAPI.test-seed#[3F4498CCD03B06F5]) [    ] o.a.s.u.UpdateShardHandler Creating UpdateShardHandler HTTP client with params: socketTimeout=340000&connTimeout=45000&retry=true
   [junit4]   2> 920265 INFO  (TEST-TestReqParamsAPI.test-seed#[3F4498CCD03B06F5]) [    ] o.a.s.l.LogWatcher SLF4J impl is org.slf4j.impl.Log4jLoggerFactory
   [junit4]   2> 920265 INFO  (TEST-TestReqParamsAPI.test-seed#[3F4498CCD03B06F5]) [    ] o.a.s.l.LogWatcher Registering Log Listener [Log4j (org.slf4j.impl.Log4jLoggerFactory)]
   [junit4]   2> 920265 INFO  (TEST-TestReqParamsAPI.test-seed#[3F4498CCD03B06F5]) [    ] o.a.s.c.ZkContainer Zookeeper client=127.0.0.1:64134/solr
   [junit4]   2> 920266 INFO  (TEST-TestReqParamsAPI.test-seed#[3F4498CCD03B06F5]) [    ] o.a.s.c.ZkController zkHost includes chroot
   [junit4]   2> 920266 INFO  (TEST-TestReqParamsAPI.test-seed#[3F4498CCD03B06F5]) [    ] o.a.s.c.c.SolrZkClient Using default ZkCredentialsProvider
   [junit4]   2> 920266 INFO  (TEST-TestReqParamsAPI.test-seed#[3F4498CCD03B06F5]) [    ] o.a.s.c.c.ConnectionManager Waiting for client to connect to ZooKeeper
   [junit4]   2> 920274 INFO  (zkCallback-1035-thread-1) [    ] o.a.s.c.c.ConnectionManager Watcher org.apache.solr.common.cloud.ConnectionManager@30cb2720 name:ZooKeeperConnection Watcher:127.0.0.1:64134 got event WatchedEvent state:SyncConnected type:None path:null path:null type:None
   [junit4]   2> 920274 INFO  (TEST-TestReqParamsAPI.test-seed#[3F4498CCD03B06F5]) [    ] o.a.s.c.c.ConnectionManager Client is connected to ZooKeeper
   [junit4]   2> 920274 INFO  (TEST-TestReqParamsAPI.test-seed#[3F4498CCD03B06F5]) [    ] o.a.s.c.c.SolrZkClient Using default ZkACLProvider
   [junit4]   2> 920276 INFO  (TEST-TestReqParamsAPI.test-seed#[3F4498CCD03B06F5]) [n:127.0.0.1:35567_    ] o.a.s.c.c.ConnectionManager Waiting for client to connect to ZooKeeper
   [junit4]   2> 920277 INFO  (zkCallback-1036-thread-1-processing-n:127.0.0.1:35567_) [n:127.0.0.1:35567_    ] o.a.s.c.c.ConnectionManager Watcher org.apache.solr.common.cloud.ConnectionManager@7f9fd71f name:ZooKeeperConnection Watcher:127.0.0.1:64134/solr got event WatchedEvent state:SyncConnected type:None path:null path:null type:None
   [junit4]   2> 920278 INFO  (TEST-TestReqParamsAPI.test-seed#[3F4498CCD03B06F5]) [n:127.0.0.1:35567_    ] o.a.s.c.c.ConnectionManager Client is connected to ZooKeeper
   [junit4]   2> 920279 INFO  (TEST-TestReqParamsAPI.test-seed#[3F4498CCD03B06F5]) [n:127.0.0.1:35567_    ] o.a.s.c.c.SolrZkClient makePath: /overseer/queue
   [junit4]   2> 920282 INFO  (TEST-TestReqParamsAPI.test-seed#[3F4498CCD03B06F5]) [n:127.0.0.1:35567_    ] o.a.s.c.c.SolrZkClient makePath: /overseer/collection-queue-work
   [junit4]   2> 920286 INFO  (TEST-TestReqParamsAPI.test-seed#[3F4498CCD03B06F5]) [n:127.0.0.1:35567_    ] o.a.s.c.c.SolrZkClient makePath: /overseer/collection-map-running
   [junit4]   2> 920289 INFO  (TEST-TestReqParamsAPI.test-seed#[3F4498CCD03B06F5]) [n:127.0.0.1:35567_    ] o.a.s.c.c.SolrZkClient makePath: /overseer/collection-map-completed
   [junit4]   2> 920292 INFO  (TEST-TestReqParamsAPI.test-seed#[3F4498CCD03B06F5]) [n:127.0.0.1:35567_    ] o.a.s.c.c.SolrZkClient makePath: /overseer/collection-map-failure
   [junit4]   2> 920295 INFO  (TEST-TestReqParamsAPI.test-seed#[3F4498CCD03B06F5]) [n:127.0.0.1:35567_    ] o.a.s.c.c.SolrZkClient makePath: /live_nodes
   [junit4]   2> 920297 INFO  (TEST-TestReqParamsAPI.test-seed#[3F4498CCD03B06F5]) [n:127.0.0.1:35567_    ] o.a.s.c.c.SolrZkClient makePath: /aliases.json
   [junit4]   2> 920299 INFO  (TEST-TestReqParamsAPI.test-seed#[3F4498CCD03B06F5]) [n:127.0.0.1:35567_    ] o.a.s.c.c.SolrZkClient makePath: /clusterstate.json
   [junit4]   2> 920300 INFO  (TEST-TestReqParamsAPI.test-seed#[3F4498CCD03B06F5]) [n:127.0.0.1:35567_    ] o.a.s.c.c.SolrZkClient makePath: /security.json
   [junit4]   2> 920302 INFO  (TEST-TestReqParamsAPI.test-seed#[3F4498CCD03B06F5]) [n:127.0.0.1:35567_    ] o.a.s.c.c.ZkStateReader Updating cluster state from ZooKeeper... 
   [junit4]   2> 920303 INFO  (TEST-TestReqParamsAPI.test-seed#[3F4498CCD03B06F5]) [n:127.0.0.1:35567_    ] o.a.s.c.c.ZkStateReader Updated live nodes from ZooKeeper... (0) -> (0)
   [junit4]   2> 920306 INFO  (TEST-TestReqParamsAPI.test-seed#[3F4498CCD03B06F5]) [n:127.0.0.1:35567_    ] o.a.s.c.c.SolrZkClient makePath: /overseer_elect
   [junit4]   2> 920308 INFO  (TEST-TestReqParamsAPI.test-seed#[3F4498CCD03B06F5]) [n:127.0.0.1:35567_    ] o.a.s.c.c.SolrZkClient makePath: /overseer_elect/election
   [junit4]   2> 920310 INFO  (TEST-TestReqParamsAPI.test-seed#[3F4498CCD03B06F5]) [n:127.0.0.1:35567_    ] o.a.s.c.Overseer Overseer (id=null) closing
   [junit4]   2> 920310 INFO  (TEST-TestReqParamsAPI.test-seed#[3F4498CCD03B06F5]) [n:127.0.0.1:35567_    ] o.a.s.c.LeaderElector Joined leadership election with path: /overseer_elect/election/95583273626304516-127.0.0.1:35567_-n_0000000000
   [junit4]   2> 920311 INFO  (TEST-TestReqParamsAPI.test-seed#[3F4498CCD03B06F5]) [n:127.0.0.1:35567_    ] o.a.s.c.OverseerElectionContext I am going to be the leader 127.0.0.1:35567_
   [junit4]   2> 920311 INFO  (TEST-TestReqParamsAPI.test-seed#[3F4498CCD03B06F5]) [n:127.0.0.1:35567_    ] o.a.s.c.c.SolrZkClient makePath: /overseer_elect/leader
   [junit4]   2> 920314 INFO  (TEST-TestReqParamsAPI.test-seed#[3F4498CCD03B06F5]) [n:127.0.0.1:35567_    ] o.a.s.c.Overseer Overseer (id=95583273626304516-127.0.0.1:35567_-n_0000000000) starting
   [junit4]   2> 920318 INFO  (TEST-TestReqParamsAPI.test-seed#[3F4498CCD03B06F5]) [n:127.0.0.1:35567_    ] o.a.s.c.c.SolrZkClient makePath: /overseer/queue-work
   [junit4]   2> 920326 INFO  (TEST-TestReqParamsAPI.test-seed#[3F4498CCD03B06F5]) [n:127.0.0.1:35567_    ] o.a.s.c.OverseerAutoReplicaFailoverThread Starting OverseerAutoReplicaFailoverThread autoReplicaFailoverWorkLoopDelay=10000 autoReplicaFailoverWaitAfterExpiration=30000 autoReplicaFailoverBadNodeExpiration=60000
   [junit4]   2> 920327 INFO  (OverseerCollectionConfigSetProcessor-95583273626304516-127.0.0.1:35567_-n_0000000000) [n:127.0.0.1:35567_    ] o.a.s.c.OverseerTaskProcessor Process current queue of overseer operations
   [junit4]   2> 920327 INFO  (TEST-TestReqParamsAPI.test-seed#[3F4498CCD03B06F5]) [n:127.0.0.1:35567_    ] o.a.s.c.ZkController Register node as live in ZooKeeper:/live_nodes/127.0.0.1:35567_
   [junit4]   2> 920328 INFO  (OverseerStateUpdate-95583273626304516-127.0.0.1:35567_-n_0000000000) [n:127.0.0.1:35567_    ] o.a.s.c.Overseer Starting to work on the main queue
   [junit4]   2> 920329 INFO  (TEST-TestReqParamsAPI.test-seed#[3F4498CCD03B06F5]) [n:127.0.0.1:35567_    ] o.a.s.c.c.SolrZkClient makePath: /live_nodes/127.0.0.1:35567_
   [junit4]   2> 920332 INFO  (OverseerStateUpdate-95583273626304516-127.0.0.1:35567_-n_0000000000) [n:127.0.0.1:35567_    ] o.a.s.c.c.ZkStateReader Updated live nodes from ZooKeeper... (0) -> (1)
   [junit4]   2> 920332 INFO  (zkCallback-1036-thread-1-processing-n:127.0.0.1:35567_) [n:127.0.0.1:35567_    ] o.a.s.c.c.ZkStateReader A live node change: [WatchedEvent state:SyncConnected type:NodeChildrenChanged path:/live_nodes], has occurred - updating... (live nodes size: [0])
   [junit4]   2> 920333 INFO  (zkCallback-1036-thread-1-processing-n:127.0.0.1:35567_) [n:127.0.0.1:35567_    ] o.a.s.c.c.ZkStateReader Updated live nodes from ZooKeeper... (1) -> (1)
   [junit4]   2> 920364 INFO  (TEST-TestReqParamsAPI.test-seed#[3F4498CCD03B06F5]) [n:127.0.0.1:35567_    ] o.a.s.c.CoreContainer Security conf doesn't exist. Skipping setup for authorization module.
   [junit4]   2> 920364 INFO  (TEST-TestReqParamsAPI.test-seed#[3F4498CCD03B06F5]) [n:127.0.0.1:35567_    ] o.a.s.c.CoreContainer No authentication plugin used.
   [junit4]   2> 920365 INFO  (TEST-TestReqParamsAPI.test-seed#[3F4498CCD03B06F5]) [n:127.0.0.1:35567_    ] o.a.s.c.CorePropertiesLocator Looking for core definitions underneath /export/home/jenkins/workspace/Lucene-Solr-master-Solaris/solr/build/solr-core/test/J1/temp/solr.handler.TestReqParamsAPI_3F4498CCD03B06F5-001/control-001/cores
   [junit4]   2> 920366 INFO  (TEST-TestReqParamsAPI.test-seed#[3F4498CCD03B06F5]) [n:127.0.0.1:35567_    ] o.a.s.c.CoreDescriptor Created CoreDescriptor: {name=collection1, config=solrconfig.xml, transient=false, schema=schema.xml, loadOnStartup=true, configSetProperties=configsetprops.json, collection=control_collection, coreNodeName=, dataDir=data/, shard=}
   [junit4]   2> 920366 INFO  (TEST-TestReqParamsAPI.test-seed#[3F4498CCD03B06F5]) [n:127.0.0.1:35567_    ] o.a.s.c.CorePropertiesLocator Found core collection1 in /export/home/jenkins/workspace/Lucene-Solr-master-Solaris/solr/build/solr-core/test/J1/temp/solr.handler.TestReqParamsAPI_3F4498CCD03B06F5-001/control-001/cores/collection1
   [junit4]   2> 920366 INFO  (TEST-TestReqParamsAPI.test-seed#[3F4498CCD03B06F5]) [n:127.0.0.1:35567_    ] o.a.s.c.CorePropertiesLocator Found 1 core definitions
   [junit4]   2> 920367 INFO  (coreLoadExecutor-2807-thread-1-processing-n:127.0.0.1:35567_) [n:127.0.0.1:35567_ c:control_collection   x:collection1] o.a.s.c.ZkController publishing state=down
   [junit4]   2> 920367 INFO  (TEST-TestReqParamsAPI.test-seed#[3F4498CCD03B06F5]) [n:127.0.0.1:35567_    ] o.a.s.s.SolrDispatchFilter user.dir=/export/home/jenkins/workspace/Lucene-Solr-master-Solaris/solr/build/solr-core/test/J1
   [junit4]   2> 920367 INFO  (coreLoadExecutor-2807-thread-1-processing-n:127.0.0.1:35567_) [n:127.0.0.1:35567_ c:control_collection   x:collection1] o.a.s.c.ZkController numShards not found on descriptor - reading it from system property
   [junit4]   2> 920367 INFO  (TEST-TestReqParamsAPI.test-seed#[3F4498CCD03B06F5]) [n:127.0.0.1:35567_    ] o.a.s.s.SolrDispatchFilter SolrDispatchFilter.init() done
   [junit4]   2> 920370 INFO  (OverseerStateUpdate-95583273626304516-127.0.0.1:35567_-n_0000000000) [n:127.0.0.1:35567_    ] o.a.s.c.Overseer processMessage: queueSize: 1, message = {
   [junit4]   2>   "core":"collection1",
   [junit4]   2>   "roles":null,
   [junit4]   2>   "base_url":"http://127.0.0.1:35567",
   [junit4]   2>   "node_name":"127.0.0.1:35567_",
   [junit4]   2>   "numShards":"1",
   [junit4]   2>   "state":"down",
   [junit4]   2>   "shard":null,
   [junit4]   2>   "collection":"control_collection",
   [junit4]   2>   "operation":"state"} current state version: 0
   [junit4]   2> 920370 INFO  (coreLoadExecutor-2807-thread-1-processing-n:127.0.0.1:35567_) [n:127.0.0.1:35567_ c:control_collection   x:collection1] o.a.s.c.ZkController look for our core node name
   [junit4]   2> 920371 INFO  (OverseerStateUpdate-95583273626304516-127.0.0.1:35567_-n_0000000000) [n:127.0.0.1:35567_    ] o.a.s.c.o.ReplicaMutator Update state numShards=1 message={
   [junit4]   2>   "core":"collection1",
   [junit4]   2>   "roles":null,
   [junit4]   2>   "base_url":"http://127.0.0.1:35567",
   [junit4]   2>   "node_name":"127.0.0.1:35567_",
   [junit4]   2>   "numShards":"1",
   [junit4]   2>   "state":"down",
   [junit4]   2>   "shard":null,
   [junit4]   2>   "collection":"control_collection",
   [junit4]   2>   "operation":"state"}
   [junit4]   2> 920371 INFO  (OverseerStateUpdate-95583273626304516-127.0.0.1:35567_-n_0000000000) [n:127.0.0.1:35567_    ] o.a.s.c.o.ClusterStateMutator building a new cName: control_collection
   [junit4]   2> 920372 INFO  (OverseerStateUpdate-95583273626304516-127.0.0.1:35567_-n_0000000000) [n:127.0.0.1:35567_    ] o.a.s.c.o.ReplicaMutator Assigning new node to shard shard=shard1
   [junit4]   2> 920374 INFO  (zkCallback-1036-thread-1-processing-n:127.0.0.1:35567_) [n:127.0.0.1:35567_    ] o.a.s.c.c.ZkStateReader A cluster state change: [WatchedEvent state:SyncConnected type:NodeDataChanged path:/clusterstate.json], has occurred - updating... (live nodes size: [1])
   [junit4]   2> 921371 INFO  (coreLoadExecutor-2807-thread-1-processing-n:127.0.0.1:35567_) [n:127.0.0.1:35567_ c:control_collection   x:collection1] o.a.s.c.ZkController waiting to find shard id in clusterstate for collection1
   [junit4]   2> 921371 INFO  (coreLoadExecutor-2807-thread-1-processing-n:127.0.0.1:35567_) [n:127.0.0.1:35567_ c:control_collection   x:collection1] o.a.s.c.ZkController Check for collection zkNode:control_collection
   [junit4]   2> 921371 INFO  (coreLoadExecutor-2807-thread-1-processing-n:127.0.0.1:35567_) [n:127.0.0.1:35567_ c:control_collection   x:collection1] o.a.s.c.ZkController Collection zkNode exists
   [junit4]   2> 921371 INFO  (coreLoadExecutor-2807-thread-1-processing-n:127.0.0.1:35567_) [n:127.0.0.1:35567_ c:control_collection   x:collection1] o.a.s.c.c.ZkStateReader Load collection config from: [/collections/control_collection]
   [junit4]   2> 921373 INFO  (coreLoadExecutor-2807-thread-1-processing-n:127.0.0.1:35567_) [n:127.0.0.1:35567_ c:control_collection   x:collection1] o.a.s.c.c.ZkStateReader path=[/collections/control_collection] [configName]=[conf1] specified config exists in ZooKeeper
   [junit4]   2> 921373 INFO  (coreLoadExecutor-2807-thread-1-processing-n:127.0.0.1:35567_) [n:127.0.0.1:35567_ c:control_collection   x:collection1] o.a.s.c.SolrResourceLoader new SolrResourceLoader for directory: '/export/home/jenkins/workspace/Lucene-Solr-master-Solaris/solr/build/solr-core/test/J1/temp/solr.handler.TestReqParamsAPI_3F4498CCD03B06F5-001/control-001/cores/collection1'
   [junit4]   2> 921373 INFO  (coreLoadExecutor-2807-thread-1-processing-n:127.0.0.1:35567_) [n:127.0.0.1:35567_ c:control_collection   x:collection1] o.a.s.c.SolrResourceLoader JNDI not configured for solr (NoInitialContextEx)
   [junit4]   2> 921373 INFO  (coreLoadExecutor-2807-thread-1-processing-n:127.0.0.1:35567_) [n:127.0.0.1:35567_ c:control_collection   x:collection1] o.a.s.c.SolrResourceLoader solr home defaulted to 'solr/' (could not find system property or JNDI)
   [junit4]   2> 921375 INFO  (coreLoadExecutor-2807-thread-1-processing-n:127.0.0.1:35567_) [n:127.0.0.1:35567_ c:control_collection   x:collection1] o.a.s.c.Config loaded config solrconfig.xml with version 0 
   [junit4]   2> 921381 INFO  (coreLoadExecutor-2807-thread-1-processing-n:127.0.0.1:35567_) [n:127.0.0.1:35567_ c:control_collection   x:collection1] o.a.s.c.SolrConfig current version of requestparams : -1
   [junit4]   2> 921386 INFO  (coreLoadExecutor-2807-thread-1-processing-n:127.0.0.1:35567_) [n:127.0.0.1:35567_ c:control_collection   x:collection1] o.a.s.c.SolrConfig Using Lucene MatchVersion: 7.0.0
   [junit4]   2> 921393 INFO  (coreLoadExecutor-2807-thread-1-processing-n:127.0.0.1:35567_) [n:127.0.0.1:35567_ c:control_collection   x:collection1] o.a.s.c.SolrConfig Loaded SolrConfig: solrconfig.xml
   [junit4]   2> 921400 INFO  (coreLoadExecutor-2807-thread-1-processing-n:127.0.0.1:35567_) [n:127.0.0.1:35567_ c:control_collection   x:collection1] o.a.s.s.IndexSchema [collection1] Schema name=test
   [junit4]   2> 922009 INFO  (coreLoadExecutor-2807-thread-1-processing-n:127.0.0.1:35567_) [n:127.0.0.1:35567_ c:control_collection   x:collection1] o.a.s.s.OpenExchangeRatesOrgProvider Initialized with rates=open-exchange-rates.json, refreshInterval=1440.
   [junit4]   2> 922016 INFO  (coreLoadExecutor-2807-thread-1-processing-n:127.0.0.1:35567_) [n:127.0.0.1:35567_ c:control_collection   x:collection1] o.a.s.s.IndexSchema default search field in schema is text
   [junit4]   2> 922017 INFO  (coreLoadExecutor-2807-thread-1-processing-n:127.0.0.1:35567_) [n:127.0.0.1:35567_ c:control_collection   x:collection1] o.a.s.s.IndexSchema unique key field: id
   [junit4]   2> 922031 INFO  (coreLoadExecutor-2807-thread-1-processing-n:127.0.0.1:35567_) [n:127.0.0.1:35567_ c:control_collection   x:collection1] o.a.s.s.FileExchangeRateProvider Reloading exchange rates from file currency.xml
   [junit4]   2> 922035 INFO  (coreLoadExecutor-2807-thread-1-processing-n:127.0.0.1:35567_) [n:127.0.0.1:35567_ c:control_collection   x:collection1] o.a.s.s.FileExchangeRateProvider Reloading exchange rates from file currency.xml
   [junit4]   2> 922039 INFO  (coreLoadExecutor-2807-thread-1-processing-n:127.0.0.1:35567_) [n:127.0.0.1:35567_ c:control_collection   x:collection1] o.a.s.s.OpenExchangeRatesOrgProvider Reloading exchange rates from open-exchange-rates.json
   [junit4]   2> 922040 INFO  (coreLoadExecutor-2807-thread-1-processing-n:127.0.0.1:35567_) [n:127.0.0.1:35567_ c:control_collection   x:collection1] o.a.s.s.OpenExchangeRatesOrgProvider Reloading exchange rates from open-exchange-rates.json
   [junit4]   2> 922043 INFO  (coreLoadExecutor-2807-thread-1-processing-n:127.0.0.1:35567_) [n:127.0.0.1:35567_ c:control_collection   x:collection1] o.a.s.c.ConfigSetProperties Did not find ConfigSet properties, assuming default properties: Can't find resource 'configsetprops.json' in classpath or '/configs/conf1', cwd=/export/home/jenkins/workspace/Lucene-Solr-master-Solaris/solr/build/solr-core/test/J1
   [junit4]   2> 922043 INFO  (coreLoadExecutor-2807-thread-1-processing-n:127.0.0.1:35567_) [n:127.0.0.1:35567_ c:control_collection   x:collection1] o.a.s.c.CoreContainer Creating SolrCore 'collection1' using configuration from collection control_collection
   [junit4]   2> 922043 INFO  (coreLoadExecutor-2807-thread-1-processing-n:127.0.0.1:35567_) [n:127.0.0.1:35567_ c:control_collection s:shard1 r:core_node1 x:collection1] o.a.s.c.SolrCore org.apache.solr.core.MockDirectoryFactory
   [junit4]   2> 922043 INFO  (coreLoadExecutor-2807-thread-1-processing-n:127.0.0.1:35567_) [n:127.0.0.1:35567_ c:control_collection s:shard1 r:core_node1 x:collection1] o.a.s.c.SolrCore [[collection1] ] Opening new SolrCore at [/export/home/jenkins/workspace/Lucene-Solr-master-Solaris/solr/build/solr-core/test/J1/temp/solr.handler.TestReqParamsAPI_3F4498CCD03B06F5-001/control-001/cores/collection1], dataDir=[/export/home/jenkins/workspace/Lucene-Solr-master-Solaris/solr/build/solr-core/test/J1/temp/solr.handler.TestReqParamsAPI_3F4498CCD03B06F5-001/control-001/cores/collection1/data/]
   [junit4]   2> 922043 INFO  (coreLoadExecutor-2807-thread-1-processing-n:127.0.0.1:35567_) [n:127.0.0.1:35567_ c:control_collection s:shard1 r:core_node1 x:collection1] o.a.s.c.JmxMonitoredMap JMX monitoring is enabled. Adding Solr mbeans to JMX Server: com.sun.jmx.mbeanserver.JmxMBeanServer@3bd9360f
   [junit4]   2> 922044 INFO  (coreLoadExecutor-2807-thread-1-processing-n:127.0.0.1:35567_) [n:127.0.0.1:35567_ c:control_collection s:shard1 r:core_node1 x:collection1] o.a.s.c.CachingDirectoryFactory return new directory for /export/home/jenkins/workspace/Lucene-Solr-master-Solaris/solr/build/solr-core/test/J1/temp/solr.handler.TestReqParamsAPI_3F4498CCD03B06F5-001/control-001/cores/collection1/data
   [junit4]   2> 922044 INFO  (coreLoadExecutor-2807-thread-1-processing-n:127.0.0.1:35567_) [n:127.0.0.1:35567_ c:control_collection s:shard1 r:core_node1 x:collection1] o.a.s.c.SolrCore New index directory detected: old=null new=/export/home/jenkins/workspace/Lucene-Solr-master-Solaris/solr/build/solr-core/test/J1/temp/solr.handler.TestReqParamsAPI_3F4498CCD03B06F5-001/control-001/cores/collection1/data/index/
   [junit4]   2> 922044 WARN  (coreLoadExecutor-2807-thread-1-processing-n:127.0.0.1:35567_) [n:127.0.0.1:35567_ c:control_collection s:shard1 r:core_node1 x:collection1] o.a.s.c.SolrCore [collection1] Solr index directory '/export/home/jenkins/workspace/Lucene-Solr-master-Solaris/solr/build/solr-core/test/J1/temp/solr.handler.TestReqParamsAPI_3F4498CCD03B06F5-001/control-001/cores/collection1/data/index' doesn't exist. Creating new index...
   [junit4]   2> 922044 INFO  (coreLoadExecutor-2807-thread-1-processing-n:127.0.0.1:35567_) [n:127.0.0.1:35567_ c:control_collection s:shard1 r:core_node1 x:collection1] o.a.s.c.CachingDirectoryFactory return new directory for /export/home/jenkins/workspace/Lucene-Solr-master-Solaris/solr/build/solr-core/test/J1/temp/solr.handler.TestReqParamsAPI_3F4498CCD03B06F5-001/control-001/cores/collection1/data/index
   [junit4]   2> 922046 INFO  (coreLoadExecutor-2807-thread-1-processing-n:127.0.0.1:35567_) [n:127.0.0.1:35567_ c:control_collection s:shard1 r:core_node1 x:collection1] o.a.s.u.RandomMergePolicy RandomMergePolicy wrapping class org.apache.lucene.index.AlcoholicMergePolicy: [AlcoholicMergePolicy: minMergeSize=0, mergeFactor=10, maxMergeSize=561429909, maxMergeSizeForForcedMerge=9223372036854775807, calibrateSizeByDeletes=true, maxMergeDocs=2147483647, maxCFSSegmentSizeMB=8.796093022207999E12, noCFSRatio=0.1]
   [junit4]   2> 922046 INFO  (coreLoadExecutor-2807-thread-1-processing-n:127.0.0.1:35567_) [n:127.0.0.1:35567_ c:control_collection s:shard1 r:core_node1 x:collection1] o.a.s.c.SolrDeletionPolicy SolrDeletionPolicy.onCommit: commits: num=1
   [junit4]   2> 	commit{dir=MockDirectoryWrapper(RAMDirectory@2cf57ccb lockFactory=org.apache.lucene.store.SingleInstanceLockFactory@193c8f36),segFN=segments_1,generation=1}
   [junit4]   2> 922047 INFO  (coreLoadExecutor-2807-thread-1-processing-n:127.0.0.1:35567_) [n:127.0.0.1:35567_ c:control_collection s:shard1 r:core_node1 x:collection1] o.a.s.c.SolrDeletionPolicy newest commit generation = 1
   [junit4]   2> 922049 INFO  (coreLoadExecutor-2807-thread-1-processing-n:127.0.0.1:35567_) [n:127.0.0.1:35567_ c:control_collection s:shard1 r:core_node1 x:collection1] o.a.s.u.p.UpdateRequestProcessorChain creating updateRequestProcessorChain "nodistrib"
   [junit4]   2> 922049 INFO  (coreLoadExecutor-2807-thread-1-processing-n:127.0.0.1:35567_) [n:127.0.0.1:35567_ c:control_collection s:shard1 r:core_node1 x:collection1] o.a.s.u.p.UpdateRequestProcessorChain creating updateRequestProcessorChain "dedupe"
   [junit4]   2> 922049 INFO  (coreLoadExecutor-2807-thread-1-processing-n:127.0.0.1:35567_) [n:127.0.0.1:35567_ c:control_collection s:shard1 r:core_node1 x:collection1] o.a.s.u.p.UpdateRequestProcessorChain inserting DistributedUpdateProcessorFactory into updateRequestProcessorChain "dedupe"
   [junit4]   2> 922049 INFO  (coreLoadExecutor-2807-thread-1-processing-n:127.0.0.1:35567_) [n:127.0.0.1:35567_ c:control_collection s:shard1 r:core_node1 x:collection1] o.a.s.u.p.UpdateRequestProcessorChain creating updateRequestProcessorChain "stored_sig"
   [junit4]   2> 922049 INFO  (coreLoadExecutor-2807-thread-1-processing-n:127.0.0.1:35567_) [n:127.0.0.1:35567_ c:control_collection s:shard1 r:core_node1 x:collection1] o.a.s.u.p.UpdateRequestProcessorChain inserting DistributedUpdateProcessorFactory into updateRequestProcessorChain "stored_sig"
   [junit4]   2> 922049 INFO  (coreLoadExecutor-2807-thread-1-processing-n:127.0.0.1:35567_) [n:127.0.0.1:35567_ c:control_collection s:shard1 r:core_node1 x:collection1] o.a.s.u.p.UpdateRequestProcessorChain creating updateRequestProcessorChain "distrib-dup-test-chain-explicit"
   [junit4]   2> 922050 INFO  (coreLoadExecutor-2807-thread-1-processing-n:127.0.0.1:35567_) [n:127.0.0.1:35567_ c:control_collection s:shard1 r:core_node1 x:collection1] o.a.s.u.p.UpdateRequestProcessorChain creating updateRequestProcessorChain "distrib-dup-test-chain-implicit"
   [junit4]   2> 922050 INFO  (coreLoadExecutor-2807-thread-1-processing-n:127.0.0.1:35567_) [n:127.0.0.1:35567_ c:control_collection s:shard1 r:core_node1 x:collection1] o.a.s.u.p.UpdateRequestProcessorChain inserting DistributedUpdateProcessorFactory into updateRequestProcessorChain "distrib-dup-test-chain-implicit"
   [junit4]   2> 922050 INFO  (coreLoadExecutor-2807-thread-1-processing-n:127.0.0.1:35567_) [n:127.0.0.1:35567_ c:control_collection s:shard1 r:core_node1 x:collection1] o.a.s.c.SolrCore no updateRequestProcessorChain defined as default, creating implicit default
   [junit4]   2> 922050 WARN  (coreLoadExecutor-2807-thread-1-processing-n:127.0.0.1:35567_) [n:127.0.0.1:35567_ c:control_collection s:shard1 r:core_node1 x:collection1] o.a.s.c.RequestHandlers INVALID paramSet a in requestHandler {type = requestHandler,name = /dump,class = DumpRequestHandler,args = {defaults={a=A,b=B}}}
   [junit4]   2> 922050 INFO  (OldIndexDirectoryCleanupThreadForCore-collection1) [n:127.0.0.1:35567_ c:control_collection s:shard1 r:core_node1 x:collection1] o.a.s.c.SolrCore Looking for old index directories to cleanup for core collection1 in /export/home/jenkins/workspace/Lucene-Solr-master-Solaris/solr/build/solr-core/test/J1/temp/solr.handler.TestReqParamsAPI_3F4498CCD03B06F5-001/control-001/cores/collection1/data/
   [junit4]   2> 922050 WARN  (OldIndexDirectoryCleanupThreadForCore-collection1) [n:127.0.0.1:35567_ c:control_collection s:shard1 r:core_node1 x:collection1] o.a.s.c.DirectoryFactory /export/home/jenkins/workspace/Lucene-Solr-master-Solaris/solr/build/solr-core/test/J1/temp/solr.handler.TestReqParamsAPI_3F4498CCD03B06F5-001/control-001/cores/collection1/data/ does not point to a valid data directory; skipping clean-up of old index directories.
   [junit4]   2> 922052 INFO  (coreLoadExecutor-2807-thread-1-processing-n:127.0.0.1:35567_) [n:127.0.0.1:35567_ c:control_collection s:shard1 r:core_node1 x:collection1] o.a.s.h.l.XMLLoader xsltCacheLifetimeSeconds=60
   [junit4]   2> 922053 INFO  (coreLoadExecutor-2807-thread-1-processing-n:127.0.0.1:35567_) [n:127.0.0.1:35567_ c:control_collection s:shard1 r:core_node1 x:collection1] o.a.s.h.l.XMLLoader xsltCacheLifetimeSeconds=60
   [junit4]   2> 922054 INFO  (coreLoadExecutor-2807-thread-1-processing-n:127.0.0.1:35567_) [n:127.0.0.1:35567_ c:control_collection s:shard1 r:core_node1 x:collection1] o.a.s.h.l.XMLLoader xsltCacheLifetimeSeconds=60
   [junit4]   2> 922055 INFO  (coreLoadExecutor-2807-thread-1-processing-n:127.0.0.1:35567_) [n:127.0.0.1:35567_ c:control_collection s:shard1 r:core_node1 x:collection1] o.a.s.h.l.XMLLoader xsltCacheLifetimeSeconds=60
   [junit4]   2> 922058 INFO  (coreLoadExecutor-2807-thread-1-processing-n:127.0.0.1:35567_) [n:127.0.0.1:35567_ c:control_collection s:shard1 r:core_node1 x:collection1] o.a.s.c.RequestHandlers Registered paths: /admin/mbeans,standard,/dump,/update/csv,/sql,/update/json/docs,/admin/luke,/export,/admin/segments,/get,/admin/system,/replication,/admin/properties,/config,/stream,/schema,/admin/plugins,/admin/logging,/update/json,/admin/ping,/admin/threads,/update,/admin/file
   [junit4]   2> 922058 INFO  (coreLoadExecutor-2807-thread-1-processing-n:127.0.0.1:35567_) [n:127.0.0.1:35567_ c:control_collection s:shard1 r:core_node1 x:collection1] o.a.s.c.SolrCore Using default statsCache cache: org.apache.solr.search.stats.LocalStatsCache
   [junit4]   2> 922059 INFO  (coreLoadExecutor-2807-thread-1-processing-n:127.0.0.1:35567_) [n:127.0.0.1:35567_ c:control_collection s:shard1 r:core_node1 x:collection1] o.a.s.u.UpdateHandler Using UpdateLog implementation: org.apache.solr.update.UpdateLog
   [junit4]   2> 922059 INFO  (coreLoadExecutor-2807-thread-1-processing-n:127.0.0.1:35567_) [n:127.0.0.1:35567_ c:control_collection s:shard1 r:core_node1 x:collection1] o.a.s.u.UpdateLog Initializing UpdateLog: dataDir= defaultSyncLevel=FLUSH numRecordsToKeep=100 maxNumLogsToKeep=10 numVersionBuckets=65536
   [junit4]   2> 922061 INFO  (coreLoadExecutor-2807-thread-1-processing-n:127.0.0.1:35567_) [n:127.0.0.1:35567_ c:control_collection s:shard1 r:core_node1 x:collection1] o.a.s.u.CommitTracker Hard AutoCommit: disabled
   [junit4]   2> 922061 INFO  (coreLoadExecutor-2807-thread-1-processing-n:127.0.0.1:35567_) [n:127.0.0.1:35567_ c:control_collection s:shard1 r:core_node1 x:collection1] o.a.s.u.CommitTracker Soft AutoCommit: disabled
   [junit4]   2> 922062 INFO  (coreLoadExecutor-2807-thread-1-processing-n:127.0.0.1:35567_) [n:127.0.0.1:35567_ c:control_collection s:shard1 r:core_node1 x:collection1] o.a.s.u.RandomMergePolicy RandomMergePolicy wrapping class org.apache.lucene.index.LogDocMergePolicy: [LogDocMergePolicy: minMergeSize=1000, mergeFactor=49, maxMergeSize=9223372036854775807, maxMergeSizeForForcedMerge=9223372036854775807, calibrateSizeByDeletes=true, maxMergeDocs=2147483647, maxCFSSegmentSizeMB=8.796093022207999E12, noCFSRatio=1.0]
   [junit4]   2> 922062 INFO  (coreLoadExecutor-2807-thread-1-processing-n:127.0.0.1:35567_) [n:127.0.0.1:35567_ c:control_collection s:shard1 r:core_node1 x:collection1] o.a.s.c.SolrDeletionPolicy SolrDeletionPolicy.onInit: commits: num=1
   [junit4]   2> 	commit{dir=MockDirectoryWrapper(RAMDirectory@2cf57ccb lockFactory=org.apache.lucene.store.SingleInstanceLockFactory@193c8f36),segFN=segments_1,generation=1}
   [junit4]   2> 922062 INFO  (coreLoadExecutor-2807-thread-1-processing-n:127.0.0.1:35567_) [n:127.0.0.1:35567_ c:control_collection s:shard1 r:core_node1 x:collection1] o.a.s.c.SolrDeletionPolicy newest commit generation = 1
   [junit4]   2> 922062 INFO  (coreLoadExecutor-2807-thread-1-processing-n:127.0.0.1:35567_) [n:127.0.0.1:35567_ c:control_collection s:shard1 r:core_node1 x:collection1] o.a.s.s.SolrIndexSearcher Opening [Searcher@805d646[collection1] main]
   [junit4]   2> 922062 INFO  (coreLoadExecutor-2807-thread-1-processing-n:127.0.0.1:35567_) [n:127.0.0.1:35567_ c:control_collection s:shard1 r:core_node1 x:collection1] o.a.s.c.c.ZkStateReader Load collection config from: [/collections/control_collection]
   [junit4]   2> 922063 INFO  (coreLoadExecutor-2807-thread-1-processing-n:127.0.0.1:35567_) [n:127.0.0.1:35567_ c:control_collection s:shard1 r:core_node1 x:collection1] o.a.s.c.c.ZkStateReader path=[/collections/control_collection] [configName]=[conf1] specified config exists in ZooKeeper
   [junit4]   2> 922063 INFO  (coreLoadExecutor-2807-thread-1-processing-n:127.0.0.1:35567_) [n:127.0.0.1:35567_ c:control_collection s:shard1 r:core_node1 x:collection1] o.a.s.r.ManagedResourceStorage Setting up ZooKeeper-based storage for the RestManager with znodeBase: /configs/conf1
   [junit4]   2> 922064 INFO  (coreLoadExecutor-2807-thread-1-processing-n:127.0.0.1:35567_) [n:127.0.0.1:35567_ c:control_collection s:shard1 r:core_node1 x:collection1] o.a.s.r.ManagedResourceStorage Configured ZooKeeperStorageIO with znodeBase: /configs/conf1
   [junit4]   2> 922064 INFO  (coreLoadExecutor-2807-thread-1-processing-n:127.0.0.1:35567_) [n:127.0.0.1:35567_ c:control_collection s:shard1 r:core_node1 x:collection1] o.a.s.r.RestManager Initializing RestManager with initArgs: {}
   [junit4]   2> 922064 INFO  (coreLoadExecutor-2807-thread-1-processing-n:127.0.0.1:35567_) [n:127.0.0.1:35567_ c:control_collection s:shard1 r:core_node1 x:collection1] o.a.s.r.ManagedResourceStorage Reading _rest_managed.json using ZooKeeperStorageIO:path=/configs/conf1
   [junit4]   2> 922064 INFO  (coreLoadExecutor-2807-thread-1-processing-n:127.0.0.1:35567_) [n:127.0.0.1:35567_ c:control_collection s:shard1 r:core_node1 x:collection1] o.a.s.r.ManagedResourceStorage No data found for znode /configs/conf1/_rest_managed.json
   [junit4]   2> 922064 INFO  (coreLoadExecutor-2807-thread-1-processing-n:127.0.0.1:35567_) [n:127.0.0.1:35567_ c:control_collection s:shard1 r:core_node1 x:collection1] o.a.s.r.ManagedResourceStorage Loaded null at path _rest_managed.json using ZooKeeperStorageIO:path=/configs/conf1
   [junit4]   2> 922064 INFO  (coreLoadExecutor-2807-thread-1-processing-n:127.0.0.1:35567_) [n:127.0.0.1:35567_ c:control_collection s:shard1 r:core_node1 x:collection1] o.a.s.r.RestManager Initializing 0 registered ManagedResources
   [junit4]   2> 922065 INFO  (coreLoadExecutor-2807-thread-1-processing-n:127.0.0.1:35567_) [n:127.0.0.1:35567_ c:control_collection s:shard1 r:core_node1 x:collection1] o.a.s.h.ReplicationHandler Commits will be reserved for  10000
   [junit4]   2> 922065 INFO  (coreLoadExecutor-2807-thread-1-processing-n:127.0.0.1:35567_) [n:127.0.0.1:35567_ c:control_collection s:shard1 r:core_node1 x:collection1] o.a.s.u.UpdateLog Looking up max value of version field to seed version buckets
   [junit4]   2> 922065 INFO  (coreLoadExecutor-2807-thread-1-processing-n:127.0.0.1:35567_) [n:127.0.0.1:35567_ c:control_collection s:shard1 r:core_node1 x:collection1] o.a.s.u.VersionInfo Refreshing highest value of _version_ for 65536 version buckets from index
   [junit4]   2> 922065 INFO  (coreLoadExecutor-2807-thread-1-processing-n:127.0.0.1:35567_) [n:127.0.0.1:35567_ c:control_collection s:shard1 r:core_node1 x:collection1] o.a.s.u.VersionInfo No terms found for _version_, cannot seed version bucket highest value from index
   [junit4]   2> 922065 INFO  (coreLoadExecutor-2807-thread-1-processing-n:127.0.0.1:35567_) [n:127.0.0.1:35567_ c:control_collection s:shard1 r:core_node1 x:collection1] o.a.s.u.UpdateLog Could not find max version in index or recent updates, using new clock 1529332380515434496
   [junit4]   2> 922066 INFO  (searcherExecutor-2808-thread-1-processing-n:127.0.0.1:35567_ x:collection1 s:shard1 c:control_collection r:core_node1) [n:127.0.0.1:35567_ c:control_collection s:shard1 r:core_node1 x:collection1] o.a.s.c.SolrCore [collection1] Registered new searcher Searcher@805d646[collection1] main{ExitableDirectoryReader(UninvertingDirectoryReader())}
   [junit4]   2> 922067 INFO  (coreLoadExecutor-2807-thread-1-processing-n:127.0.0.1:35567_) [n:127.0.0.1:35567_ c:control_collection s:shard1 r:core_node1 x:collection1] o.a.s.u.UpdateLog Took 1.0ms to seed version buckets with highest version 1529332380515434496
   [junit4]   2> 922067 INFO  (coreLoadExecutor-2807-thread-1-processing-n:127.0.0.1:35567_) [n:127.0.0.1:35567_ c:control_collection s:shard1 r:core_node1 x:collection1] o.a.s.c.ZkController watch zkdir /configs/conf1
   [junit4]   2> 922068 INFO  (coreLoadExecutor-2807-thread-1-processing-n:127.0.0.1:35567_) [n:127.0.0.1:35567_ c:control_collection s:shard1 r:core_node1 x:collection1] o.a.s.c.CoreContainer registering core: collection1
   [junit4]   2> 922069 INFO  (coreZkRegister-2801-thread-1-processing-n:127.0.0.1:35567_ x:collection1 s:shard1 c:control_collection r:core_node1) [n:127.0.0.1:35567_ c:control_collection s:shard1 r:core_node1 x:collection1] o.a.s.c.ZkController Register replica - core:collection1 address:http://127.0.0.1:35567 collection:control_collection shard:shard1
   [junit4]   2> 922070 INFO  (coreZkRegister-2801-thread-1-processing-n:127.0.0.1:35567_ x:collection1 s:shard1 c:control_collection r:core_node1) [n:127.0.0.1:35567_ c:control_collection s:shard1 r:core_node1 x:collection1] o.a.s.c.c.SolrZkClient makePath: /collections/control_collection/leader_elect/shard1/election
   [junit4]   2> 922075 INFO  (coreZkRegister-2801-thread-1-processing-n:127.0.0.1:35567_ x:collection1 s:shard1 c:control_collection r:core_node1) [n:127.0.0.1:35567_ c:control_collection s:shard1 r:core_node1 x:collection1] o.a.s.c.LeaderElector Joined leadership election with path: /collections/control_collection/leader_elect/shard1/election/95583273626304516-core_node1-n_0000000000
   [junit4]   2> 922075 INFO  (coreZkRegister-2801-thread-1-processing-n:127.0.0.1:35567_ x:collection1 s:shard1 c:control_collection r:core_node1) [n:127.0.0.1:35567_ c:control_collection s:shard1 r:core_node1 x:collection1] o.a.s.c.ShardLeaderElectionContext Running the leader process for shard=shard1 and weAreReplacement=false and leaderVoteWait=10000
   [junit4]   2> 922078 INFO  (coreZkRegister-2801-thread-1-processing-n:127.0.0.1:35567_ x:collection1 s:shard1 c:control_collection r:core_node1) [n:127.0.0.1:35567_ c:control_collection s:shard1 r:core_node1 x:collection1] o.a.s.c.ShardLeaderElectionContext Enough replicas found to continue.
   [junit4]   2> 922078 INFO  (coreZkRegister-2801-thread-1-processing-n:127.0.0.1:35567_ x:collection1 s:shard1 c:control_collection r:core_node1) [n:127.0.0.1:35567_ c:control_collection s:shard1 r:core_node1 x:collection1] o.a.s.c.ShardLeaderElectionContext I may be the new leader - try and sync
   [junit4]   2> 922078 INFO  (coreZkRegister-2801-thread-1-processing-n:127.0.0.1:35567_ x:collection1 s:shard1 c:control_collection r:core_node1) [n:127.0.0.1:35567_ c:control_collection s:shard1 r:core_node1 x:collection1] o.a.s.c.SyncStrategy Sync replicas to http://127.0.0.1:35567/collection1/
   [junit4]   2> 922078 INFO  (coreZkRegister-2801-thread-1-processing-n:127.0.0.1:35567_ x:collection1 s:shard1 c:control_collection r:core_node1) [n:127.0.0.1:35567_ c:control_collection s:shard1 r:core_node1 x:collection1] o.a.s.c.SyncStrategy Sync Success - now sync replicas to me
   [junit4]   2> 922078 INFO  (coreZkRegister-2801-thread-1-processing-n:127.0.0.1:35567_ x:collection1 s:shard1 c:control_collection r:core_node1) [n:127.0.0.1:35567_ c:control_collection s:shard1 r:core_node1 x:collection1] o.a.s.c.SyncStrategy http://127.0.0.1:35567/collection1/ has no replicas
   [junit4]   2> 922078 INFO  (OverseerStateUpdate-95583273626304516-127.0.0.1:35567_-n_0000000000) [n:127.0.0.1:35567_    ] o.a.s.c.Overseer processMessage: queueSize: 1, message = {
   [junit4]   2>   "operation":"leader",
   [junit4]   2>   "shard":"shard1",
   [junit4]   2>   "collection":"control_collection"} current state version: 1
   [junit4]   2> 922079 INFO  (coreZkRegister-2801-thread-1-processing-n:127.0.0.1:35567_ x:collection1 s:shard1 c:control_collection r:core_node1) [n:127.0.0.1:35567_ c:control_collection s:shard1 r:core_node1 x:collection1] o.a.s.c.c.SolrZkClient makePath: /collections/control_collection/leaders/shard1
   [junit4]   2> 922081 INFO  (zkCallback-1036-thread-1-processing-n:127.0.0.1:35567_) [n:127.0.0.1:35567_    ] o.a.s.c.c.ZkStateReader A cluster state change: [WatchedEvent state:SyncConnected type:NodeDataChanged path:/clusterstate.json], has occurred - updating... (live nodes size: [1])
   [junit4]   2> 922085 INFO  (coreZkRegister-2801-thread-1-processing-n:127.0.0.1:35567_ x:collection1 s:shard1 c:control_collection r:core_node1) [n:127.0.0.1:35567_ c:control_collection s:shard1 r:core_node1 x:collection1] o.a.s.c.ShardLeaderElectionContextBase Creating leader registration node /collections/control_collection/leaders/shard1/leader after winning as /collections/control_collection/leader_elect/shard1/election/95583273626304516-core_node1-n_0000000000
   [junit4]   2> 922087 INFO  (coreZkRegister-2801-thread-1-processing-n:127.0.0.1:35567_ x:collection1 s:shard1 c:control_collection r:core_node1) [n:127.0.0.1:35567_ c:control_collection s:shard1 r:core_node1 x:collection1] o.a.s.c.ShardLeaderElectionContext I am the new leader: http://127.0.0.1:35567/collection1/ shard1
   [junit4]   2> 922089 INFO  (OverseerStateUpdate-95583273626304516-127.0.0.1:35567_-n_0000000000) [n:127.0.0.1:35567_    ] o.a.s.c.Overseer processMessage: queueSize: 1, message = {
   [junit4]   2>   "operation":"leader",
   [junit4]   2>   "shard":"shard1",
   [junit4]   2>   "collection":"control_collection",
   [junit4]   2>   "base_url":"http://127.0.0.1:35567",
   [junit4]   2>   "core":"collection1",
   [junit4]   2>   "state":"active"} current state version: 2
   [junit4]   2> 922192 INFO  (zkCallback-1036-thread-1-processing-n:127.0.0.1:35567_) [n:127.0.0.1:35567_    ] o.a.s.c.c.ZkStateReader A cluster state change: [WatchedEvent state:SyncConnected type:NodeDataChanged path:/clusterstate.json], has occurred - updating... (live nodes size: [1])
   [junit4]   2> 922239 INFO  (coreZkRegister-2801-thread-1-processing-n:127.0.0.1:35567_ x:collection1 s:shard1 c:control_collection r:core_node1) [n:127.0.0.1:35567_ c:control_collection s:shard1 r:core_node1 x:collection1] o.a.s.c.ZkController We are http://127.0.0.1:35567/collection1/ and leader is http://127.0.0.1:35567/collection1/
   [junit4]   2> 922239 INFO  (coreZkRegister-2801-thread-1-processing-n:127.0.0.1:35567_ x:collection1 s:shard1 c:control_collection r:core_node1) [n:127.0.0.1:35567_ c:control_collection s:shard1 r:core_node1 x:collection1] o.a.s.c.ZkController No LogReplay needed for core=collection1 baseURL=http://127.0.0.1:35567
   [junit4]   2> 922239 INFO  (coreZkRegister-2801-thread-1-processing-n:127.0.0.1:35567_ x:collection1 s:shard1 c:control_collection r:core_node1) [n:127.0.0.1:35567_ c:control_collection s:shard1 r:core_node1 x:collection1] o.a.s.c.ZkController I am the leader, no recovery necessary
   [junit4]   2> 922239 INFO  (coreZkRegister-2801-thread-1-processing-n:127.0.0.1:35567_ x:collection1 s:shard1 c:control_collection r:core_node1) [n:127.0.0.1:35567_ c:control_collection s:shard1 r:core_node1 x:collection1] o.a.s.c.ZkController publishing state=active
   [junit4]   2> 922239 INFO  (coreZkRegister-2801-thread-1-processing-n:127.0.0.1:35567_ x:collection1 s:shard1 c:control_collection r:core_node1) [n:127.0.0.1:35567_ c:control_collection s:shard1 r:core_node1 x:collection1] o.a.s.c.ZkController numShards not found on descriptor - reading it from system property
   [junit4]   2> 922242 INFO  (OverseerStateUpdate-95583273626304516-127.0.0.1:35567_-n_0000000000) [n:127.0.0.1:35567_    ] o.a.s.c.Overseer processMessage: queueSize: 1, message = {
   [junit4]   2>   "core":"collection1",
   [junit4]   2>   "core_node_name":"core_node1",
   [junit4]   2>   "roles":null,
   [junit4]   2>   "base_url":"http://127.0.0.1:35567",
   [junit4]   2>   "node_name":"127.0.0.1:35567_",
   [junit4]   2>   "numShards":"1",
   [junit4]   2>   "state":"active",
   [junit4]   2>   "shard":"shard1",
   [junit4]   2>   "collection":"control_collection",
   [junit4]   2>   "operation":"state"} current state version: 3
   [junit4]   2> 922243 INFO  (OverseerStateUpdate-95583273626304516-127.0.0.1:35567_-n_0000000000) [n:127.0.0.1:35567_    ] o.a.s.c.o.ReplicaMutator Update state numShards=1 message={
   [junit4]   2>   "core":"collection1",
   [junit4]   2>   "core_node_name":"core_node1",
   [junit4]   2>   "roles":null,
   [junit4]   2>   "base_url":"http://127.0.0.1:35567",
   [junit4]   2>   "node_name":"127.0.0.1:35567_",
   [junit4]   2>   "numShards":"1",
   [junit4]   2>   "state":"active",
   [junit4]   2>   "shard":"shard1",
   [junit4]   2>   "collection":"control_collection",
   [junit4]   2>   "operation":"state"}
   [junit4]   2> 922350 INFO  (zkCallback-1036-thread-1-processing-n:127.0.0.1:35567_) [n:127.0.0.1:35567_    ] o.a.s.c.c.ZkStateReader A cluster state change: [WatchedEvent state:SyncConnected type:NodeDataChanged path:/clusterstate.json], has occurred - updating... (live nodes size: [1])
   [junit4]   2> 922381 INFO  (TEST-TestReqParamsAPI.test-seed#[3F4498CCD03B06F5]) [    ] o.a.s.c.c.SolrZkClient Using default ZkCredentialsProvider
   [junit4]   2> 922381 INFO  (TEST-TestReqParamsAPI.test-seed#[3F4498CCD03B06F5]) [    ] o.a.s.c.c.ConnectionManager Waiting for client to connect to ZooKeeper
   [junit4]   2> 922383 INFO  (zkCallback-1038-thread-1) [    ] o.a.s.c.c.ConnectionManager Watcher org.apache.solr.common.cloud.ConnectionManager@71751c2f name:ZooKeeperConnection Watcher:127.0.0.1:64134/solr got event WatchedEvent state:SyncConnected type:None path:null path:null type:None
   [junit4]   2> 922383 INFO  (TEST-TestReqParamsAPI.test-seed#[3F4498CCD03B06F5]) [    ] o.a.s.c.c.ConnectionManager Client is connected to ZooKeeper
   [junit4]   2> 922383 INFO  (TEST-TestReqParamsAPI.test-seed#[3F4498CCD03B06F5]) [    ] o.a.s.c.c.SolrZkClient Using default ZkACLProvider
   [junit4]   2> 922383 INFO  (TEST-TestReqParamsAPI.test-seed#[3F4498CCD03B06F5]) [    ] o.a.s.c.c.ZkStateReader Updating cluster state from ZooKeeper... 
   [junit4]   2> 922387 INFO  (TEST-TestReqParamsAPI.test-seed#[3F4498CCD03B06F5]) [    ] o.a.s.c.c.ZkStateReader Updated live nodes from ZooKeeper... (0) -> (1)
   [junit4]   2> 922388 INFO  (TEST-TestReqParamsAPI.test-seed#[3F4498CCD03B06F5]) [    ] o.a.s.c.ChaosMonkey monkey: init - expire sessions:false cause connection loss:false
   [junit4]   2> 922388 INFO  (TEST-TestReqParamsAPI.test-seed#[3F4498CCD03B06F5]) [    ] o.a.s.c.AbstractFullDistribZkTestBase Creating collection1 with stateFormat=2
   [junit4]   2> 922388 INFO  (TEST-TestReqParamsAPI.test-seed#[3F4498CCD03B06F5]) [    ] o.a.s.c.c.SolrZkClient Using default ZkCredentialsProvider
   [junit4]   2> 922388 INFO  (TEST-TestReqParamsAPI.test-seed#[3F4498CCD03B06F5]) [    ] o.a.s.c.c.ConnectionManager Waiting for client to connect to ZooKeeper
   [junit4]   2> 922390 INFO  (zkCallback-1039-thread-1) [    ] o.a.s.c.c.ConnectionManager Watcher org.apache.solr.common.cloud.ConnectionManager@f4dceec name:ZooKeeperConnection Watcher:127.0.0.1:64134/solr got event WatchedEvent state:SyncConnected type:None path:null path:null type:None
   [junit4]   2> 922390 INFO  (TEST-TestReqParamsAPI.test-seed#[3F4498CCD03B06F5]) [    ] o.a.s.c.c.ConnectionManager Client is connected to ZooKeeper
   [junit4]   2> 922390 INFO  (TEST-TestReqParamsAPI.test-seed#[3F4498CCD03B06F5]) [    ] o.a.s.c.c.SolrZkClient Using default ZkACLProvider
   [junit4]   2> 922394 INFO  (OverseerStateUpdate-95583273626304516-127.0.0.1:35567_-n_0000000000) [n:127.0.0.1:35567_    ] o.a.s.c.Overseer processMessage: queueSize: 1, message = {
   [junit4]   2>   "operation":"create",
   [junit4]   2>   "name":"collection1",
   [junit4]   2>   "numShards":"2",
   [junit4]   2>   "stateFormat":"2"} current state version: 4
   [junit4]   2> 922394 INFO  (OverseerStateUpdate-95583273626304516-127.0.0.1:35567_-n_0000000000) [n:127.0.0.1:35567_    ] o.a.s.c.o.ClusterStateMutator building a new cName: collection1
   [junit4]   2> 922497 INFO  (OverseerStateUpdate-95583273626304516-127.0.0.1:35567_-n_0000000000) [n:127.0.0.1:35567_    ] o.a.s.c.o.ZkStateWriter going to create_collection /collections/collection1/state.json
   [junit4]   2> 922674 INFO  (TEST-TestReqParamsAPI.test-seed#[3F4498CCD03B06F5]) [    ] o.a.s.SolrTestCaseJ4 Writing core.properties file to /export/home/jenkins/workspace/Lucene-Solr-master-Solaris/solr/build/solr-core/test/J1/temp/solr.handler.TestReqParamsAPI_3F4498CCD03B06F5-001/shard-1-001/cores/collection1
   [junit4]   2> 922674 INFO  (TEST-TestReqParamsAPI.test-seed#[3F4498CCD03B06F5]) [    ] o.a.s.c.AbstractFullDistribZkTestBase create jetty 1 in directory /export/home/jenkins/workspace/Lucene-Solr-master-Solaris/solr/build/solr-core/test/J1/temp/solr.handler.TestReqParamsAPI_3F4498CCD03B06F5-001/shard-1-001
   [junit4]   2> 922675 INFO  (TEST-TestReqParamsAPI.test-seed#[3F4498CCD03B06F5]) [    ] o.e.j.s.Server jetty-9.3.8.v20160314
   [junit4]   2> 922677 INFO  (TEST-TestReqParamsAPI.test-seed#[3F4498CCD03B06F5]) [    ] o.e.j.s.h.ContextHandler Started o.e.j.s.ServletContextHandler@a762390{/,null,AVAILABLE}
   [junit4]   2> 922677 INFO  (TEST-TestReqParamsAPI.test-seed#[3F4498CCD03B06F5]) [    ] o.e.j.s.ServerConnector Started ServerConnector@4c91c98d{HTTP/1.1,[http/1.1]}{127.0.0.1:41874}
   [junit4]   2> 922677 INFO  (TEST-TestReqParamsAPI.test-seed#[3F4498CCD03B06F5]) [    ] o.e.j.s.Server Started @926012ms
   [junit4]   2> 922678 INFO  (TEST-TestReqParamsAPI.test-seed#[3F4498CCD03B06F5]) [    ] o.a.s.c.s.e.JettySolrRunner Jetty properties: {solr.data.dir=/export/home/jenkins/workspace/Lucene-Solr-master-Solaris/solr/build/solr-core/test/J1/temp/solr.handler.TestReqParamsAPI_3F4498CCD03B06F5-001/tempDir-001/jetty1, solrconfig=solrconfig.xml, hostContext=/, hostPort=41874, coreRootDirectory=/export/home/jenkins/workspace/Lucene-Solr-master-Solaris/solr/build/solr-core/test/J1/temp/solr.handler.TestReqParamsAPI_3F4498CCD03B06F5-001/shard-1-001/cores}
   [junit4]   2> 922678 INFO  (TEST-TestReqParamsAPI.test-seed#[3F4498CCD03B06F5]) [    ] o.a.s.s.SolrDispatchFilter SolrDispatchFilter.init(): sun.misc.Launcher$AppClassLoader@6d06d69c
   [junit4]   2> 922678 INFO  (TEST-TestReqParamsAPI.test-seed#[3F4498CCD03B06F5]) [    ] o.a.s.c.SolrResourceLoader new SolrResourceLoader for directory: '/export/home/jenkins/workspace/Lucene-Solr-master-Solaris/solr/build/solr-core/test/J1/temp/solr.handler.TestReqParamsAPI_3F4498CCD03B06F5-001/shard-1-001'
   [junit4]   2> 922678 INFO  (TEST-TestReqParamsAPI.test-seed#[3F4498CCD03B06F5]) [    ] o.a.s.c.SolrResourceLoader JNDI not configured for solr (NoInitialContextEx)
   [junit4]   2> 922679 INFO  (TEST-TestReqParamsAPI.test-seed#[3F4498CCD03B06F5]) [    ] o.a.s.c.SolrResourceLoader solr home defaulted to 'solr/' (could not find system property or JNDI)
   [junit4]   2> 922679 INFO  (TEST-TestReqParamsAPI.test-seed#[3F4498CCD03B06F5]) [    ] o.a.s.c.c.SolrZkClient Using default ZkCredentialsProvider
   [junit4]   2> 922679 INFO  (TEST-TestReqParamsAPI.test-seed#[3F4498CCD03B06F5]) [    ] o.a.s.c.c.ConnectionManager Waiting for client to connect to ZooKeeper
   [junit4]   2> 922681 INFO  (zkCallback-1040-thread-1) [    ] o.a.s.c.c.ConnectionManager Watcher org.apache.solr.common.cloud.ConnectionManager@c9bf9d8 name:ZooKeeperConnection Watcher:127.0.0.1:64134/solr got event WatchedEvent state:SyncConnected type:None path:null path:null type:None
   [junit4]   2> 922681 INFO  (TEST-TestReqParamsAPI.test-seed#[3F4498CCD03B06F5]) [    ] o.a.s.c.c.ConnectionManager Client is connected to ZooKeeper
   [junit4]   2> 922682 INFO  (TEST-TestReqParamsAPI.test-seed#[3F4498CCD03B06F5]) [    ] o.a.s.c.c.SolrZkClient Using default ZkACLProvider
   [junit4]   2> 922683 INFO  (TEST-TestReqParamsAPI.test-seed#[3F4498CCD03B06F5]) [    ] o.a.s.s.SolrDispatchFilter Loading solr.xml from SolrHome (not found in ZooKeeper)
   [junit4]   2> 922683 INFO  (TEST-TestReqParamsAPI.test-seed#[3F4498CCD03B06F5]) [    ] o.a.s.c.SolrXmlConfig Loading container configuration from /export/home/jenkins/workspace/Lucene-Solr-master-Solaris/solr/build/solr-core/test/J1/temp/solr.handler.TestReqParamsAPI_3F4498CCD03B06F5-001/shard-1-001/solr.xml
   [junit4]   2> 922688 INFO  (TEST-TestReqParamsAPI.test-seed#[3F4498CCD03B06F5]) [    ] o.a.s.c.CorePropertiesLocator Config-defined core root directory: /export/home/jenkins/workspace/Lucene-Solr-master-Solaris/solr/build/solr-core/test/J1/temp/solr.handler.TestReqParamsAPI_3F4498CCD03B06F5-001/shard-1-001/cores
   [junit4]   2> 922688 INFO  (TEST-TestReqParamsAPI.test-seed#[3F4498CCD03B06F5]) [    ] o.a.s.c.CoreContainer New CoreContainer 1028725580
   [junit4]   2> 922688 INFO  (TEST-TestReqParamsAPI.test-seed#[3F4498CCD03B06F5]) [    ] o.a.s.c.CoreContainer Loading cores into CoreContainer [instanceDir=/export/home/jenkins/workspace/Lucene-Solr-master-Solaris/solr/build/solr-core/test/J1/temp/solr.handler.TestReqParamsAPI_3F4498CCD03B06F5-001/shard-1-001]
   [junit4]   2> 922688 WARN  (TEST-TestReqParamsAPI.test-seed#[3F4498CCD03B06F5]) [    ] o.a.s.c.CoreContainer Couldn't add files from /export/home/jenkins/workspace/Lucene-Solr-master-Solaris/solr/build/solr-core/test/J1/temp/solr.handler.TestReqParamsAPI_3F4498CCD03B06F5-001/shard-1-001/lib to classpath: /export/home/jenkins/workspace/Lucene-Solr-master-Solaris/solr/build/solr-core/test/J1/temp/solr.handler.TestReqParamsAPI_3F4498CCD03B06F5-001/shard-1-001/lib
   [junit4]   2> 922689 INFO  (TEST-TestReqParamsAPI.test-seed#[3F4498CCD03B06F5]) [    ] o.a.s.h.c.HttpShardHandlerFactory created with socketTimeout : 90000,urlScheme : ,connTimeout : 15000,maxConnectionsPerHost : 20,maxConnections : 10000,corePoolSize : 0,maximumPoolSize : 2147483647,maxThreadIdleTime : 5,sizeOfQueue : -1,fairnessPolicy : false,useRetries : false,
   [junit4]   2> 922690 INFO  (TEST-TestReqParamsAPI.test-seed#[3F4498CCD03B06F5]) [    ] o.a.s.u.UpdateShardHandler Creating UpdateShardHandler HTTP client with params: socketTimeout=340000&connTimeout=45000&retry=true
   [junit4]   2> 922690 INFO  (TEST-TestReqParamsAPI.test-seed#[3F4498CCD03B06F5]) [    ] o.a.s.l.LogWatcher SLF4J impl is org.slf4j.impl.Log4jLoggerFactory
   [junit4]   2> 922690 INFO  (TEST-TestReqParamsAPI.test-seed#[3F4498CCD03B06F5]) [    ] o.a.s.l.LogWatcher Registering Log Listener [Log4j (org.slf4j.impl.Log4jLoggerFactory)]
   [junit4]   2> 922690 INFO  (TEST-TestReqParamsAPI.test-seed#[3F4498CCD03B06F5]) [    ] o.a.s.c.ZkContainer Zookeeper client=127.0.0.1:64134/solr
   [junit4]   2> 922690 INFO  (TEST-TestReqParamsAPI.test-seed#[3F4498CCD03B06F5]) [    ] o.a.s.c.ZkController zkHost includes chroot
   [junit4]   2> 922690 INFO  (TEST-TestReqParamsAPI.test-seed#[3F4498CCD03B06F5]) [    ] o.a.s.c.c.SolrZkClient Using default ZkCredentialsProvider
   [junit4]   2> 922691 INFO  (TEST-TestReqParamsAPI.test-seed#[3F4498CCD03B06F5]) [    ] o.a.s.c.c.ConnectionManager Waiting for client to connect to ZooKeeper
   [junit4]   2> 922693 INFO  (zkCallback-1043-thread-1) [    ] o.a.s.c.c.ConnectionManager Watcher org.apache.solr.common.cloud.ConnectionManager@4bd6a535 name:ZooKeeperConnection Watcher:127.0.0.1:64134 got event WatchedEvent state:SyncConnected type:None path:null path:null type:None
   [junit4]   2> 922694 INFO  (TEST-TestReqParamsAPI.test-seed#[3F4498CCD03B06F5]) [    ] o.a.s.c.c.ConnectionManager Client is connected to ZooKeeper
   [junit4]   2> 922694 INFO  (TEST-TestReqParamsAPI.test-seed#[3F4498CCD03B06F5]) [    ] o.a.s.c.c.SolrZkClient Using default ZkACLProvider
   [junit4]   2> 922695 INFO  (TEST-TestReqParamsAPI.test-seed#[3F4498CCD03B06F5]) [n:127.0.0.1:41874_    ] o.a.s.c.c.ConnectionManager Waiting for client to connect to ZooKeeper
   [junit4]   2> 922696 WARN  (NIOServerCxn.Factory:0.0.0.0/0.0.0.0:0) [    ] o.a.z.s.NIOServerCnxn caught end of stream exception
   [junit4]   2> EndOfStreamException: Unable to read additional data from client sessionid 0x153947b1ef70008, likely client has closed socket
   [junit4]   2> 	at org.apache.zookeeper.server.NIOServerCnxn.doIO(NIOServerCnxn.java:228)
   [junit4]   2> 	at org.apache.zookeeper.server.NIOServerCnxnFactory.run(NIOServerCnxnFactory.java:208)
   [junit4]   2> 	at java.lang.Thread.run(Thread.java:745)
   [junit4]   2> 922699 INFO  (zkCallback-1044-thread-1-processing-n:127.0.0.1:41874_) [n:127.0.0.1:41874_    ] o.a.s.c.c.ConnectionManager Watcher org.apache.solr.common.cloud.ConnectionManager@18ce53a7 name:ZooKeeperConnection Watcher:127.0.0.1:64134/solr got event WatchedEvent state:SyncConnected type:None path:null path:null type:None
   [junit4]   2> 922699 INFO  (TEST-TestReqParamsAPI.test-seed#[3F4498CCD03B06F5]) [n:127.0.0.1:41874_    ] o.a.s.c.c.ConnectionManager Client is connected to ZooKeeper
   [junit4]   2> 922711 INFO  (TEST-TestReqParamsAPI.test-seed#[3F4498CCD03B06F5]) [n:127.0.0.1:41874_    ] o.a.s.c.c.ZkStateReader Updating cluster state from ZooKeeper... 
   [junit4]   2> 922713 INFO  (TEST-TestReqParamsAPI.test-seed#[3F4498CCD03B06F5]) [n:127.0.0.1:41874_    ] o.a.s.c.c.ZkStateReader Updated live nodes from ZooKeeper... (0) -> (1)
   [junit4]   2> 922716 INFO  (TEST-TestReqParamsAPI.test-seed#[3F4498CCD03B06F5]) [n:127.0.0.1:41874_    ] o.a.s.c.Overseer Overseer (id=null) closing
   [junit4]   2> 922717 INFO  (TEST-TestReqParamsAPI.test-seed#[3F4498CCD03B06F5]) [n:127.0.0.1:41874_    ] o.a.s.c.LeaderElector Joined leadership election with path: /overseer_elect/election/95583273626304521-127.0.0.1:41874_-n_0000000001
   [junit4]   2> 922718 INFO  (TEST-TestReqParamsAPI.test-seed#[3F4498CCD03B06F5]) [n:127.0.0.1:41874_    ] o.a.s.c.LeaderElector Watching path /overseer_elect/election/95583273626304516-127.0.0.1:35567_-n_0000000000 to know if I could be the leader
   [junit4]   2> 922718 INFO  (TEST-TestReqParamsAPI.test-seed#[3F4498CCD03B06F5]) [n:127.0.0.1:41874_    ] o.a.s.c.ZkController Publish node=127.0.0.1:41874_ as DOWN
   [junit4]   2> 922721 INFO  (OverseerStateUpdate-95583273626304516-127.0.0.1:35567_-n_0000000000) [n:127.0.0.1:35567_    ] o.a.s.c.Overseer processMessage: queueSize: 1, message = {
   [junit4]   2>   "operation":"downnode",
   [junit4]   2>   "node_name":"127.0.0.1:41874_"} current state version: 4
   [junit4]   2> 922721 INFO  (OverseerStateUpdate-95583273626304516-127.0.0.1:35567_-n_0000000000) [n:127.0.0.1:35567_    ] o.a.s.c.o.NodeMutator DownNode state invoked for node: 127.0.0.1:41874_
   [junit4]   2> 922723 INFO  (OverseerStateUpdate-95583273626304516-127.0.0.1:35567_-n_0000000000) [n:127.0.0.1:35567_    ] o.a.s.c.o.ZkStateWriter going to update_collection /collections/collection1/state.json version: 0
   [junit4]   2> 922827 INFO  (zkCallback-1036-thread-1-processing-n:127.0.0.1:35567_) [n:127.0.0.1:35567_    ] o.a.s.c.c.ZkStateReader A cluster state change: [WatchedEvent state:SyncConnected type:NodeDataChanged path:/clusterstate.json], has occurred - updating... (live nodes size: [1])
   [junit4]   2> 922827 INFO  (zkCallback-1038-thread-1) [    ] o.a.s.c.c.ZkStateReader A cluster state change: [WatchedEvent state:SyncConnected type:NodeDataChanged path:/clusterstate.json], has occurred - updating... (live nodes size: [1])
   [junit4]   2> 922828 INFO  (zkCallback-1044-thread-1-processing-n:127.0.0.1:41874_) [n:127.0.0.1:41874_    ] o.a.s.c.c.ZkStateReader A cluster state change: [WatchedEvent state:SyncConnected type:NodeDataChanged path:/clusterstate.json], has occurred - updating... (live nodes size: [1])
   [junit4]   2> 923723 INFO  (TEST-TestReqParamsAPI.test-seed#[3F4498CCD03B06F5]) [n:127.0.0.1:41874_    ] o.a.s.c.ZkController Register node as live in ZooKeeper:/live_nodes/127.0.0.1:41874_
   [junit4]   2> 923724 INFO  (TEST-TestReqParamsAPI.test-seed#[3F4498CCD03B06F5]) [n:127.0.0.1:41874_    ] o.a.s.c.c.SolrZkClient makePath: /live_nodes/127.0.0.1:41874_
   [junit4]   2> 923725 INFO  (zkCallback-1038-thread-1) [    ] o.a.s.c.c.ZkStateReader A live node change: [WatchedEvent state:SyncConnected type:NodeChildrenChanged path:/live_nodes], has occurred - updating... (live nodes size: [1])
   [junit4]   2> 923726 INFO  (zkCallback-1038-thread-1) [    ] o.a.s.c.c.ZkStateReader Updated live nodes from ZooKeeper... (1) -> (2)
   [junit4]   2> 923726 INFO  (zkCallback-1036-thread-1-processing-n:127.0.0.1:35567_) [n:127.0.0.1:35567_    ] o.a.s.c.c.ZkStateReader A live node change: [WatchedEvent state:SyncConnected type:NodeChildrenChanged path:/live_nodes], has occurred - updating... (live nodes size: [1])
   [junit4]   2> 923726 INFO  (zkCallback-1044-thread-1-processing-n:127.0.0.1:41874_) [n:127.0.0.1:41874_    ] o.a.s.c.c.ZkStateReader A live node change: [WatchedEvent state:SyncConnected type:NodeChildrenChanged path:/live_nodes], has occurred - updating... (live nodes size: [1])
   [junit4]   2> 923727 INFO  (zkCallback-1036-thread-1-processing-n:127.0.0.1:35567_) [n:127.0.0.1:35567_    ] o.a.s.c.c.ZkStateReader Updated live nodes from ZooKeeper... (1) -> (2)
   [junit4]   2> 923727 INFO  (zkCallback-1044-thread-1-processing-n:127.0.0.1:41874_) [n:127.0.0.1:41874_    ] o.a.s.c.c.ZkStateReader Updated live nodes from ZooKeeper... (1) -> (2)
   [junit4]   2> 923745 INFO  (TEST-TestReqParamsAPI.test-seed#[3F4498CCD03B06F5]) [n:127.0.0.1:41874_    ] o.a.s.c.CoreContainer Security conf doesn't exist. Skipping setup for authorization module.
   [junit4]   2> 923745 INFO  (TEST-TestReqParamsAPI.test-seed#[3F4498CCD03B06F5]) [n:127.0.0.1:41874_    ] o.a.s.c.CoreContainer No authentication plugin used.
   [junit4]   2> 923746 INFO  (TEST-TestReqParamsAPI.test-seed#[3F4498CCD03B06F5]) [n:127.0.0.1:41874_    ] o.a.s.c.CorePropertiesLocator Looking for core definitions underneath /export/home/jenkins/workspace/Lucene-Solr-master-Solaris/solr/build/solr-core/test/J1/temp/solr.handler.TestReqParamsAPI_3F4498CCD03B06F5-001/shard-1-001/cores
   [junit4]   2> 923747 INFO  (TEST-TestReqParamsAPI.test-seed#[3F4498CCD03B06F5]) [n:127.0.0.1:41874_    ] o.a.s.c.CoreDescriptor Created CoreDescriptor: {name=collection1, config=solrconfig.xml, transient=false, schema=schema.xml, loadOnStartup=true, configSetProperties=configsetprops.json, collection=collection1, coreNodeName=, dataDir=data/, shard=}
   [junit4]   2> 923747 INFO  (TEST-TestReqParamsAPI.test-seed#[3F4498CCD03B06F5]) [n:127.0.0.1:41874_    ] o.a.s.c.CorePropertiesLocator Found core collection1 in /export/home/jenkins/workspace/Lucene-Solr-master-Solaris/solr/build/solr-core/test/J1/temp/solr.handler.TestReqParamsAPI_3F4498CCD03B06F5-001/shard-1-001/cores/collection1
   [junit4]   2> 923747 INFO  (TEST-TestReqParamsAPI.test-seed#[3F4498CCD03B06F5]) [n:127.0.0.1:41874_    ] o.a.s.c.CorePropertiesLocator Found 1 core definitions
   [junit4]   2> 923748 INFO  (TEST-TestReqParamsAPI.test-seed#[3F4498CCD03B06F5]) [n:127.0.0.1:41874_    ] o.a.s.s.SolrDispatchFilter user.dir=/export/home/jenkins/workspace/Lucene-Solr-master-Solaris/solr/build/solr-core/test/J1
   [junit4]   2> 923748 INFO  (TEST-TestReqParamsAPI.test-seed#[3F4498CCD03B06F5]) [n:127.0.0.1:41874_    ] o.a.s.s.SolrDispatchFilter SolrDispatchFilter.init() done
   [junit4]   2> 923749 INFO  (coreLoadExecutor-2818-thread-1-processing-n:127.0.0.1:41874_) [n:127.0.0.1:41874_ c:collection1   x:collection1] o.a.s.c.ZkController publishing state=down
   [junit4]   2> 923749 INFO  (coreLoadExecutor-2818-thread-1-processing-n:127.0.0.1:41874_) [n:127.0.0.1:41874_ c:collection1   x:collection1] o.a.s.c.ZkController numShards not found on descriptor - reading it from system property
   [junit4]   2> 923751 INFO  (coreLoadExecutor-2818-thread-1-processing-n:127.0.0.1:41874_) [n:127.0.0.1:41874_ c:collection1   x:collection1] o.a.s.c.ZkController Registering watch for collection collection1
   [junit4]   2> 923751 INFO  (coreLoadExecutor-2818-thread-1-processing-n:127.0.0.1:41874_) [n:127.0.0.1:41874_ c:collection1   x:collection1] o.a.s.c.c.ZkStateReader addZkWatch [collection1]
   [junit4]   2> 923751 INFO  (OverseerStateUpdate-95583273626304516-127.0.0.1:35567_-n_0000000000) [n:127.0.0.1:35567_    ] o.a.s.c.Overseer processMessage: queueSize: 1, message = {
   [junit4]   2>   "core":"collection1",
   [junit4]   2>   "roles":null,
   [junit4]   2>   "base_url":"http://127.0.0.1:41874",
   [junit4]   2>   "node_name":"127.0.0.1:41874_",
   [junit4]   2>   "numShards":"2",
   [junit4]   2>   "state":"down",
   [junit4]   2>   "shard":null,
   [junit4]   2>   "collection":"collection1",
   [junit4]   2>   "operation":"state"} current state version: 5
   [junit4]   2> 923751 INFO  (coreLoadExecutor-2818-thread-1-processing-n:127.0.0.1:41874_) [n:127.0.0.1:41874_ c:collection1   x:collection1] o.a.s.c.c.ZkStateReader Add data for [collection1] ver [1]
   [junit4]   2> 923751 INFO  (coreLoadExecutor-2818-thread-1-processing-n:127.0.0.1:41874_) [n:127.0.0.1:41874_ c:collection1   x:collection1] o.a.s.c.ZkController look for our core node name
   [junit4]   2> 923752 INFO  (OverseerStateUpdate-95583273626304516-127.0.0.1:35567_-n_0000000000) [n:127.0.0.1:35567_    ] o.a.s.c.o.ReplicaMutator Update state numShards=2 message={
   [junit4]   2>   "core":"collection1",
   [junit4]   2>   "roles":null,
   [junit4]   2>   "base_url":"http://127.0.0.1:41874",
   [junit4]   2>   "node_name":"127.0.0.1:41874_",
   [junit4]   2>   "numShards":"2",
   [junit4]   2>   "state":"down",
   [junit4]   2>   "shard":null,
   [junit4]   2>   "collection":"collection1",
   [junit4]   2>   "operation":"state"}
   [junit4]   2> 923752 INFO  (OverseerStateUpdate-95583273626304516-127.0.0.1:35567_-n_0000000000) [n:127.0.0.1:35567_    ] o.a.s.c.o.ReplicaMutator Collection already exists with numShards=2
   [junit4]   2> 923752 INFO  (OverseerStateUpdate-95583273626304516-127.0.0.1:35567_-n_0000000000) [n:127.0.0.1:35567_    ] o.a.s.c.o.ReplicaMutator Assigning new node to shard shard=shard2
   [junit4]   2> 923855 INFO  (OverseerStateUpdate-95583273626304516-127.0.0.1:35567_-n_0000000000) [n:127.0.0.1:35567_    ] o.a.s.c.o.ZkStateWriter going to update_collection /collections/collection1/state.json version: 1
   [junit4]   2> 923856 INFO  (zkCallback-1044-thread-1-processing-n:127.0.0.1:41874_) [n:127.0.0.1:41874_    ] o.a.s.c.c.ZkStateReader A cluster state change: [WatchedEvent state:SyncConnected type:NodeDataChanged path:/collections/collection1/state.json] for collection [collection1] has occurred - updating... (live nodes size: [2])
   [junit4]   2> 923857 INFO  (zkCallback-1044-thread-1-processing-n:127.0.0.1:41874_) [n:127.0.0.1:41874_    ] o.a.s.c.c.ZkStateReader Updating data for [collection1] from [1] to [2]
   [junit4]   2> 924753 INFO  (coreLoadExecutor-2818-thread-1-processing-n:127.0.0.1:41874_) [n:127.0.0.1:41874_ c:collection1   x:collection1] o.a.s.c.ZkController waiting to find shard id in clusterstate for collection1
   [junit4]   2> 924753 INFO  (coreLoadExecutor-2818-thread-1-processing-n:127.0.0.1:41874_) [n:127.0.0.1:41874_ c:collection1   x:collection1] o.a.s.c.ZkController Check for collection zkNode:collection1
   [junit4]   2> 924753 INFO  (coreLoadExecutor-2818-thread-1-processing-n:127.0.0.1:41874_) [n:127.0.0.1:41874_ c:collection1   x:collection1] o.a.s.c.ZkController Collection zkNode exists
   [junit4]   2> 924753 INFO  (coreLoadExecutor-2818-thread-1-processing-n:127.0.0.1:41874_) [n:127.0.0.1:41874_ c:collection1   x:collection1] o.a.s.c.c.ZkStateReader Load collection config from: [/collections/collection1]
   [junit4]   2> 924754 INFO  (coreLoadExecutor-2818-thread-1-processing-n:127.0.0.1:41874_) [n:127.0.0.1:41874_ c:collection1   x:collection1] o.a.s.c.c.ZkStateReader path=[/collections/collection1] [configName]=[conf1] specified config exists in ZooKeeper
   [junit4]   2> 924754 INFO  (coreLoadExecutor-2818-thread-1-processing-n:127.0.0.1:41874_) [n:127.0.0.1:41874_ c:collection1   x:collection1] o.a.s.c.SolrResourceLoader new SolrResourceLoader for directory: '/export/home/jenkins/workspace/Lucene-Solr-master-Solaris/solr/build/solr-core/test/J1/temp/solr.handler.TestReqParamsAPI_3F4498CCD03B06F5-001/shard-1-001/cores/collection1'
   [junit4]   2> 924754 INFO  (coreLoadExecutor-2818-thread-1-processing-n:127.0.0.1:41874_) [n:127.0.0.1:41874_ c:collection1   x:collection1] o.a.s.c.SolrResourceLoader JNDI not configured for solr (NoInitialContextEx)
   [junit4]   2> 924754 INFO  (coreLoadExecutor-2818-thread-1-processing-n:127.0.0.1:41874_) [n:127.0.0.1:41874_ c:collection1   x:collection1] o.a.s.c.SolrResourceLoader solr home defaulted to 'solr/' (could not find system property or JNDI)
   [junit4]   2> 924757 INFO  (coreLoadExecutor-2818-thread-1-processing-n:127.0.0.1:41874_) [n:127.0.0.1:41874_ c:collection1   x:collection1] o.a.s.c.Config loaded config solrconfig.xml with version 0 
   [junit4]   2> 924762 INFO  (coreLoadExecutor-2818-thread-1-processing-n:127.0.0.1:41874_) [n:127.0.0.1:41874_ c:collection1   x:collection1] o.a.s.c.SolrConfig current version of requestparams : -1
   [junit4]   2> 924765 INFO  (coreLoadExecutor-2818-thread-1-processing-n:127.0.0.1:41874_) [n:127.0.0.1:41874_ c:collection1   x:collection1] o.a.s.c.SolrConfig Using Lucene MatchVersion: 7.0.0
   [junit4]   2> 924772 INFO  (coreLoadExecutor-2818-thread-1-processing-n:127.0.0.1:41874_) [n:127.0.0.1:41874_ c:collection1   x:collection1] o.a.s.c.SolrConfig Loaded SolrConfig: solrconfig.xml
   [junit4]   2> 924778 INFO  (coreLoadExecutor-2818-thread-1-processing-n:127.0.0.1:41874_) [n:127.0.0.1:41874_ c:collection1   x:collection1] o.a.s.s.IndexSchema [collection1] Schema name=test
   [junit4]   2> 924898 INFO  (coreLoadExecutor-2818-thread-1-processing-n:127.0.0.1:41874_) [n:127.0.0.1:41874_ c:collection1   x:collection1] o.a.s.s.OpenExchangeRatesOrgProvider Initialized with rates=open-exchange-rates.json, refreshInterval=1440.
   [junit4]   2> 924906 INFO  (coreLoadExecutor-2818-thread-1-processing-n:127.0.0.1:41874_) [n:127.0.0.1:41874_ c:collection1   x:collection1] o.a.s.s.IndexSchema default search field in schema is text
   [junit4]   2> 924908 INFO  (coreLoadExecutor-2818-thread-1-processing-n:127.0.0.1:41874_) [n:127.0.0.1:41874_ c:collection1   x:collection1] o.a.s.s.IndexSchema unique key field: id
   [junit4]   2> 924921 INFO  (coreLoadExecutor-2818-thread-1-processing-n:127.0.0.1:41874_) [n:127.0.0.1:41874_ c:collection1   x:collection1] o.a.s.s.FileExchangeRateProvider Reloading exchange rates from file currency.xml
   [junit4]   2> 924925 INFO  (coreLoadExecutor-2818-thread-1-processing-n:127.0.0.1:41874_) [n:127.0.0.1:41874_ c:collection1   x:collection1] o.a.s.s.FileExchangeRateProvider Reloading exchange rates from file currency.xml
   [junit4]   2> 924929 INFO  (coreLoadExecutor-2818-thread-1-processing-n:127.0.0.1:41874_) [n:127.0.0.1:41874_ c:collection1   x:collection1] o.a.s.s.OpenExchangeRatesOrgProvider Reloading exchange rates from open-exchange-rates.json
   [junit4]   2> 924930 INFO  (coreLoadExecutor-2818-thread-1-processing-n:127.0.0.1:41874_) [n:127.0.0.1:41874_ c:collection1   x:collection1] o.a.s.s.OpenExchangeRatesOrgProvider Reloading exchange rates from open-exchange-rates.json
   [junit4]   2> 924932 INFO  (coreLoadExecutor-2818-thread-1-processing-n:127.0.0.1:41874_) [n:127.0.0.1:41874_ c:collection1   x:collection1] o.a.s.c.ConfigSetProperties Did not find ConfigSet properties, assuming default properties: Can't find resource 'configsetprops.json' in classpath or '/configs/conf1', cwd=/export/home/jenkins/workspace/Lucene-Solr-master-Solaris/solr/build/solr-core/test/J1
   [junit4]   2> 924932 INFO  (coreLoadExecutor-2818-thread-1-processing-n:127.0.0.1:41874_) [n:127.0.0.1:41874_ c:collection1   x:collection1] o.a.s.c.CoreContainer Creating SolrCore 'collection1' using configuration from collection collection1
   [junit4]   2> 924932 INFO  (coreLoadExecutor-2818-thread-1-processing-n:127.0.0.1:41874_) [n:127.0.0.1:41874_ c:collection1 s:shard2 r:core_node1 x:collection1] o.a.s.c.SolrCore org.apache.solr.core.MockDirectoryFactory
   [junit4]   2> 924932 INFO  (coreLoadExecutor-2818-thread-1-processing-n:127.0.0.1:41874_) [n:127.0.0.1:41874_ c:collection1 s:shard2 r:core_node1 x:collection1] o.a.s.c.SolrCore [[collection1] ] Opening new SolrCore at [/export/home/jenkins/workspace/Lucene-Solr-master-Solaris/solr/build/solr-core/test/J1/temp/solr.handler.TestReqParamsAPI_3F4498CCD03B06F5-001/shard-1-001/cores/collection1], dataDir=[/export/home/jenkins/workspace/Lucene-Solr-master-Solaris/solr/build/solr-core/test/J1/temp/solr.handler.TestReqParamsAPI_3F4498CCD03B06F5-001/shard-1-001/cores/collection1/data/]
   [junit4]   2> 924933 INFO  (coreLoadExecutor-2818-thread-1-processing-n:127.0.0.1:41874_) [n:127.0.0.1:41874_ c:collection1 s:shard2 r:core_node1 x:collection1] o.a.s.c.JmxMonitoredMap JMX monitoring is enabled. Adding Solr mbeans to JMX Server: com.sun.jmx.mbeanserver.JmxMBeanServer@3bd9360f
   [junit4]   2> 924933 INFO  (coreLoadExecutor-2818-thread-1-processing-n:127.0.0.1:41874_) [n:127.0.0.1:41874_ c:collection1 s:shard2 r:core_node1 x:collection1] o.a.s.c.CachingDirectoryFactory return new directory for /export/home/jenkins/workspace/Lucene-Solr-master-Solaris/solr/build/solr-core/test/J1/temp/solr.handler.TestReqParamsAPI_3F4498CCD03B06F5-001/shard-1-001/cores/collection1/data
   [junit4]   2> 924933 INFO  (coreLoadExecutor-2818-thread-1-processing-n:127.0.0.1:41874_) [n:127.0.0.1:41874_ c:collection1 s:shard2 r:core_node1 x:collection1] o.a.s.c.SolrCore New index directory detected: old=null new=/export/home/jenkins/workspace/L

[...truncated too long message...]

/data;done=false>>]
   [junit4]   2> 951121 INFO  (coreCloseExecutor-2941-thread-1) [n:127.0.0.1:62364_ c:collection1 s:shard1 r:core_node4 x:collection1] o.a.s.c.CachingDirectoryFactory Closing directory: /export/home/jenkins/workspace/Lucene-Solr-master-Solaris/solr/build/solr-core/test/J1/temp/solr.handler.TestReqParamsAPI_3F4498CCD03B06F5-001/shard-4-001/cores/collection1/data
   [junit4]   2> 951121 INFO  (OverseerStateUpdate-95583273626304530-127.0.0.1:62364_-n_0000000004) [n:127.0.0.1:62364_    ] o.a.s.c.o.ZkStateWriter going to update_collection /collections/collection1/state.json version: 26
   [junit4]   2> 951122 INFO  (TEST-TestReqParamsAPI.test-seed#[3F4498CCD03B06F5]) [    ] o.a.s.c.Overseer Overseer (id=95583273626304530-127.0.0.1:62364_-n_0000000004) closing
   [junit4]   2> 951122 INFO  (OverseerStateUpdate-95583273626304530-127.0.0.1:62364_-n_0000000004) [n:127.0.0.1:62364_    ] o.a.s.c.Overseer Overseer Loop exiting : 127.0.0.1:62364_
   [junit4]   2> 951122 INFO  (zkCallback-1060-thread-2-processing-n:127.0.0.1:62364_) [n:127.0.0.1:62364_    ] o.a.s.c.c.ZkStateReader A cluster state change: [WatchedEvent state:SyncConnected type:NodeDataChanged path:/collections/collection1/state.json] for collection [collection1] has occurred - updating... (live nodes size: [1])
   [junit4]   2> 951123 ERROR (TEST-TestReqParamsAPI.test-seed#[3F4498CCD03B06F5]-EventThread) [n:127.0.0.1:62364_    ] o.a.z.ClientCnxn Error while calling watcher 
   [junit4]   2> java.util.concurrent.RejectedExecutionException: Task org.apache.solr.common.util.ExecutorUtil$MDCAwareThreadPoolExecutor$$Lambda$6/1049902705@85fd288 rejected from org.apache.solr.common.util.ExecutorUtil$MDCAwareThreadPoolExecutor@66e50132[Shutting down, pool size = 1, active threads = 1, queued tasks = 0, completed tasks = 47]
   [junit4]   2> 	at java.util.concurrent.ThreadPoolExecutor$AbortPolicy.rejectedExecution(ThreadPoolExecutor.java:2047)
   [junit4]   2> 	at java.util.concurrent.ThreadPoolExecutor.reject(ThreadPoolExecutor.java:823)
   [junit4]   2> 	at java.util.concurrent.ThreadPoolExecutor.execute(ThreadPoolExecutor.java:1369)
   [junit4]   2> 	at org.apache.solr.common.util.ExecutorUtil$MDCAwareThreadPoolExecutor.execute(ExecutorUtil.java:214)
   [junit4]   2> 	at java.util.concurrent.AbstractExecutorService.submit(AbstractExecutorService.java:112)
   [junit4]   2> 	at org.apache.solr.common.cloud.SolrZkClient$3.process(SolrZkClient.java:266)
   [junit4]   2> 	at org.apache.zookeeper.ClientCnxn$EventThread.processEvent(ClientCnxn.java:522)
   [junit4]   2> 	at org.apache.zookeeper.ClientCnxn$EventThread.run(ClientCnxn.java:498)
   [junit4]   2> 952623 WARN  (zkCallback-1060-thread-2-processing-n:127.0.0.1:62364_) [n:127.0.0.1:62364_    ] o.a.s.c.c.ZkStateReader ZooKeeper watch triggered, but Solr cannot talk to ZK: [KeeperErrorCode = Session expired for /collections/collection1/state.json]
   [junit4]   2> 952625 INFO  (TEST-TestReqParamsAPI.test-seed#[3F4498CCD03B06F5]) [    ] o.e.j.s.ServerConnector Stopped ServerConnector@4be1570{HTTP/1.1,[http/1.1]}{127.0.0.1:0}
   [junit4]   2> 952625 INFO  (TEST-TestReqParamsAPI.test-seed#[3F4498CCD03B06F5]) [    ] o.e.j.s.h.ContextHandler Stopped o.e.j.s.ServletContextHandler@542d32f6{/,null,UNAVAILABLE}
   [junit4]   2> 952629 INFO  (TEST-TestReqParamsAPI.test-seed#[3F4498CCD03B06F5]) [    ] o.a.s.c.ZkTestServer connecting to 127.0.0.1:64134 64134
   [junit4]   2> 952645 INFO  (Thread-2562) [    ] o.a.s.c.ZkTestServer connecting to 127.0.0.1:64134 64134
   [junit4]   2> 952647 WARN  (Thread-2562) [    ] o.a.s.c.ZkTestServer Watch limit violations: 
   [junit4]   2> Maximum concurrent create/delete watches above limit:
   [junit4]   2> 
   [junit4]   2> 	45	/solr/configs/conf1
   [junit4]   2> 	6	/solr/aliases.json
   [junit4]   2> 	5	/solr/security.json
   [junit4]   2> 
   [junit4]   2> Maximum concurrent data watches above limit:
   [junit4]   2> 
   [junit4]   2> 	6	/solr/clusterstate.json
   [junit4]   2> 	4	/solr/collections/collection1/state.json
   [junit4]   2> 
   [junit4]   2> Maximum concurrent children watches above limit:
   [junit4]   2> 
   [junit4]   2> 	6	/solr/live_nodes
   [junit4]   2> 	6	/solr/collections
   [junit4]   2> 	5	/solr/overseer/collection-queue-work
   [junit4]   2> 	4	/solr/overseer/queue
   [junit4]   2> 	2	/solr/overseer/queue-work
   [junit4]   2> 
   [junit4]   2> NOTE: reproduce with: ant test  -Dtestcase=TestReqParamsAPI -Dtests.method=test -Dtests.seed=3F4498CCD03B06F5 -Dtests.slow=true -Dtests.locale=de-CH -Dtests.timezone=Pacific/Samoa -Dtests.asserts=true -Dtests.file.encoding=UTF-8
   [junit4] FAILURE 33.0s J1 | TestReqParamsAPI.test <<<
   [junit4]    > Throwable #1: java.lang.AssertionError: Could not get expected value  'null' for path 'response/params/y/p' full output: {
   [junit4]    >   "responseHeader":{
   [junit4]    >     "status":0,
   [junit4]    >     "QTime":0},
   [junit4]    >   "response":{
   [junit4]    >     "znodeVersion":4,
   [junit4]    >     "params":{
   [junit4]    >       "x":{
   [junit4]    >         "a":"A val",
   [junit4]    >         "b":"B val",
   [junit4]    >         "_appends_":{"add":"first"},
   [junit4]    >         "_invariants_":{"fixed":"f"},
   [junit4]    >         "":{"v":1}},
   [junit4]    >       "y":{
   [junit4]    >         "p":"P val",
   [junit4]    >         "q":"Q val",
   [junit4]    >         "":{"v":2}}}}}
   [junit4]    > 	at __randomizedtesting.SeedInfo.seed([3F4498CCD03B06F5:B710A7167EC76B0D]:0)
   [junit4]    > 	at org.apache.solr.core.TestSolrConfigHandler.testForResponseElement(TestSolrConfigHandler.java:458)
   [junit4]    > 	at org.apache.solr.handler.TestReqParamsAPI.testReqParams(TestReqParamsAPI.java:264)
   [junit4]    > 	at org.apache.solr.handler.TestReqParamsAPI.test(TestReqParamsAPI.java:67)
   [junit4]    > 	at org.apache.solr.BaseDistributedSearchTestCase$ShardsRepeatRule$ShardsFixedStatement.callStatement(BaseDistributedSearchTestCase.java:996)
   [junit4]    > 	at org.apache.solr.BaseDistributedSearchTestCase$ShardsRepeatRule$ShardsStatement.evaluate(BaseDistributedSearchTestCase.java:971)
   [junit4]    > 	at java.lang.Thread.run(Thread.java:745)
   [junit4]   2> 952652 INFO  (SUITE-TestReqParamsAPI-seed#[3F4498CCD03B06F5]-worker) [    ] o.a.s.SolrTestCaseJ4 ###deleteCore
   [junit4]   2> NOTE: leaving temporary files on disk at: /export/home/jenkins/workspace/Lucene-Solr-master-Solaris/solr/build/solr-core/test/J1/temp/solr.handler.TestReqParamsAPI_3F4498CCD03B06F5-001
   [junit4]   2> Mar 20, 2016 2:44:03 PM com.carrotsearch.randomizedtesting.ThreadLeakControl checkThreadLeaks
   [junit4]   2> WARNING: Will linger awaiting termination of 1 leaked thread(s).
   [junit4]   2> NOTE: test params are: codec=Asserting(Lucene60): {}, docValues:{}, maxPointsInLeafNode=33, maxMBSortInHeap=4.010765621242804, sim=RandomSimilarity(queryNorm=true,coord=crazy): {}, locale=de-CH, timezone=Pacific/Samoa
   [junit4]   2> NOTE: SunOS 5.11 amd64/Oracle Corporation 1.8.0_72 (64-bit)/cpus=3,threads=1,free=289698208,total=536870912
   [junit4]   2> NOTE: All tests run in this JVM: [HdfsChaosMonkeyNothingIsSafeTest, ZkSolrClientTest, MigrateRouteKeyTest, TestSortByMinMaxFunction, DocValuesMissingTest, TestAddFieldRealTimeGet, DateMathParserTest, TestDistributedMissingSort, TestQuerySenderListener, BaseCdcrDistributedZkTest, DistributedMLTComponentTest, AnalyticsMergeStrategyTest, TestConfigOverlay, HttpPartitionTest, TestConfigSetsAPI, SolrPluginUtilsTest, BasicFunctionalityTest, TestUniqueKeyFieldResource, TestSolrJ, NoCacheHeaderTest, SuggesterTest, RequestLoggingTest, VersionInfoTest, ShardRoutingCustomTest, InfoHandlerTest, TestBM25SimilarityFactory, TestOverriddenPrefixQueryForCustomFieldType, TestWriterPerf, DebugComponentTest, TestDynamicLoading, CustomCollectionTest, TestFilteredDocIdSet, TestPerFieldSimilarityWithDefaultOverride, TestFuzzyAnalyzedSuggestions, HdfsDirectoryFactoryTest, TestConfigReload, TestFieldTypeResource, CopyFieldTest, HLLUtilTest, SolrCmdDistributorTest, BufferStoreTest, TestFastWriter, TestSimpleQParserPlugin, AsyncCallRequestStatusResponseTest, PreAnalyzedUpdateProcessorTest, MultiTermTest, TestJsonRequest, TestRebalanceLeaders, TestSQLHandler, SynonymTokenizerTest, TestMiniSolrCloudClusterBase, BasicDistributedZk2Test, HdfsRecoverLeaseTest, TestCloudManagedSchema, HdfsUnloadDistributedZkTest, SpatialHeatmapFacetsTest, TestCloudPivotFacet, SolrXmlInZkTest, RequestHandlersTest, TestDistributedGrouping, OutputWriterTest, DirectUpdateHandlerOptimizeTest, TestReqParamsAPI]
   [junit4] Completed [145/580 (1!)] on J1 in 33.99s, 1 test, 1 failure <<< FAILURES!

[...truncated 1409 lines...]
BUILD FAILED
/export/home/jenkins/workspace/Lucene-Solr-master-Solaris/build.xml:740: The following error occurred while executing this line:
/export/home/jenkins/workspace/Lucene-Solr-master-Solaris/build.xml:684: The following error occurred while executing this line:
/export/home/jenkins/workspace/Lucene-Solr-master-Solaris/build.xml:59: The following error occurred while executing this line:
/export/home/jenkins/workspace/Lucene-Solr-master-Solaris/solr/build.xml:233: The following error occurred while executing this line:
/export/home/jenkins/workspace/Lucene-Solr-master-Solaris/solr/common-build.xml:529: The following error occurred while executing this line:
/export/home/jenkins/workspace/Lucene-Solr-master-Solaris/lucene/common-build.xml:1457: The following error occurred while executing this line:
/export/home/jenkins/workspace/Lucene-Solr-master-Solaris/lucene/common-build.xml:1014: There were test failures: 580 suites (10 ignored), 2320 tests, 1 failure, 86 ignored (70 assumptions) [seed: 3F4498CCD03B06F5]

Total time: 72 minutes 26 seconds
Build step 'Invoke Ant' marked build as failure
Archiving artifacts
[WARNINGS] Skipping publisher since build result is FAILURE
Recording test results
Email was triggered for: Failure - Any
Sending email for trigger: Failure - Any



Mime
View raw message