lucene-dev mailing list archives

Site index · List index
Message view « Date » · « Thread »
Top « Date » · « Thread »
From Policeman Jenkins Server <jenk...@thetaphi.de>
Subject [JENKINS-EA] Lucene-Solr-6.x-Linux (32bit/jdk-9-jigsaw-ea+110) - Build # 240 - Failure!
Date Fri, 25 Mar 2016 11:49:23 GMT
Build: http://jenkins.thetaphi.de/job/Lucene-Solr-6.x-Linux/240/
Java: 32bit/jdk-9-jigsaw-ea+110 -server -XX:+UseParallelGC -XX:-CompactStrings

1 tests failed.
FAILED:  org.apache.solr.handler.TestReqParamsAPI.test

Error Message:
Could not get expected value  'CY val' for path 'params/c' full output: {   "responseHeader":{     "status":0,     "QTime":0},   "params":{     "a":"A val",     "b":"B val",     "wt":"json",     "useParams":""},   "context":{     "webapp":"",     "path":"/dump1",     "httpMethod":"GET"}}

Stack Trace:
java.lang.AssertionError: Could not get expected value  'CY val' for path 'params/c' full output: {
  "responseHeader":{
    "status":0,
    "QTime":0},
  "params":{
    "a":"A val",
    "b":"B val",
    "wt":"json",
    "useParams":""},
  "context":{
    "webapp":"",
    "path":"/dump1",
    "httpMethod":"GET"}}
	at __randomizedtesting.SeedInfo.seed([2131C5AF6F60B95F:A965FA75C19CD4A7]:0)
	at org.junit.Assert.fail(Assert.java:93)
	at org.junit.Assert.assertTrue(Assert.java:43)
	at org.apache.solr.core.TestSolrConfigHandler.testForResponseElement(TestSolrConfigHandler.java:458)
	at org.apache.solr.handler.TestReqParamsAPI.testReqParams(TestReqParamsAPI.java:177)
	at org.apache.solr.handler.TestReqParamsAPI.test(TestReqParamsAPI.java:67)
	at sun.reflect.NativeMethodAccessorImpl.invoke0(java.base@9-ea/Native Method)
	at sun.reflect.NativeMethodAccessorImpl.invoke(java.base@9-ea/NativeMethodAccessorImpl.java:62)
	at sun.reflect.DelegatingMethodAccessorImpl.invoke(java.base@9-ea/DelegatingMethodAccessorImpl.java:43)
	at java.lang.reflect.Method.invoke(java.base@9-ea/Method.java:531)
	at com.carrotsearch.randomizedtesting.RandomizedRunner.invoke(RandomizedRunner.java:1764)
	at com.carrotsearch.randomizedtesting.RandomizedRunner$8.evaluate(RandomizedRunner.java:871)
	at com.carrotsearch.randomizedtesting.RandomizedRunner$9.evaluate(RandomizedRunner.java:907)
	at com.carrotsearch.randomizedtesting.RandomizedRunner$10.evaluate(RandomizedRunner.java:921)
	at org.apache.solr.BaseDistributedSearchTestCase$ShardsRepeatRule$ShardsFixedStatement.callStatement(BaseDistributedSearchTestCase.java:996)
	at org.apache.solr.BaseDistributedSearchTestCase$ShardsRepeatRule$ShardsStatement.evaluate(BaseDistributedSearchTestCase.java:971)
	at com.carrotsearch.randomizedtesting.rules.SystemPropertiesRestoreRule$1.evaluate(SystemPropertiesRestoreRule.java:57)
	at org.apache.lucene.util.TestRuleSetupTeardownChained$1.evaluate(TestRuleSetupTeardownChained.java:49)
	at org.apache.lucene.util.AbstractBeforeAfterRule$1.evaluate(AbstractBeforeAfterRule.java:45)
	at org.apache.lucene.util.TestRuleThreadAndTestName$1.evaluate(TestRuleThreadAndTestName.java:48)
	at org.apache.lucene.util.TestRuleIgnoreAfterMaxFailures$1.evaluate(TestRuleIgnoreAfterMaxFailures.java:64)
	at org.apache.lucene.util.TestRuleMarkFailure$1.evaluate(TestRuleMarkFailure.java:47)
	at com.carrotsearch.randomizedtesting.rules.StatementAdapter.evaluate(StatementAdapter.java:36)
	at com.carrotsearch.randomizedtesting.ThreadLeakControl$StatementRunner.run(ThreadLeakControl.java:367)
	at com.carrotsearch.randomizedtesting.ThreadLeakControl.forkTimeoutingTask(ThreadLeakControl.java:809)
	at com.carrotsearch.randomizedtesting.ThreadLeakControl$3.evaluate(ThreadLeakControl.java:460)
	at com.carrotsearch.randomizedtesting.RandomizedRunner.runSingleTest(RandomizedRunner.java:880)
	at com.carrotsearch.randomizedtesting.RandomizedRunner$5.evaluate(RandomizedRunner.java:781)
	at com.carrotsearch.randomizedtesting.RandomizedRunner$6.evaluate(RandomizedRunner.java:816)
	at com.carrotsearch.randomizedtesting.RandomizedRunner$7.evaluate(RandomizedRunner.java:827)
	at com.carrotsearch.randomizedtesting.rules.StatementAdapter.evaluate(StatementAdapter.java:36)
	at com.carrotsearch.randomizedtesting.rules.SystemPropertiesRestoreRule$1.evaluate(SystemPropertiesRestoreRule.java:57)
	at org.apache.lucene.util.AbstractBeforeAfterRule$1.evaluate(AbstractBeforeAfterRule.java:45)
	at com.carrotsearch.randomizedtesting.rules.StatementAdapter.evaluate(StatementAdapter.java:36)
	at org.apache.lucene.util.TestRuleStoreClassName$1.evaluate(TestRuleStoreClassName.java:41)
	at com.carrotsearch.randomizedtesting.rules.NoShadowingOrOverridesOnMethodsRule$1.evaluate(NoShadowingOrOverridesOnMethodsRule.java:40)
	at com.carrotsearch.randomizedtesting.rules.NoShadowingOrOverridesOnMethodsRule$1.evaluate(NoShadowingOrOverridesOnMethodsRule.java:40)
	at com.carrotsearch.randomizedtesting.rules.StatementAdapter.evaluate(StatementAdapter.java:36)
	at com.carrotsearch.randomizedtesting.rules.StatementAdapter.evaluate(StatementAdapter.java:36)
	at com.carrotsearch.randomizedtesting.rules.StatementAdapter.evaluate(StatementAdapter.java:36)
	at org.apache.lucene.util.TestRuleAssertionsRequired$1.evaluate(TestRuleAssertionsRequired.java:53)
	at org.apache.lucene.util.TestRuleMarkFailure$1.evaluate(TestRuleMarkFailure.java:47)
	at org.apache.lucene.util.TestRuleIgnoreAfterMaxFailures$1.evaluate(TestRuleIgnoreAfterMaxFailures.java:64)
	at org.apache.lucene.util.TestRuleIgnoreTestSuites$1.evaluate(TestRuleIgnoreTestSuites.java:54)
	at com.carrotsearch.randomizedtesting.rules.StatementAdapter.evaluate(StatementAdapter.java:36)
	at com.carrotsearch.randomizedtesting.ThreadLeakControl$StatementRunner.run(ThreadLeakControl.java:367)
	at java.lang.Thread.run(java.base@9-ea/Thread.java:804)




Build Log:
[...truncated 12181 lines...]
   [junit4] Suite: org.apache.solr.handler.TestReqParamsAPI
   [junit4]   2> Creating dataDir: /home/jenkins/workspace/Lucene-Solr-6.x-Linux/solr/build/solr-core/test/J1/temp/solr.handler.TestReqParamsAPI_2131C5AF6F60B95F-001/init-core-data-001
   [junit4]   2> 1713146 INFO  (SUITE-TestReqParamsAPI-seed#[2131C5AF6F60B95F]-worker) [    ] o.a.s.SolrTestCaseJ4 Randomized ssl (false) and clientAuth (false)
   [junit4]   2> 1713146 INFO  (SUITE-TestReqParamsAPI-seed#[2131C5AF6F60B95F]-worker) [    ] o.a.s.BaseDistributedSearchTestCase Setting hostContext system property: /
   [junit4]   2> 1713147 INFO  (TEST-TestReqParamsAPI.test-seed#[2131C5AF6F60B95F]) [    ] o.a.s.c.ZkTestServer STARTING ZK TEST SERVER
   [junit4]   2> 1713147 INFO  (Thread-3867) [    ] o.a.s.c.ZkTestServer client port:0.0.0.0/0.0.0.0:0
   [junit4]   2> 1713147 INFO  (Thread-3867) [    ] o.a.s.c.ZkTestServer Starting server
   [junit4]   2> 1713248 INFO  (TEST-TestReqParamsAPI.test-seed#[2131C5AF6F60B95F]) [    ] o.a.s.c.ZkTestServer start zk server on port:46017
   [junit4]   2> 1713248 INFO  (TEST-TestReqParamsAPI.test-seed#[2131C5AF6F60B95F]) [    ] o.a.s.c.c.SolrZkClient Using default ZkCredentialsProvider
   [junit4]   2> 1713248 INFO  (TEST-TestReqParamsAPI.test-seed#[2131C5AF6F60B95F]) [    ] o.a.s.c.c.ConnectionManager Waiting for client to connect to ZooKeeper
   [junit4]   2> 1713250 INFO  (zkCallback-1459-thread-1) [    ] o.a.s.c.c.ConnectionManager Watcher org.apache.solr.common.cloud.ConnectionManager@6f1094 name:ZooKeeperConnection Watcher:127.0.0.1:46017 got event WatchedEvent state:SyncConnected type:None path:null path:null type:None
   [junit4]   2> 1713250 INFO  (TEST-TestReqParamsAPI.test-seed#[2131C5AF6F60B95F]) [    ] o.a.s.c.c.ConnectionManager Client is connected to ZooKeeper
   [junit4]   2> 1713250 INFO  (TEST-TestReqParamsAPI.test-seed#[2131C5AF6F60B95F]) [    ] o.a.s.c.c.SolrZkClient Using default ZkACLProvider
   [junit4]   2> 1713250 INFO  (TEST-TestReqParamsAPI.test-seed#[2131C5AF6F60B95F]) [    ] o.a.s.c.c.SolrZkClient makePath: /solr
   [junit4]   2> 1713251 INFO  (TEST-TestReqParamsAPI.test-seed#[2131C5AF6F60B95F]) [    ] o.a.s.c.c.SolrZkClient Using default ZkCredentialsProvider
   [junit4]   2> 1713252 INFO  (TEST-TestReqParamsAPI.test-seed#[2131C5AF6F60B95F]) [    ] o.a.s.c.c.ConnectionManager Waiting for client to connect to ZooKeeper
   [junit4]   2> 1713252 INFO  (zkCallback-1460-thread-1) [    ] o.a.s.c.c.ConnectionManager Watcher org.apache.solr.common.cloud.ConnectionManager@15508c4 name:ZooKeeperConnection Watcher:127.0.0.1:46017/solr got event WatchedEvent state:SyncConnected type:None path:null path:null type:None
   [junit4]   2> 1713252 INFO  (TEST-TestReqParamsAPI.test-seed#[2131C5AF6F60B95F]) [    ] o.a.s.c.c.ConnectionManager Client is connected to ZooKeeper
   [junit4]   2> 1713253 INFO  (TEST-TestReqParamsAPI.test-seed#[2131C5AF6F60B95F]) [    ] o.a.s.c.c.SolrZkClient Using default ZkACLProvider
   [junit4]   2> 1713253 INFO  (TEST-TestReqParamsAPI.test-seed#[2131C5AF6F60B95F]) [    ] o.a.s.c.c.SolrZkClient makePath: /collections/collection1
   [junit4]   2> 1713253 INFO  (TEST-TestReqParamsAPI.test-seed#[2131C5AF6F60B95F]) [    ] o.a.s.c.c.SolrZkClient makePath: /collections/collection1/shards
   [junit4]   2> 1713254 INFO  (TEST-TestReqParamsAPI.test-seed#[2131C5AF6F60B95F]) [    ] o.a.s.c.c.SolrZkClient makePath: /collections/control_collection
   [junit4]   2> 1713254 INFO  (TEST-TestReqParamsAPI.test-seed#[2131C5AF6F60B95F]) [    ] o.a.s.c.c.SolrZkClient makePath: /collections/control_collection/shards
   [junit4]   2> 1713255 INFO  (TEST-TestReqParamsAPI.test-seed#[2131C5AF6F60B95F]) [    ] o.a.s.c.AbstractZkTestCase put /home/jenkins/workspace/Lucene-Solr-6.x-Linux/solr/core/src/test-files/solr/collection1/conf/solrconfig-tlog.xml to /configs/conf1/solrconfig.xml
   [junit4]   2> 1713255 INFO  (TEST-TestReqParamsAPI.test-seed#[2131C5AF6F60B95F]) [    ] o.a.s.c.c.SolrZkClient makePath: /configs/conf1/solrconfig.xml
   [junit4]   2> 1713256 INFO  (TEST-TestReqParamsAPI.test-seed#[2131C5AF6F60B95F]) [    ] o.a.s.c.AbstractZkTestCase put /home/jenkins/workspace/Lucene-Solr-6.x-Linux/solr/core/src/test-files/solr/collection1/conf/schema.xml to /configs/conf1/schema.xml
   [junit4]   2> 1713256 INFO  (TEST-TestReqParamsAPI.test-seed#[2131C5AF6F60B95F]) [    ] o.a.s.c.c.SolrZkClient makePath: /configs/conf1/schema.xml
   [junit4]   2> 1713256 INFO  (TEST-TestReqParamsAPI.test-seed#[2131C5AF6F60B95F]) [    ] o.a.s.c.AbstractZkTestCase put /home/jenkins/workspace/Lucene-Solr-6.x-Linux/solr/core/src/test-files/solr/collection1/conf/solrconfig.snippet.randomindexconfig.xml to /configs/conf1/solrconfig.snippet.randomindexconfig.xml
   [junit4]   2> 1713257 INFO  (TEST-TestReqParamsAPI.test-seed#[2131C5AF6F60B95F]) [    ] o.a.s.c.c.SolrZkClient makePath: /configs/conf1/solrconfig.snippet.randomindexconfig.xml
   [junit4]   2> 1713257 INFO  (TEST-TestReqParamsAPI.test-seed#[2131C5AF6F60B95F]) [    ] o.a.s.c.AbstractZkTestCase put /home/jenkins/workspace/Lucene-Solr-6.x-Linux/solr/core/src/test-files/solr/collection1/conf/stopwords.txt to /configs/conf1/stopwords.txt
   [junit4]   2> 1713257 INFO  (TEST-TestReqParamsAPI.test-seed#[2131C5AF6F60B95F]) [    ] o.a.s.c.c.SolrZkClient makePath: /configs/conf1/stopwords.txt
   [junit4]   2> 1713257 INFO  (TEST-TestReqParamsAPI.test-seed#[2131C5AF6F60B95F]) [    ] o.a.s.c.AbstractZkTestCase put /home/jenkins/workspace/Lucene-Solr-6.x-Linux/solr/core/src/test-files/solr/collection1/conf/protwords.txt to /configs/conf1/protwords.txt
   [junit4]   2> 1713257 INFO  (TEST-TestReqParamsAPI.test-seed#[2131C5AF6F60B95F]) [    ] o.a.s.c.c.SolrZkClient makePath: /configs/conf1/protwords.txt
   [junit4]   2> 1713258 INFO  (TEST-TestReqParamsAPI.test-seed#[2131C5AF6F60B95F]) [    ] o.a.s.c.AbstractZkTestCase put /home/jenkins/workspace/Lucene-Solr-6.x-Linux/solr/core/src/test-files/solr/collection1/conf/currency.xml to /configs/conf1/currency.xml
   [junit4]   2> 1713258 INFO  (TEST-TestReqParamsAPI.test-seed#[2131C5AF6F60B95F]) [    ] o.a.s.c.c.SolrZkClient makePath: /configs/conf1/currency.xml
   [junit4]   2> 1713259 INFO  (TEST-TestReqParamsAPI.test-seed#[2131C5AF6F60B95F]) [    ] o.a.s.c.AbstractZkTestCase put /home/jenkins/workspace/Lucene-Solr-6.x-Linux/solr/core/src/test-files/solr/collection1/conf/enumsConfig.xml to /configs/conf1/enumsConfig.xml
   [junit4]   2> 1713259 INFO  (TEST-TestReqParamsAPI.test-seed#[2131C5AF6F60B95F]) [    ] o.a.s.c.c.SolrZkClient makePath: /configs/conf1/enumsConfig.xml
   [junit4]   2> 1713259 INFO  (TEST-TestReqParamsAPI.test-seed#[2131C5AF6F60B95F]) [    ] o.a.s.c.AbstractZkTestCase put /home/jenkins/workspace/Lucene-Solr-6.x-Linux/solr/core/src/test-files/solr/collection1/conf/open-exchange-rates.json to /configs/conf1/open-exchange-rates.json
   [junit4]   2> 1713259 INFO  (TEST-TestReqParamsAPI.test-seed#[2131C5AF6F60B95F]) [    ] o.a.s.c.c.SolrZkClient makePath: /configs/conf1/open-exchange-rates.json
   [junit4]   2> 1713260 INFO  (TEST-TestReqParamsAPI.test-seed#[2131C5AF6F60B95F]) [    ] o.a.s.c.AbstractZkTestCase put /home/jenkins/workspace/Lucene-Solr-6.x-Linux/solr/core/src/test-files/solr/collection1/conf/mapping-ISOLatin1Accent.txt to /configs/conf1/mapping-ISOLatin1Accent.txt
   [junit4]   2> 1713260 INFO  (TEST-TestReqParamsAPI.test-seed#[2131C5AF6F60B95F]) [    ] o.a.s.c.c.SolrZkClient makePath: /configs/conf1/mapping-ISOLatin1Accent.txt
   [junit4]   2> 1713260 INFO  (TEST-TestReqParamsAPI.test-seed#[2131C5AF6F60B95F]) [    ] o.a.s.c.AbstractZkTestCase put /home/jenkins/workspace/Lucene-Solr-6.x-Linux/solr/core/src/test-files/solr/collection1/conf/old_synonyms.txt to /configs/conf1/old_synonyms.txt
   [junit4]   2> 1713260 INFO  (TEST-TestReqParamsAPI.test-seed#[2131C5AF6F60B95F]) [    ] o.a.s.c.c.SolrZkClient makePath: /configs/conf1/old_synonyms.txt
   [junit4]   2> 1713261 INFO  (TEST-TestReqParamsAPI.test-seed#[2131C5AF6F60B95F]) [    ] o.a.s.c.AbstractZkTestCase put /home/jenkins/workspace/Lucene-Solr-6.x-Linux/solr/core/src/test-files/solr/collection1/conf/synonyms.txt to /configs/conf1/synonyms.txt
   [junit4]   2> 1713261 INFO  (TEST-TestReqParamsAPI.test-seed#[2131C5AF6F60B95F]) [    ] o.a.s.c.c.SolrZkClient makePath: /configs/conf1/synonyms.txt
   [junit4]   2> 1713316 INFO  (TEST-TestReqParamsAPI.test-seed#[2131C5AF6F60B95F]) [    ] o.a.s.SolrTestCaseJ4 Writing core.properties file to /home/jenkins/workspace/Lucene-Solr-6.x-Linux/solr/build/solr-core/test/J1/temp/solr.handler.TestReqParamsAPI_2131C5AF6F60B95F-001/control-001/cores/collection1
   [junit4]   2> 1713317 INFO  (TEST-TestReqParamsAPI.test-seed#[2131C5AF6F60B95F]) [    ] o.e.j.s.Server jetty-9.3.8.v20160314
   [junit4]   2> 1713323 INFO  (TEST-TestReqParamsAPI.test-seed#[2131C5AF6F60B95F]) [    ] o.e.j.s.h.ContextHandler Started o.e.j.s.ServletContextHandler@1fd4dd0{/,null,AVAILABLE}
   [junit4]   2> 1713325 INFO  (TEST-TestReqParamsAPI.test-seed#[2131C5AF6F60B95F]) [    ] o.e.j.s.ServerConnector Started ServerConnector@68cf0c{HTTP/1.1,[http/1.1]}{127.0.0.1:43437}
   [junit4]   2> 1713325 INFO  (TEST-TestReqParamsAPI.test-seed#[2131C5AF6F60B95F]) [    ] o.e.j.s.Server Started @1715176ms
   [junit4]   2> 1713325 INFO  (TEST-TestReqParamsAPI.test-seed#[2131C5AF6F60B95F]) [    ] o.a.s.c.s.e.JettySolrRunner Jetty properties: {solr.data.dir=/home/jenkins/workspace/Lucene-Solr-6.x-Linux/solr/build/solr-core/test/J1/temp/solr.handler.TestReqParamsAPI_2131C5AF6F60B95F-001/tempDir-001/control/data, hostContext=/, hostPort=43437, coreRootDirectory=/home/jenkins/workspace/Lucene-Solr-6.x-Linux/solr/build/solr-core/test/J1/temp/solr.handler.TestReqParamsAPI_2131C5AF6F60B95F-001/control-001/cores}
   [junit4]   2> 1713325 INFO  (TEST-TestReqParamsAPI.test-seed#[2131C5AF6F60B95F]) [    ] o.a.s.s.SolrDispatchFilter SolrDispatchFilter.init(): jdk.internal.loader.ClassLoaders$AppClassLoader@864e92
   [junit4]   2> 1713325 INFO  (TEST-TestReqParamsAPI.test-seed#[2131C5AF6F60B95F]) [    ] o.a.s.c.SolrResourceLoader new SolrResourceLoader for directory: '/home/jenkins/workspace/Lucene-Solr-6.x-Linux/solr/build/solr-core/test/J1/temp/solr.handler.TestReqParamsAPI_2131C5AF6F60B95F-001/control-001'
   [junit4]   2> 1713325 INFO  (TEST-TestReqParamsAPI.test-seed#[2131C5AF6F60B95F]) [    ] o.a.s.c.SolrResourceLoader JNDI not configured for solr (NoInitialContextEx)
   [junit4]   2> 1713325 INFO  (TEST-TestReqParamsAPI.test-seed#[2131C5AF6F60B95F]) [    ] o.a.s.c.SolrResourceLoader solr home defaulted to 'solr/' (could not find system property or JNDI)
   [junit4]   2> 1713326 INFO  (TEST-TestReqParamsAPI.test-seed#[2131C5AF6F60B95F]) [    ] o.a.s.c.c.SolrZkClient Using default ZkCredentialsProvider
   [junit4]   2> 1713326 INFO  (TEST-TestReqParamsAPI.test-seed#[2131C5AF6F60B95F]) [    ] o.a.s.c.c.ConnectionManager Waiting for client to connect to ZooKeeper
   [junit4]   2> 1713327 INFO  (zkCallback-1461-thread-1) [    ] o.a.s.c.c.ConnectionManager Watcher org.apache.solr.common.cloud.ConnectionManager@134e1a3 name:ZooKeeperConnection Watcher:127.0.0.1:46017/solr got event WatchedEvent state:SyncConnected type:None path:null path:null type:None
   [junit4]   2> 1713327 INFO  (TEST-TestReqParamsAPI.test-seed#[2131C5AF6F60B95F]) [    ] o.a.s.c.c.ConnectionManager Client is connected to ZooKeeper
   [junit4]   2> 1713327 INFO  (TEST-TestReqParamsAPI.test-seed#[2131C5AF6F60B95F]) [    ] o.a.s.c.c.SolrZkClient Using default ZkACLProvider
   [junit4]   2> 1713328 INFO  (TEST-TestReqParamsAPI.test-seed#[2131C5AF6F60B95F]) [    ] o.a.s.s.SolrDispatchFilter Loading solr.xml from SolrHome (not found in ZooKeeper)
   [junit4]   2> 1713328 INFO  (TEST-TestReqParamsAPI.test-seed#[2131C5AF6F60B95F]) [    ] o.a.s.c.SolrXmlConfig Loading container configuration from /home/jenkins/workspace/Lucene-Solr-6.x-Linux/solr/build/solr-core/test/J1/temp/solr.handler.TestReqParamsAPI_2131C5AF6F60B95F-001/control-001/solr.xml
   [junit4]   2> 1713330 INFO  (TEST-TestReqParamsAPI.test-seed#[2131C5AF6F60B95F]) [    ] o.a.s.c.CorePropertiesLocator Config-defined core root directory: /home/jenkins/workspace/Lucene-Solr-6.x-Linux/solr/build/solr-core/test/J1/temp/solr.handler.TestReqParamsAPI_2131C5AF6F60B95F-001/control-001/cores
   [junit4]   2> 1713331 INFO  (TEST-TestReqParamsAPI.test-seed#[2131C5AF6F60B95F]) [    ] o.a.s.c.CoreContainer New CoreContainer 20416765
   [junit4]   2> 1713331 INFO  (TEST-TestReqParamsAPI.test-seed#[2131C5AF6F60B95F]) [    ] o.a.s.c.CoreContainer Loading cores into CoreContainer [instanceDir=/home/jenkins/workspace/Lucene-Solr-6.x-Linux/solr/build/solr-core/test/J1/temp/solr.handler.TestReqParamsAPI_2131C5AF6F60B95F-001/control-001]
   [junit4]   2> 1713331 WARN  (TEST-TestReqParamsAPI.test-seed#[2131C5AF6F60B95F]) [    ] o.a.s.c.CoreContainer Couldn't add files from /home/jenkins/workspace/Lucene-Solr-6.x-Linux/solr/build/solr-core/test/J1/temp/solr.handler.TestReqParamsAPI_2131C5AF6F60B95F-001/control-001/lib to classpath: /home/jenkins/workspace/Lucene-Solr-6.x-Linux/solr/build/solr-core/test/J1/temp/solr.handler.TestReqParamsAPI_2131C5AF6F60B95F-001/control-001/lib
   [junit4]   2> 1713331 INFO  (TEST-TestReqParamsAPI.test-seed#[2131C5AF6F60B95F]) [    ] o.a.s.h.c.HttpShardHandlerFactory created with socketTimeout : 90000,urlScheme : ,connTimeout : 15000,maxConnectionsPerHost : 20,maxConnections : 10000,corePoolSize : 0,maximumPoolSize : 2147483647,maxThreadIdleTime : 5,sizeOfQueue : -1,fairnessPolicy : false,useRetries : false,
   [junit4]   2> 1713332 INFO  (TEST-TestReqParamsAPI.test-seed#[2131C5AF6F60B95F]) [    ] o.a.s.u.UpdateShardHandler Creating UpdateShardHandler HTTP client with params: socketTimeout=340000&connTimeout=45000&retry=true
   [junit4]   2> 1713332 INFO  (TEST-TestReqParamsAPI.test-seed#[2131C5AF6F60B95F]) [    ] o.a.s.l.LogWatcher SLF4J impl is org.slf4j.impl.Log4jLoggerFactory
   [junit4]   2> 1713332 INFO  (TEST-TestReqParamsAPI.test-seed#[2131C5AF6F60B95F]) [    ] o.a.s.l.LogWatcher Registering Log Listener [Log4j (org.slf4j.impl.Log4jLoggerFactory)]
   [junit4]   2> 1713332 INFO  (TEST-TestReqParamsAPI.test-seed#[2131C5AF6F60B95F]) [    ] o.a.s.c.ZkContainer Zookeeper client=127.0.0.1:46017/solr
   [junit4]   2> 1713332 INFO  (TEST-TestReqParamsAPI.test-seed#[2131C5AF6F60B95F]) [    ] o.a.s.c.ZkController zkHost includes chroot
   [junit4]   2> 1713332 INFO  (TEST-TestReqParamsAPI.test-seed#[2131C5AF6F60B95F]) [    ] o.a.s.c.c.SolrZkClient Using default ZkCredentialsProvider
   [junit4]   2> 1713333 INFO  (TEST-TestReqParamsAPI.test-seed#[2131C5AF6F60B95F]) [    ] o.a.s.c.c.ConnectionManager Waiting for client to connect to ZooKeeper
   [junit4]   2> 1713333 INFO  (zkCallback-1464-thread-1) [    ] o.a.s.c.c.ConnectionManager Watcher org.apache.solr.common.cloud.ConnectionManager@19e28f0 name:ZooKeeperConnection Watcher:127.0.0.1:46017 got event WatchedEvent state:SyncConnected type:None path:null path:null type:None
   [junit4]   2> 1713334 INFO  (TEST-TestReqParamsAPI.test-seed#[2131C5AF6F60B95F]) [    ] o.a.s.c.c.ConnectionManager Client is connected to ZooKeeper
   [junit4]   2> 1713334 INFO  (TEST-TestReqParamsAPI.test-seed#[2131C5AF6F60B95F]) [    ] o.a.s.c.c.SolrZkClient Using default ZkACLProvider
   [junit4]   2> 1713335 INFO  (TEST-TestReqParamsAPI.test-seed#[2131C5AF6F60B95F]) [    ] o.a.s.c.c.ConnectionManager Waiting for client to connect to ZooKeeper
   [junit4]   2> 1713336 INFO  (zkCallback-1465-thread-1) [    ] o.a.s.c.c.ConnectionManager Watcher org.apache.solr.common.cloud.ConnectionManager@10d356f name:ZooKeeperConnection Watcher:127.0.0.1:46017/solr got event WatchedEvent state:SyncConnected type:None path:null path:null type:None
   [junit4]   2> 1713336 INFO  (TEST-TestReqParamsAPI.test-seed#[2131C5AF6F60B95F]) [    ] o.a.s.c.c.ConnectionManager Client is connected to ZooKeeper
   [junit4]   2> 1713336 INFO  (TEST-TestReqParamsAPI.test-seed#[2131C5AF6F60B95F]) [    ] o.a.s.c.c.SolrZkClient makePath: /overseer/queue
   [junit4]   2> 1713337 INFO  (TEST-TestReqParamsAPI.test-seed#[2131C5AF6F60B95F]) [    ] o.a.s.c.c.SolrZkClient makePath: /overseer/collection-queue-work
   [junit4]   2> 1713337 INFO  (TEST-TestReqParamsAPI.test-seed#[2131C5AF6F60B95F]) [    ] o.a.s.c.c.SolrZkClient makePath: /overseer/collection-map-running
   [junit4]   2> 1713338 INFO  (TEST-TestReqParamsAPI.test-seed#[2131C5AF6F60B95F]) [    ] o.a.s.c.c.SolrZkClient makePath: /overseer/collection-map-completed
   [junit4]   2> 1713339 INFO  (TEST-TestReqParamsAPI.test-seed#[2131C5AF6F60B95F]) [    ] o.a.s.c.c.SolrZkClient makePath: /overseer/collection-map-failure
   [junit4]   2> 1713339 INFO  (TEST-TestReqParamsAPI.test-seed#[2131C5AF6F60B95F]) [    ] o.a.s.c.c.SolrZkClient makePath: /live_nodes
   [junit4]   2> 1713339 INFO  (TEST-TestReqParamsAPI.test-seed#[2131C5AF6F60B95F]) [    ] o.a.s.c.c.SolrZkClient makePath: /aliases.json
   [junit4]   2> 1713340 INFO  (TEST-TestReqParamsAPI.test-seed#[2131C5AF6F60B95F]) [    ] o.a.s.c.c.SolrZkClient makePath: /clusterstate.json
   [junit4]   2> 1713340 INFO  (TEST-TestReqParamsAPI.test-seed#[2131C5AF6F60B95F]) [    ] o.a.s.c.c.SolrZkClient makePath: /security.json
   [junit4]   2> 1713340 INFO  (TEST-TestReqParamsAPI.test-seed#[2131C5AF6F60B95F]) [    ] o.a.s.c.c.ZkStateReader Updating cluster state from ZooKeeper... 
   [junit4]   2> 1713341 INFO  (TEST-TestReqParamsAPI.test-seed#[2131C5AF6F60B95F]) [    ] o.a.s.c.c.ZkStateReader Updated live nodes from ZooKeeper... (0) -> (0)
   [junit4]   2> 1713341 INFO  (TEST-TestReqParamsAPI.test-seed#[2131C5AF6F60B95F]) [    ] o.a.s.c.c.SolrZkClient makePath: /overseer_elect
   [junit4]   2> 1713341 INFO  (TEST-TestReqParamsAPI.test-seed#[2131C5AF6F60B95F]) [    ] o.a.s.c.c.SolrZkClient makePath: /overseer_elect/election
   [junit4]   2> 1713342 INFO  (TEST-TestReqParamsAPI.test-seed#[2131C5AF6F60B95F]) [    ] o.a.s.c.Overseer Overseer (id=null) closing
   [junit4]   2> 1713342 INFO  (TEST-TestReqParamsAPI.test-seed#[2131C5AF6F60B95F]) [    ] o.a.s.c.LeaderElector Joined leadership election with path: /overseer_elect/election/95610890626662404-127.0.0.1:43437_-n_0000000000
   [junit4]   2> 1713342 INFO  (TEST-TestReqParamsAPI.test-seed#[2131C5AF6F60B95F]) [    ] o.a.s.c.OverseerElectionContext I am going to be the leader 127.0.0.1:43437_
   [junit4]   2> 1713342 INFO  (TEST-TestReqParamsAPI.test-seed#[2131C5AF6F60B95F]) [    ] o.a.s.c.c.SolrZkClient makePath: /overseer_elect/leader
   [junit4]   2> 1713343 INFO  (TEST-TestReqParamsAPI.test-seed#[2131C5AF6F60B95F]) [    ] o.a.s.c.Overseer Overseer (id=95610890626662404-127.0.0.1:43437_-n_0000000000) starting
   [junit4]   2> 1713343 INFO  (TEST-TestReqParamsAPI.test-seed#[2131C5AF6F60B95F]) [    ] o.a.s.c.c.SolrZkClient makePath: /overseer/queue-work
   [junit4]   2> 1713344 INFO  (TEST-TestReqParamsAPI.test-seed#[2131C5AF6F60B95F]) [    ] o.a.s.c.OverseerAutoReplicaFailoverThread Starting OverseerAutoReplicaFailoverThread autoReplicaFailoverWorkLoopDelay=10000 autoReplicaFailoverWaitAfterExpiration=30000 autoReplicaFailoverBadNodeExpiration=60000
   [junit4]   2> 1713345 INFO  (OverseerCollectionConfigSetProcessor-95610890626662404-127.0.0.1:43437_-n_0000000000) [    ] o.a.s.c.OverseerTaskProcessor Process current queue of overseer operations
   [junit4]   2> 1713345 INFO  (OverseerStateUpdate-95610890626662404-127.0.0.1:43437_-n_0000000000) [    ] o.a.s.c.Overseer Starting to work on the main queue
   [junit4]   2> 1713345 INFO  (TEST-TestReqParamsAPI.test-seed#[2131C5AF6F60B95F]) [    ] o.a.s.c.ZkController Register node as live in ZooKeeper:/live_nodes/127.0.0.1:43437_
   [junit4]   2> 1713345 INFO  (TEST-TestReqParamsAPI.test-seed#[2131C5AF6F60B95F]) [    ] o.a.s.c.c.SolrZkClient makePath: /live_nodes/127.0.0.1:43437_
   [junit4]   2> 1713345 INFO  (OverseerStateUpdate-95610890626662404-127.0.0.1:43437_-n_0000000000) [    ] o.a.s.c.c.ZkStateReader Updated live nodes from ZooKeeper... (0) -> (0)
   [junit4]   2> 1713346 INFO  (zkCallback-1465-thread-1) [    ] o.a.s.c.c.ZkStateReader A live node change: [WatchedEvent state:SyncConnected type:NodeChildrenChanged path:/live_nodes], has occurred - updating... (live nodes size: [0])
   [junit4]   2> 1713346 INFO  (zkCallback-1465-thread-1) [    ] o.a.s.c.c.ZkStateReader Updated live nodes from ZooKeeper... (0) -> (1)
   [junit4]   2> 1713369 INFO  (TEST-TestReqParamsAPI.test-seed#[2131C5AF6F60B95F]) [    ] o.a.s.c.CoreContainer Security conf doesn't exist. Skipping setup for authorization module.
   [junit4]   2> 1713369 INFO  (TEST-TestReqParamsAPI.test-seed#[2131C5AF6F60B95F]) [    ] o.a.s.c.CoreContainer No authentication plugin used.
   [junit4]   2> 1713369 INFO  (TEST-TestReqParamsAPI.test-seed#[2131C5AF6F60B95F]) [    ] o.a.s.c.CorePropertiesLocator Looking for core definitions underneath /home/jenkins/workspace/Lucene-Solr-6.x-Linux/solr/build/solr-core/test/J1/temp/solr.handler.TestReqParamsAPI_2131C5AF6F60B95F-001/control-001/cores
   [junit4]   2> 1713370 INFO  (TEST-TestReqParamsAPI.test-seed#[2131C5AF6F60B95F]) [    ] o.a.s.c.CoreDescriptor Created CoreDescriptor: {name=collection1, config=solrconfig.xml, transient=false, schema=schema.xml, loadOnStartup=true, configSetProperties=configsetprops.json, collection=control_collection, coreNodeName=, dataDir=data/, shard=}
   [junit4]   2> 1713370 INFO  (TEST-TestReqParamsAPI.test-seed#[2131C5AF6F60B95F]) [    ] o.a.s.c.CorePropertiesLocator Found core collection1 in /home/jenkins/workspace/Lucene-Solr-6.x-Linux/solr/build/solr-core/test/J1/temp/solr.handler.TestReqParamsAPI_2131C5AF6F60B95F-001/control-001/cores/collection1
   [junit4]   2> 1713370 INFO  (TEST-TestReqParamsAPI.test-seed#[2131C5AF6F60B95F]) [    ] o.a.s.c.CorePropertiesLocator Found 1 core definitions
   [junit4]   2> 1713370 INFO  (TEST-TestReqParamsAPI.test-seed#[2131C5AF6F60B95F]) [    ] o.a.s.s.SolrDispatchFilter user.dir=/home/jenkins/workspace/Lucene-Solr-6.x-Linux/solr/build/solr-core/test/J1
   [junit4]   2> 1713370 INFO  (TEST-TestReqParamsAPI.test-seed#[2131C5AF6F60B95F]) [    ] o.a.s.s.SolrDispatchFilter SolrDispatchFilter.init() done
   [junit4]   2> 1713370 INFO  (coreLoadExecutor-5291-thread-1) [    ] o.a.s.c.ZkController publishing state=down
   [junit4]   2> 1713371 INFO  (coreLoadExecutor-5291-thread-1) [    ] o.a.s.c.ZkController numShards not found on descriptor - reading it from system property
   [junit4]   2> 1713371 INFO  (OverseerStateUpdate-95610890626662404-127.0.0.1:43437_-n_0000000000) [    ] o.a.s.c.Overseer processMessage: queueSize: 1, message = {
   [junit4]   2>   "core":"collection1",
   [junit4]   2>   "roles":null,
   [junit4]   2>   "base_url":"http://127.0.0.1:43437",
   [junit4]   2>   "node_name":"127.0.0.1:43437_",
   [junit4]   2>   "numShards":"1",
   [junit4]   2>   "state":"down",
   [junit4]   2>   "shard":null,
   [junit4]   2>   "collection":"control_collection",
   [junit4]   2>   "operation":"state"} current state version: 0
   [junit4]   2> 1713371 INFO  (coreLoadExecutor-5291-thread-1) [    ] o.a.s.c.ZkController look for our core node name
   [junit4]   2> 1713371 INFO  (OverseerStateUpdate-95610890626662404-127.0.0.1:43437_-n_0000000000) [    ] o.a.s.c.o.ReplicaMutator Update state numShards=1 message={
   [junit4]   2>   "core":"collection1",
   [junit4]   2>   "roles":null,
   [junit4]   2>   "base_url":"http://127.0.0.1:43437",
   [junit4]   2>   "node_name":"127.0.0.1:43437_",
   [junit4]   2>   "numShards":"1",
   [junit4]   2>   "state":"down",
   [junit4]   2>   "shard":null,
   [junit4]   2>   "collection":"control_collection",
   [junit4]   2>   "operation":"state"}
   [junit4]   2> 1713372 INFO  (OverseerStateUpdate-95610890626662404-127.0.0.1:43437_-n_0000000000) [    ] o.a.s.c.o.ClusterStateMutator building a new cName: control_collection
   [junit4]   2> 1713372 INFO  (OverseerStateUpdate-95610890626662404-127.0.0.1:43437_-n_0000000000) [    ] o.a.s.c.o.ReplicaMutator Assigning new node to shard shard=shard1
   [junit4]   2> 1713372 INFO  (zkCallback-1465-thread-1) [    ] o.a.s.c.c.ZkStateReader A cluster state change: [WatchedEvent state:SyncConnected type:NodeDataChanged path:/clusterstate.json], has occurred - updating... (live nodes size: [1])
   [junit4]   2> 1714372 INFO  (coreLoadExecutor-5291-thread-1) [    ] o.a.s.c.ZkController waiting to find shard id in clusterstate for collection1
   [junit4]   2> 1714372 INFO  (coreLoadExecutor-5291-thread-1) [    ] o.a.s.c.ZkController Check for collection zkNode:control_collection
   [junit4]   2> 1714372 INFO  (coreLoadExecutor-5291-thread-1) [    ] o.a.s.c.ZkController Collection zkNode exists
   [junit4]   2> 1714372 INFO  (coreLoadExecutor-5291-thread-1) [    ] o.a.s.c.c.ZkStateReader Load collection config from: [/collections/control_collection]
   [junit4]   2> 1714372 INFO  (coreLoadExecutor-5291-thread-1) [    ] o.a.s.c.c.ZkStateReader path=[/collections/control_collection] [configName]=[conf1] specified config exists in ZooKeeper
   [junit4]   2> 1714372 INFO  (coreLoadExecutor-5291-thread-1) [    ] o.a.s.c.SolrResourceLoader new SolrResourceLoader for directory: '/home/jenkins/workspace/Lucene-Solr-6.x-Linux/solr/build/solr-core/test/J1/temp/solr.handler.TestReqParamsAPI_2131C5AF6F60B95F-001/control-001/cores/collection1'
   [junit4]   2> 1714372 INFO  (coreLoadExecutor-5291-thread-1) [    ] o.a.s.c.SolrResourceLoader JNDI not configured for solr (NoInitialContextEx)
   [junit4]   2> 1714372 INFO  (coreLoadExecutor-5291-thread-1) [    ] o.a.s.c.SolrResourceLoader solr home defaulted to 'solr/' (could not find system property or JNDI)
   [junit4]   2> 1714373 INFO  (coreLoadExecutor-5291-thread-1) [    ] o.a.s.c.Config loaded config solrconfig.xml with version 0 
   [junit4]   2> 1714376 INFO  (coreLoadExecutor-5291-thread-1) [    ] o.a.s.c.SolrConfig current version of requestparams : -1
   [junit4]   2> 1714378 INFO  (coreLoadExecutor-5291-thread-1) [    ] o.a.s.c.SolrConfig Using Lucene MatchVersion: 6.1.0
   [junit4]   2> 1714383 INFO  (coreLoadExecutor-5291-thread-1) [    ] o.a.s.c.SolrConfig Loaded SolrConfig: solrconfig.xml
   [junit4]   2> 1714387 INFO  (coreLoadExecutor-5291-thread-1) [    ] o.a.s.s.IndexSchema [collection1] Schema name=test
   [junit4]   2> 1714437 INFO  (coreLoadExecutor-5291-thread-1) [    ] o.a.s.s.OpenExchangeRatesOrgProvider Initialized with rates=open-exchange-rates.json, refreshInterval=1440.
   [junit4]   2> 1714441 INFO  (coreLoadExecutor-5291-thread-1) [    ] o.a.s.s.IndexSchema default search field in schema is text
   [junit4]   2> 1714441 INFO  (coreLoadExecutor-5291-thread-1) [    ] o.a.s.s.IndexSchema unique key field: id
   [junit4]   2> 1714445 INFO  (coreLoadExecutor-5291-thread-1) [    ] o.a.s.s.FileExchangeRateProvider Reloading exchange rates from file currency.xml
   [junit4]   2> 1714446 INFO  (coreLoadExecutor-5291-thread-1) [    ] o.a.s.s.FileExchangeRateProvider Reloading exchange rates from file currency.xml
   [junit4]   2> 1714446 INFO  (coreLoadExecutor-5291-thread-1) [    ] o.a.s.s.OpenExchangeRatesOrgProvider Reloading exchange rates from open-exchange-rates.json
   [junit4]   2> 1714447 INFO  (coreLoadExecutor-5291-thread-1) [    ] o.a.s.s.OpenExchangeRatesOrgProvider Reloading exchange rates from open-exchange-rates.json
   [junit4]   2> 1714447 INFO  (coreLoadExecutor-5291-thread-1) [    ] o.a.s.c.ConfigSetProperties Did not find ConfigSet properties, assuming default properties: Can't find resource 'configsetprops.json' in classpath or '/configs/conf1', cwd=/home/jenkins/workspace/Lucene-Solr-6.x-Linux/solr/build/solr-core/test/J1
   [junit4]   2> 1714447 INFO  (coreLoadExecutor-5291-thread-1) [    ] o.a.s.c.CoreContainer Creating SolrCore 'collection1' using configuration from collection control_collection
   [junit4]   2> 1714448 INFO  (coreLoadExecutor-5291-thread-1) [    ] o.a.s.c.SolrCore org.apache.solr.core.MockDirectoryFactory
   [junit4]   2> 1714448 INFO  (coreLoadExecutor-5291-thread-1) [    ] o.a.s.c.SolrCore [[collection1] ] Opening new SolrCore at [/home/jenkins/workspace/Lucene-Solr-6.x-Linux/solr/build/solr-core/test/J1/temp/solr.handler.TestReqParamsAPI_2131C5AF6F60B95F-001/control-001/cores/collection1], dataDir=[/home/jenkins/workspace/Lucene-Solr-6.x-Linux/solr/build/solr-core/test/J1/temp/solr.handler.TestReqParamsAPI_2131C5AF6F60B95F-001/control-001/cores/collection1/data/]
   [junit4]   2> 1714448 INFO  (coreLoadExecutor-5291-thread-1) [    ] o.a.s.c.JmxMonitoredMap JMX monitoring is enabled. Adding Solr mbeans to JMX Server: com.sun.jmx.mbeanserver.JmxMBeanServer@1df94bf
   [junit4]   2> 1714448 INFO  (coreLoadExecutor-5291-thread-1) [    ] o.a.s.c.CachingDirectoryFactory return new directory for /home/jenkins/workspace/Lucene-Solr-6.x-Linux/solr/build/solr-core/test/J1/temp/solr.handler.TestReqParamsAPI_2131C5AF6F60B95F-001/control-001/cores/collection1/data
   [junit4]   2> 1714448 INFO  (coreLoadExecutor-5291-thread-1) [    ] o.a.s.c.SolrCore New index directory detected: old=null new=/home/jenkins/workspace/Lucene-Solr-6.x-Linux/solr/build/solr-core/test/J1/temp/solr.handler.TestReqParamsAPI_2131C5AF6F60B95F-001/control-001/cores/collection1/data/index/
   [junit4]   2> 1714448 WARN  (coreLoadExecutor-5291-thread-1) [    ] o.a.s.c.SolrCore [collection1] Solr index directory '/home/jenkins/workspace/Lucene-Solr-6.x-Linux/solr/build/solr-core/test/J1/temp/solr.handler.TestReqParamsAPI_2131C5AF6F60B95F-001/control-001/cores/collection1/data/index' doesn't exist. Creating new index...
   [junit4]   2> 1714449 INFO  (coreLoadExecutor-5291-thread-1) [    ] o.a.s.c.CachingDirectoryFactory return new directory for /home/jenkins/workspace/Lucene-Solr-6.x-Linux/solr/build/solr-core/test/J1/temp/solr.handler.TestReqParamsAPI_2131C5AF6F60B95F-001/control-001/cores/collection1/data/index
   [junit4]   2> 1714449 INFO  (coreLoadExecutor-5291-thread-1) [    ] o.a.s.u.RandomMergePolicy RandomMergePolicy wrapping class org.apache.lucene.index.TieredMergePolicy: [TieredMergePolicy: maxMergeAtOnce=28, maxMergeAtOnceExplicit=49, maxMergedSegmentMB=33.0615234375, floorSegmentMB=1.072265625, forceMergeDeletesPctAllowed=5.252844919906297, segmentsPerTier=19.0, maxCFSSegmentSizeMB=8.796093022207999E12, noCFSRatio=0.0
   [junit4]   2> 1714449 INFO  (coreLoadExecutor-5291-thread-1) [    ] o.a.s.c.SolrDeletionPolicy SolrDeletionPolicy.onCommit: commits: num=1
   [junit4]   2> 	commit{dir=MockDirectoryWrapper(RAMDirectory@f91e95 lockFactory=org.apache.lucene.store.SingleInstanceLockFactory@1c3d0bc),segFN=segments_1,generation=1}
   [junit4]   2> 1714449 INFO  (coreLoadExecutor-5291-thread-1) [    ] o.a.s.c.SolrDeletionPolicy newest commit generation = 1
   [junit4]   2> 1714449 INFO  (OldIndexDirectoryCleanupThreadForCore-collection1) [    ] o.a.s.c.SolrCore Looking for old index directories to cleanup for core collection1 in /home/jenkins/workspace/Lucene-Solr-6.x-Linux/solr/build/solr-core/test/J1/temp/solr.handler.TestReqParamsAPI_2131C5AF6F60B95F-001/control-001/cores/collection1/data/
   [junit4]   2> 1714449 WARN  (OldIndexDirectoryCleanupThreadForCore-collection1) [    ] o.a.s.c.DirectoryFactory /home/jenkins/workspace/Lucene-Solr-6.x-Linux/solr/build/solr-core/test/J1/temp/solr.handler.TestReqParamsAPI_2131C5AF6F60B95F-001/control-001/cores/collection1/data/ does not point to a valid data directory; skipping clean-up of old index directories.
   [junit4]   2> 1714451 INFO  (coreLoadExecutor-5291-thread-1) [    ] o.a.s.u.p.UpdateRequestProcessorChain creating updateRequestProcessorChain "nodistrib"
   [junit4]   2> 1714452 INFO  (coreLoadExecutor-5291-thread-1) [    ] o.a.s.u.p.UpdateRequestProcessorChain creating updateRequestProcessorChain "dedupe"
   [junit4]   2> 1714452 INFO  (coreLoadExecutor-5291-thread-1) [    ] o.a.s.u.p.UpdateRequestProcessorChain inserting DistributedUpdateProcessorFactory into updateRequestProcessorChain "dedupe"
   [junit4]   2> 1714452 INFO  (coreLoadExecutor-5291-thread-1) [    ] o.a.s.u.p.UpdateRequestProcessorChain creating updateRequestProcessorChain "stored_sig"
   [junit4]   2> 1714452 INFO  (coreLoadExecutor-5291-thread-1) [    ] o.a.s.u.p.UpdateRequestProcessorChain inserting DistributedUpdateProcessorFactory into updateRequestProcessorChain "stored_sig"
   [junit4]   2> 1714452 INFO  (coreLoadExecutor-5291-thread-1) [    ] o.a.s.u.p.UpdateRequestProcessorChain creating updateRequestProcessorChain "distrib-dup-test-chain-explicit"
   [junit4]   2> 1714452 INFO  (coreLoadExecutor-5291-thread-1) [    ] o.a.s.u.p.UpdateRequestProcessorChain creating updateRequestProcessorChain "distrib-dup-test-chain-implicit"
   [junit4]   2> 1714452 INFO  (coreLoadExecutor-5291-thread-1) [    ] o.a.s.u.p.UpdateRequestProcessorChain inserting DistributedUpdateProcessorFactory into updateRequestProcessorChain "distrib-dup-test-chain-implicit"
   [junit4]   2> 1714452 INFO  (coreLoadExecutor-5291-thread-1) [    ] o.a.s.c.SolrCore no updateRequestProcessorChain defined as default, creating implicit default
   [junit4]   2> 1714452 WARN  (coreLoadExecutor-5291-thread-1) [    ] o.a.s.c.RequestHandlers INVALID paramSet a in requestHandler {type = requestHandler,name = /dump,class = DumpRequestHandler,args = {defaults={a=A,b=B}}}
   [junit4]   2> 1714453 INFO  (coreLoadExecutor-5291-thread-1) [    ] o.a.s.h.l.XMLLoader xsltCacheLifetimeSeconds=60
   [junit4]   2> 1714454 INFO  (coreLoadExecutor-5291-thread-1) [    ] o.a.s.h.l.XMLLoader xsltCacheLifetimeSeconds=60
   [junit4]   2> 1714455 INFO  (coreLoadExecutor-5291-thread-1) [    ] o.a.s.h.l.XMLLoader xsltCacheLifetimeSeconds=60
   [junit4]   2> 1714455 INFO  (coreLoadExecutor-5291-thread-1) [    ] o.a.s.h.l.XMLLoader xsltCacheLifetimeSeconds=60
   [junit4]   2> 1714457 INFO  (coreLoadExecutor-5291-thread-1) [    ] o.a.s.c.RequestHandlers Registered paths: /admin/mbeans,standard,/dump,/update/csv,/sql,/update/json/docs,/admin/luke,/export,/admin/segments,/get,/admin/system,/replication,/admin/properties,/config,/stream,/schema,/admin/plugins,/admin/logging,/update/json,/admin/ping,/admin/threads,/update,/admin/file
   [junit4]   2> 1714458 INFO  (coreLoadExecutor-5291-thread-1) [    ] o.a.s.c.SolrCore Using default statsCache cache: org.apache.solr.search.stats.LocalStatsCache
   [junit4]   2> 1714458 INFO  (coreLoadExecutor-5291-thread-1) [    ] o.a.s.u.UpdateHandler Using UpdateLog implementation: org.apache.solr.update.UpdateLog
   [junit4]   2> 1714458 INFO  (coreLoadExecutor-5291-thread-1) [    ] o.a.s.u.UpdateLog Initializing UpdateLog: dataDir= defaultSyncLevel=FLUSH numRecordsToKeep=100 maxNumLogsToKeep=10 numVersionBuckets=65536
   [junit4]   2> 1714458 INFO  (coreLoadExecutor-5291-thread-1) [    ] o.a.s.u.CommitTracker Hard AutoCommit: disabled
   [junit4]   2> 1714458 INFO  (coreLoadExecutor-5291-thread-1) [    ] o.a.s.u.CommitTracker Soft AutoCommit: disabled
   [junit4]   2> 1714459 INFO  (coreLoadExecutor-5291-thread-1) [    ] o.a.s.u.RandomMergePolicy RandomMergePolicy wrapping class org.apache.lucene.index.TieredMergePolicy: [TieredMergePolicy: maxMergeAtOnce=46, maxMergeAtOnceExplicit=49, maxMergedSegmentMB=85.9140625, floorSegmentMB=1.908203125, forceMergeDeletesPctAllowed=27.601219475153954, segmentsPerTier=23.0, maxCFSSegmentSizeMB=8.796093022207999E12, noCFSRatio=1.0
   [junit4]   2> 1714459 INFO  (coreLoadExecutor-5291-thread-1) [    ] o.a.s.c.SolrDeletionPolicy SolrDeletionPolicy.onInit: commits: num=1
   [junit4]   2> 	commit{dir=MockDirectoryWrapper(RAMDirectory@f91e95 lockFactory=org.apache.lucene.store.SingleInstanceLockFactory@1c3d0bc),segFN=segments_1,generation=1}
   [junit4]   2> 1714459 INFO  (coreLoadExecutor-5291-thread-1) [    ] o.a.s.c.SolrDeletionPolicy newest commit generation = 1
   [junit4]   2> 1714459 INFO  (coreLoadExecutor-5291-thread-1) [    ] o.a.s.s.SolrIndexSearcher Opening [Searcher@d21bf1[collection1] main]
   [junit4]   2> 1714459 INFO  (coreLoadExecutor-5291-thread-1) [    ] o.a.s.c.c.ZkStateReader Load collection config from: [/collections/control_collection]
   [junit4]   2> 1714459 INFO  (coreLoadExecutor-5291-thread-1) [    ] o.a.s.c.c.ZkStateReader path=[/collections/control_collection] [configName]=[conf1] specified config exists in ZooKeeper
   [junit4]   2> 1714459 INFO  (coreLoadExecutor-5291-thread-1) [    ] o.a.s.r.ManagedResourceStorage Setting up ZooKeeper-based storage for the RestManager with znodeBase: /configs/conf1
   [junit4]   2> 1714459 INFO  (coreLoadExecutor-5291-thread-1) [    ] o.a.s.r.ManagedResourceStorage Configured ZooKeeperStorageIO with znodeBase: /configs/conf1
   [junit4]   2> 1714459 INFO  (coreLoadExecutor-5291-thread-1) [    ] o.a.s.r.RestManager Initializing RestManager with initArgs: {}
   [junit4]   2> 1714459 INFO  (coreLoadExecutor-5291-thread-1) [    ] o.a.s.r.ManagedResourceStorage Reading _rest_managed.json using ZooKeeperStorageIO:path=/configs/conf1
   [junit4]   2> 1714460 INFO  (coreLoadExecutor-5291-thread-1) [    ] o.a.s.r.ManagedResourceStorage No data found for znode /configs/conf1/_rest_managed.json
   [junit4]   2> 1714460 INFO  (coreLoadExecutor-5291-thread-1) [    ] o.a.s.r.ManagedResourceStorage Loaded null at path _rest_managed.json using ZooKeeperStorageIO:path=/configs/conf1
   [junit4]   2> 1714460 INFO  (coreLoadExecutor-5291-thread-1) [    ] o.a.s.r.RestManager Initializing 0 registered ManagedResources
   [junit4]   2> 1714460 INFO  (coreLoadExecutor-5291-thread-1) [    ] o.a.s.h.ReplicationHandler Commits will be reserved for  10000
   [junit4]   2> 1714460 INFO  (searcherExecutor-5292-thread-1) [    ] o.a.s.c.SolrCore [collection1] Registered new searcher Searcher@d21bf1[collection1] main{ExitableDirectoryReader(UninvertingDirectoryReader())}
   [junit4]   2> 1714460 INFO  (coreLoadExecutor-5291-thread-1) [    ] o.a.s.u.UpdateLog Looking up max value of version field to seed version buckets
   [junit4]   2> 1714461 INFO  (coreLoadExecutor-5291-thread-1) [    ] o.a.s.u.VersionInfo Refreshing highest value of _version_ for 65536 version buckets from index
   [junit4]   2> 1714461 INFO  (coreLoadExecutor-5291-thread-1) [    ] o.a.s.u.VersionInfo No terms found for _version_, cannot seed version bucket highest value from index
   [junit4]   2> 1714461 INFO  (coreLoadExecutor-5291-thread-1) [    ] o.a.s.u.UpdateLog Could not find max version in index or recent updates, using new clock 1529774251403378688
   [junit4]   2> 1714462 INFO  (coreLoadExecutor-5291-thread-1) [    ] o.a.s.u.UpdateLog Took 1.0ms to seed version buckets with highest version 1529774251403378688
   [junit4]   2> 1714462 INFO  (coreLoadExecutor-5291-thread-1) [    ] o.a.s.c.ZkController watch zkdir /configs/conf1
   [junit4]   2> 1714463 INFO  (coreLoadExecutor-5291-thread-1) [    ] o.a.s.c.CoreContainer registering core: collection1
   [junit4]   2> 1714463 INFO  (coreZkRegister-5285-thread-1) [    ] o.a.s.c.ZkController Register replica - core:collection1 address:http://127.0.0.1:43437 collection:control_collection shard:shard1
   [junit4]   2> 1714463 INFO  (coreZkRegister-5285-thread-1) [    ] o.a.s.c.c.SolrZkClient makePath: /collections/control_collection/leader_elect/shard1/election
   [junit4]   2> 1714464 INFO  (coreZkRegister-5285-thread-1) [    ] o.a.s.c.LeaderElector Joined leadership election with path: /collections/control_collection/leader_elect/shard1/election/95610890626662404-core_node1-n_0000000000
   [junit4]   2> 1714464 INFO  (coreZkRegister-5285-thread-1) [    ] o.a.s.c.ShardLeaderElectionContext Running the leader process for shard=shard1 and weAreReplacement=false and leaderVoteWait=10000
   [junit4]   2> 1714465 INFO  (coreZkRegister-5285-thread-1) [    ] o.a.s.c.ShardLeaderElectionContext Enough replicas found to continue.
   [junit4]   2> 1714465 INFO  (coreZkRegister-5285-thread-1) [    ] o.a.s.c.ShardLeaderElectionContext I may be the new leader - try and sync
   [junit4]   2> 1714465 INFO  (coreZkRegister-5285-thread-1) [    ] o.a.s.c.SyncStrategy Sync replicas to http://127.0.0.1:43437/collection1/
   [junit4]   2> 1714465 INFO  (OverseerStateUpdate-95610890626662404-127.0.0.1:43437_-n_0000000000) [    ] o.a.s.c.Overseer processMessage: queueSize: 1, message = {
   [junit4]   2>   "operation":"leader",
   [junit4]   2>   "shard":"shard1",
   [junit4]   2>   "collection":"control_collection"} current state version: 1
   [junit4]   2> 1714465 INFO  (coreZkRegister-5285-thread-1) [    ] o.a.s.c.SyncStrategy Sync Success - now sync replicas to me
   [junit4]   2> 1714465 INFO  (coreZkRegister-5285-thread-1) [    ] o.a.s.c.SyncStrategy http://127.0.0.1:43437/collection1/ has no replicas
   [junit4]   2> 1714465 INFO  (coreZkRegister-5285-thread-1) [    ] o.a.s.c.c.SolrZkClient makePath: /collections/control_collection/leaders/shard1
   [junit4]   2> 1714466 INFO  (coreZkRegister-5285-thread-1) [    ] o.a.s.c.ShardLeaderElectionContextBase Creating leader registration node /collections/control_collection/leaders/shard1/leader after winning as /collections/control_collection/leader_elect/shard1/election/95610890626662404-core_node1-n_0000000000
   [junit4]   2> 1714467 INFO  (coreZkRegister-5285-thread-1) [    ] o.a.s.c.ShardLeaderElectionContext I am the new leader: http://127.0.0.1:43437/collection1/ shard1
   [junit4]   2> 1714467 INFO  (OverseerStateUpdate-95610890626662404-127.0.0.1:43437_-n_0000000000) [    ] o.a.s.c.Overseer processMessage: queueSize: 1, message = {
   [junit4]   2>   "operation":"leader",
   [junit4]   2>   "shard":"shard1",
   [junit4]   2>   "collection":"control_collection",
   [junit4]   2>   "base_url":"http://127.0.0.1:43437",
   [junit4]   2>   "core":"collection1",
   [junit4]   2>   "state":"active"} current state version: 1
   [junit4]   2> 1714568 INFO  (zkCallback-1465-thread-1) [    ] o.a.s.c.c.ZkStateReader A cluster state change: [WatchedEvent state:SyncConnected type:NodeDataChanged path:/clusterstate.json], has occurred - updating... (live nodes size: [1])
   [junit4]   2> 1714617 INFO  (coreZkRegister-5285-thread-1) [    ] o.a.s.c.ZkController We are http://127.0.0.1:43437/collection1/ and leader is http://127.0.0.1:43437/collection1/
   [junit4]   2> 1714617 INFO  (coreZkRegister-5285-thread-1) [    ] o.a.s.c.ZkController No LogReplay needed for core=collection1 baseURL=http://127.0.0.1:43437
   [junit4]   2> 1714617 INFO  (coreZkRegister-5285-thread-1) [    ] o.a.s.c.ZkController I am the leader, no recovery necessary
   [junit4]   2> 1714617 INFO  (coreZkRegister-5285-thread-1) [    ] o.a.s.c.ZkController publishing state=active
   [junit4]   2> 1714617 INFO  (coreZkRegister-5285-thread-1) [    ] o.a.s.c.ZkController numShards not found on descriptor - reading it from system property
   [junit4]   2> 1714619 INFO  (OverseerStateUpdate-95610890626662404-127.0.0.1:43437_-n_0000000000) [    ] o.a.s.c.Overseer processMessage: queueSize: 1, message = {
   [junit4]   2>   "core":"collection1",
   [junit4]   2>   "core_node_name":"core_node1",
   [junit4]   2>   "roles":null,
   [junit4]   2>   "base_url":"http://127.0.0.1:43437",
   [junit4]   2>   "node_name":"127.0.0.1:43437_",
   [junit4]   2>   "numShards":"1",
   [junit4]   2>   "state":"active",
   [junit4]   2>   "shard":"shard1",
   [junit4]   2>   "collection":"control_collection",
   [junit4]   2>   "operation":"state"} current state version: 2
   [junit4]   2> 1714619 INFO  (OverseerStateUpdate-95610890626662404-127.0.0.1:43437_-n_0000000000) [    ] o.a.s.c.o.ReplicaMutator Update state numShards=1 message={
   [junit4]   2>   "core":"collection1",
   [junit4]   2>   "core_node_name":"core_node1",
   [junit4]   2>   "roles":null,
   [junit4]   2>   "base_url":"http://127.0.0.1:43437",
   [junit4]   2>   "node_name":"127.0.0.1:43437_",
   [junit4]   2>   "numShards":"1",
   [junit4]   2>   "state":"active",
   [junit4]   2>   "shard":"shard1",
   [junit4]   2>   "collection":"control_collection",
   [junit4]   2>   "operation":"state"}
   [junit4]   2> 1714720 INFO  (zkCallback-1465-thread-1) [    ] o.a.s.c.c.ZkStateReader A cluster state change: [WatchedEvent state:SyncConnected type:NodeDataChanged path:/clusterstate.json], has occurred - updating... (live nodes size: [1])
   [junit4]   2> 1714871 INFO  (TEST-TestReqParamsAPI.test-seed#[2131C5AF6F60B95F]) [    ] o.a.s.c.c.SolrZkClient Using default ZkCredentialsProvider
   [junit4]   2> 1714872 INFO  (TEST-TestReqParamsAPI.test-seed#[2131C5AF6F60B95F]) [    ] o.a.s.c.c.ConnectionManager Waiting for client to connect to ZooKeeper
   [junit4]   2> 1714872 INFO  (zkCallback-1467-thread-1) [    ] o.a.s.c.c.ConnectionManager Watcher org.apache.solr.common.cloud.ConnectionManager@18d2131 name:ZooKeeperConnection Watcher:127.0.0.1:46017/solr got event WatchedEvent state:SyncConnected type:None path:null path:null type:None
   [junit4]   2> 1714872 INFO  (TEST-TestReqParamsAPI.test-seed#[2131C5AF6F60B95F]) [    ] o.a.s.c.c.ConnectionManager Client is connected to ZooKeeper
   [junit4]   2> 1714873 INFO  (TEST-TestReqParamsAPI.test-seed#[2131C5AF6F60B95F]) [    ] o.a.s.c.c.SolrZkClient Using default ZkACLProvider
   [junit4]   2> 1714873 INFO  (TEST-TestReqParamsAPI.test-seed#[2131C5AF6F60B95F]) [    ] o.a.s.c.c.ZkStateReader Updating cluster state from ZooKeeper... 
   [junit4]   2> 1714873 INFO  (TEST-TestReqParamsAPI.test-seed#[2131C5AF6F60B95F]) [    ] o.a.s.c.c.ZkStateReader Updated live nodes from ZooKeeper... (0) -> (1)
   [junit4]   2> 1714873 INFO  (TEST-TestReqParamsAPI.test-seed#[2131C5AF6F60B95F]) [    ] o.a.s.c.ChaosMonkey monkey: init - expire sessions:false cause connection loss:false
   [junit4]   2> 1714873 INFO  (TEST-TestReqParamsAPI.test-seed#[2131C5AF6F60B95F]) [    ] o.a.s.c.AbstractFullDistribZkTestBase Creating collection1 with stateFormat=2
   [junit4]   2> 1714873 INFO  (TEST-TestReqParamsAPI.test-seed#[2131C5AF6F60B95F]) [    ] o.a.s.c.c.SolrZkClient Using default ZkCredentialsProvider
   [junit4]   2> 1714874 INFO  (TEST-TestReqParamsAPI.test-seed#[2131C5AF6F60B95F]) [    ] o.a.s.c.c.ConnectionManager Waiting for client to connect to ZooKeeper
   [junit4]   2> 1714874 INFO  (zkCallback-1468-thread-1) [    ] o.a.s.c.c.ConnectionManager Watcher org.apache.solr.common.cloud.ConnectionManager@9b6873 name:ZooKeeperConnection Watcher:127.0.0.1:46017/solr got event WatchedEvent state:SyncConnected type:None path:null path:null type:None
   [junit4]   2> 1714874 INFO  (TEST-TestReqParamsAPI.test-seed#[2131C5AF6F60B95F]) [    ] o.a.s.c.c.ConnectionManager Client is connected to ZooKeeper
   [junit4]   2> 1714875 INFO  (TEST-TestReqParamsAPI.test-seed#[2131C5AF6F60B95F]) [    ] o.a.s.c.c.SolrZkClient Using default ZkACLProvider
   [junit4]   2> 1714875 INFO  (OverseerStateUpdate-95610890626662404-127.0.0.1:43437_-n_0000000000) [    ] o.a.s.c.Overseer processMessage: queueSize: 1, message = {
   [junit4]   2>   "operation":"create",
   [junit4]   2>   "name":"collection1",
   [junit4]   2>   "numShards":"2",
   [junit4]   2>   "stateFormat":"2"} current state version: 3
   [junit4]   2> 1714876 INFO  (OverseerStateUpdate-95610890626662404-127.0.0.1:43437_-n_0000000000) [    ] o.a.s.c.o.ClusterStateMutator building a new cName: collection1
   [junit4]   2> 1714931 INFO  (TEST-TestReqParamsAPI.test-seed#[2131C5AF6F60B95F]) [    ] o.a.s.SolrTestCaseJ4 Writing core.properties file to /home/jenkins/workspace/Lucene-Solr-6.x-Linux/solr/build/solr-core/test/J1/temp/solr.handler.TestReqParamsAPI_2131C5AF6F60B95F-001/shard-1-001/cores/collection1
   [junit4]   2> 1714931 INFO  (TEST-TestReqParamsAPI.test-seed#[2131C5AF6F60B95F]) [    ] o.a.s.c.AbstractFullDistribZkTestBase create jetty 1 in directory /home/jenkins/workspace/Lucene-Solr-6.x-Linux/solr/build/solr-core/test/J1/temp/solr.handler.TestReqParamsAPI_2131C5AF6F60B95F-001/shard-1-001
   [junit4]   2> 1714932 INFO  (TEST-TestReqParamsAPI.test-seed#[2131C5AF6F60B95F]) [    ] o.e.j.s.Server jetty-9.3.8.v20160314
   [junit4]   2> 1714933 INFO  (TEST-TestReqParamsAPI.test-seed#[2131C5AF6F60B95F]) [    ] o.e.j.s.h.ContextHandler Started o.e.j.s.ServletContextHandler@1845cde{/,null,AVAILABLE}
   [junit4]   2> 1714933 INFO  (TEST-TestReqParamsAPI.test-seed#[2131C5AF6F60B95F]) [    ] o.e.j.s.ServerConnector Started ServerConnector@fdc25f{HTTP/1.1,[http/1.1]}{127.0.0.1:40968}
   [junit4]   2> 1714933 INFO  (TEST-TestReqParamsAPI.test-seed#[2131C5AF6F60B95F]) [    ] o.e.j.s.Server Started @1716785ms
   [junit4]   2> 1714933 INFO  (TEST-TestReqParamsAPI.test-seed#[2131C5AF6F60B95F]) [    ] o.a.s.c.s.e.JettySolrRunner Jetty properties: {solr.data.dir=/home/jenkins/workspace/Lucene-Solr-6.x-Linux/solr/build/solr-core/test/J1/temp/solr.handler.TestReqParamsAPI_2131C5AF6F60B95F-001/tempDir-001/jetty1, solrconfig=solrconfig.xml, hostContext=/, hostPort=40968, coreRootDirectory=/home/jenkins/workspace/Lucene-Solr-6.x-Linux/solr/build/solr-core/test/J1/temp/solr.handler.TestReqParamsAPI_2131C5AF6F60B95F-001/shard-1-001/cores}
   [junit4]   2> 1714934 INFO  (TEST-TestReqParamsAPI.test-seed#[2131C5AF6F60B95F]) [    ] o.a.s.s.SolrDispatchFilter SolrDispatchFilter.init(): jdk.internal.loader.ClassLoaders$AppClassLoader@864e92
   [junit4]   2> 1714934 INFO  (TEST-TestReqParamsAPI.test-seed#[2131C5AF6F60B95F]) [    ] o.a.s.c.SolrResourceLoader new SolrResourceLoader for directory: '/home/jenkins/workspace/Lucene-Solr-6.x-Linux/solr/build/solr-core/test/J1/temp/solr.handler.TestReqParamsAPI_2131C5AF6F60B95F-001/shard-1-001'
   [junit4]   2> 1714934 INFO  (TEST-TestReqParamsAPI.test-seed#[2131C5AF6F60B95F]) [    ] o.a.s.c.SolrResourceLoader JNDI not configured for solr (NoInitialContextEx)
   [junit4]   2> 1714934 INFO  (TEST-TestReqParamsAPI.test-seed#[2131C5AF6F60B95F]) [    ] o.a.s.c.SolrResourceLoader solr home defaulted to 'solr/' (could not find system property or JNDI)
   [junit4]   2> 1714934 INFO  (TEST-TestReqParamsAPI.test-seed#[2131C5AF6F60B95F]) [    ] o.a.s.c.c.SolrZkClient Using default ZkCredentialsProvider
   [junit4]   2> 1714934 INFO  (TEST-TestReqParamsAPI.test-seed#[2131C5AF6F60B95F]) [    ] o.a.s.c.c.ConnectionManager Waiting for client to connect to ZooKeeper
   [junit4]   2> 1714935 INFO  (zkCallback-1469-thread-1) [    ] o.a.s.c.c.ConnectionManager Watcher org.apache.solr.common.cloud.ConnectionManager@45536b name:ZooKeeperConnection Watcher:127.0.0.1:46017/solr got event WatchedEvent state:SyncConnected type:None path:null path:null type:None
   [junit4]   2> 1714935 INFO  (TEST-TestReqParamsAPI.test-seed#[2131C5AF6F60B95F]) [    ] o.a.s.c.c.ConnectionManager Client is connected to ZooKeeper
   [junit4]   2> 1714935 INFO  (TEST-TestReqParamsAPI.test-seed#[2131C5AF6F60B95F]) [    ] o.a.s.c.c.SolrZkClient Using default ZkACLProvider
   [junit4]   2> 1714936 INFO  (TEST-TestReqParamsAPI.test-seed#[2131C5AF6F60B95F]) [    ] o.a.s.s.SolrDispatchFilter Loading solr.xml from SolrHome (not found in ZooKeeper)
   [junit4]   2> 1714936 INFO  (TEST-TestReqParamsAPI.test-seed#[2131C5AF6F60B95F]) [    ] o.a.s.c.SolrXmlConfig Loading container configuration from /home/jenkins/workspace/Lucene-Solr-6.x-Linux/solr/build/solr-core/test/J1/temp/solr.handler.TestReqParamsAPI_2131C5AF6F60B95F-001/shard-1-001/solr.xml
   [junit4]   2> 1714938 INFO  (TEST-TestReqParamsAPI.test-seed#[2131C5AF6F60B95F]) [    ] o.a.s.c.CorePropertiesLocator Config-defined core root directory: /home/jenkins/workspace/Lucene-Solr-6.x-Linux/solr/build/solr-core/test/J1/temp/solr.handler.TestReqParamsAPI_2131C5AF6F60B95F-001/shard-1-001/cores
   [junit4]   2> 1714938 INFO  (TEST-TestReqParamsAPI.test-seed#[2131C5AF6F60B95F]) [    ] o.a.s.c.CoreContainer New CoreContainer 22643442
   [junit4]   2> 1714938 INFO  (TEST-TestReqParamsAPI.test-seed#[2131C5AF6F60B95F]) [    ] o.a.s.c.CoreContainer Loading cores into CoreContainer [instanceDir=/home/jenkins/workspace/Lucene-Solr-6.x-Linux/solr/build/solr-core/test/J1/temp/solr.handler.TestReqParamsAPI_2131C5AF6F60B95F-001/shard-1-001]
   [junit4]   2> 1714939 WARN  (TEST-TestReqParamsAPI.test-seed#[2131C5AF6F60B95F]) [    ] o.a.s.c.CoreContainer Couldn't add files from /home/jenkins/workspace/Lucene-Solr-6.x-Linux/solr/build/solr-core/test/J1/temp/solr.handler.TestReqParamsAPI_2131C5AF6F60B95F-001/shard-1-001/lib to classpath: /home/jenkins/workspace/Lucene-Solr-6.x-Linux/solr/build/solr-core/test/J1/temp/solr.handler.TestReqParamsAPI_2131C5AF6F60B95F-001/shard-1-001/lib
   [junit4]   2> 1714939 INFO  (TEST-TestReqParamsAPI.test-seed#[2131C5AF6F60B95F]) [    ] o.a.s.h.c.HttpShardHandlerFactory created with socketTimeout : 90000,urlScheme : ,connTimeout : 15000,maxConnectionsPerHost : 20,maxConnections : 10000,corePoolSize : 0,maximumPoolSize : 2147483647,maxThreadIdleTime : 5,sizeOfQueue : -1,fairnessPolicy : false,useRetries : false,
   [junit4]   2> 1714939 INFO  (TEST-TestReqParamsAPI.test-seed#[2131C5AF6F60B95F]) [    ] o.a.s.u.UpdateShardHandler Creating UpdateShardHandler HTTP client with params: socketTimeout=340000&connTimeout=45000&retry=true
   [junit4]   2> 1714940 INFO  (TEST-TestReqParamsAPI.test-seed#[2131C5AF6F60B95F]) [    ] o.a.s.l.LogWatcher SLF4J impl is org.slf4j.impl.Log4jLoggerFactory
   [junit4]   2> 1714940 INFO  (TEST-TestReqParamsAPI.test-seed#[2131C5AF6F60B95F]) [    ] o.a.s.l.LogWatcher Registering Log Listener [Log4j (org.slf4j.impl.Log4jLoggerFactory)]
   [junit4]   2> 1714940 INFO  (TEST-TestReqParamsAPI.test-seed#[2131C5AF6F60B95F]) [    ] o.a.s.c.ZkContainer Zookeeper client=127.0.0.1:46017/solr
   [junit4]   2> 1714940 INFO  (TEST-TestReqParamsAPI.test-seed#[2131C5AF6F60B95F]) [    ] o.a.s.c.ZkController zkHost includes chroot
   [junit4]   2> 1714940 INFO  (TEST-TestReqParamsAPI.test-seed#[2131C5AF6F60B95F]) [    ] o.a.s.c.c.SolrZkClient Using default ZkCredentialsProvider
   [junit4]   2> 1714940 INFO  (TEST-TestReqParamsAPI.test-seed#[2131C5AF6F60B95F]) [    ] o.a.s.c.c.ConnectionManager Waiting for client to connect to ZooKeeper
   [junit4]   2> 1714940 INFO  (zkCallback-1472-thread-1) [    ] o.a.s.c.c.ConnectionManager Watcher org.apache.solr.common.cloud.ConnectionManager@14c7721 name:ZooKeeperConnection Watcher:127.0.0.1:46017 got event WatchedEvent state:SyncConnected type:None path:null path:null type:None
   [junit4]   2> 1714941 INFO  (TEST-TestReqParamsAPI.test-seed#[2131C5AF6F60B95F]) [    ] o.a.s.c.c.ConnectionManager Client is connected to ZooKeeper
   [junit4]   2> 1714941 INFO  (TEST-TestReqParamsAPI.test-seed#[2131C5AF6F60B95F]) [    ] o.a.s.c.c.SolrZkClient Using default ZkACLProvider
   [junit4]   2> 1714942 INFO  (TEST-TestReqParamsAPI.test-seed#[2131C5AF6F60B95F]) [    ] o.a.s.c.c.ConnectionManager Waiting for client to connect to ZooKeeper
   [junit4]   2> 1714943 INFO  (zkCallback-1473-thread-1) [    ] o.a.s.c.c.ConnectionManager Watcher org.apache.solr.common.cloud.ConnectionManager@cfcd54 name:ZooKeeperConnection Watcher:127.0.0.1:46017/solr got event WatchedEvent state:SyncConnected type:None path:null path:null type:None
   [junit4]   2> 1714943 INFO  (TEST-TestReqParamsAPI.test-seed#[2131C5AF6F60B95F]) [    ] o.a.s.c.c.ConnectionManager Client is connected to ZooKeeper
   [junit4]   2> 1714945 INFO  (TEST-TestReqParamsAPI.test-seed#[2131C5AF6F60B95F]) [    ] o.a.s.c.c.ZkStateReader Updating cluster state from ZooKeeper... 
   [junit4]   2> 1714945 INFO  (TEST-TestReqParamsAPI.test-seed#[2131C5AF6F60B95F]) [    ] o.a.s.c.c.ZkStateReader Updated live nodes from ZooKeeper... (0) -> (1)
   [junit4]   2> 1714946 INFO  (TEST-TestReqParamsAPI.test-seed#[2131C5AF6F60B95F]) [    ] o.a.s.c.Overseer Overseer (id=null) closing
   [junit4]   2> 1714946 INFO  (TEST-TestReqParamsAPI.test-seed#[2131C5AF6F60B95F]) [    ] o.a.s.c.LeaderElector Joined leadership election with path: /overseer_elect/election/95610890626662409-127.0.0.1:40968_-n_0000000001
   [junit4]   2> 1714946 INFO  (TEST-TestReqParamsAPI.test-seed#[2131C5AF6F60B95F]) [    ] o.a.s.c.LeaderElector Watching path /overseer_elect/election/95610890626662404-127.0.0.1:43437_-n_0000000000 to know if I could be the leader
   [junit4]   2> 1714946 INFO  (TEST-TestReqParamsAPI.test-seed#[2131C5AF6F60B95F]) [    ] o.a.s.c.ZkController Publish node=127.0.0.1:40968_ as DOWN
   [junit4]   2> 1714947 INFO  (OverseerStateUpdate-95610890626662404-127.0.0.1:43437_-n_0000000000) [    ] o.a.s.c.Overseer processMessage: queueSize: 1, message = {
   [junit4]   2>   "operation":"downnode",
   [junit4]   2>   "node_name":"127.0.0.1:40968_"} current state version: 3
   [junit4]   2> 1714947 INFO  (OverseerStateUpdate-95610890626662404-127.0.0.1:43437_-n_0000000000) [    ] o.a.s.c.o.NodeMutator DownNode state invoked for node: 127.0.0.1:40968_
   [junit4]   2> 1714947 INFO  (OverseerStateUpdate-95610890626662404-127.0.0.1:43437_-n_0000000000) [    ] o.a.s.c.o.ZkStateWriter going to create_collection /collections/collection1/state.json
   [junit4]   2> 1715049 INFO  (zkCallback-1465-thread-1) [    ] o.a.s.c.c.ZkStateReader A cluster state change: [WatchedEvent state:SyncConnected type:NodeDataChanged path:/clusterstate.json], has occurred - updating... (live nodes size: [1])
   [junit4]   2> 1715049 INFO  (zkCallback-1467-thread-1) [    ] o.a.s.c.c.ZkStateReader A cluster state change: [WatchedEvent state:SyncConnected type:NodeDataChanged path:/clusterstate.json], has occurred - updating... (live nodes size: [1])
   [junit4]   2> 1715049 INFO  (zkCallback-1473-thread-1) [    ] o.a.s.c.c.ZkStateReader A cluster state change: [WatchedEvent state:SyncConnected type:NodeDataChanged path:/clusterstate.json], has occurred - updating... (live nodes size: [1])
   [junit4]   2> 1715947 INFO  (TEST-TestReqParamsAPI.test-seed#[2131C5AF6F60B95F]) [    ] o.a.s.c.ZkController Register node as live in ZooKeeper:/live_nodes/127.0.0.1:40968_
   [junit4]   2> 1715947 INFO  (TEST-TestReqParamsAPI.test-seed#[2131C5AF6F60B95F]) [    ] o.a.s.c.c.SolrZkClient makePath: /live_nodes/127.0.0.1:40968_
   [junit4]   2> 1715948 INFO  (zkCallback-1465-thread-1) [    ] o.a.s.c.c.ZkStateReader A live node change: [WatchedEvent state:SyncConnected type:NodeChildrenChanged path:/live_nodes], has occurred - updating... (live nodes size: [1])
   [junit4]   2> 1715948 INFO  (zkCallback-1467-thread-1) [    ] o.a.s.c.c.ZkStateReader A live node change: [WatchedEvent state:SyncConnected type:NodeChildrenChanged path:/live_nodes], has occurred - updating... (live nodes size: [1])
   [junit4]   2> 1715948 INFO  (zkCallback-1473-thread-1) [    ] o.a.s.c.c.ZkStateReader A live node change: [WatchedEvent state:SyncConnected type:NodeChildrenChanged path:/live_nodes], has occurred - updating... (live nodes size: [1])
   [junit4]   2> 1715948 INFO  (zkCallback-1465-thread-1) [    ] o.a.s.c.c.ZkStateReader Updated live nodes from ZooKeeper... (1) -> (2)
   [junit4]   2> 1715948 INFO  (zkCallback-1467-thread-1) [    ] o.a.s.c.c.ZkStateReader Updated live nodes from ZooKeeper... (1) -> (2)
   [junit4]   2> 1715948 INFO  (zkCallback-1473-thread-1) [    ] o.a.s.c.c.ZkStateReader Updated live nodes from ZooKeeper... (1) -> (2)
   [junit4]   2> 1715957 INFO  (TEST-TestReqParamsAPI.test-seed#[2131C5AF6F60B95F]) [    ] o.a.s.c.CoreContainer Security conf doesn't exist. Skipping setup for authorization module.
   [junit4]   2> 1715958 INFO  (TEST-TestReqParamsAPI.test-seed#[2131C5AF6F60B95F]) [    ] o.a.s.c.CoreContainer No authentication plugin used.
   [junit4]   2> 1715958 INFO  (TEST-TestReqParamsAPI.test-seed#[2131C5AF6F60B95F]) [    ] o.a.s.c.CorePropertiesLocator Looking for core definitions underneath /home/jenkins/workspace/Lucene-Solr-6.x-Linux/solr/build/solr-core/test/J1/temp/solr.handler.TestReqParamsAPI_2131C5AF6F60B95F-001/shard-1-001/cores
   [junit4]   2> 1715958 INFO  (TEST-TestReqParamsAPI.test-seed#[2131C5AF6F60B95F]) [    ] o.a.s.c.CoreDescriptor Created CoreDescriptor: {name=collection1, config=solrconfig.xml, transient=false, schema=schema.xml, loadOnStartup=true, configSetProperties=configsetprops.json, collection=collection1, coreNodeName=, dataDir=data/, shard=}
   [junit4]   2> 1715959 INFO  (TEST-TestReqParamsAPI.test-seed#[2131C5AF6F60B95F]) [    ] o.a.s.c.CorePropertiesLocator Found core collection1 in /home/jenkins/workspace/Lucene-Solr-6.x-Linux/solr/build/solr-core/test/J1/temp/solr.handler.TestReqParamsAPI_2131C5AF6F60B95F-001/shard-1-001/cores/collection1
   [junit4]   2> 1715959 INFO  (TEST-TestReqParamsAPI.test-seed#[2131C5AF6F60B95F]) [    ] o.a.s.c.CorePropertiesLocator Found 1 core definitions
   [junit4]   2> 1715959 INFO  (TEST-TestReqParamsAPI.test-seed#[2131C5AF6F60B95F]) [    ] o.a.s.s.SolrDispatchFilter user.dir=/home/jenkins/workspace/Lucene-Solr-6.x-Linux/solr/build/solr-core/test/J1
   [junit4]   2> 1715959 INFO  (TEST-TestReqParamsAPI.test-seed#[2131C5AF6F60B95F]) [    ] o.a.s.s.SolrDispatchFilter SolrDispatchFilter.init() done
   [junit4]   2> 1715959 INFO  (coreLoadExecutor-5302-thread-1) [    ] o.a.s.c.ZkController publishing state=down
   [junit4]   2> 1715959 INFO  (coreLoadExecutor-5302-thread-1) [    ] o.a.s.c.ZkController numShards not found on descriptor - reading it from system property
   [junit4]   2> 1715960 INFO  (coreLoadExecutor-5302-thread-1) [    ] o.a.s.c.ZkController Registering watch for collection collection1
   [junit4]   2> 1715960 INFO  (coreLoadExecutor-5302-thread-1) [    ] o.a.s.c.c.ZkStateReader addZkWatch [collection1]
   [junit4]   2> 1715960 INFO  (OverseerStateUpdate-95610890626662404-127.0.0.1:43437_-n_0000000000) [    ] o.a.s.c.Overseer processMessage: queueSize: 1, message = {
   [junit4]   2>   "core":"collection1",
   [junit4]   2>   "roles":null,
   [junit4]   2>   "base_url":"http://127.0.0.1:40968",
   [junit4]   2>   "node_name":"127.0.0.1:40968_",
   [junit4]   2>   "numShards":"2",
   [junit4]   2>   "state":"down",
   [junit4]   2>   "shard":null,
   [junit4]   2>   "collection":"collection1",
   [junit4]   2>   "operation":"state"} current state version: 4
   [junit4]   2> 1715960 INFO  (coreLoadExecutor-5302-thread-1) [    ] o.a.s.c.c.ZkStateReader Add data for [collection1] ver [0]
   [junit4]   2> 1715960 INFO  (coreLoadExecutor-5302-thread-1) [    ] o.a.s.c.ZkController look for our core node name
   [junit4]   2> 1715960 INFO  (OverseerStateUpdate-95610890626662404-127.0.0.1:43437_-n_0000000000) [    ] o.a.s.c.o.ReplicaMutator Update state numShards=2 message={
   [junit4]   2>   "core":"collection1",
   [junit4]   2>   "roles":null,
   [junit4]   2>   "base_url":"http://127.0.0.1:40968",
   [junit4]   2>   "node_name":"127.0.0.1:40968_",
   [junit4]   2>   "numShards":"2",
   [junit4]   2>   "state":"down",
   [junit4]   2>   "shard":null,
   [junit4]   2>   "collection":"collection1",
   [junit4]   2>   "operation":"state"}
   [junit4]   2> 1715960 INFO  (OverseerStateUpdate-95610890626662404-127.0.0.1:43437_-n_0000000000) [    ] o.a.s.c.o.ReplicaMutator Collection already exists with numShards=2
   [junit4]   2> 1715960 INFO  (OverseerStateUpdate-95610890626662404-127.0.0.1:43437_-n_0000000000) [    ] o.a.s.c.o.ReplicaMutator Assigning new node to shard shard=shard2
   [junit4]   2> 1716061 INFO  (OverseerStateUpdate-95610890626662404-127.0.0.1:43437_-n_0000000000) [    ] o.a.s.c.o.ZkStateWriter going to update_collection /collections/collection1/state.json version: 0
   [junit4]   2> 1716061 INFO  (zkCallback-1473-thread-1) [    ] o.a.s.c.c.ZkStateReader A cluster state change: [WatchedEvent state:SyncConnected type:NodeDataChanged path:/collections/collection1/state.json] for collection [collection1] has occurred - updating... (live nodes size: [2])
   [junit4]   2> 1716062 INFO  (zkCallback-1473-thread-1) [    ] o.a.s.c.c.ZkStateReader Updating data for [collection1] from [0] to [1]
   [junit4]   2> 1716960 INFO  (coreLoadExecutor-5302-thread-1) [    ] o.a.s.c.ZkController waiting to find shard id in clusterstate for collection1
   [junit4]   2> 1716960 INFO  (coreLoadExecutor-5302-thread-1) [    ] o.a.s.c.ZkController Check for collection zkNode:collection1
   [junit4]   2> 1716960 INFO  (coreLoadExecutor-5302-thread-1) [    ] o.a.s.c.ZkController Collection zkNode exists
   [junit4]   2> 1716960 INFO  (coreLoadExecutor-5302-thread-1) [    ] o.a.s.c.c.ZkStateReader Load collection config from: [/collections/collection1]
   [junit4]   2> 1716961 INFO  (coreLoadExecutor-5302-thread-1) [    ] o.a.s.c.c.ZkStateReader path=[/collections/collection1] [configName]=[conf1] specified config exists in ZooKeeper
   [junit4]   2> 1716961 INFO  (coreLoadExecutor-5302-thread-1) [    ] o.a.s.c.SolrResourceLoader new SolrResourceLoader for directory: '/home/jenkins/workspace/Lucene-Solr-6.x-Linux/solr/build/solr-core/test/J1/temp/solr.handler.TestReqParamsAPI_2131C5AF6F60B95F-001/shard-1-001/cores/collection1'
   [junit4]   2> 1716961 INFO  (coreLoadExecutor-5302-thread-1) [    ] o.a.s.c.SolrResourceLoader JNDI not configured for solr (NoInitialContextEx)
   [junit4]   2> 1716961 INFO  (coreLoadExecutor-5302-thread-1) [    ] o.a.s.c.SolrResourceLoader solr home defaulted to 'solr/' (could not find system property or JNDI)
   [junit4]   2> 1716962 INFO  (coreLoadExecutor-5302-thread-1) [    ] o.a.s.c.Config loaded config solrconfig.xml with version 0 
   [junit4]   2> 1716964 INFO  (coreLoadExecutor-5302-thread-1) [    ] o.a.s.c.SolrConfig current version of requestparams : -1
   [junit4]   2> 1716966 INFO  (coreLoadExecutor-5302-thread-1) [    ] o.a.s.c.SolrConfig Using Lucene MatchVersion: 6.1.0
   [junit4]   2> 1716971 INFO  (coreLoadExecutor-5302-thread-1) [    ] o.a.s.c.SolrConfig Loaded SolrConfig: solrconfig.xml
   [junit4]   2> 1716975 INFO  (coreLoadExecutor-5302-thread-1) [    ] o.a.s.s.IndexSchema [collection1] Schema name=test
   [junit4]   2> 1717024 INFO  (coreLoadExecutor-5302-thread-1) [    ] o.a.s.s.OpenExchangeRatesOrgProvider Initialized with rates=open-exchange-rates.json, refreshInterval=1440.
   [junit4]   2> 1717027 INFO  (coreLoadExecutor-5302-thread-1) [    ] o.a.s.s.IndexSchema default search field in schema is text
   [junit4]   2> 1717028 INFO  (coreLoadExecutor-5302-thread-1) [    ] o.a.s.s.IndexSchema unique key field: id
   [junit4]   2> 1717031 INFO  (coreLoadExecutor-5302-thread-1) [    ] o.a.s.s.FileExchangeRateProvider Reloading exchange rates from file currency.xml
   [junit4]   2> 1717032 INFO  (coreLoadExecutor-5302-thread-1) [    ] o.a.s.s.FileExchangeRateProvider Reloading exchange rates from file currency.xml
   [junit4]   2> 1717033 INFO  (coreLoadExecutor-5302-thread-1) [    ] o.a.s.s.OpenExchangeRatesOrgProvider Reloading exchange rates from open-exchange-rates.json
   [junit4]   2> 1717033 INFO  (coreLoadExecutor-5302-thread-1) [    ] o.a.s.s.OpenExchangeRatesOrgProvider Reloading exchange rates from open-exchange-rates.json
   [junit4]   2> 1717034 INFO  (coreLoadExecutor-5302-thread-1) [    ] o.a.s.c.ConfigSetProperties Did not find ConfigSet properties, assuming default properties: Can't find resource 'configsetprops.json' in classpath or '/configs/conf1', cwd=/home/jenkins/workspace/Lucene-Solr-6.x-Linux/solr/build/solr-core/test/J1
   [junit4]   2> 1717034 INFO  (coreLoadExecutor-5302-thread-1) [    ] o.a.s.c.CoreContainer Creating SolrCore 'collection1' using configuration from collection collection1
   [junit4]   2> 1717034 INFO  (coreLoadExecutor-5302-thread-1) [    ] o.a.s.c.SolrCore org.apache.solr.core.MockDirectoryFactory
   [junit4]   2> 1717034 INFO  (coreLoadExecutor-5302-thread-1) [    ] o.a.s.c.SolrCore [[collection1] ] Opening new SolrCore at [/home/jenkins/workspace/Lucene-Solr-6.x-Linux/solr/build/solr-core/test/J1/temp/solr.handler.TestReqParamsAPI_2131C5AF6F60B95F-001/shard-1-001/cores/collection1], dataDir=[/home/jenkins/workspace/Lucene-Solr-6.x-Linux/solr/build/solr-core/test/J1/temp/solr.handler.TestReqParamsAPI_2131C5AF6F60B95F-001/shard-1-001/cores/collection1/data/]
   [junit4]   2> 1717034 INFO  (coreLoadExecutor-5302-thread-1) [    ] o.a.s.c.JmxMonitoredMap JMX monitoring is enabled. Adding Solr mbeans to JMX Server: com.sun.jmx.mbeanserver.JmxMBeanServer@1df94bf
   [junit4]   2> 1717035 INFO  (coreLoadExecutor-5302-thread-1) [    ] o.a.s.c.CachingDirectoryFactory return new directory for /home/jenkins/workspace/Lucene-Solr-6.x-Linux/solr/build/solr-core/test/J1/temp/solr.handler.TestReqParamsAPI_2131C5AF6F60B95F-001/shard-1-001/cores/collection1/data
   [junit4]   2> 1717035 INFO  (coreLoadExecutor-5302-thread-1) [    ] o.a.s.c.SolrCore New index directory detected: old=null new=/home/jenkins/workspace/Lucene-Solr-6.x-Linux/solr/build/solr-core/test/J1/temp/solr.handler.TestReqParamsAPI_2131C5AF6F60B95F-001/shard-1-001/cores/collection1/data/index/
   [junit4]   2> 1717035 WARN  (coreLoadExecutor-5302-thread-1) [    ] o.a.s.c.SolrCore [collection1] Solr index directory '/home/jenkins/workspace/Lucene-Solr-6.x-Linux/solr/build/solr-core/test/J1/temp/solr.handler.TestReqParamsAPI_2131C5AF6F60B95F-001/shard-1-001/cores/collection1/data/index' doesn't exist. Creating new index...
   [junit4]   2> 1717035 INFO  (coreLoadExecutor-5302-thread-1) [    ] o.a.s.c.CachingDirectoryFactory return new directory for /home/jenkins/workspace/Lucene-Solr-6.x-Linux/solr/build/solr-core/test/J1/temp/solr.handler.TestReqParamsAPI_2131C5AF6F60B95F-001/shard-1-001/cores/collection1/data/index
   [junit4]   2> 1717035 INFO  (coreLoadExecutor-5302-thread-1) [    ] o.a.s.u.RandomMergePolicy RandomMergePolicy wrapping class org.apache.lucene.index.TieredMergePolicy: [TieredMergePolicy: maxMergeAtOnce=28, maxMergeAtOnceExplicit=49, maxMergedSegmentMB=33.0615234375, floorSegmentMB=1.072265625, forceMergeDeletesPctAllowed=5.252844919906297, segmentsPerTier=19.0, maxCFSSegmentSizeMB=8.796093022207999E12, noCFSRatio=0.0
   [junit4]   2> 1717035 INFO  (coreLoadExecutor-5302-thread-1) [    ] o.a.s.c.SolrDeletionPolicy SolrDeletionPolicy.onCommit: commits: num=1
   [junit4]   2> 	commit{dir=MockDirectoryWrapper(RAMDirectory@236b1a lockFactory=org.apache.lucene.store.SingleInstanceLockFactory@1c81ac3),segFN=segments_1,generation=1}
   [junit4]   2> 1717035 INFO  (coreLoadExecutor-5302-thread-1) [    ] o.a.s.c.SolrDeletionPolicy newest commit generation = 1
   [junit4]   2> 1717036 INFO  (OldIndexDirectoryCleanupThreadForCore-collection1) [    ] o.a.s.c.SolrCore Looking for old index directories to cleanup for core collection1 in /home/jenkins/workspace/Lucene-Solr-6.x-Linux/solr/build/solr-core/test/J1/temp/solr.handler.TestReqParamsAPI_2131C5AF6F60B95F-001/shard-1-001/cores/collection1/data/
   [junit4]   2> 1717036 WARN  (OldIndexDirectoryCleanupThreadForCore-collection1) [    ] o.a.s.c.DirectoryFactory /home/jenkins/workspace/Lucene-Solr-6.x-Linux/solr/build/solr-core/test/J1/temp/solr.handler.TestReqParamsAPI_2131C5AF6F60B95F-001/shard-1-001/cores/collection1/data/ does not point to a valid data directory; skipping clean-up of old index directories.
   [junit4]   2> 1717038 INFO  (coreLoadExecutor-5302-thread-1) [    ] o.a.s.u.p.UpdateRequestProcessorChain creating updateRequestProcessorChain "nodistrib"
   [junit4]   2> 1717038 INFO  (coreLoadExecutor-5302-thread-1) [    ] o.a.s.u.p.UpdateRequestProcessorChain creating updateRequestProcessorChain "dedupe"
   [junit4]   2> 1717038 INFO  (coreLoadExecutor-5302-thread-1) [    ] o.a.s.u.p.UpdateRequestProcessorChain inserting DistributedUpdateProcessorFactory into updateRequestProcessorChain "dedupe"
   [junit4]   2> 1717038 INFO  (coreLoadExecutor-5302-thread-1) [    ] o.a.s.u.p.UpdateRequestProcessorChain creating updateRequestProcessorChain "stored_sig"
   [junit4]   2> 1717038 INFO  (coreLoadExecutor-5302-thread-1) [    ] o.a.s.u.p.UpdateRequestProcessorChain inserting DistributedUpdateProcessorFactory into updateRequestProcessorChain "stored_sig"
   [junit4]   2> 1717038 INFO  (coreLoadExecutor-5302-thread-1) [    ] o.a.s.u.p.UpdateRequestProcessorChain creating updateRequestProcessorChain "distrib-dup-test-chain-explicit"
   [junit4]   2> 1717039 INFO  (coreLoadExecutor-5302-thread-1) [    ] o.a.s.u.p.UpdateRequestProcessorChain creating updateRequestProcessorChain "distrib-dup-test-chain-implicit"
   [junit4]   2> 1717039 INFO  (coreLoadExecutor-5302-thread-1) [    ] o.a.s.u.p.UpdateRequestProcessorChain inserting DistributedUpdateProcessorFactory into updateRequestProcessorChain "distrib-dup-test-chain-implicit"
   [junit4]   2> 1717039 INFO  (coreLoadExecutor-5302-thread-1) [    ] o.a.s.c.SolrCore no updateRequestProcessorChain defined as default, creating implicit default
   [junit4]   2> 1717039 WARN  (coreLoadExecutor-5302-thread-1) [    ] o.a.s.c.RequestHandlers INVALID paramSet a in requestHandler {type = requestHandler,name = /dump,class = DumpRequestHandler,args = {defaults={a=A,b=B}}}
   [junit4]   2> 1717040 INFO  (coreLoadExecutor-5302-thread-1) [    ] o.a.s.h.l.XMLLoader xsltCacheLifetimeSeconds=60
   [junit4]   2> 1717041 INFO  (coreLoadExecutor-5302-thread-1) [    ] o.a.s.h.l.XMLLoader xsltCacheLifetimeSeconds=60
   [junit4]   2> 1717041 INFO  (coreLoadExecutor-5302-thread-1) [    ] o.a.s.h.l.XMLLoader xsltCacheLifetimeSeconds=60
   [junit4]   2> 1717042 INFO  (coreLoadExecutor-5302-thread-1) [    ] o.a.s.h.l.XMLLoader xsltCacheLifetimeSeconds=60
   [junit4]   2> 1717046 INFO  (coreLoadExecutor-5302-thread-1) [    ] o.a.s.c.RequestHandlers Registered paths: /admin/mbeans,standard,/dump,/update/csv,/sql,/update/json/docs,/admin/luke,/export,/admin/segments,/get,/admin/system,/replication,/admin/properties,/config,/stream,/schema,/admin/plugins,/admin/logging,/update/json,/admin/ping,/admin/threads,/update,/admin/file
   [junit4]   2> 1717047 INFO  (coreLoadExecutor-5302-thread-1) [    ] o.a.s.c.SolrCore Using default statsCache cache: org.apache.solr.search.stats.LocalStatsCache
   [junit4]   2> 1717047 INFO  (coreLoadExecutor-5302-thread-1) [    ] o.a.s.u.UpdateHandler Using UpdateLog implementation: org.apache.solr.update.UpdateLog
   [junit4]   2> 1717047 INFO  (coreLoadExecutor-5302-thread-1) [    ] o.a.s.u.UpdateLog Initializing UpdateLog: dataDir= defaultSyncLevel=FLUSH numRecordsToKeep=100 maxNumLogsToKeep=10 numVersionBuckets=65536
   [junit4]   2> 1717047 INFO  (coreLoadExecutor-5302-thread-1) [    ] o.a.s.u.CommitTracker Hard AutoCommit: disabled
   [junit4]   2> 1717047 INFO  (coreLoadExecutor-5302-thread-1) [    ] o.a.s.u.CommitTracker Soft AutoCommit: disabled
   [junit4]   2> 1717048 INFO  (coreLoadExecutor-5302-thread-1) [    ] o.a.s.u.RandomMergePolicy RandomMergePolicy wrapping class org.apache.lucene.index.TieredMergePolicy: [TieredMergePolicy: maxMergeAtOnce=46, maxMergeAtOnceExplicit=49, maxMergedSegmentMB=85.9140625, floorSegmentMB=1.908203125, forceMergeDeletesPctAllowed=27.601219475153954, segmentsPerTier=23.0, maxCFSSegmentSizeMB=8.796093022207999E12, noCFSRatio=1.0
   [junit4]   2> 1717048 INFO  (coreLoadExecutor-5302-thread-1) [    ] o.a.s.c.SolrDeletionPolicy SolrDeletionPolicy.onInit: commits: num=1
   [junit4]   2> 	commit{dir=MockDirectoryWrapper(RAMDirectory@236b1a lockFactory=org.apache.lucene.store.SingleInstanceLockFactory@1c81ac3),segFN=segments_1,generation=1}
   [junit4]   2> 1717048 INFO  (coreLoadExecutor-5302-thread-1) [    ] o.a.s.c.SolrDeletionPolicy newest commit generation = 1
   [junit4]   2> 1717048 INFO  (coreLoadExecutor-5302-thread-1) [    ] o.a.s.s.SolrIndexSearcher Opening [Searcher@1849015[collection1] main]
   [junit4]   2> 1717048 INFO  (coreLoadExecutor-5302-thread-1) [    ] o.a.s.c.c.ZkStateReader Load collection config from: [/collections/collection1]
   [junit4]   2> 1717048 INFO  (coreLoadExecutor-5302-thread-1) [    ] o.a.s.c.c.ZkStateReader path=[/collections/collection1] [configName]=[conf1] specified config exists in ZooKeeper
   [junit4]   2> 1717048 INFO  (coreLoadExecutor-5302-thread-1) [    ] o.a.s.r.ManagedResourceStorage Setting up ZooKeeper-based storage for the RestManager with znodeBase: /configs/conf1
   [junit4]   2> 1717048 INFO  (coreLoadExecutor-5302-thread-1) [    ] o.a.s.r.ManagedResourceStorage Configured ZooKeeperStorageIO with znodeBase: /configs/conf1
   [junit4]   2> 1717048 INFO  (coreLoadExecutor-5302-thread-1) [    ] o.a.s.r.RestManager Initializing RestManager with initArgs: {}
   [junit4]   2> 1717048 INFO  (coreLoadExecutor-5302-thread-1) [    ] o.a.s.r.ManagedResourceStorage Reading _rest_managed.json using ZooKeeperStorageIO:path=/configs/conf1
   [junit4]   2> 1717049 INFO  (coreLoadExecutor-5302-thread-1) [    ] o.a.s.r.ManagedResourceStorage No data found for znode /configs/conf1/_rest_managed.json
   [junit4]   2> 1717049 INFO  (coreLoadExecutor-5302-thread-1) [    ] o.a.s.r.ManagedResourceStorage Loaded null at path _rest_managed.json using ZooKeeperStorageIO:path=/configs/conf1
   [junit4]   2> 1717049 INFO  (coreLoadExecutor-5302-thread-1) [    ] o.a.s.r.RestManager Initializing 0 registered ManagedResources
   [junit4]   2> 1717049 INFO  (coreLoadExecutor-5302-thread-1) [    ] o.a.s.h.ReplicationHandler Commits will be reserved for  10000
   [junit4]   2> 1717050 INFO  (searcherExecutor-5303-thread-1) [    ] o.a.s.c.SolrCore [collection1] Registered new searcher Searcher@1849015[collection1] main{ExitableDirectoryReader(UninvertingDirectoryReader())}
   [junit4]   2> 1717050 INFO  (coreLoadExecutor-5302-thread-1) [    ] o.a.s.u.UpdateLog Looking up max value of version field to seed version buckets
   [junit4]   2> 1717050 INFO  (coreLoadExecutor-5302-thread-1) [    ] o.a.s.u.VersionInfo Refreshing highest value of _version_ for 65536 version buckets from index
   [junit4]   2> 1717050 INFO  (coreLoadExecutor-5302-thread-1) [    ] o.a.s.u.VersionInfo No terms found for _version_, cannot seed version bucket highest value from index
   [junit4]   2> 1717050 INFO  (coreLoadExecutor-5302-thread-1) [    ] o.a.s.u.UpdateLog Could not find max version in index or recent updates, using new clock 1529774254118141952
   [junit4]   2> 1717051 INFO  (coreLoadExecutor-5302-thread-1) [    ] o.a.s.u.UpdateLog Took 1.0ms to seed version buckets with highest version 1529774254118141952
   [junit4]   2> 1717051 INFO  (coreLoadExecutor-5302-thread-1) [    ] o.a.s.c.ZkController watch zkdir /configs/conf1
   [junit4]   2> 1717052 INFO  (coreLoadExecutor-5302-thread-1) [    ] o.a.s.c.CoreContainer registering core: collection1
   [junit4]   2> 1717052 INFO  (coreZkRegister-5297-thread-1) [    ] o.a.s.c.ZkController Register replica - core:collection1 address:http://127.0.0.1:40968 collection:collection1 shard:shard2
   [junit4]   2> 1717052 INFO  (coreZkRegister-5297-thread-1) [    ] o.a.s.c.c.SolrZkClient makePath: /collections/collection1/leader_elect/shard2/election
   [junit4]   2> 1717053 INFO  (coreZkRegister-5297-thread-1) [    ] o.a.s.c.LeaderElector Joined leadership election with path: /collections/collection1/leader_elect/shard2/election/95610890626662409-core_node1-n_0000000000
   [junit4]   2> 1717053 INFO  (coreZkRegister-5297-thread-1) [    ] o.a.s.c.ShardLeaderElectionContext Running the leader process for shard=shard2 and weAreReplacement=false and leaderVoteWait=10000
   [junit4]   2> 1717054 INFO  (coreZkRegister-5297-thread-1) [    ] o.a.s.c.ShardLeaderElectionContext Enough replicas found to continue.
   [junit4]   2> 1717054 INFO  (coreZkRegister-5297-thread-1) [    ] o.a.s.c.ShardLeaderElectionContext I may be the new leader - try and sync
   [junit4]   2> 1717054 INFO  (coreZkRegister-5297-thread-1) [    ] o.a.s.c.SyncStrategy Sync replicas to http://127.0.0.1:40968/collection1/
   [junit4]   2> 1717054 INFO  (coreZkRegister-5297-thread-1) [    ] o.a.s.c.SyncStrategy Sync Success - now sync replicas to me
   [junit4]   2> 1717054 INFO  (coreZkRegister-5297-thread-1) [    ] o.a.s.c.SyncStrategy http://127.0.0.1:40968/collection1/ has no replicas
   [junit4]   2> 1717054 INFO  (OverseerStateUpdate-95610890626662404-127.0.0.1:43437_-n_0000000000) [    ] o.a.s.c.Overseer processMessage: queueSize: 1, message = {
   [junit4]   2>   "operation":"leader",
   [junit4]   2>   "shard":"shard2",
   [junit4]   2>   "collection":"collection1"} current state version: 4
   [junit4]   2> 1717054 INFO  (coreZkRegister-5297-thread-1) [    ] o.a.s.c.c.SolrZkClient makePath: /collections/collection1/leaders/shard2
   [junit4]   2> 1717055 INFO  (coreZkRegister-5297-thread-1) [    ] o.a.s.c.ShardLeaderElectionContextBase Creating leader registration node /collections/collection1/leaders/shard2/leader after winning as /collections/collection1/leader_elect/shard2/election/95610890626662409-core_node1-n_0000000000
   [junit4]   2> 1717056 INFO  (coreZkRegister-5297-thread-1) [    ] o.a.s.c.ShardLeaderElectionContext I am the new leader: http://127.0.0.1:40968/collection1/ shard2
   [junit4]   2> 1717056 INFO  (OverseerStateUpdate-95610890626662404-127.0.0.1:43437_-n_0000000000) [    ] o.a.s.c.Overseer processMessage: queueSize: 1, message = {
   [junit4]   2>   "operation":"leader",
   [junit4]   2>   "shard":"shard2",
   [junit4]   2>   "collection":"collection1",
   [junit4]   2>   "base_url":"http://127.0.0.1:40968",
   [junit4]   2>   "core":"collection1",
   [junit4]   2>   "state":"active"} current state version: 4
   [junit4]   2> 1717157 INFO  (OverseerStateUpdate-95610890626662404-127.0.0.1:43437_-n_0000000000) [    ] o.a.s.c.o.ZkStateWriter going to update_collection /collections/collection1/state.json version: 1
   [junit4]   2> 1717157 INFO  (zkCallback-1473-thread-1) [    ] o.a.s.c.c.ZkStateReader A cluster state change: [WatchedEvent state:SyncConnected type:NodeDataChanged path:/collections/collection1/state.json] for collection [collection1] has occurred - updating... (live nodes size: [2])
   [junit4]   2> 1717157 INFO  (zkCallback-1473-thread-1) [    ] o.a.s.c.c.ZkStateReader Updating data for [collection1] from [1] to [2]
   [junit4]   2> 1717206 INFO  (coreZkRegister-5297-thread-1) [    ] o.a.s.c.ZkController We are http://127.0.0.1:40968/collection1/ and leader is http://127.0.0.1:40968/collection1/
   [junit4]   2> 1717206 INFO  (coreZkRegister-5297-thread-1) [    ] o.a.s.c.ZkController No LogReplay needed for core=collection1 baseURL=http://127.0.0.1:40968
   [junit4]   2> 1717206 INFO  (coreZkRegister-5297-thread-1) [    ] o.a.s.c.ZkController I am the leader, no recovery necessary
   [junit4]   2> 1717206 INFO  (coreZkRegister-5297-thread-1) [    ] o.a.s.c.ZkController publishing state=active
   [junit4]   2> 1717206 INFO  (coreZkRegister-5297-thread-1) [    ] o.a.s.c.ZkController numShards not found on descriptor - reading it from system property
   [junit4]   2> 1717207 INFO  (OverseerStateUpdate-95610890626662404-127.0.0.1:43437_-n_0000000000) [    ] o.a.s.c.Overseer processMessage: queueSize: 1, message = {
   [junit4]   2>   "core":"collection1",
   [junit4]   2>   "core_node_name":"core_node1",
   [junit4]   2>   "roles":null,
   [junit4]   2>   "base_url":"http://127.0.0.1:40968",
   [junit4]   2>   "node_name":"127.0.0.1:40968_",
   [junit4]   2>   "numShards":"2",
   [junit4]   2>   "state":"active",
   [junit4]   2>   "shard":"shard2",
   [junit4]   2>   "collection":"collection1",
   [junit4]   2>   "operation":"state"} current state version: 4
   [junit4]   2> 1717207 INFO  (OverseerStateUpdate-95610890626662404-127.0.0.1:43437_-n_0000000000) [    ] o.a.s.c.o.ReplicaMutator Update state numShards=2 message={
   [junit4]   2>   "core":"collection1",
   [junit4]   2>   "core_node_name":"core_node1",
   [junit4]   2>   "roles":null,
   [junit4]   2>   "base_url":"http://127.0.0.1:40968",
   [junit4]   2>   "node_name":"127.0.0.1:40968_",
   [junit4]   2>   "numShards":"2",
   [junit4]   2>   "state":"active",
   [junit4]   2>   "shard":"shard2",
   [junit4]   2>   "collection":"collection1",
   [junit4]   2>   "operation":"state"}
   [junit4]   2> 1717308 INFO  (OverseerStateUpdate-95610890626662404-127.0.0.1:43437_-n_0000000000) [    ] o.a.s.c.o.ZkStateWriter going to update_collection /collections/collection1/state.json version: 2
   [junit4]   2> 1717308 INFO  (zkCallback-1473-thread-1) [    ] o.a.s.c.c.ZkStateReader A cluster state change: [WatchedEvent state:SyncConnected type:NodeDataChanged path:/collections/collection1/state.json] for collection [collection1] has occurred - updating... (live nodes size: [2])
   [junit4]   2> 1717309 INFO  (zkCallback-1473-thread-1) [    ] o.a.s.c.c.ZkStateReader Updating data for [collection1] from [2] to [3]
   [junit4]   2> 1717514 INFO  (TEST-TestReqParamsAPI.test-seed#[2131C5AF6F60B95F]) [    ] o.a.s.SolrTestCaseJ4 Writing core.properties file to /home/jenkins/workspace/Lucene-Solr-6.x-Linux/solr/build/solr-core/test/J1/temp/solr.handler.TestReqParamsAPI_2131C5AF6F60B95F-001/shard-2-001/cores/collection1
   [junit4]   2> 1717515 INFO  (TEST-TestReqParamsAPI.test-seed#[2131C5AF6F

[...truncated too long message...]

 [    ] o.a.s.c.CachingDirectoryFactory Closing directory: /home/jenkins/workspace/Lucene-Solr-6.x-Linux/solr/build/solr-core/test/J1/../../../../../../../../../home/jenkins/workspace/Lucene-Solr-6.x-Linux/solr/build/solr-core/test/J1/temp/solr.handler.TestReqParamsAPI_2131C5AF6F60B95F-001/shard-4-001/cores/collection1/data/index
   [junit4]   2> 1737818 INFO  (TEST-TestReqParamsAPI.test-seed#[2131C5AF6F60B95F]) [    ] o.a.s.c.Overseer Overseer (id=95610890626662418-127.0.0.1:39419_-n_0000000004) closing
   [junit4]   2> 1737818 INFO  (OverseerStateUpdate-95610890626662418-127.0.0.1:39419_-n_0000000004) [    ] o.a.s.c.Overseer Overseer Loop exiting : 127.0.0.1:39419_
   [junit4]   2> 1737819 INFO  (zkCallback-1489-thread-2) [    ] o.a.s.c.c.ZkStateReader A live node change: [WatchedEvent state:SyncConnected type:NodeChildrenChanged path:/live_nodes], has occurred - updating... (live nodes size: [1])
   [junit4]   2> 1737819 WARN  (zkCallback-1489-thread-2) [    ] o.a.s.c.c.ZkStateReader ZooKeeper watch triggered, but Solr cannot talk to ZK: [KeeperErrorCode = Session expired for /live_nodes]
   [junit4]   2> 1737820 INFO  (TEST-TestReqParamsAPI.test-seed#[2131C5AF6F60B95F]) [    ] o.e.j.s.ServerConnector Stopped ServerConnector@40a95{HTTP/1.1,[http/1.1]}{127.0.0.1:0}
   [junit4]   2> 1737820 INFO  (TEST-TestReqParamsAPI.test-seed#[2131C5AF6F60B95F]) [    ] o.e.j.s.h.ContextHandler Stopped o.e.j.s.ServletContextHandler@1d923a6{/,null,UNAVAILABLE}
   [junit4]   2> 1737821 INFO  (TEST-TestReqParamsAPI.test-seed#[2131C5AF6F60B95F]) [    ] o.a.s.c.ZkTestServer connecting to 127.0.0.1:46017 46017
   [junit4]   2> 1737886 INFO  (Thread-3867) [    ] o.a.s.c.ZkTestServer connecting to 127.0.0.1:46017 46017
   [junit4]   2> 1737887 WARN  (Thread-3867) [    ] o.a.s.c.ZkTestServer Watch limit violations: 
   [junit4]   2> Maximum concurrent create/delete watches above limit:
   [junit4]   2> 
   [junit4]   2> 	25	/solr/configs/conf1
   [junit4]   2> 	6	/solr/aliases.json
   [junit4]   2> 	5	/solr/security.json
   [junit4]   2> 
   [junit4]   2> Maximum concurrent data watches above limit:
   [junit4]   2> 
   [junit4]   2> 	6	/solr/clusterstate.json
   [junit4]   2> 	4	/solr/collections/collection1/state.json
   [junit4]   2> 
   [junit4]   2> Maximum concurrent children watches above limit:
   [junit4]   2> 
   [junit4]   2> 	6	/solr/live_nodes
   [junit4]   2> 	6	/solr/collections
   [junit4]   2> 	4	/solr/overseer/queue
   [junit4]   2> 	4	/solr/overseer/collection-queue-work
   [junit4]   2> 
   [junit4]   2> NOTE: reproduce with: ant test  -Dtestcase=TestReqParamsAPI -Dtests.method=test -Dtests.seed=2131C5AF6F60B95F -Dtests.multiplier=3 -Dtests.slow=true -Dtests.locale=en-FK -Dtests.timezone=Asia/Rangoon -Dtests.asserts=true -Dtests.file.encoding=ISO-8859-1
   [junit4] FAILURE 24.7s J1 | TestReqParamsAPI.test <<<
   [junit4]    > Throwable #1: java.lang.AssertionError: Could not get expected value  'CY val' for path 'params/c' full output: {
   [junit4]    >   "responseHeader":{
   [junit4]    >     "status":0,
   [junit4]    >     "QTime":0},
   [junit4]    >   "params":{
   [junit4]    >     "a":"A val",
   [junit4]    >     "b":"B val",
   [junit4]    >     "wt":"json",
   [junit4]    >     "useParams":""},
   [junit4]    >   "context":{
   [junit4]    >     "webapp":"",
   [junit4]    >     "path":"/dump1",
   [junit4]    >     "httpMethod":"GET"}}
   [junit4]    > 	at __randomizedtesting.SeedInfo.seed([2131C5AF6F60B95F:A965FA75C19CD4A7]:0)
   [junit4]    > 	at org.apache.solr.core.TestSolrConfigHandler.testForResponseElement(TestSolrConfigHandler.java:458)
   [junit4]    > 	at org.apache.solr.handler.TestReqParamsAPI.testReqParams(TestReqParamsAPI.java:177)
   [junit4]    > 	at org.apache.solr.handler.TestReqParamsAPI.test(TestReqParamsAPI.java:67)
   [junit4]    > 	at org.apache.solr.BaseDistributedSearchTestCase$ShardsRepeatRule$ShardsFixedStatement.callStatement(BaseDistributedSearchTestCase.java:996)
   [junit4]    > 	at org.apache.solr.BaseDistributedSearchTestCase$ShardsRepeatRule$ShardsStatement.evaluate(BaseDistributedSearchTestCase.java:971)
   [junit4]    > 	at java.lang.Thread.run(java.base@9-ea/Thread.java:804)
   [junit4]   2> 1737889 INFO  (SUITE-TestReqParamsAPI-seed#[2131C5AF6F60B95F]-worker) [    ] o.a.s.SolrTestCaseJ4 ###deleteCore
   [junit4]   2> NOTE: leaving temporary files on disk at: /home/jenkins/workspace/Lucene-Solr-6.x-Linux/solr/build/solr-core/test/J1/temp/solr.handler.TestReqParamsAPI_2131C5AF6F60B95F-001
   [junit4]   2> Mar 25, 2016 11:47:16 AM com.carrotsearch.randomizedtesting.ThreadLeakControl checkThreadLeaks
   [junit4]   2> WARNING: Will linger awaiting termination of 2 leaked thread(s).
   [junit4]   2> NOTE: test params are: codec=Asserting(Lucene60): {}, docValues:{}, maxPointsInLeafNode=1898, maxMBSortInHeap=4.095523446677162, sim=ClassicSimilarity, locale=en-FK, timezone=Asia/Rangoon
   [junit4]   2> NOTE: Linux 4.2.0-34-generic i386/Oracle Corporation 9-ea (32-bit)/cpus=12,threads=1,free=119129416,total=401866752
   [junit4]   2> NOTE: All tests run in this JVM: [TestUseDocValuesAsStored, SolrIndexSplitterTest, OpenCloseCoreStressTest, TestSizeLimitedDistributedMap, CdcrUpdateLogTest, OpenExchangeRatesOrgProviderTest, TestDocumentBuilder, HdfsLockFactoryTest, TestCollationFieldDocValues, TestManagedStopFilterFactory, TestDistributedGrouping, TestMissingGroups, JavabinLoaderTest, TestJsonFacets, TestLeaderElectionZkExpiry, UUIDUpdateProcessorFallbackTest, AliasIntegrationTest, SpellingQueryConverterTest, DOMUtilTest, DirectoryFactoryTest, TestSolrCoreProperties, SpellPossibilityIteratorTest, TestBM25SimilarityFactory, SpellCheckComponentTest, LoggingHandlerTest, DistributedDebugComponentTest, ConfigSetsAPITest, TestLFUCache, LeaderFailoverAfterPartitionTest, FastVectorHighlighterTest, TestCursorMarkWithoutUniqueKey, DeleteShardTest, TestIntervalFaceting, TestLMJelinekMercerSimilarityFactory, DistributedMLTComponentTest, TestQueryTypes, TestCloudManagedSchema, DistribDocExpirationUpdateProcessorTest, CollectionsAPIAsyncDistributedZkTest, TestWordDelimiterFilterFactory, SolrCmdDistributorTest, TestAuthorizationFramework, TestSolrConfigHandler, SuggesterFSTTest, TestFieldTypeResource, TestQuerySenderNoQuery, FileUtilsTest, SolrInfoMBeanTest, TermsComponentTest, TestExceedMaxTermLength, TestBinaryResponseWriter, QueryResultKeyTest, TestScoreJoinQPNoScore, CollectionReloadTest, TestSurroundQueryParser, SoftAutoCommitTest, ZkSolrClientTest, TestSearcherReuse, TestNRTOpen, SimplePostToolTest, DistributedSuggestComponentTest, MigrateRouteKeyTest, MultiTermTest, TestExpandComponent, RankQueryTest, DirectSolrSpellCheckerTest, TestQuerySenderListener, HdfsBasicDistributedZkTest, SolrPluginUtilsTest, DistributedTermsComponentTest, DistributedVersionInfoTest, HLLUtilTest, TriLevelCompositeIdRoutingTest, CloudMLTQParserTest, DocumentBuilderTest, TestCoreContainer, RuleEngineTest, TestSchemaSimilarityResource, TestConfigSetsAPIExclusivity, MoreLikeThisHandlerTest, TestFastLRUCache, TestRTimerTree, TestHashPartitioner, ParsingFieldUpdateProcessorsTest, TestQueryWrapperFilter, TestSolrDeletionPolicy2, ClusterStateUpdateTest, DistributedFacetPivotLongTailTest, TestDistribIDF, TestReplicationHandlerBackup, TestRequestForwarding, ShardRoutingCustomTest, IndexBasedSpellCheckerTest, TestHashQParserPlugin, BasicDistributedZkTest, BasicDistributedZk2Test, CollectionsAPIDistributedZkTest, TestStressReorder, TestStressVersions, TestSolr4Spatial, PeerSyncTest, TestFiltering, TestTrie, SpatialFilterTest, WordBreakSolrSpellCheckerTest, SolrCoreCheckLockOnStartupTest, TestUpdate, DefaultValueUpdateProcessorTest, DocValuesMultiTest, DistanceFunctionTest, DisMaxRequestHandlerTest, TestQueryUtils, TestWriterPerf, XmlUpdateRequestHandlerTest, TestValueSourceCache, TestArbitraryIndexDir, MBeansHandlerTest, TestPartialUpdateDeduplication, CSVRequestHandlerTest, AlternateDirectoryTest, SolrIndexConfigTest, NumericFieldsTest, MinimalSchemaTest, TestFuzzyAnalyzedSuggestions, TestCodecSupport, TestSweetSpotSimilarityFactory, TestJmxMonitoredMap, ScriptEngineTest, TestSolrJ, TestUtils, CursorPagingTest, SolrTestCaseJ4Test, TestDistributedMissingSort, TestSimpleTrackingShardHandler, TestEmbeddedSolrServerConstructors, ActionThrottleTest, AsyncMigrateRouteKeyTest, ConcurrentDeleteAndCreateCollectionTest, ConnectionManagerTest, DeleteLastCustomShardedReplicaTest, DeleteReplicaTest, OverseerStatusTest, RecoveryAfterSoftCommitTest, SSLMigrationTest, ShardSplitTest, TestShortCircuitedRequests, TestConfigSetProperties, TestImplicitCoreProperties, TestReloadAndDeleteDocs, RequestLoggingTest, TestReqParamsAPI]
   [junit4] Completed [488/582 (1!)] on J1 in 25.01s, 1 test, 1 failure <<< FAILURES!

[...truncated 294 lines...]
BUILD FAILED
/home/jenkins/workspace/Lucene-Solr-6.x-Linux/build.xml:740: The following error occurred while executing this line:
/home/jenkins/workspace/Lucene-Solr-6.x-Linux/build.xml:684: The following error occurred while executing this line:
/home/jenkins/workspace/Lucene-Solr-6.x-Linux/build.xml:59: The following error occurred while executing this line:
/home/jenkins/workspace/Lucene-Solr-6.x-Linux/solr/build.xml:233: The following error occurred while executing this line:
/home/jenkins/workspace/Lucene-Solr-6.x-Linux/solr/common-build.xml:529: The following error occurred while executing this line:
/home/jenkins/workspace/Lucene-Solr-6.x-Linux/lucene/common-build.xml:1457: The following error occurred while executing this line:
/home/jenkins/workspace/Lucene-Solr-6.x-Linux/lucene/common-build.xml:1014: There were test failures: 582 suites (10 ignored), 2331 tests, 1 failure, 117 ignored (70 assumptions) [seed: 2131C5AF6F60B95F]

Total time: 50 minutes 50 seconds
Build step 'Invoke Ant' marked build as failure
Archiving artifacts
[WARNINGS] Skipping publisher since build result is FAILURE
Recording test results
Email was triggered for: Failure - Any
Sending email for trigger: Failure - Any



Mime
View raw message