lucene-dev mailing list archives

Site index · List index
Message view « Date » · « Thread »
Top « Date » · « Thread »
From Apache Jenkins Server <jenk...@builds.apache.org>
Subject [JENKINS] Lucene-Solr-Tests-trunk-Java8 - Build # 939 - Still Failing
Date Thu, 03 Mar 2016 03:45:33 GMT
Build: https://builds.apache.org/job/Lucene-Solr-Tests-trunk-Java8/939/

1 tests failed.
FAILED:  org.apache.solr.handler.TestReqParamsAPI.test

Error Message:
Could not get expected value  'CY val' for path 'response/params/y/c' full output: {   "responseHeader":{     "status":0,     "QTime":0},   "response":{     "znodeVersion":0,     "params":{"x":{         "a":"A val",         "b":"B val",         "":{"v":0}}}}}

Stack Trace:
java.lang.AssertionError: Could not get expected value  'CY val' for path 'response/params/y/c' full output: {
  "responseHeader":{
    "status":0,
    "QTime":0},
  "response":{
    "znodeVersion":0,
    "params":{"x":{
        "a":"A val",
        "b":"B val",
        "":{"v":0}}}}}
	at __randomizedtesting.SeedInfo.seed([39E6725A3B60CB1A:B1B24D80959CA6E2]:0)
	at org.junit.Assert.fail(Assert.java:93)
	at org.junit.Assert.assertTrue(Assert.java:43)
	at org.apache.solr.core.TestSolrConfigHandler.testForResponseElement(TestSolrConfigHandler.java:458)
	at org.apache.solr.handler.TestReqParamsAPI.testReqParams(TestReqParamsAPI.java:165)
	at org.apache.solr.handler.TestReqParamsAPI.test(TestReqParamsAPI.java:67)
	at sun.reflect.NativeMethodAccessorImpl.invoke0(Native Method)
	at sun.reflect.NativeMethodAccessorImpl.invoke(NativeMethodAccessorImpl.java:62)
	at sun.reflect.DelegatingMethodAccessorImpl.invoke(DelegatingMethodAccessorImpl.java:43)
	at java.lang.reflect.Method.invoke(Method.java:497)
	at com.carrotsearch.randomizedtesting.RandomizedRunner.invoke(RandomizedRunner.java:1764)
	at com.carrotsearch.randomizedtesting.RandomizedRunner$8.evaluate(RandomizedRunner.java:871)
	at com.carrotsearch.randomizedtesting.RandomizedRunner$9.evaluate(RandomizedRunner.java:907)
	at com.carrotsearch.randomizedtesting.RandomizedRunner$10.evaluate(RandomizedRunner.java:921)
	at org.apache.solr.BaseDistributedSearchTestCase$ShardsRepeatRule$ShardsFixedStatement.callStatement(BaseDistributedSearchTestCase.java:996)
	at org.apache.solr.BaseDistributedSearchTestCase$ShardsRepeatRule$ShardsStatement.evaluate(BaseDistributedSearchTestCase.java:971)
	at com.carrotsearch.randomizedtesting.rules.SystemPropertiesRestoreRule$1.evaluate(SystemPropertiesRestoreRule.java:57)
	at org.apache.lucene.util.TestRuleSetupTeardownChained$1.evaluate(TestRuleSetupTeardownChained.java:49)
	at org.apache.lucene.util.AbstractBeforeAfterRule$1.evaluate(AbstractBeforeAfterRule.java:45)
	at org.apache.lucene.util.TestRuleThreadAndTestName$1.evaluate(TestRuleThreadAndTestName.java:48)
	at org.apache.lucene.util.TestRuleIgnoreAfterMaxFailures$1.evaluate(TestRuleIgnoreAfterMaxFailures.java:64)
	at org.apache.lucene.util.TestRuleMarkFailure$1.evaluate(TestRuleMarkFailure.java:47)
	at com.carrotsearch.randomizedtesting.rules.StatementAdapter.evaluate(StatementAdapter.java:36)
	at com.carrotsearch.randomizedtesting.ThreadLeakControl$StatementRunner.run(ThreadLeakControl.java:367)
	at com.carrotsearch.randomizedtesting.ThreadLeakControl.forkTimeoutingTask(ThreadLeakControl.java:809)
	at com.carrotsearch.randomizedtesting.ThreadLeakControl$3.evaluate(ThreadLeakControl.java:460)
	at com.carrotsearch.randomizedtesting.RandomizedRunner.runSingleTest(RandomizedRunner.java:880)
	at com.carrotsearch.randomizedtesting.RandomizedRunner$5.evaluate(RandomizedRunner.java:781)
	at com.carrotsearch.randomizedtesting.RandomizedRunner$6.evaluate(RandomizedRunner.java:816)
	at com.carrotsearch.randomizedtesting.RandomizedRunner$7.evaluate(RandomizedRunner.java:827)
	at com.carrotsearch.randomizedtesting.rules.StatementAdapter.evaluate(StatementAdapter.java:36)
	at com.carrotsearch.randomizedtesting.rules.SystemPropertiesRestoreRule$1.evaluate(SystemPropertiesRestoreRule.java:57)
	at org.apache.lucene.util.AbstractBeforeAfterRule$1.evaluate(AbstractBeforeAfterRule.java:45)
	at com.carrotsearch.randomizedtesting.rules.StatementAdapter.evaluate(StatementAdapter.java:36)
	at org.apache.lucene.util.TestRuleStoreClassName$1.evaluate(TestRuleStoreClassName.java:41)
	at com.carrotsearch.randomizedtesting.rules.NoShadowingOrOverridesOnMethodsRule$1.evaluate(NoShadowingOrOverridesOnMethodsRule.java:40)
	at com.carrotsearch.randomizedtesting.rules.NoShadowingOrOverridesOnMethodsRule$1.evaluate(NoShadowingOrOverridesOnMethodsRule.java:40)
	at com.carrotsearch.randomizedtesting.rules.StatementAdapter.evaluate(StatementAdapter.java:36)
	at com.carrotsearch.randomizedtesting.rules.StatementAdapter.evaluate(StatementAdapter.java:36)
	at com.carrotsearch.randomizedtesting.rules.StatementAdapter.evaluate(StatementAdapter.java:36)
	at org.apache.lucene.util.TestRuleAssertionsRequired$1.evaluate(TestRuleAssertionsRequired.java:53)
	at org.apache.lucene.util.TestRuleMarkFailure$1.evaluate(TestRuleMarkFailure.java:47)
	at org.apache.lucene.util.TestRuleIgnoreAfterMaxFailures$1.evaluate(TestRuleIgnoreAfterMaxFailures.java:64)
	at org.apache.lucene.util.TestRuleIgnoreTestSuites$1.evaluate(TestRuleIgnoreTestSuites.java:54)
	at com.carrotsearch.randomizedtesting.rules.StatementAdapter.evaluate(StatementAdapter.java:36)
	at com.carrotsearch.randomizedtesting.ThreadLeakControl$StatementRunner.run(ThreadLeakControl.java:367)
	at java.lang.Thread.run(Thread.java:745)




Build Log:
[...truncated 12075 lines...]
   [junit4] Suite: org.apache.solr.handler.TestReqParamsAPI
   [junit4]   2> Creating dataDir: /x1/jenkins/jenkins-slave/workspace/Lucene-Solr-Tests-trunk-Java8/solr/build/solr-core/test/J2/temp/solr.handler.TestReqParamsAPI_39E6725A3B60CB1A-001/init-core-data-001
   [junit4]   2> 1964629 INFO  (SUITE-TestReqParamsAPI-seed#[39E6725A3B60CB1A]-worker) [    ] o.a.s.SolrTestCaseJ4 Randomized ssl (true) and clientAuth (false)
   [junit4]   2> 1964629 INFO  (SUITE-TestReqParamsAPI-seed#[39E6725A3B60CB1A]-worker) [    ] o.a.s.BaseDistributedSearchTestCase Setting hostContext system property: /f_kda/cd
   [junit4]   2> 1964631 INFO  (TEST-TestReqParamsAPI.test-seed#[39E6725A3B60CB1A]) [    ] o.a.s.c.ZkTestServer STARTING ZK TEST SERVER
   [junit4]   2> 1964632 INFO  (Thread-6185) [    ] o.a.s.c.ZkTestServer client port:0.0.0.0/0.0.0.0:0
   [junit4]   2> 1964632 INFO  (Thread-6185) [    ] o.a.s.c.ZkTestServer Starting server
   [junit4]   2> 1964732 INFO  (TEST-TestReqParamsAPI.test-seed#[39E6725A3B60CB1A]) [    ] o.a.s.c.ZkTestServer start zk server on port:58444
   [junit4]   2> 1964732 INFO  (TEST-TestReqParamsAPI.test-seed#[39E6725A3B60CB1A]) [    ] o.a.s.c.c.SolrZkClient Using default ZkCredentialsProvider
   [junit4]   2> 1964733 INFO  (TEST-TestReqParamsAPI.test-seed#[39E6725A3B60CB1A]) [    ] o.a.s.c.c.ConnectionManager Waiting for client to connect to ZooKeeper
   [junit4]   2> 1964735 INFO  (zkCallback-2356-thread-1) [    ] o.a.s.c.c.ConnectionManager Watcher org.apache.solr.common.cloud.ConnectionManager@c9d0164 name:ZooKeeperConnection Watcher:127.0.0.1:58444 got event WatchedEvent state:SyncConnected type:None path:null path:null type:None
   [junit4]   2> 1964735 INFO  (TEST-TestReqParamsAPI.test-seed#[39E6725A3B60CB1A]) [    ] o.a.s.c.c.ConnectionManager Client is connected to ZooKeeper
   [junit4]   2> 1964735 INFO  (TEST-TestReqParamsAPI.test-seed#[39E6725A3B60CB1A]) [    ] o.a.s.c.c.SolrZkClient Using default ZkACLProvider
   [junit4]   2> 1964735 INFO  (TEST-TestReqParamsAPI.test-seed#[39E6725A3B60CB1A]) [    ] o.a.s.c.c.SolrZkClient makePath: /solr
   [junit4]   2> 1964739 INFO  (TEST-TestReqParamsAPI.test-seed#[39E6725A3B60CB1A]) [    ] o.a.s.c.c.SolrZkClient Using default ZkCredentialsProvider
   [junit4]   2> 1964739 INFO  (TEST-TestReqParamsAPI.test-seed#[39E6725A3B60CB1A]) [    ] o.a.s.c.c.ConnectionManager Waiting for client to connect to ZooKeeper
   [junit4]   2> 1964740 INFO  (zkCallback-2357-thread-1) [    ] o.a.s.c.c.ConnectionManager Watcher org.apache.solr.common.cloud.ConnectionManager@5bf68c17 name:ZooKeeperConnection Watcher:127.0.0.1:58444/solr got event WatchedEvent state:SyncConnected type:None path:null path:null type:None
   [junit4]   2> 1964740 INFO  (TEST-TestReqParamsAPI.test-seed#[39E6725A3B60CB1A]) [    ] o.a.s.c.c.ConnectionManager Client is connected to ZooKeeper
   [junit4]   2> 1964741 INFO  (TEST-TestReqParamsAPI.test-seed#[39E6725A3B60CB1A]) [    ] o.a.s.c.c.SolrZkClient Using default ZkACLProvider
   [junit4]   2> 1964741 INFO  (TEST-TestReqParamsAPI.test-seed#[39E6725A3B60CB1A]) [    ] o.a.s.c.c.SolrZkClient makePath: /collections/collection1
   [junit4]   2> 1964743 INFO  (TEST-TestReqParamsAPI.test-seed#[39E6725A3B60CB1A]) [    ] o.a.s.c.c.SolrZkClient makePath: /collections/collection1/shards
   [junit4]   2> 1964745 INFO  (TEST-TestReqParamsAPI.test-seed#[39E6725A3B60CB1A]) [    ] o.a.s.c.c.SolrZkClient makePath: /collections/control_collection
   [junit4]   2> 1964746 INFO  (TEST-TestReqParamsAPI.test-seed#[39E6725A3B60CB1A]) [    ] o.a.s.c.c.SolrZkClient makePath: /collections/control_collection/shards
   [junit4]   2> 1964748 INFO  (TEST-TestReqParamsAPI.test-seed#[39E6725A3B60CB1A]) [    ] o.a.s.c.AbstractZkTestCase put /x1/jenkins/jenkins-slave/workspace/Lucene-Solr-Tests-trunk-Java8/solr/core/src/test-files/solr/collection1/conf/solrconfig-tlog.xml to /configs/conf1/solrconfig.xml
   [junit4]   2> 1964748 INFO  (TEST-TestReqParamsAPI.test-seed#[39E6725A3B60CB1A]) [    ] o.a.s.c.c.SolrZkClient makePath: /configs/conf1/solrconfig.xml
   [junit4]   2> 1964751 INFO  (TEST-TestReqParamsAPI.test-seed#[39E6725A3B60CB1A]) [    ] o.a.s.c.AbstractZkTestCase put /x1/jenkins/jenkins-slave/workspace/Lucene-Solr-Tests-trunk-Java8/solr/core/src/test-files/solr/collection1/conf/schema.xml to /configs/conf1/schema.xml
   [junit4]   2> 1964751 INFO  (TEST-TestReqParamsAPI.test-seed#[39E6725A3B60CB1A]) [    ] o.a.s.c.c.SolrZkClient makePath: /configs/conf1/schema.xml
   [junit4]   2> 1964753 INFO  (TEST-TestReqParamsAPI.test-seed#[39E6725A3B60CB1A]) [    ] o.a.s.c.AbstractZkTestCase put /x1/jenkins/jenkins-slave/workspace/Lucene-Solr-Tests-trunk-Java8/solr/core/src/test-files/solr/collection1/conf/solrconfig.snippet.randomindexconfig.xml to /configs/conf1/solrconfig.snippet.randomindexconfig.xml
   [junit4]   2> 1964753 INFO  (TEST-TestReqParamsAPI.test-seed#[39E6725A3B60CB1A]) [    ] o.a.s.c.c.SolrZkClient makePath: /configs/conf1/solrconfig.snippet.randomindexconfig.xml
   [junit4]   2> 1964755 INFO  (TEST-TestReqParamsAPI.test-seed#[39E6725A3B60CB1A]) [    ] o.a.s.c.AbstractZkTestCase put /x1/jenkins/jenkins-slave/workspace/Lucene-Solr-Tests-trunk-Java8/solr/core/src/test-files/solr/collection1/conf/stopwords.txt to /configs/conf1/stopwords.txt
   [junit4]   2> 1964755 INFO  (TEST-TestReqParamsAPI.test-seed#[39E6725A3B60CB1A]) [    ] o.a.s.c.c.SolrZkClient makePath: /configs/conf1/stopwords.txt
   [junit4]   2> 1964756 INFO  (TEST-TestReqParamsAPI.test-seed#[39E6725A3B60CB1A]) [    ] o.a.s.c.AbstractZkTestCase put /x1/jenkins/jenkins-slave/workspace/Lucene-Solr-Tests-trunk-Java8/solr/core/src/test-files/solr/collection1/conf/protwords.txt to /configs/conf1/protwords.txt
   [junit4]   2> 1964757 INFO  (TEST-TestReqParamsAPI.test-seed#[39E6725A3B60CB1A]) [    ] o.a.s.c.c.SolrZkClient makePath: /configs/conf1/protwords.txt
   [junit4]   2> 1964758 INFO  (TEST-TestReqParamsAPI.test-seed#[39E6725A3B60CB1A]) [    ] o.a.s.c.AbstractZkTestCase put /x1/jenkins/jenkins-slave/workspace/Lucene-Solr-Tests-trunk-Java8/solr/core/src/test-files/solr/collection1/conf/currency.xml to /configs/conf1/currency.xml
   [junit4]   2> 1964758 INFO  (TEST-TestReqParamsAPI.test-seed#[39E6725A3B60CB1A]) [    ] o.a.s.c.c.SolrZkClient makePath: /configs/conf1/currency.xml
   [junit4]   2> 1964760 INFO  (TEST-TestReqParamsAPI.test-seed#[39E6725A3B60CB1A]) [    ] o.a.s.c.AbstractZkTestCase put /x1/jenkins/jenkins-slave/workspace/Lucene-Solr-Tests-trunk-Java8/solr/core/src/test-files/solr/collection1/conf/enumsConfig.xml to /configs/conf1/enumsConfig.xml
   [junit4]   2> 1964760 INFO  (TEST-TestReqParamsAPI.test-seed#[39E6725A3B60CB1A]) [    ] o.a.s.c.c.SolrZkClient makePath: /configs/conf1/enumsConfig.xml
   [junit4]   2> 1964761 INFO  (TEST-TestReqParamsAPI.test-seed#[39E6725A3B60CB1A]) [    ] o.a.s.c.AbstractZkTestCase put /x1/jenkins/jenkins-slave/workspace/Lucene-Solr-Tests-trunk-Java8/solr/core/src/test-files/solr/collection1/conf/open-exchange-rates.json to /configs/conf1/open-exchange-rates.json
   [junit4]   2> 1964762 INFO  (TEST-TestReqParamsAPI.test-seed#[39E6725A3B60CB1A]) [    ] o.a.s.c.c.SolrZkClient makePath: /configs/conf1/open-exchange-rates.json
   [junit4]   2> 1964763 INFO  (TEST-TestReqParamsAPI.test-seed#[39E6725A3B60CB1A]) [    ] o.a.s.c.AbstractZkTestCase put /x1/jenkins/jenkins-slave/workspace/Lucene-Solr-Tests-trunk-Java8/solr/core/src/test-files/solr/collection1/conf/mapping-ISOLatin1Accent.txt to /configs/conf1/mapping-ISOLatin1Accent.txt
   [junit4]   2> 1964764 INFO  (TEST-TestReqParamsAPI.test-seed#[39E6725A3B60CB1A]) [    ] o.a.s.c.c.SolrZkClient makePath: /configs/conf1/mapping-ISOLatin1Accent.txt
   [junit4]   2> 1964765 INFO  (TEST-TestReqParamsAPI.test-seed#[39E6725A3B60CB1A]) [    ] o.a.s.c.AbstractZkTestCase put /x1/jenkins/jenkins-slave/workspace/Lucene-Solr-Tests-trunk-Java8/solr/core/src/test-files/solr/collection1/conf/old_synonyms.txt to /configs/conf1/old_synonyms.txt
   [junit4]   2> 1964766 INFO  (TEST-TestReqParamsAPI.test-seed#[39E6725A3B60CB1A]) [    ] o.a.s.c.c.SolrZkClient makePath: /configs/conf1/old_synonyms.txt
   [junit4]   2> 1964767 INFO  (TEST-TestReqParamsAPI.test-seed#[39E6725A3B60CB1A]) [    ] o.a.s.c.AbstractZkTestCase put /x1/jenkins/jenkins-slave/workspace/Lucene-Solr-Tests-trunk-Java8/solr/core/src/test-files/solr/collection1/conf/synonyms.txt to /configs/conf1/synonyms.txt
   [junit4]   2> 1964767 INFO  (TEST-TestReqParamsAPI.test-seed#[39E6725A3B60CB1A]) [    ] o.a.s.c.c.SolrZkClient makePath: /configs/conf1/synonyms.txt
   [junit4]   2> 1964769 INFO  (TEST-TestReqParamsAPI.test-seed#[39E6725A3B60CB1A]) [    ] o.a.s.c.c.SolrZkClient Using default ZkCredentialsProvider
   [junit4]   2> 1964770 INFO  (TEST-TestReqParamsAPI.test-seed#[39E6725A3B60CB1A]) [    ] o.a.s.c.c.ConnectionManager Waiting for client to connect to ZooKeeper
   [junit4]   2> 1964771 INFO  (zkCallback-2358-thread-1) [    ] o.a.s.c.c.ConnectionManager Watcher org.apache.solr.common.cloud.ConnectionManager@7cf284b4 name:ZooKeeperConnection Watcher:127.0.0.1:58444/solr got event WatchedEvent state:SyncConnected type:None path:null path:null type:None
   [junit4]   2> 1964771 INFO  (TEST-TestReqParamsAPI.test-seed#[39E6725A3B60CB1A]) [    ] o.a.s.c.c.ConnectionManager Client is connected to ZooKeeper
   [junit4]   2> 1964771 INFO  (TEST-TestReqParamsAPI.test-seed#[39E6725A3B60CB1A]) [    ] o.a.s.c.c.SolrZkClient Using default ZkACLProvider
   [junit4]   2> 1964772 WARN  (NIOServerCxn.Factory:0.0.0.0/0.0.0.0:0) [    ] o.a.z.s.NIOServerCnxn caught end of stream exception
   [junit4]   2> EndOfStreamException: Unable to read additional data from client sessionid 0x1533a902bce0002, likely client has closed socket
   [junit4]   2> 	at org.apache.zookeeper.server.NIOServerCnxn.doIO(NIOServerCnxn.java:228)
   [junit4]   2> 	at org.apache.zookeeper.server.NIOServerCnxnFactory.run(NIOServerCnxnFactory.java:208)
   [junit4]   2> 	at java.lang.Thread.run(Thread.java:745)
   [junit4]   2> 1964872 INFO  (TEST-TestReqParamsAPI.test-seed#[39E6725A3B60CB1A]) [    ] o.a.s.SolrTestCaseJ4 Writing core.properties file to /x1/jenkins/jenkins-slave/workspace/Lucene-Solr-Tests-trunk-Java8/solr/build/solr-core/test/J2/temp/solr.handler.TestReqParamsAPI_39E6725A3B60CB1A-001/control-001/cores/collection1
   [junit4]   2> 1964874 INFO  (TEST-TestReqParamsAPI.test-seed#[39E6725A3B60CB1A]) [    ] o.e.j.s.Server jetty-9.3.6.v20151106
   [junit4]   2> 1964876 INFO  (TEST-TestReqParamsAPI.test-seed#[39E6725A3B60CB1A]) [    ] o.e.j.s.h.ContextHandler Started o.e.j.s.ServletContextHandler@13fbe813{/f_kda/cd,null,AVAILABLE}
   [junit4]   2> 1964878 INFO  (TEST-TestReqParamsAPI.test-seed#[39E6725A3B60CB1A]) [    ] o.e.j.u.s.SslContextFactory x509=X509@6b7ffa47(solrtest,h=[],w=[]) for SslContextFactory@6f9f001c(file:///x1/jenkins/jenkins-slave/workspace/Lucene-Solr-Tests-trunk-Java8/solr/server/etc/test/solrtest.keystore,file:///x1/jenkins/jenkins-slave/workspace/Lucene-Solr-Tests-trunk-Java8/solr/server/etc/test/solrtest.keystore)
   [junit4]   2> 1964881 INFO  (TEST-TestReqParamsAPI.test-seed#[39E6725A3B60CB1A]) [    ] o.e.j.s.ServerConnector Started ServerConnector@7ba6726a{SSL,[ssl, http/1.1]}{127.0.0.1:50989}
   [junit4]   2> 1964881 INFO  (TEST-TestReqParamsAPI.test-seed#[39E6725A3B60CB1A]) [    ] o.e.j.s.Server Started @1968253ms
   [junit4]   2> 1964882 INFO  (TEST-TestReqParamsAPI.test-seed#[39E6725A3B60CB1A]) [    ] o.a.s.c.s.e.JettySolrRunner Jetty properties: {solr.data.dir=/x1/jenkins/jenkins-slave/workspace/Lucene-Solr-Tests-trunk-Java8/solr/build/solr-core/test/J2/temp/solr.handler.TestReqParamsAPI_39E6725A3B60CB1A-001/tempDir-001/control/data, hostContext=/f_kda/cd, hostPort=50989, coreRootDirectory=/x1/jenkins/jenkins-slave/workspace/Lucene-Solr-Tests-trunk-Java8/solr/build/solr-core/test/J2/temp/solr.handler.TestReqParamsAPI_39E6725A3B60CB1A-001/control-001/cores}
   [junit4]   2> 1964882 INFO  (TEST-TestReqParamsAPI.test-seed#[39E6725A3B60CB1A]) [    ] o.a.s.s.SolrDispatchFilter SolrDispatchFilter.init(): sun.misc.Launcher$AppClassLoader@4e0e2f2a
   [junit4]   2> 1964882 INFO  (TEST-TestReqParamsAPI.test-seed#[39E6725A3B60CB1A]) [    ] o.a.s.c.SolrResourceLoader new SolrResourceLoader for directory: '/x1/jenkins/jenkins-slave/workspace/Lucene-Solr-Tests-trunk-Java8/solr/build/solr-core/test/J2/temp/solr.handler.TestReqParamsAPI_39E6725A3B60CB1A-001/control-001'
   [junit4]   2> 1964882 INFO  (TEST-TestReqParamsAPI.test-seed#[39E6725A3B60CB1A]) [    ] o.a.s.c.SolrResourceLoader JNDI not configured for solr (NoInitialContextEx)
   [junit4]   2> 1964882 INFO  (TEST-TestReqParamsAPI.test-seed#[39E6725A3B60CB1A]) [    ] o.a.s.c.SolrResourceLoader solr home defaulted to 'solr/' (could not find system property or JNDI)
   [junit4]   2> 1964883 INFO  (TEST-TestReqParamsAPI.test-seed#[39E6725A3B60CB1A]) [    ] o.a.s.c.c.SolrZkClient Using default ZkCredentialsProvider
   [junit4]   2> 1964883 INFO  (TEST-TestReqParamsAPI.test-seed#[39E6725A3B60CB1A]) [    ] o.a.s.c.c.ConnectionManager Waiting for client to connect to ZooKeeper
   [junit4]   2> 1964884 INFO  (zkCallback-2359-thread-1) [    ] o.a.s.c.c.ConnectionManager Watcher org.apache.solr.common.cloud.ConnectionManager@de1f1ba name:ZooKeeperConnection Watcher:127.0.0.1:58444/solr got event WatchedEvent state:SyncConnected type:None path:null path:null type:None
   [junit4]   2> 1964884 INFO  (TEST-TestReqParamsAPI.test-seed#[39E6725A3B60CB1A]) [    ] o.a.s.c.c.ConnectionManager Client is connected to ZooKeeper
   [junit4]   2> 1964884 INFO  (TEST-TestReqParamsAPI.test-seed#[39E6725A3B60CB1A]) [    ] o.a.s.c.c.SolrZkClient Using default ZkACLProvider
   [junit4]   2> 1964885 INFO  (TEST-TestReqParamsAPI.test-seed#[39E6725A3B60CB1A]) [    ] o.a.s.s.SolrDispatchFilter Loading solr.xml from SolrHome (not found in ZooKeeper)
   [junit4]   2> 1964885 INFO  (TEST-TestReqParamsAPI.test-seed#[39E6725A3B60CB1A]) [    ] o.a.s.c.SolrXmlConfig Loading container configuration from /x1/jenkins/jenkins-slave/workspace/Lucene-Solr-Tests-trunk-Java8/solr/build/solr-core/test/J2/temp/solr.handler.TestReqParamsAPI_39E6725A3B60CB1A-001/control-001/solr.xml
   [junit4]   2> 1965731 INFO  (TEST-TestReqParamsAPI.test-seed#[39E6725A3B60CB1A]) [    ] o.a.s.c.CorePropertiesLocator Config-defined core root directory: /x1/jenkins/jenkins-slave/workspace/Lucene-Solr-Tests-trunk-Java8/solr/build/solr-core/test/J2/temp/solr.handler.TestReqParamsAPI_39E6725A3B60CB1A-001/control-001/cores
   [junit4]   2> 1965732 INFO  (TEST-TestReqParamsAPI.test-seed#[39E6725A3B60CB1A]) [    ] o.a.s.c.CoreContainer New CoreContainer 248058561
   [junit4]   2> 1965732 INFO  (TEST-TestReqParamsAPI.test-seed#[39E6725A3B60CB1A]) [    ] o.a.s.c.CoreContainer Loading cores into CoreContainer [instanceDir=/x1/jenkins/jenkins-slave/workspace/Lucene-Solr-Tests-trunk-Java8/solr/build/solr-core/test/J2/temp/solr.handler.TestReqParamsAPI_39E6725A3B60CB1A-001/control-001]
   [junit4]   2> 1965732 WARN  (TEST-TestReqParamsAPI.test-seed#[39E6725A3B60CB1A]) [    ] o.a.s.c.CoreContainer Couldn't add files from /x1/jenkins/jenkins-slave/workspace/Lucene-Solr-Tests-trunk-Java8/solr/build/solr-core/test/J2/temp/solr.handler.TestReqParamsAPI_39E6725A3B60CB1A-001/control-001/lib to classpath: /x1/jenkins/jenkins-slave/workspace/Lucene-Solr-Tests-trunk-Java8/solr/build/solr-core/test/J2/temp/solr.handler.TestReqParamsAPI_39E6725A3B60CB1A-001/control-001/lib
   [junit4]   2> 1965733 INFO  (TEST-TestReqParamsAPI.test-seed#[39E6725A3B60CB1A]) [    ] o.a.s.h.c.HttpShardHandlerFactory created with socketTimeout : 90000,urlScheme : ,connTimeout : 15000,maxConnectionsPerHost : 20,maxConnections : 10000,corePoolSize : 0,maximumPoolSize : 2147483647,maxThreadIdleTime : 5,sizeOfQueue : -1,fairnessPolicy : false,useRetries : false,
   [junit4]   2> 1965735 INFO  (TEST-TestReqParamsAPI.test-seed#[39E6725A3B60CB1A]) [    ] o.a.s.u.UpdateShardHandler Creating UpdateShardHandler HTTP client with params: socketTimeout=340000&connTimeout=45000&retry=true
   [junit4]   2> 1965737 INFO  (TEST-TestReqParamsAPI.test-seed#[39E6725A3B60CB1A]) [    ] o.a.s.l.LogWatcher SLF4J impl is org.slf4j.impl.Log4jLoggerFactory
   [junit4]   2> 1965737 INFO  (TEST-TestReqParamsAPI.test-seed#[39E6725A3B60CB1A]) [    ] o.a.s.l.LogWatcher Registering Log Listener [Log4j (org.slf4j.impl.Log4jLoggerFactory)]
   [junit4]   2> 1965737 INFO  (TEST-TestReqParamsAPI.test-seed#[39E6725A3B60CB1A]) [    ] o.a.s.c.ZkContainer Zookeeper client=127.0.0.1:58444/solr
   [junit4]   2> 1965737 INFO  (TEST-TestReqParamsAPI.test-seed#[39E6725A3B60CB1A]) [    ] o.a.s.c.ZkController zkHost includes chroot
   [junit4]   2> 1965737 INFO  (TEST-TestReqParamsAPI.test-seed#[39E6725A3B60CB1A]) [    ] o.a.s.c.c.SolrZkClient Using default ZkCredentialsProvider
   [junit4]   2> 1965738 INFO  (TEST-TestReqParamsAPI.test-seed#[39E6725A3B60CB1A]) [    ] o.a.s.c.c.ConnectionManager Waiting for client to connect to ZooKeeper
   [junit4]   2> 1965739 INFO  (zkCallback-2362-thread-1) [    ] o.a.s.c.c.ConnectionManager Watcher org.apache.solr.common.cloud.ConnectionManager@45138c71 name:ZooKeeperConnection Watcher:127.0.0.1:58444 got event WatchedEvent state:SyncConnected type:None path:null path:null type:None
   [junit4]   2> 1965739 INFO  (TEST-TestReqParamsAPI.test-seed#[39E6725A3B60CB1A]) [    ] o.a.s.c.c.ConnectionManager Client is connected to ZooKeeper
   [junit4]   2> 1965740 INFO  (TEST-TestReqParamsAPI.test-seed#[39E6725A3B60CB1A]) [    ] o.a.s.c.c.SolrZkClient Using default ZkACLProvider
   [junit4]   2> 1965741 INFO  (TEST-TestReqParamsAPI.test-seed#[39E6725A3B60CB1A]) [n:127.0.0.1:50989_f_kda%2Fcd    ] o.a.s.c.c.ConnectionManager Waiting for client to connect to ZooKeeper
   [junit4]   2> 1965742 INFO  (zkCallback-2363-thread-1-processing-n:127.0.0.1:50989_f_kda%2Fcd) [n:127.0.0.1:50989_f_kda%2Fcd    ] o.a.s.c.c.ConnectionManager Watcher org.apache.solr.common.cloud.ConnectionManager@31fec9b7 name:ZooKeeperConnection Watcher:127.0.0.1:58444/solr got event WatchedEvent state:SyncConnected type:None path:null path:null type:None
   [junit4]   2> 1965742 INFO  (TEST-TestReqParamsAPI.test-seed#[39E6725A3B60CB1A]) [n:127.0.0.1:50989_f_kda%2Fcd    ] o.a.s.c.c.ConnectionManager Client is connected to ZooKeeper
   [junit4]   2> 1965743 INFO  (TEST-TestReqParamsAPI.test-seed#[39E6725A3B60CB1A]) [n:127.0.0.1:50989_f_kda%2Fcd    ] o.a.s.c.c.SolrZkClient makePath: /overseer/queue
   [junit4]   2> 1965745 INFO  (TEST-TestReqParamsAPI.test-seed#[39E6725A3B60CB1A]) [n:127.0.0.1:50989_f_kda%2Fcd    ] o.a.s.c.c.SolrZkClient makePath: /overseer/collection-queue-work
   [junit4]   2> 1965748 INFO  (TEST-TestReqParamsAPI.test-seed#[39E6725A3B60CB1A]) [n:127.0.0.1:50989_f_kda%2Fcd    ] o.a.s.c.c.SolrZkClient makePath: /overseer/collection-map-running
   [junit4]   2> 1965750 INFO  (TEST-TestReqParamsAPI.test-seed#[39E6725A3B60CB1A]) [n:127.0.0.1:50989_f_kda%2Fcd    ] o.a.s.c.c.SolrZkClient makePath: /overseer/collection-map-completed
   [junit4]   2> 1965752 INFO  (TEST-TestReqParamsAPI.test-seed#[39E6725A3B60CB1A]) [n:127.0.0.1:50989_f_kda%2Fcd    ] o.a.s.c.c.SolrZkClient makePath: /overseer/collection-map-failure
   [junit4]   2> 1965753 INFO  (TEST-TestReqParamsAPI.test-seed#[39E6725A3B60CB1A]) [n:127.0.0.1:50989_f_kda%2Fcd    ] o.a.s.c.c.SolrZkClient makePath: /live_nodes
   [junit4]   2> 1965755 INFO  (TEST-TestReqParamsAPI.test-seed#[39E6725A3B60CB1A]) [n:127.0.0.1:50989_f_kda%2Fcd    ] o.a.s.c.c.SolrZkClient makePath: /aliases.json
   [junit4]   2> 1965756 INFO  (TEST-TestReqParamsAPI.test-seed#[39E6725A3B60CB1A]) [n:127.0.0.1:50989_f_kda%2Fcd    ] o.a.s.c.c.SolrZkClient makePath: /clusterstate.json
   [junit4]   2> 1965757 INFO  (TEST-TestReqParamsAPI.test-seed#[39E6725A3B60CB1A]) [n:127.0.0.1:50989_f_kda%2Fcd    ] o.a.s.c.c.SolrZkClient makePath: /security.json
   [junit4]   2> 1965758 INFO  (TEST-TestReqParamsAPI.test-seed#[39E6725A3B60CB1A]) [n:127.0.0.1:50989_f_kda%2Fcd    ] o.a.s.c.c.ZkStateReader Updating cluster state from ZooKeeper... 
   [junit4]   2> 1965759 INFO  (TEST-TestReqParamsAPI.test-seed#[39E6725A3B60CB1A]) [n:127.0.0.1:50989_f_kda%2Fcd    ] o.a.s.c.c.ZkStateReader Updated live nodes from ZooKeeper... (0) -> (0)
   [junit4]   2> 1965760 INFO  (TEST-TestReqParamsAPI.test-seed#[39E6725A3B60CB1A]) [n:127.0.0.1:50989_f_kda%2Fcd    ] o.a.s.c.c.SolrZkClient makePath: /overseer_elect
   [junit4]   2> 1965762 INFO  (TEST-TestReqParamsAPI.test-seed#[39E6725A3B60CB1A]) [n:127.0.0.1:50989_f_kda%2Fcd    ] o.a.s.c.c.SolrZkClient makePath: /overseer_elect/election
   [junit4]   2> 1965763 INFO  (TEST-TestReqParamsAPI.test-seed#[39E6725A3B60CB1A]) [n:127.0.0.1:50989_f_kda%2Fcd    ] o.a.s.c.Overseer Overseer (id=null) closing
   [junit4]   2> 1965763 INFO  (TEST-TestReqParamsAPI.test-seed#[39E6725A3B60CB1A]) [n:127.0.0.1:50989_f_kda%2Fcd    ] o.a.s.c.LeaderElector Joined leadership election with path: /overseer_elect/election/95484407989534725-127.0.0.1:50989_f_kda%2Fcd-n_0000000000
   [junit4]   2> 1965763 INFO  (TEST-TestReqParamsAPI.test-seed#[39E6725A3B60CB1A]) [n:127.0.0.1:50989_f_kda%2Fcd    ] o.a.s.c.OverseerElectionContext I am going to be the leader 127.0.0.1:50989_f_kda%2Fcd
   [junit4]   2> 1965764 INFO  (TEST-TestReqParamsAPI.test-seed#[39E6725A3B60CB1A]) [n:127.0.0.1:50989_f_kda%2Fcd    ] o.a.s.c.c.SolrZkClient makePath: /overseer_elect/leader
   [junit4]   2> 1965765 INFO  (TEST-TestReqParamsAPI.test-seed#[39E6725A3B60CB1A]) [n:127.0.0.1:50989_f_kda%2Fcd    ] o.a.s.c.Overseer Overseer (id=95484407989534725-127.0.0.1:50989_f_kda%2Fcd-n_0000000000) starting
   [junit4]   2> 1965766 INFO  (TEST-TestReqParamsAPI.test-seed#[39E6725A3B60CB1A]) [n:127.0.0.1:50989_f_kda%2Fcd    ] o.a.s.c.c.SolrZkClient makePath: /overseer/queue-work
   [junit4]   2> 1965771 INFO  (TEST-TestReqParamsAPI.test-seed#[39E6725A3B60CB1A]) [n:127.0.0.1:50989_f_kda%2Fcd    ] o.a.s.c.OverseerAutoReplicaFailoverThread Starting OverseerAutoReplicaFailoverThread autoReplicaFailoverWorkLoopDelay=10000 autoReplicaFailoverWaitAfterExpiration=30000 autoReplicaFailoverBadNodeExpiration=60000
   [junit4]   2> 1965771 INFO  (OverseerCollectionConfigSetProcessor-95484407989534725-127.0.0.1:50989_f_kda%2Fcd-n_0000000000) [n:127.0.0.1:50989_f_kda%2Fcd    ] o.a.s.c.OverseerTaskProcessor Process current queue of overseer operations
   [junit4]   2> 1965771 INFO  (OverseerStateUpdate-95484407989534725-127.0.0.1:50989_f_kda%2Fcd-n_0000000000) [n:127.0.0.1:50989_f_kda%2Fcd    ] o.a.s.c.Overseer Starting to work on the main queue
   [junit4]   2> 1965772 INFO  (TEST-TestReqParamsAPI.test-seed#[39E6725A3B60CB1A]) [n:127.0.0.1:50989_f_kda%2Fcd    ] o.a.s.c.ZkController Register node as live in ZooKeeper:/live_nodes/127.0.0.1:50989_f_kda%2Fcd
   [junit4]   2> 1965772 INFO  (TEST-TestReqParamsAPI.test-seed#[39E6725A3B60CB1A]) [n:127.0.0.1:50989_f_kda%2Fcd    ] o.a.s.c.c.SolrZkClient makePath: /live_nodes/127.0.0.1:50989_f_kda%2Fcd
   [junit4]   2> 1965773 INFO  (OverseerStateUpdate-95484407989534725-127.0.0.1:50989_f_kda%2Fcd-n_0000000000) [n:127.0.0.1:50989_f_kda%2Fcd    ] o.a.s.c.c.ZkStateReader Updated live nodes from ZooKeeper... (0) -> (0)
   [junit4]   2> 1965773 INFO  (zkCallback-2363-thread-1-processing-n:127.0.0.1:50989_f_kda%2Fcd) [n:127.0.0.1:50989_f_kda%2Fcd    ] o.a.s.c.c.ZkStateReader A live node change: [WatchedEvent state:SyncConnected type:NodeChildrenChanged path:/live_nodes], has occurred - updating... (live nodes size: [0])
   [junit4]   2> 1965774 INFO  (zkCallback-2363-thread-1-processing-n:127.0.0.1:50989_f_kda%2Fcd) [n:127.0.0.1:50989_f_kda%2Fcd    ] o.a.s.c.c.ZkStateReader Updated live nodes from ZooKeeper... (0) -> (1)
   [junit4]   2> 1965788 INFO  (TEST-TestReqParamsAPI.test-seed#[39E6725A3B60CB1A]) [n:127.0.0.1:50989_f_kda%2Fcd    ] o.a.s.c.CoreContainer Security conf doesn't exist. Skipping setup for authorization module.
   [junit4]   2> 1965788 INFO  (TEST-TestReqParamsAPI.test-seed#[39E6725A3B60CB1A]) [n:127.0.0.1:50989_f_kda%2Fcd    ] o.a.s.c.CoreContainer No authentication plugin used.
   [junit4]   2> 1965789 INFO  (TEST-TestReqParamsAPI.test-seed#[39E6725A3B60CB1A]) [n:127.0.0.1:50989_f_kda%2Fcd    ] o.a.s.c.CorePropertiesLocator Looking for core definitions underneath /x1/jenkins/jenkins-slave/workspace/Lucene-Solr-Tests-trunk-Java8/solr/build/solr-core/test/J2/temp/solr.handler.TestReqParamsAPI_39E6725A3B60CB1A-001/control-001/cores
   [junit4]   2> 1965789 INFO  (TEST-TestReqParamsAPI.test-seed#[39E6725A3B60CB1A]) [n:127.0.0.1:50989_f_kda%2Fcd    ] o.a.s.c.CoreDescriptor Created CoreDescriptor: {name=collection1, config=solrconfig.xml, transient=false, schema=schema.xml, loadOnStartup=true, configSetProperties=configsetprops.json, collection=control_collection, coreNodeName=, dataDir=data/, shard=}
   [junit4]   2> 1965790 INFO  (TEST-TestReqParamsAPI.test-seed#[39E6725A3B60CB1A]) [n:127.0.0.1:50989_f_kda%2Fcd    ] o.a.s.c.CorePropertiesLocator Found core collection1 in /x1/jenkins/jenkins-slave/workspace/Lucene-Solr-Tests-trunk-Java8/solr/build/solr-core/test/J2/temp/solr.handler.TestReqParamsAPI_39E6725A3B60CB1A-001/control-001/cores/collection1
   [junit4]   2> 1965790 INFO  (TEST-TestReqParamsAPI.test-seed#[39E6725A3B60CB1A]) [n:127.0.0.1:50989_f_kda%2Fcd    ] o.a.s.c.CorePropertiesLocator Found 1 core definitions
   [junit4]   2> 1965791 INFO  (TEST-TestReqParamsAPI.test-seed#[39E6725A3B60CB1A]) [n:127.0.0.1:50989_f_kda%2Fcd    ] o.a.s.s.SolrDispatchFilter user.dir=/x1/jenkins/jenkins-slave/workspace/Lucene-Solr-Tests-trunk-Java8/solr/build/solr-core/test/J2
   [junit4]   2> 1965791 INFO  (TEST-TestReqParamsAPI.test-seed#[39E6725A3B60CB1A]) [n:127.0.0.1:50989_f_kda%2Fcd    ] o.a.s.s.SolrDispatchFilter SolrDispatchFilter.init() done
   [junit4]   2> 1965791 INFO  (coreLoadExecutor-6231-thread-1-processing-n:127.0.0.1:50989_f_kda%2Fcd) [n:127.0.0.1:50989_f_kda%2Fcd c:control_collection   x:collection1] o.a.s.c.ZkController publishing state=down
   [junit4]   2> 1965791 INFO  (coreLoadExecutor-6231-thread-1-processing-n:127.0.0.1:50989_f_kda%2Fcd) [n:127.0.0.1:50989_f_kda%2Fcd c:control_collection   x:collection1] o.a.s.c.ZkController numShards not found on descriptor - reading it from system property
   [junit4]   2> 1965793 INFO  (OverseerStateUpdate-95484407989534725-127.0.0.1:50989_f_kda%2Fcd-n_0000000000) [n:127.0.0.1:50989_f_kda%2Fcd    ] o.a.s.c.Overseer processMessage: queueSize: 1, message = {
   [junit4]   2>   "core":"collection1",
   [junit4]   2>   "roles":null,
   [junit4]   2>   "base_url":"https://127.0.0.1:50989/f_kda/cd",
   [junit4]   2>   "node_name":"127.0.0.1:50989_f_kda%2Fcd",
   [junit4]   2>   "numShards":"1",
   [junit4]   2>   "state":"down",
   [junit4]   2>   "shard":null,
   [junit4]   2>   "collection":"control_collection",
   [junit4]   2>   "operation":"state"} current state version: 0
   [junit4]   2> 1965794 INFO  (coreLoadExecutor-6231-thread-1-processing-n:127.0.0.1:50989_f_kda%2Fcd) [n:127.0.0.1:50989_f_kda%2Fcd c:control_collection   x:collection1] o.a.s.c.ZkController look for our core node name
   [junit4]   2> 1965794 INFO  (OverseerStateUpdate-95484407989534725-127.0.0.1:50989_f_kda%2Fcd-n_0000000000) [n:127.0.0.1:50989_f_kda%2Fcd    ] o.a.s.c.o.ReplicaMutator Update state numShards=1 message={
   [junit4]   2>   "core":"collection1",
   [junit4]   2>   "roles":null,
   [junit4]   2>   "base_url":"https://127.0.0.1:50989/f_kda/cd",
   [junit4]   2>   "node_name":"127.0.0.1:50989_f_kda%2Fcd",
   [junit4]   2>   "numShards":"1",
   [junit4]   2>   "state":"down",
   [junit4]   2>   "shard":null,
   [junit4]   2>   "collection":"control_collection",
   [junit4]   2>   "operation":"state"}
   [junit4]   2> 1965794 INFO  (OverseerStateUpdate-95484407989534725-127.0.0.1:50989_f_kda%2Fcd-n_0000000000) [n:127.0.0.1:50989_f_kda%2Fcd    ] o.a.s.c.o.ClusterStateMutator building a new cName: control_collection
   [junit4]   2> 1965795 INFO  (OverseerStateUpdate-95484407989534725-127.0.0.1:50989_f_kda%2Fcd-n_0000000000) [n:127.0.0.1:50989_f_kda%2Fcd    ] o.a.s.c.o.ReplicaMutator Assigning new node to shard shard=shard1
   [junit4]   2> 1965797 INFO  (zkCallback-2363-thread-1-processing-n:127.0.0.1:50989_f_kda%2Fcd) [n:127.0.0.1:50989_f_kda%2Fcd    ] o.a.s.c.c.ZkStateReader A cluster state change: [WatchedEvent state:SyncConnected type:NodeDataChanged path:/clusterstate.json], has occurred - updating... (live nodes size: [1])
   [junit4]   2> 1966794 INFO  (coreLoadExecutor-6231-thread-1-processing-n:127.0.0.1:50989_f_kda%2Fcd) [n:127.0.0.1:50989_f_kda%2Fcd c:control_collection   x:collection1] o.a.s.c.ZkController waiting to find shard id in clusterstate for collection1
   [junit4]   2> 1966794 INFO  (coreLoadExecutor-6231-thread-1-processing-n:127.0.0.1:50989_f_kda%2Fcd) [n:127.0.0.1:50989_f_kda%2Fcd c:control_collection   x:collection1] o.a.s.c.ZkController Check for collection zkNode:control_collection
   [junit4]   2> 1966795 INFO  (coreLoadExecutor-6231-thread-1-processing-n:127.0.0.1:50989_f_kda%2Fcd) [n:127.0.0.1:50989_f_kda%2Fcd c:control_collection   x:collection1] o.a.s.c.ZkController Collection zkNode exists
   [junit4]   2> 1966795 INFO  (coreLoadExecutor-6231-thread-1-processing-n:127.0.0.1:50989_f_kda%2Fcd) [n:127.0.0.1:50989_f_kda%2Fcd c:control_collection   x:collection1] o.a.s.c.c.ZkStateReader Load collection config from: [/collections/control_collection]
   [junit4]   2> 1966796 INFO  (coreLoadExecutor-6231-thread-1-processing-n:127.0.0.1:50989_f_kda%2Fcd) [n:127.0.0.1:50989_f_kda%2Fcd c:control_collection   x:collection1] o.a.s.c.c.ZkStateReader path=[/collections/control_collection] [configName]=[conf1] specified config exists in ZooKeeper
   [junit4]   2> 1966796 INFO  (coreLoadExecutor-6231-thread-1-processing-n:127.0.0.1:50989_f_kda%2Fcd) [n:127.0.0.1:50989_f_kda%2Fcd c:control_collection   x:collection1] o.a.s.c.SolrResourceLoader new SolrResourceLoader for directory: '/x1/jenkins/jenkins-slave/workspace/Lucene-Solr-Tests-trunk-Java8/solr/build/solr-core/test/J2/temp/solr.handler.TestReqParamsAPI_39E6725A3B60CB1A-001/control-001/cores/collection1'
   [junit4]   2> 1966796 INFO  (coreLoadExecutor-6231-thread-1-processing-n:127.0.0.1:50989_f_kda%2Fcd) [n:127.0.0.1:50989_f_kda%2Fcd c:control_collection   x:collection1] o.a.s.c.SolrResourceLoader JNDI not configured for solr (NoInitialContextEx)
   [junit4]   2> 1966796 INFO  (coreLoadExecutor-6231-thread-1-processing-n:127.0.0.1:50989_f_kda%2Fcd) [n:127.0.0.1:50989_f_kda%2Fcd c:control_collection   x:collection1] o.a.s.c.SolrResourceLoader solr home defaulted to 'solr/' (could not find system property or JNDI)
   [junit4]   2> 1966798 INFO  (coreLoadExecutor-6231-thread-1-processing-n:127.0.0.1:50989_f_kda%2Fcd) [n:127.0.0.1:50989_f_kda%2Fcd c:control_collection   x:collection1] o.a.s.c.Config loaded config solrconfig.xml with version 0 
   [junit4]   2> 1966803 INFO  (coreLoadExecutor-6231-thread-1-processing-n:127.0.0.1:50989_f_kda%2Fcd) [n:127.0.0.1:50989_f_kda%2Fcd c:control_collection   x:collection1] o.a.s.c.SolrConfig current version of requestparams : -1
   [junit4]   2> 1966807 INFO  (coreLoadExecutor-6231-thread-1-processing-n:127.0.0.1:50989_f_kda%2Fcd) [n:127.0.0.1:50989_f_kda%2Fcd c:control_collection   x:collection1] o.a.s.c.SolrConfig Using Lucene MatchVersion: 7.0.0
   [junit4]   2> 1966815 INFO  (coreLoadExecutor-6231-thread-1-processing-n:127.0.0.1:50989_f_kda%2Fcd) [n:127.0.0.1:50989_f_kda%2Fcd c:control_collection   x:collection1] o.a.s.c.SolrConfig Loaded SolrConfig: solrconfig.xml
   [junit4]   2> 1966821 INFO  (coreLoadExecutor-6231-thread-1-processing-n:127.0.0.1:50989_f_kda%2Fcd) [n:127.0.0.1:50989_f_kda%2Fcd c:control_collection   x:collection1] o.a.s.s.IndexSchema [collection1] Schema name=test
   [junit4]   2> 1966915 INFO  (coreLoadExecutor-6231-thread-1-processing-n:127.0.0.1:50989_f_kda%2Fcd) [n:127.0.0.1:50989_f_kda%2Fcd c:control_collection   x:collection1] o.a.s.s.OpenExchangeRatesOrgProvider Initialized with rates=open-exchange-rates.json, refreshInterval=1440.
   [junit4]   2> 1966921 INFO  (coreLoadExecutor-6231-thread-1-processing-n:127.0.0.1:50989_f_kda%2Fcd) [n:127.0.0.1:50989_f_kda%2Fcd c:control_collection   x:collection1] o.a.s.s.IndexSchema default search field in schema is text
   [junit4]   2> 1966922 INFO  (coreLoadExecutor-6231-thread-1-processing-n:127.0.0.1:50989_f_kda%2Fcd) [n:127.0.0.1:50989_f_kda%2Fcd c:control_collection   x:collection1] o.a.s.s.IndexSchema unique key field: id
   [junit4]   2> 1966932 INFO  (coreLoadExecutor-6231-thread-1-processing-n:127.0.0.1:50989_f_kda%2Fcd) [n:127.0.0.1:50989_f_kda%2Fcd c:control_collection   x:collection1] o.a.s.s.FileExchangeRateProvider Reloading exchange rates from file currency.xml
   [junit4]   2> 1966935 INFO  (coreLoadExecutor-6231-thread-1-processing-n:127.0.0.1:50989_f_kda%2Fcd) [n:127.0.0.1:50989_f_kda%2Fcd c:control_collection   x:collection1] o.a.s.s.FileExchangeRateProvider Reloading exchange rates from file currency.xml
   [junit4]   2> 1966937 INFO  (coreLoadExecutor-6231-thread-1-processing-n:127.0.0.1:50989_f_kda%2Fcd) [n:127.0.0.1:50989_f_kda%2Fcd c:control_collection   x:collection1] o.a.s.s.OpenExchangeRatesOrgProvider Reloading exchange rates from open-exchange-rates.json
   [junit4]   2> 1966937 INFO  (coreLoadExecutor-6231-thread-1-processing-n:127.0.0.1:50989_f_kda%2Fcd) [n:127.0.0.1:50989_f_kda%2Fcd c:control_collection   x:collection1] o.a.s.s.OpenExchangeRatesOrgProvider Reloading exchange rates from open-exchange-rates.json
   [junit4]   2> 1966939 INFO  (coreLoadExecutor-6231-thread-1-processing-n:127.0.0.1:50989_f_kda%2Fcd) [n:127.0.0.1:50989_f_kda%2Fcd c:control_collection   x:collection1] o.a.s.c.ConfigSetProperties Did not find ConfigSet properties, assuming default properties: Can't find resource 'configsetprops.json' in classpath or '/configs/conf1', cwd=/x1/jenkins/jenkins-slave/workspace/Lucene-Solr-Tests-trunk-Java8/solr/build/solr-core/test/J2
   [junit4]   2> 1966939 INFO  (coreLoadExecutor-6231-thread-1-processing-n:127.0.0.1:50989_f_kda%2Fcd) [n:127.0.0.1:50989_f_kda%2Fcd c:control_collection   x:collection1] o.a.s.c.CoreContainer Creating SolrCore 'collection1' using configuration from collection control_collection
   [junit4]   2> 1966939 INFO  (coreLoadExecutor-6231-thread-1-processing-n:127.0.0.1:50989_f_kda%2Fcd) [n:127.0.0.1:50989_f_kda%2Fcd c:control_collection s:shard1 r:core_node1 x:collection1] o.a.s.c.SolrCore org.apache.solr.core.MockDirectoryFactory
   [junit4]   2> 1966940 INFO  (coreLoadExecutor-6231-thread-1-processing-n:127.0.0.1:50989_f_kda%2Fcd) [n:127.0.0.1:50989_f_kda%2Fcd c:control_collection s:shard1 r:core_node1 x:collection1] o.a.s.c.SolrCore [[collection1] ] Opening new SolrCore at [/x1/jenkins/jenkins-slave/workspace/Lucene-Solr-Tests-trunk-Java8/solr/build/solr-core/test/J2/temp/solr.handler.TestReqParamsAPI_39E6725A3B60CB1A-001/control-001/cores/collection1], dataDir=[/x1/jenkins/jenkins-slave/workspace/Lucene-Solr-Tests-trunk-Java8/solr/build/solr-core/test/J2/temp/solr.handler.TestReqParamsAPI_39E6725A3B60CB1A-001/control-001/cores/collection1/data/]
   [junit4]   2> 1966940 INFO  (coreLoadExecutor-6231-thread-1-processing-n:127.0.0.1:50989_f_kda%2Fcd) [n:127.0.0.1:50989_f_kda%2Fcd c:control_collection s:shard1 r:core_node1 x:collection1] o.a.s.c.JmxMonitoredMap JMX monitoring is enabled. Adding Solr mbeans to JMX Server: com.sun.jmx.mbeanserver.JmxMBeanServer@1820fb26
   [junit4]   2> 1966940 INFO  (coreLoadExecutor-6231-thread-1-processing-n:127.0.0.1:50989_f_kda%2Fcd) [n:127.0.0.1:50989_f_kda%2Fcd c:control_collection s:shard1 r:core_node1 x:collection1] o.a.s.c.CachingDirectoryFactory return new directory for /x1/jenkins/jenkins-slave/workspace/Lucene-Solr-Tests-trunk-Java8/solr/build/solr-core/test/J2/temp/solr.handler.TestReqParamsAPI_39E6725A3B60CB1A-001/control-001/cores/collection1/data
   [junit4]   2> 1966940 INFO  (coreLoadExecutor-6231-thread-1-processing-n:127.0.0.1:50989_f_kda%2Fcd) [n:127.0.0.1:50989_f_kda%2Fcd c:control_collection s:shard1 r:core_node1 x:collection1] o.a.s.c.SolrCore New index directory detected: old=null new=/x1/jenkins/jenkins-slave/workspace/Lucene-Solr-Tests-trunk-Java8/solr/build/solr-core/test/J2/temp/solr.handler.TestReqParamsAPI_39E6725A3B60CB1A-001/control-001/cores/collection1/data/index/
   [junit4]   2> 1966941 WARN  (coreLoadExecutor-6231-thread-1-processing-n:127.0.0.1:50989_f_kda%2Fcd) [n:127.0.0.1:50989_f_kda%2Fcd c:control_collection s:shard1 r:core_node1 x:collection1] o.a.s.c.SolrCore [collection1] Solr index directory '/x1/jenkins/jenkins-slave/workspace/Lucene-Solr-Tests-trunk-Java8/solr/build/solr-core/test/J2/temp/solr.handler.TestReqParamsAPI_39E6725A3B60CB1A-001/control-001/cores/collection1/data/index' doesn't exist. Creating new index...
   [junit4]   2> 1966941 INFO  (coreLoadExecutor-6231-thread-1-processing-n:127.0.0.1:50989_f_kda%2Fcd) [n:127.0.0.1:50989_f_kda%2Fcd c:control_collection s:shard1 r:core_node1 x:collection1] o.a.s.c.CachingDirectoryFactory return new directory for /x1/jenkins/jenkins-slave/workspace/Lucene-Solr-Tests-trunk-Java8/solr/build/solr-core/test/J2/temp/solr.handler.TestReqParamsAPI_39E6725A3B60CB1A-001/control-001/cores/collection1/data/index
   [junit4]   2> 1966941 INFO  (coreLoadExecutor-6231-thread-1-processing-n:127.0.0.1:50989_f_kda%2Fcd) [n:127.0.0.1:50989_f_kda%2Fcd c:control_collection s:shard1 r:core_node1 x:collection1] o.a.s.u.RandomMergePolicy RandomMergePolicy wrapping class org.apache.lucene.index.TieredMergePolicy: [TieredMergePolicy: maxMergeAtOnce=26, maxMergeAtOnceExplicit=14, maxMergedSegmentMB=60.69140625, floorSegmentMB=1.22265625, forceMergeDeletesPctAllowed=1.8721020922451215, segmentsPerTier=18.0, maxCFSSegmentSizeMB=8.796093022207999E12, noCFSRatio=0.0
   [junit4]   2> 1966942 INFO  (coreLoadExecutor-6231-thread-1-processing-n:127.0.0.1:50989_f_kda%2Fcd) [n:127.0.0.1:50989_f_kda%2Fcd c:control_collection s:shard1 r:core_node1 x:collection1] o.a.s.c.SolrDeletionPolicy SolrDeletionPolicy.onCommit: commits: num=1
   [junit4]   2> 	commit{dir=MockDirectoryWrapper(RAMDirectory@51dd780 lockFactory=org.apache.lucene.store.SingleInstanceLockFactory@18089b73),segFN=segments_1,generation=1}
   [junit4]   2> 1966942 INFO  (coreLoadExecutor-6231-thread-1-processing-n:127.0.0.1:50989_f_kda%2Fcd) [n:127.0.0.1:50989_f_kda%2Fcd c:control_collection s:shard1 r:core_node1 x:collection1] o.a.s.c.SolrDeletionPolicy newest commit generation = 1
   [junit4]   2> 1966947 INFO  (coreLoadExecutor-6231-thread-1-processing-n:127.0.0.1:50989_f_kda%2Fcd) [n:127.0.0.1:50989_f_kda%2Fcd c:control_collection s:shard1 r:core_node1 x:collection1] o.a.s.u.p.UpdateRequestProcessorChain creating updateRequestProcessorChain "nodistrib"
   [junit4]   2> 1966948 INFO  (coreLoadExecutor-6231-thread-1-processing-n:127.0.0.1:50989_f_kda%2Fcd) [n:127.0.0.1:50989_f_kda%2Fcd c:control_collection s:shard1 r:core_node1 x:collection1] o.a.s.u.p.UpdateRequestProcessorChain creating updateRequestProcessorChain "dedupe"
   [junit4]   2> 1966948 INFO  (coreLoadExecutor-6231-thread-1-processing-n:127.0.0.1:50989_f_kda%2Fcd) [n:127.0.0.1:50989_f_kda%2Fcd c:control_collection s:shard1 r:core_node1 x:collection1] o.a.s.u.p.UpdateRequestProcessorChain inserting DistributedUpdateProcessorFactory into updateRequestProcessorChain "dedupe"
   [junit4]   2> 1966948 INFO  (coreLoadExecutor-6231-thread-1-processing-n:127.0.0.1:50989_f_kda%2Fcd) [n:127.0.0.1:50989_f_kda%2Fcd c:control_collection s:shard1 r:core_node1 x:collection1] o.a.s.u.p.UpdateRequestProcessorChain creating updateRequestProcessorChain "stored_sig"
   [junit4]   2> 1966948 INFO  (coreLoadExecutor-6231-thread-1-processing-n:127.0.0.1:50989_f_kda%2Fcd) [n:127.0.0.1:50989_f_kda%2Fcd c:control_collection s:shard1 r:core_node1 x:collection1] o.a.s.u.p.UpdateRequestProcessorChain inserting DistributedUpdateProcessorFactory into updateRequestProcessorChain "stored_sig"
   [junit4]   2> 1966948 INFO  (coreLoadExecutor-6231-thread-1-processing-n:127.0.0.1:50989_f_kda%2Fcd) [n:127.0.0.1:50989_f_kda%2Fcd c:control_collection s:shard1 r:core_node1 x:collection1] o.a.s.u.p.UpdateRequestProcessorChain creating updateRequestProcessorChain "distrib-dup-test-chain-explicit"
   [junit4]   2> 1966948 INFO  (coreLoadExecutor-6231-thread-1-processing-n:127.0.0.1:50989_f_kda%2Fcd) [n:127.0.0.1:50989_f_kda%2Fcd c:control_collection s:shard1 r:core_node1 x:collection1] o.a.s.u.p.UpdateRequestProcessorChain creating updateRequestProcessorChain "distrib-dup-test-chain-implicit"
   [junit4]   2> 1966948 INFO  (coreLoadExecutor-6231-thread-1-processing-n:127.0.0.1:50989_f_kda%2Fcd) [n:127.0.0.1:50989_f_kda%2Fcd c:control_collection s:shard1 r:core_node1 x:collection1] o.a.s.u.p.UpdateRequestProcessorChain inserting DistributedUpdateProcessorFactory into updateRequestProcessorChain "distrib-dup-test-chain-implicit"
   [junit4]   2> 1966948 INFO  (coreLoadExecutor-6231-thread-1-processing-n:127.0.0.1:50989_f_kda%2Fcd) [n:127.0.0.1:50989_f_kda%2Fcd c:control_collection s:shard1 r:core_node1 x:collection1] o.a.s.c.SolrCore no updateRequestProcessorChain defined as default, creating implicit default
   [junit4]   2> 1966949 WARN  (coreLoadExecutor-6231-thread-1-processing-n:127.0.0.1:50989_f_kda%2Fcd) [n:127.0.0.1:50989_f_kda%2Fcd c:control_collection s:shard1 r:core_node1 x:collection1] o.a.s.c.RequestHandlers INVALID paramSet a in requestHandler {type = requestHandler,name = /dump,class = DumpRequestHandler,args = {defaults={a=A,b=B}}}
   [junit4]   2> 1966951 INFO  (coreLoadExecutor-6231-thread-1-processing-n:127.0.0.1:50989_f_kda%2Fcd) [n:127.0.0.1:50989_f_kda%2Fcd c:control_collection s:shard1 r:core_node1 x:collection1] o.a.s.h.l.XMLLoader xsltCacheLifetimeSeconds=60
   [junit4]   2> 1966952 INFO  (coreLoadExecutor-6231-thread-1-processing-n:127.0.0.1:50989_f_kda%2Fcd) [n:127.0.0.1:50989_f_kda%2Fcd c:control_collection s:shard1 r:core_node1 x:collection1] o.a.s.h.l.XMLLoader xsltCacheLifetimeSeconds=60
   [junit4]   2> 1966953 INFO  (coreLoadExecutor-6231-thread-1-processing-n:127.0.0.1:50989_f_kda%2Fcd) [n:127.0.0.1:50989_f_kda%2Fcd c:control_collection s:shard1 r:core_node1 x:collection1] o.a.s.h.l.XMLLoader xsltCacheLifetimeSeconds=60
   [junit4]   2> 1966954 INFO  (coreLoadExecutor-6231-thread-1-processing-n:127.0.0.1:50989_f_kda%2Fcd) [n:127.0.0.1:50989_f_kda%2Fcd c:control_collection s:shard1 r:core_node1 x:collection1] o.a.s.h.l.XMLLoader xsltCacheLifetimeSeconds=60
   [junit4]   2> 1966955 INFO  (OldIndexDirectoryCleanupThreadForCore-collection1) [n:127.0.0.1:50989_f_kda%2Fcd c:control_collection s:shard1 r:core_node1 x:collection1] o.a.s.c.SolrCore Looking for old index directories to cleanup for core collection1 in /x1/jenkins/jenkins-slave/workspace/Lucene-Solr-Tests-trunk-Java8/solr/build/solr-core/test/J2/temp/solr.handler.TestReqParamsAPI_39E6725A3B60CB1A-001/control-001/cores/collection1/data/
   [junit4]   2> 1966956 WARN  (OldIndexDirectoryCleanupThreadForCore-collection1) [n:127.0.0.1:50989_f_kda%2Fcd c:control_collection s:shard1 r:core_node1 x:collection1] o.a.s.c.DirectoryFactory /x1/jenkins/jenkins-slave/workspace/Lucene-Solr-Tests-trunk-Java8/solr/build/solr-core/test/J2/temp/solr.handler.TestReqParamsAPI_39E6725A3B60CB1A-001/control-001/cores/collection1/data/ does not point to a valid data directory; skipping clean-up of old index directories.
   [junit4]   2> 1966958 INFO  (coreLoadExecutor-6231-thread-1-processing-n:127.0.0.1:50989_f_kda%2Fcd) [n:127.0.0.1:50989_f_kda%2Fcd c:control_collection s:shard1 r:core_node1 x:collection1] o.a.s.c.RequestHandlers Registered paths: /admin/mbeans,standard,/dump,/update/csv,/sql,/update/json/docs,/admin/luke,/export,/admin/segments,/get,/admin/system,/replication,/admin/properties,/config,/stream,/schema,/admin/plugins,/admin/logging,/update/json,/admin/ping,/admin/threads,/update,/admin/file
   [junit4]   2> 1966958 INFO  (coreLoadExecutor-6231-thread-1-processing-n:127.0.0.1:50989_f_kda%2Fcd) [n:127.0.0.1:50989_f_kda%2Fcd c:control_collection s:shard1 r:core_node1 x:collection1] o.a.s.c.SolrCore Using default statsCache cache: org.apache.solr.search.stats.LocalStatsCache
   [junit4]   2> 1966961 INFO  (coreLoadExecutor-6231-thread-1-processing-n:127.0.0.1:50989_f_kda%2Fcd) [n:127.0.0.1:50989_f_kda%2Fcd c:control_collection s:shard1 r:core_node1 x:collection1] o.a.s.u.UpdateHandler Using UpdateLog implementation: org.apache.solr.update.UpdateLog
   [junit4]   2> 1966961 INFO  (coreLoadExecutor-6231-thread-1-processing-n:127.0.0.1:50989_f_kda%2Fcd) [n:127.0.0.1:50989_f_kda%2Fcd c:control_collection s:shard1 r:core_node1 x:collection1] o.a.s.u.UpdateLog Initializing UpdateLog: dataDir= defaultSyncLevel=FLUSH numRecordsToKeep=100 maxNumLogsToKeep=10 numVersionBuckets=65536
   [junit4]   2> 1966961 INFO  (coreLoadExecutor-6231-thread-1-processing-n:127.0.0.1:50989_f_kda%2Fcd) [n:127.0.0.1:50989_f_kda%2Fcd c:control_collection s:shard1 r:core_node1 x:collection1] o.a.s.u.CommitTracker Hard AutoCommit: disabled
   [junit4]   2> 1966962 INFO  (coreLoadExecutor-6231-thread-1-processing-n:127.0.0.1:50989_f_kda%2Fcd) [n:127.0.0.1:50989_f_kda%2Fcd c:control_collection s:shard1 r:core_node1 x:collection1] o.a.s.u.CommitTracker Soft AutoCommit: disabled
   [junit4]   2> 1966962 INFO  (coreLoadExecutor-6231-thread-1-processing-n:127.0.0.1:50989_f_kda%2Fcd) [n:127.0.0.1:50989_f_kda%2Fcd c:control_collection s:shard1 r:core_node1 x:collection1] o.a.s.u.RandomMergePolicy RandomMergePolicy wrapping class org.apache.lucene.index.TieredMergePolicy: [TieredMergePolicy: maxMergeAtOnce=37, maxMergeAtOnceExplicit=47, maxMergedSegmentMB=38.771484375, floorSegmentMB=2.134765625, forceMergeDeletesPctAllowed=25.349564226330124, segmentsPerTier=15.0, maxCFSSegmentSizeMB=8.796093022207999E12, noCFSRatio=0.0
   [junit4]   2> 1966963 INFO  (coreLoadExecutor-6231-thread-1-processing-n:127.0.0.1:50989_f_kda%2Fcd) [n:127.0.0.1:50989_f_kda%2Fcd c:control_collection s:shard1 r:core_node1 x:collection1] o.a.s.c.SolrDeletionPolicy SolrDeletionPolicy.onInit: commits: num=1
   [junit4]   2> 	commit{dir=MockDirectoryWrapper(RAMDirectory@51dd780 lockFactory=org.apache.lucene.store.SingleInstanceLockFactory@18089b73),segFN=segments_1,generation=1}
   [junit4]   2> 1966963 INFO  (coreLoadExecutor-6231-thread-1-processing-n:127.0.0.1:50989_f_kda%2Fcd) [n:127.0.0.1:50989_f_kda%2Fcd c:control_collection s:shard1 r:core_node1 x:collection1] o.a.s.c.SolrDeletionPolicy newest commit generation = 1
   [junit4]   2> 1966963 INFO  (coreLoadExecutor-6231-thread-1-processing-n:127.0.0.1:50989_f_kda%2Fcd) [n:127.0.0.1:50989_f_kda%2Fcd c:control_collection s:shard1 r:core_node1 x:collection1] o.a.s.s.SolrIndexSearcher Opening [Searcher@4ecad86d[collection1] main]
   [junit4]   2> 1966963 INFO  (coreLoadExecutor-6231-thread-1-processing-n:127.0.0.1:50989_f_kda%2Fcd) [n:127.0.0.1:50989_f_kda%2Fcd c:control_collection s:shard1 r:core_node1 x:collection1] o.a.s.c.c.ZkStateReader Load collection config from: [/collections/control_collection]
   [junit4]   2> 1966964 INFO  (coreLoadExecutor-6231-thread-1-processing-n:127.0.0.1:50989_f_kda%2Fcd) [n:127.0.0.1:50989_f_kda%2Fcd c:control_collection s:shard1 r:core_node1 x:collection1] o.a.s.c.c.ZkStateReader path=[/collections/control_collection] [configName]=[conf1] specified config exists in ZooKeeper
   [junit4]   2> 1966964 INFO  (coreLoadExecutor-6231-thread-1-processing-n:127.0.0.1:50989_f_kda%2Fcd) [n:127.0.0.1:50989_f_kda%2Fcd c:control_collection s:shard1 r:core_node1 x:collection1] o.a.s.r.ManagedResourceStorage Setting up ZooKeeper-based storage for the RestManager with znodeBase: /configs/conf1
   [junit4]   2> 1966964 INFO  (coreLoadExecutor-6231-thread-1-processing-n:127.0.0.1:50989_f_kda%2Fcd) [n:127.0.0.1:50989_f_kda%2Fcd c:control_collection s:shard1 r:core_node1 x:collection1] o.a.s.r.ManagedResourceStorage Configured ZooKeeperStorageIO with znodeBase: /configs/conf1
   [junit4]   2> 1966964 INFO  (coreLoadExecutor-6231-thread-1-processing-n:127.0.0.1:50989_f_kda%2Fcd) [n:127.0.0.1:50989_f_kda%2Fcd c:control_collection s:shard1 r:core_node1 x:collection1] o.a.s.r.RestManager Initializing RestManager with initArgs: {}
   [junit4]   2> 1966965 INFO  (coreLoadExecutor-6231-thread-1-processing-n:127.0.0.1:50989_f_kda%2Fcd) [n:127.0.0.1:50989_f_kda%2Fcd c:control_collection s:shard1 r:core_node1 x:collection1] o.a.s.r.ManagedResourceStorage Reading _rest_managed.json using ZooKeeperStorageIO:path=/configs/conf1
   [junit4]   2> 1966965 INFO  (coreLoadExecutor-6231-thread-1-processing-n:127.0.0.1:50989_f_kda%2Fcd) [n:127.0.0.1:50989_f_kda%2Fcd c:control_collection s:shard1 r:core_node1 x:collection1] o.a.s.r.ManagedResourceStorage No data found for znode /configs/conf1/_rest_managed.json
   [junit4]   2> 1966965 INFO  (coreLoadExecutor-6231-thread-1-processing-n:127.0.0.1:50989_f_kda%2Fcd) [n:127.0.0.1:50989_f_kda%2Fcd c:control_collection s:shard1 r:core_node1 x:collection1] o.a.s.r.ManagedResourceStorage Loaded null at path _rest_managed.json using ZooKeeperStorageIO:path=/configs/conf1
   [junit4]   2> 1966965 INFO  (coreLoadExecutor-6231-thread-1-processing-n:127.0.0.1:50989_f_kda%2Fcd) [n:127.0.0.1:50989_f_kda%2Fcd c:control_collection s:shard1 r:core_node1 x:collection1] o.a.s.r.RestManager Initializing 0 registered ManagedResources
   [junit4]   2> 1966965 INFO  (coreLoadExecutor-6231-thread-1-processing-n:127.0.0.1:50989_f_kda%2Fcd) [n:127.0.0.1:50989_f_kda%2Fcd c:control_collection s:shard1 r:core_node1 x:collection1] o.a.s.h.ReplicationHandler Commits will be reserved for  10000
   [junit4]   2> 1966966 INFO  (coreLoadExecutor-6231-thread-1-processing-n:127.0.0.1:50989_f_kda%2Fcd) [n:127.0.0.1:50989_f_kda%2Fcd c:control_collection s:shard1 r:core_node1 x:collection1] o.a.s.u.UpdateLog Looking up max value of version field to seed version buckets
   [junit4]   2> 1966966 INFO  (coreLoadExecutor-6231-thread-1-processing-n:127.0.0.1:50989_f_kda%2Fcd) [n:127.0.0.1:50989_f_kda%2Fcd c:control_collection s:shard1 r:core_node1 x:collection1] o.a.s.u.VersionInfo Refreshing highest value of _version_ for 65536 version buckets from index
   [junit4]   2> 1966966 INFO  (coreLoadExecutor-6231-thread-1-processing-n:127.0.0.1:50989_f_kda%2Fcd) [n:127.0.0.1:50989_f_kda%2Fcd c:control_collection s:shard1 r:core_node1 x:collection1] o.a.s.u.VersionInfo No terms found for _version_, cannot seed version bucket highest value from index
   [junit4]   2> 1966966 INFO  (coreLoadExecutor-6231-thread-1-processing-n:127.0.0.1:50989_f_kda%2Fcd) [n:127.0.0.1:50989_f_kda%2Fcd c:control_collection s:shard1 r:core_node1 x:collection1] o.a.s.u.UpdateLog Could not find max version in index or recent updates, using new clock 1527750530276786176
   [junit4]   2> 1966968 INFO  (coreLoadExecutor-6231-thread-1-processing-n:127.0.0.1:50989_f_kda%2Fcd) [n:127.0.0.1:50989_f_kda%2Fcd c:control_collection s:shard1 r:core_node1 x:collection1] o.a.s.u.UpdateLog Took 2.0ms to seed version buckets with highest version 1527750530276786176
   [junit4]   2> 1966968 INFO  (coreLoadExecutor-6231-thread-1-processing-n:127.0.0.1:50989_f_kda%2Fcd) [n:127.0.0.1:50989_f_kda%2Fcd c:control_collection s:shard1 r:core_node1 x:collection1] o.a.s.c.ZkController watch zkdir /configs/conf1
   [junit4]   2> 1966969 INFO  (searcherExecutor-6232-thread-1-processing-n:127.0.0.1:50989_f_kda%2Fcd x:collection1 s:shard1 c:control_collection r:core_node1) [n:127.0.0.1:50989_f_kda%2Fcd c:control_collection s:shard1 r:core_node1 x:collection1] o.a.s.c.SolrCore [collection1] Registered new searcher Searcher@4ecad86d[collection1] main{ExitableDirectoryReader(UninvertingDirectoryReader())}
   [junit4]   2> 1966970 INFO  (coreLoadExecutor-6231-thread-1-processing-n:127.0.0.1:50989_f_kda%2Fcd) [n:127.0.0.1:50989_f_kda%2Fcd c:control_collection s:shard1 r:core_node1 x:collection1] o.a.s.c.CoreContainer registering core: collection1
   [junit4]   2> 1966975 INFO  (coreZkRegister-6225-thread-1-processing-n:127.0.0.1:50989_f_kda%2Fcd x:collection1 s:shard1 c:control_collection r:core_node1) [n:127.0.0.1:50989_f_kda%2Fcd c:control_collection s:shard1 r:core_node1 x:collection1] o.a.s.c.ZkController Register replica - core:collection1 address:https://127.0.0.1:50989/f_kda/cd collection:control_collection shard:shard1
   [junit4]   2> 1966976 INFO  (coreZkRegister-6225-thread-1-processing-n:127.0.0.1:50989_f_kda%2Fcd x:collection1 s:shard1 c:control_collection r:core_node1) [n:127.0.0.1:50989_f_kda%2Fcd c:control_collection s:shard1 r:core_node1 x:collection1] o.a.s.c.c.SolrZkClient makePath: /collections/control_collection/leader_elect/shard1/election
   [junit4]   2> 1966980 INFO  (coreZkRegister-6225-thread-1-processing-n:127.0.0.1:50989_f_kda%2Fcd x:collection1 s:shard1 c:control_collection r:core_node1) [n:127.0.0.1:50989_f_kda%2Fcd c:control_collection s:shard1 r:core_node1 x:collection1] o.a.s.c.LeaderElector Joined leadership election with path: /collections/control_collection/leader_elect/shard1/election/95484407989534725-core_node1-n_0000000000
   [junit4]   2> 1966985 INFO  (coreZkRegister-6225-thread-1-processing-n:127.0.0.1:50989_f_kda%2Fcd x:collection1 s:shard1 c:control_collection r:core_node1) [n:127.0.0.1:50989_f_kda%2Fcd c:control_collection s:shard1 r:core_node1 x:collection1] o.a.s.c.ShardLeaderElectionContext Running the leader process for shard=shard1 and weAreReplacement=false and leaderVoteWait=10000
   [junit4]   2> 1966986 INFO  (coreZkRegister-6225-thread-1-processing-n:127.0.0.1:50989_f_kda%2Fcd x:collection1 s:shard1 c:control_collection r:core_node1) [n:127.0.0.1:50989_f_kda%2Fcd c:control_collection s:shard1 r:core_node1 x:collection1] o.a.s.c.ShardLeaderElectionContext Enough replicas found to continue.
   [junit4]   2> 1966987 INFO  (OverseerStateUpdate-95484407989534725-127.0.0.1:50989_f_kda%2Fcd-n_0000000000) [n:127.0.0.1:50989_f_kda%2Fcd    ] o.a.s.c.Overseer processMessage: queueSize: 1, message = {
   [junit4]   2>   "operation":"leader",
   [junit4]   2>   "shard":"shard1",
   [junit4]   2>   "collection":"control_collection"} current state version: 1
   [junit4]   2> 1966987 INFO  (coreZkRegister-6225-thread-1-processing-n:127.0.0.1:50989_f_kda%2Fcd x:collection1 s:shard1 c:control_collection r:core_node1) [n:127.0.0.1:50989_f_kda%2Fcd c:control_collection s:shard1 r:core_node1 x:collection1] o.a.s.c.ShardLeaderElectionContext I may be the new leader - try and sync
   [junit4]   2> 1966987 INFO  (coreZkRegister-6225-thread-1-processing-n:127.0.0.1:50989_f_kda%2Fcd x:collection1 s:shard1 c:control_collection r:core_node1) [n:127.0.0.1:50989_f_kda%2Fcd c:control_collection s:shard1 r:core_node1 x:collection1] o.a.s.c.SyncStrategy Sync replicas to https://127.0.0.1:50989/f_kda/cd/collection1/
   [junit4]   2> 1966988 INFO  (coreZkRegister-6225-thread-1-processing-n:127.0.0.1:50989_f_kda%2Fcd x:collection1 s:shard1 c:control_collection r:core_node1) [n:127.0.0.1:50989_f_kda%2Fcd c:control_collection s:shard1 r:core_node1 x:collection1] o.a.s.c.SyncStrategy Sync Success - now sync replicas to me
   [junit4]   2> 1966988 INFO  (coreZkRegister-6225-thread-1-processing-n:127.0.0.1:50989_f_kda%2Fcd x:collection1 s:shard1 c:control_collection r:core_node1) [n:127.0.0.1:50989_f_kda%2Fcd c:control_collection s:shard1 r:core_node1 x:collection1] o.a.s.c.SyncStrategy https://127.0.0.1:50989/f_kda/cd/collection1/ has no replicas
   [junit4]   2> 1966991 INFO  (coreZkRegister-6225-thread-1-processing-n:127.0.0.1:50989_f_kda%2Fcd x:collection1 s:shard1 c:control_collection r:core_node1) [n:127.0.0.1:50989_f_kda%2Fcd c:control_collection s:shard1 r:core_node1 x:collection1] o.a.s.c.c.SolrZkClient makePath: /collections/control_collection/leaders/shard1
   [junit4]   2> 1966996 INFO  (coreZkRegister-6225-thread-1-processing-n:127.0.0.1:50989_f_kda%2Fcd x:collection1 s:shard1 c:control_collection r:core_node1) [n:127.0.0.1:50989_f_kda%2Fcd c:control_collection s:shard1 r:core_node1 x:collection1] o.a.s.c.ShardLeaderElectionContextBase Creating leader registration node /collections/control_collection/leaders/shard1/leader after winning as /collections/control_collection/leader_elect/shard1/election/95484407989534725-core_node1-n_0000000000
   [junit4]   2> 1967001 INFO  (coreZkRegister-6225-thread-1-processing-n:127.0.0.1:50989_f_kda%2Fcd x:collection1 s:shard1 c:control_collection r:core_node1) [n:127.0.0.1:50989_f_kda%2Fcd c:control_collection s:shard1 r:core_node1 x:collection1] o.a.s.c.ShardLeaderElectionContext I am the new leader: https://127.0.0.1:50989/f_kda/cd/collection1/ shard1
   [junit4]   2> 1967002 INFO  (OverseerStateUpdate-95484407989534725-127.0.0.1:50989_f_kda%2Fcd-n_0000000000) [n:127.0.0.1:50989_f_kda%2Fcd    ] o.a.s.c.Overseer processMessage: queueSize: 1, message = {
   [junit4]   2>   "operation":"leader",
   [junit4]   2>   "shard":"shard1",
   [junit4]   2>   "collection":"control_collection",
   [junit4]   2>   "base_url":"https://127.0.0.1:50989/f_kda/cd",
   [junit4]   2>   "core":"collection1",
   [junit4]   2>   "state":"active"} current state version: 1
   [junit4]   2> 1967104 INFO  (zkCallback-2363-thread-1-processing-n:127.0.0.1:50989_f_kda%2Fcd) [n:127.0.0.1:50989_f_kda%2Fcd    ] o.a.s.c.c.ZkStateReader A cluster state change: [WatchedEvent state:SyncConnected type:NodeDataChanged path:/clusterstate.json], has occurred - updating... (live nodes size: [1])
   [junit4]   2> 1967107 INFO  (coreZkRegister-6225-thread-1-processing-n:127.0.0.1:50989_f_kda%2Fcd x:collection1 s:shard1 c:control_collection r:core_node1) [n:127.0.0.1:50989_f_kda%2Fcd c:control_collection s:shard1 r:core_node1 x:collection1] o.a.s.c.ZkController We are https://127.0.0.1:50989/f_kda/cd/collection1/ and leader is https://127.0.0.1:50989/f_kda/cd/collection1/
   [junit4]   2> 1967107 INFO  (coreZkRegister-6225-thread-1-processing-n:127.0.0.1:50989_f_kda%2Fcd x:collection1 s:shard1 c:control_collection r:core_node1) [n:127.0.0.1:50989_f_kda%2Fcd c:control_collection s:shard1 r:core_node1 x:collection1] o.a.s.c.ZkController No LogReplay needed for core=collection1 baseURL=https://127.0.0.1:50989/f_kda/cd
   [junit4]   2> 1967107 INFO  (coreZkRegister-6225-thread-1-processing-n:127.0.0.1:50989_f_kda%2Fcd x:collection1 s:shard1 c:control_collection r:core_node1) [n:127.0.0.1:50989_f_kda%2Fcd c:control_collection s:shard1 r:core_node1 x:collection1] o.a.s.c.ZkController I am the leader, no recovery necessary
   [junit4]   2> 1967107 INFO  (coreZkRegister-6225-thread-1-processing-n:127.0.0.1:50989_f_kda%2Fcd x:collection1 s:shard1 c:control_collection r:core_node1) [n:127.0.0.1:50989_f_kda%2Fcd c:control_collection s:shard1 r:core_node1 x:collection1] o.a.s.c.ZkController publishing state=active
   [junit4]   2> 1967107 INFO  (coreZkRegister-6225-thread-1-processing-n:127.0.0.1:50989_f_kda%2Fcd x:collection1 s:shard1 c:control_collection r:core_node1) [n:127.0.0.1:50989_f_kda%2Fcd c:control_collection s:shard1 r:core_node1 x:collection1] o.a.s.c.ZkController numShards not found on descriptor - reading it from system property
   [junit4]   2> 1967108 INFO  (OverseerStateUpdate-95484407989534725-127.0.0.1:50989_f_kda%2Fcd-n_0000000000) [n:127.0.0.1:50989_f_kda%2Fcd    ] o.a.s.c.Overseer processMessage: queueSize: 1, message = {
   [junit4]   2>   "core":"collection1",
   [junit4]   2>   "core_node_name":"core_node1",
   [junit4]   2>   "roles":null,
   [junit4]   2>   "base_url":"https://127.0.0.1:50989/f_kda/cd",
   [junit4]   2>   "node_name":"127.0.0.1:50989_f_kda%2Fcd",
   [junit4]   2>   "numShards":"1",
   [junit4]   2>   "state":"active",
   [junit4]   2>   "shard":"shard1",
   [junit4]   2>   "collection":"control_collection",
   [junit4]   2>   "operation":"state"} current state version: 2
   [junit4]   2> 1967109 INFO  (coreZkRegister-6225-thread-1-processing-n:127.0.0.1:50989_f_kda%2Fcd x:collection1 s:shard1 c:control_collection r:core_node1) [n:127.0.0.1:50989_f_kda%2Fcd c:control_collection s:shard1 r:core_node1 x:collection1] o.a.s.c.c.ZkStateReader Updated live nodes from ZooKeeper... (1) -> (1)
   [junit4]   2> 1967109 INFO  (OverseerStateUpdate-95484407989534725-127.0.0.1:50989_f_kda%2Fcd-n_0000000000) [n:127.0.0.1:50989_f_kda%2Fcd    ] o.a.s.c.o.ReplicaMutator Update state numShards=1 message={
   [junit4]   2>   "core":"collection1",
   [junit4]   2>   "core_node_name":"core_node1",
   [junit4]   2>   "roles":null,
   [junit4]   2>   "base_url":"https://127.0.0.1:50989/f_kda/cd",
   [junit4]   2>   "node_name":"127.0.0.1:50989_f_kda%2Fcd",
   [junit4]   2>   "numShards":"1",
   [junit4]   2>   "state":"active",
   [junit4]   2>   "shard":"shard1",
   [junit4]   2>   "collection":"control_collection",
   [junit4]   2>   "operation":"state"}
   [junit4]   2> 1967211 INFO  (zkCallback-2363-thread-1-processing-n:127.0.0.1:50989_f_kda%2Fcd) [n:127.0.0.1:50989_f_kda%2Fcd    ] o.a.s.c.c.ZkStateReader A cluster state change: [WatchedEvent state:SyncConnected type:NodeDataChanged path:/clusterstate.json], has occurred - updating... (live nodes size: [1])
   [junit4]   2> 1967294 INFO  (TEST-TestReqParamsAPI.test-seed#[39E6725A3B60CB1A]) [    ] o.a.s.c.c.SolrZkClient Using default ZkCredentialsProvider
   [junit4]   2> 1967295 INFO  (TEST-TestReqParamsAPI.test-seed#[39E6725A3B60CB1A]) [    ] o.a.s.c.c.ConnectionManager Waiting for client to connect to ZooKeeper
   [junit4]   2> 1967296 INFO  (zkCallback-2365-thread-1) [    ] o.a.s.c.c.ConnectionManager Watcher org.apache.solr.common.cloud.ConnectionManager@125dcbe1 name:ZooKeeperConnection Watcher:127.0.0.1:58444/solr got event WatchedEvent state:SyncConnected type:None path:null path:null type:None
   [junit4]   2> 1967296 INFO  (TEST-TestReqParamsAPI.test-seed#[39E6725A3B60CB1A]) [    ] o.a.s.c.c.ConnectionManager Client is connected to ZooKeeper
   [junit4]   2> 1967296 INFO  (TEST-TestReqParamsAPI.test-seed#[39E6725A3B60CB1A]) [    ] o.a.s.c.c.SolrZkClient Using default ZkACLProvider
   [junit4]   2> 1967296 INFO  (TEST-TestReqParamsAPI.test-seed#[39E6725A3B60CB1A]) [    ] o.a.s.c.c.ZkStateReader Updating cluster state from ZooKeeper... 
   [junit4]   2> 1967298 INFO  (TEST-TestReqParamsAPI.test-seed#[39E6725A3B60CB1A]) [    ] o.a.s.c.c.ZkStateReader Updated live nodes from ZooKeeper... (0) -> (1)
   [junit4]   2> 1967298 INFO  (TEST-TestReqParamsAPI.test-seed#[39E6725A3B60CB1A]) [    ] o.a.s.c.ChaosMonkey monkey: init - expire sessions:false cause connection loss:false
   [junit4]   2> 1967298 INFO  (TEST-TestReqParamsAPI.test-seed#[39E6725A3B60CB1A]) [    ] o.a.s.c.AbstractFullDistribZkTestBase Creating collection1 with stateFormat=2
   [junit4]   2> 1967299 INFO  (TEST-TestReqParamsAPI.test-seed#[39E6725A3B60CB1A]) [    ] o.a.s.c.c.SolrZkClient Using default ZkCredentialsProvider
   [junit4]   2> 1967299 INFO  (TEST-TestReqParamsAPI.test-seed#[39E6725A3B60CB1A]) [    ] o.a.s.c.c.ConnectionManager Waiting for client to connect to ZooKeeper
   [junit4]   2> 1967300 INFO  (zkCallback-2366-thread-1) [    ] o.a.s.c.c.ConnectionManager Watcher org.apache.solr.common.cloud.ConnectionManager@6c520722 name:ZooKeeperConnection Watcher:127.0.0.1:58444/solr got event WatchedEvent state:SyncConnected type:None path:null path:null type:None
   [junit4]   2> 1967300 INFO  (TEST-TestReqParamsAPI.test-seed#[39E6725A3B60CB1A]) [    ] o.a.s.c.c.ConnectionManager Client is connected to ZooKeeper
   [junit4]   2> 1967300 INFO  (TEST-TestReqParamsAPI.test-seed#[39E6725A3B60CB1A]) [    ] o.a.s.c.c.SolrZkClient Using default ZkACLProvider
   [junit4]   2> 1967302 INFO  (OverseerStateUpdate-95484407989534725-127.0.0.1:50989_f_kda%2Fcd-n_0000000000) [n:127.0.0.1:50989_f_kda%2Fcd    ] o.a.s.c.Overseer processMessage: queueSize: 1, message = {
   [junit4]   2>   "operation":"create",
   [junit4]   2>   "name":"collection1",
   [junit4]   2>   "numShards":"2",
   [junit4]   2>   "stateFormat":"2"} current state version: 3
   [junit4]   2> 1967302 INFO  (OverseerStateUpdate-95484407989534725-127.0.0.1:50989_f_kda%2Fcd-n_0000000000) [n:127.0.0.1:50989_f_kda%2Fcd    ] o.a.s.c.o.ClusterStateMutator building a new cName: collection1
   [junit4]   2> 1967405 INFO  (OverseerStateUpdate-95484407989534725-127.0.0.1:50989_f_kda%2Fcd-n_0000000000) [n:127.0.0.1:50989_f_kda%2Fcd    ] o.a.s.c.o.ZkStateWriter going to create_collection /collections/collection1/state.json
   [junit4]   2> 1967408 INFO  (TEST-TestReqParamsAPI.test-seed#[39E6725A3B60CB1A]) [    ] o.a.s.SolrTestCaseJ4 Writing core.properties file to /x1/jenkins/jenkins-slave/workspace/Lucene-Solr-Tests-trunk-Java8/solr/build/solr-core/test/J2/temp/solr.handler.TestReqParamsAPI_39E6725A3B60CB1A-001/shard-1-001/cores/collection1
   [junit4]   2> 1967409 INFO  (TEST-TestReqParamsAPI.test-seed#[39E6725A3B60CB1A]) [    ] o.a.s.c.AbstractFullDistribZkTestBase create jetty 1 in directory /x1/jenkins/jenkins-slave/workspace/Lucene-Solr-Tests-trunk-Java8/solr/build/solr-core/test/J2/temp/solr.handler.TestReqParamsAPI_39E6725A3B60CB1A-001/shard-1-001
   [junit4]   2> 1967412 INFO  (TEST-TestReqParamsAPI.test-seed#[39E6725A3B60CB1A]) [    ] o.e.j.s.Server jetty-9.3.6.v20151106
   [junit4]   2> 1967414 INFO  (TEST-TestReqParamsAPI.test-seed#[39E6725A3B60CB1A]) [    ] o.e.j.s.h.ContextHandler Started o.e.j.s.ServletContextHandler@67ca3e7a{/f_kda/cd,null,AVAILABLE}
   [junit4]   2> 1967415 INFO  (TEST-TestReqParamsAPI.test-seed#[39E6725A3B60CB1A]) [    ] o.e.j.u.s.SslContextFactory x509=X509@3f7160e4(solrtest,h=[],w=[]) for SslContextFactory@7bd9c9b7(file:///x1/jenkins/jenkins-slave/workspace/Lucene-Solr-Tests-trunk-Java8/solr/server/etc/test/solrtest.keystore,file:///x1/jenkins/jenkins-slave/workspace/Lucene-Solr-Tests-trunk-Java8/solr/server/etc/test/solrtest.keystore)
   [junit4]   2> 1967418 INFO  (TEST-TestReqParamsAPI.test-seed#[39E6725A3B60CB1A]) [    ] o.e.j.s.ServerConnector Started ServerConnector@1cda3e11{SSL,[ssl, http/1.1]}{127.0.0.1:35217}
   [junit4]   2> 1967418 INFO  (TEST-TestReqParamsAPI.test-seed#[39E6725A3B60CB1A]) [    ] o.e.j.s.Server Started @1970791ms
   [junit4]   2> 1967419 INFO  (TEST-TestReqParamsAPI.test-seed#[39E6725A3B60CB1A]) [    ] o.a.s.c.s.e.JettySolrRunner Jetty properties: {solr.data.dir=/x1/jenkins/jenkins-slave/workspace/Lucene-Solr-Tests-trunk-Java8/solr/build/solr-core/test/J2/temp/solr.handler.TestReqParamsAPI_39E6725A3B60CB1A-001/tempDir-001/jetty1, solrconfig=solrconfig.xml, hostContext=/f_kda/cd, hostPort=35217, coreRootDirectory=/x1/jenkins/jenkins-slave/workspace/Lucene-Solr-Tests-trunk-Java8/solr/build/solr-core/test/J2/../../../../../../../../../../x1/jenkins/jenkins-slave/workspace/Lucene-Solr-Tests-trunk-Java8/solr/build/solr-core/test/J2/temp/solr.handler.TestReqParamsAPI_39E6725A3B60CB1A-001/shard-1-001/cores}
   [junit4]   2> 1967419 INFO  (TEST-TestReqParamsAPI.test-seed#[39E6725A3B60CB1A]) [    ] o.a.s.s.SolrDispatchFilter SolrDispatchFilter.init(): sun.misc.Launcher$AppClassLoader@4e0e2f2a
   [junit4]   2> 1967419 INFO  (TEST-TestReqParamsAPI.test-seed#[39E6725A3B60CB1A]) [    ] o.a.s.c.SolrResourceLoader new SolrResourceLoader for directory: '/x1/jenkins/jenkins-slave/workspace/Lucene-Solr-Tests-trunk-Java8/solr/build/solr-core/test/J2/temp/solr.handler.TestReqParamsAPI_39E6725A3B60CB1A-001/shard-1-001'
   [junit4]   2> 1967419 INFO  (TEST-TestReqParamsAPI.test-seed#[39E6725A3B60CB1A]) [    ] o.a.s.c.SolrResourceLoader JNDI not configured for solr (NoInitialContextEx)
   [junit4]   2> 1967419 INFO  (TEST-TestReqParamsAPI.test-seed#[39E6725A3B60CB1A]) [    ] o.a.s.c.SolrResourceLoader solr home defaulted to 'solr/' (could not find system property or JNDI)
   [junit4]   2> 1967420 INFO  (TEST-TestReqParamsAPI.test-seed#[39E6725A3B60CB1A]) [    ] o.a.s.c.c.SolrZkClient Using default ZkCredentialsProvider
   [junit4]   2> 1967420 INFO  (TEST-TestReqParamsAPI.test-seed#[39E6725A3B60CB1A]) [    ] o.a.s.c.c.ConnectionManager Waiting for client to connect to ZooKeeper
   [junit4]   2> 1967421 INFO  (zkCallback-2367-thread-1) [    ] o.a.s.c.c.ConnectionManager Watcher org.apache.solr.common.cloud.ConnectionManager@32658eb9 name:ZooKeeperConnection Watcher:127.0.0.1:58444/solr got event WatchedEvent state:SyncConnected type:None path:null path:null type:None
   [junit4]   2> 1967421 INFO  (TEST-TestReqParamsAPI.test-seed#[39E6725A3B60CB1A]) [    ] o.a.s.c.c.ConnectionManager Client is connected to ZooKeeper
   [junit4]   2> 1967422 INFO  (TEST-TestReqParamsAPI.test-seed#[39E6725A3B60CB1A]) [    ] o.a.s.c.c.SolrZkClient Using default ZkACLProvider
   [junit4]   2> 1967422 INFO  (TEST-TestReqParamsAPI.test-seed#[39E6725A3B60CB1A]) [    ] o.a.s.s.SolrDispatchFilter Loading solr.xml from SolrHome (not found in ZooKeeper)
   [junit4]   2> 1967422 INFO  (TEST-TestReqParamsAPI.test-seed#[39E6725A3B60CB1A]) [    ] o.a.s.c.SolrXmlConfig Loading container configuration from /x1/jenkins/jenkins-slave/workspace/Lucene-Solr-Tests-trunk-Java8/solr/build/solr-core/test/J2/temp/solr.handler.TestReqParamsAPI_39E6725A3B60CB1A-001/shard-1-001/solr.xml
   [junit4]   2> 1967428 INFO  (TEST-TestReqParamsAPI.test-seed#[39E6725A3B60CB1A]) [    ] o.a.s.c.CorePropertiesLocator Config-defined core root directory: /x1/jenkins/jenkins-slave/workspace/Lucene-Solr-Tests-trunk-Java8/solr/build/solr-core/test/J2/../../../../../../../../../../x1/jenkins/jenkins-slave/workspace/Lucene-Solr-Tests-trunk-Java8/solr/build/solr-core/test/J2/temp/solr.handler.TestReqParamsAPI_39E6725A3B60CB1A-001/shard-1-001/cores
   [junit4]   2> 1967428 INFO  (TEST-TestReqParamsAPI.test-seed#[39E6725A3B60CB1A]) [    ] o.a.s.c.CoreContainer New CoreContainer 1023681968
   [junit4]   2> 1967428 INFO  (TEST-TestReqParamsAPI.test-seed#[39E6725A3B60CB1A]) [    ] o.a.s.c.CoreContainer Loading cores into CoreContainer [instanceDir=/x1/jenkins/jenkins-slave/workspace/Lucene-Solr-Tests-trunk-Java8/solr/build/solr-core/test/J2/temp/solr.handler.TestReqParamsAPI_39E6725A3B60CB1A-001/shard-1-001]
   [junit4]   2> 1967428 WARN  (TEST-TestReqParamsAPI.test-seed#[39E6725A3B60CB1A]) [    ] o.a.s.c.CoreContainer Couldn't add files from /x1/jenkins/jenkins-slave/workspace/Lucene-Solr-Tests-trunk-Java8/solr/build/solr-core/test/J2/temp/solr.handler.TestReqParamsAPI_39E6725A3B60CB1A-001/shard-1-001/lib to classpath: /x1/jenkins/jenkins-slave/workspace/Lucene-Solr-Tests-trunk-Java8/solr/build/solr-core/test/J2/temp/solr.handler.TestReqParamsAPI_39E6725A3B60CB1A-001/shard-1-001/lib
   [junit4]   2> 1967428 INFO  (TEST-TestReqParamsAPI.test-seed#[39E6725A3B60CB1A]) [    ] o.a.s.h.c.HttpShardHandlerFactory created with socketTimeout : 90000,urlScheme : ,connTimeout : 15000,maxConnectionsPerHost : 20,maxConnections : 10000,corePoolSize : 0,maximumPoolSize : 2147483647,maxThreadIdleTime : 5,sizeOfQueue : -1,fairnessPolicy : false,useRetries : false,
   [junit4]   2> 1967431 INFO  (TEST-TestReqParamsAPI.test-seed#[39E6725A3B60CB1A]) [    ] o.a.s.u.UpdateShardHandler Creating UpdateShardHandler HTTP client with params: socketTimeout=340000&connTimeout=45000&retry=true
   [junit4]   2> 1967432 INFO  (TEST-TestReqParamsAPI.test-seed#[39E6725A3B60CB1A]) [    ] o.a.s.l.LogWatcher SLF4J impl is org.slf4j.impl.Log4jLoggerFactory
   [junit4]   2> 1967432 INFO  (TEST-TestReqParamsAPI.test-seed#[39E6725A3B60CB1A]) [    ] o.a.s.l.LogWatcher Registering Log Listener [Log4j (org.slf4j.impl.Log4jLoggerFactory)]
   [junit4]   2> 1967432 INFO  (TEST-TestReqParamsAPI.test-seed#[39E6725A3B60CB1A]) [    ] o.a.s.c.ZkContainer Zookeeper client=127.0.0.1:58444/solr
   [junit4]   2> 1967432 INFO  (TEST-TestReqParamsAPI.test-seed#[39E6725A3B60CB1A]) [    ] o.a.s.c.ZkController zkHost includes chroot
   [junit4]   2> 1967432 INFO  (TEST-TestReqParamsAPI.test-seed#[39E6725A3B60CB1A]) [    ] o.a.s.c.c.SolrZkClient Using default ZkCredentialsProvider
   [junit4]   2> 1967437 INFO  (TEST-TestReqParamsAPI.test-seed#[39E6725A3B60CB1A]) [    ] o.a.s.c.c.ConnectionManager Waiting for client to connect to ZooKeeper
   [junit4]   2> 1967438 INFO  (zkCallback-2370-thread-1) [    ] o.a.s.c.c.ConnectionManager Watcher org.apache.solr.common.cloud.ConnectionManager@878662f name:ZooKeeperConnection Watcher:127.0.0.1:58444 got event WatchedEvent state:SyncConnected type:None path:null path:null type:None
   [junit4]   2> 1967438 INFO  (TEST-TestReqParamsAPI.test-seed#[39E6725A3B60CB1A]) [    ] o.a.s.c.c.ConnectionManager Client is connected to ZooKeeper
   [junit4]   2> 1967438 INFO  (TEST-TestReqParamsAPI.test-seed#[39E6725A3B60CB1A]) [    ] o.a.s.c.c.SolrZkClient Using default ZkACLProvider
   [junit4]   2> 1967439 INFO  (TEST-TestReqParamsAPI.test-seed#[39E6725A3B60CB1A]) [n:127.0.0.1:35217_f_kda%2Fcd    ] o.a.s.c.c.ConnectionManager Waiting for client to connect to ZooKeeper
   [junit4]   2> 1967440 INFO  (zkCallback-2371-thread-1-processing-n:127.0.0.1:35217_f_kda%2Fcd) [n:127.0.0.1:35217_f_kda%2Fcd    ] o.a.s.c.c.ConnectionManager Watcher org.apache.solr.common.cloud.ConnectionManager@2c3a5add name:ZooKeeperConnection Watcher:127.0.0.1:58444/solr got event WatchedEvent state:SyncConnected type:None path:null path:null type:None
   [junit4]   2> 1967440 INFO  (TEST-TestReqParamsAPI.test-seed#[39E6725A3B60CB1A]) [n:127.0.0.1:35217_f_kda%2Fcd    ] o.a.s.c.c.ConnectionManager Client is connected to ZooKeeper
   [junit4]   2> 1967446 INFO  (TEST-TestReqParamsAPI.test-seed#[39E6725A3B60CB1A]) [n:127.0.0.1:35217_f_kda%2Fcd    ] o.a.s.c.c.ZkStateReader Updating cluster state from ZooKeeper... 
   [junit4]   2> 1967447 INFO  (TEST-TestReqParamsAPI.test-seed#[39E6725A3B60CB1A]) [n:127.0.0.1:35217_f_kda%2Fcd    ] o.a.s.c.c.ZkStateReader Updated live nodes from ZooKeeper... (0) -> (1)
   [junit4]   2> 1967457 INFO  (TEST-TestReqParamsAPI.test-seed#[39E6725A3B60CB1A]) [n:127.0.0.1:35217_f_kda%2Fcd    ] o.a.s.c.Overseer Overseer (id=null) closing
   [junit4]   2> 1967458 INFO  (TEST-TestReqParamsAPI.test-seed#[39E6725A3B60CB1A]) [n:127.0.0.1:35217_f_kda%2Fcd    ] o.a.s.c.LeaderElector Joined leadership election with path: /overseer_elect/election/95484407989534730-127.0.0.1:35217_f_kda%2Fcd-n_0000000001
   [junit4]   2> 1967458 INFO  (TEST-TestReqParamsAPI.test-seed#[39E6725A3B60CB1A]) [n:127.0.0.1:35217_f_kda%2Fcd    ] o.a.s.c.LeaderElector Watching path /overseer_elect/election/95484407989534725-127.0.0.1:50989_f_kda%2Fcd-n_0000000000 to know if I could be the leader
   [junit4]   2> 1967459 INFO  (TEST-TestReqParamsAPI.test-seed#[39E6725A3B60CB1A]) [n:127.0.0.1:35217_f_kda%2Fcd    ] o.a.s.c.ZkController Publish node=127.0.0.1:35217_f_kda%2Fcd as DOWN
   [junit4]   2> 1967460 INFO  (OverseerStateUpdate-95484407989534725-127.0.0.1:50989_f_kda%2Fcd-n_0000000000) [n:127.0.0.1:50989_f_kda%2Fcd    ] o.a.s.c.Overseer processMessage: queueSize: 1, message = {
   [junit4]   2>   "operation":"downnode",
   [junit4]   2>   "node_name":"127.0.0.1:35217_f_kda%2Fcd"} current state version: 3
   [junit4]   2> 1967460 INFO  (OverseerStateUpdate-95484407989534725-127.0.0.1:50989_f_kda%2Fcd-n_0000000000) [n:127.0.0.1:50989_f_kda%2Fcd    ] o.a.s.c.o.NodeMutator DownNode state invoked for node: 127.0.0.1:35217_f_kda%2Fcd
   [junit4]   2> 1967461 INFO  (OverseerStateUpdate-95484407989534725-127.0.0.1:50989_f_kda%2Fcd-n_0000000000) [n:127.0.0.1:50989_f_kda%2Fcd    ] o.a.s.c.o.ZkStateWriter going to update_collection /collections/collection1/state.json version: 0
   [junit4]   2> 1967565 INFO  (zkCallback-2365-thread-1) [    ] o.a.s.c.c.ZkStateReader A cluster state change: [WatchedEvent state:SyncConnected type:NodeDataChanged path:/clusterstate.json], has occurred - updating... (live nodes size: [1])
   [junit4]   2> 1967565 INFO  (zkCallback-2371-thread-1-processing-n:127.0.0.1:35217_f_kda%2Fcd) [n:127.0.0.1:35217_f_kda%2Fcd    ] o.a.s.c.c.ZkStateReader A cluster state change: [WatchedEvent state:SyncConnected type:NodeDataChanged path:/clusterstate.json], has occurred - updating... (live nodes size: [1])
   [junit4]   2> 1967565 INFO  (zkCallback-2363-thread-1-processing-n:127.0.0.1:50989_f_kda%2Fcd) [n:127.0.0.1:50989_f_kda%2Fcd    ] o.a.s.c.c.ZkStateReader A cluster state change: [WatchedEvent state:SyncConnected type:NodeDataChanged path:/clusterstate.json], has occurred - updating... (live nodes size: [1])
   [junit4]   2> 1968461 INFO  (TEST-TestReqParamsAPI.test-seed#[39E6725A3B60CB1A]) [n:127.0.0.1:35217_f_kda%2Fcd    ] o.a.s.c.ZkController Register node as live in ZooKeeper:/live_nodes/127.0.0.1:35217_f_kda%2Fcd
   [junit4]   2> 1968462 INFO  (TEST-TestReqParamsAPI.test-seed#[39E6725A3B60CB1A]) [n:127.0.0.1:35217_f_kda%2Fcd    ] o.a.s.c.c.SolrZkClient makePath: /live_nodes/127.0.0.1:35217_f_kda%2Fcd
   [junit4]   2> 1968463 INFO  (zkCallback-2363-thread-1-processing-n:127.0.0.1:50989_f_kda%2Fcd) [n:127.0.0.1:50989_f_kda%2Fcd    ] o.a.s.c.c.ZkStateReader A live node change: [WatchedEvent state:SyncConnected type:NodeChildrenChanged path:/live_nodes], has occurred - updating... (live nodes size: [1])
   [junit4]   2> 1968463 INFO  (zkCallback-2371-thread-1-processing-n:127.0.0.1:35217_f_kda%2Fcd) [n:127.0.0.1:35217_f_kda%2Fcd    ] o.a.s.c.c.ZkStateReader A live node change: [WatchedEvent state:SyncConnected type:NodeChildrenChanged path:/live_nodes], has occurred - updating... (live nodes size: [1])
   [junit4]   2> 1968463 INFO  (zkCallback-2365-thread-1) [    ] o.a.s.c.c.ZkStateReader A live node change: [WatchedEvent state:SyncConnected type:NodeChildrenChanged path:/live_nodes], has occurred - updating... (live nodes size: [1])
   [junit4]   2> 1968464 INFO  (zkCallback-2363-thread-1-processing-n:127.0.0.1:50989_f_kda%2Fcd) [n:127.0.0.1:50989_f_kda%2Fcd    ] o.a.s.c.c.ZkStateReader Updated live nodes from ZooKeeper... (1) -> (2)
   [junit4]   2> 1968464 INFO  (zkCallback-2371-thread-1-processing-n:127.0.0.1:35217_f_kda%2Fcd) [n:127.0.0.1:35217_f_kda%2Fcd    ] o.a.s.c.c.ZkStateReader Updated live nodes from ZooKeeper... (1) -> (2)
   [junit4]   2> 1968464 INFO  (zkCallback-2365-thread-1) [    ] o.a.s.c.c.ZkStateReader Updated live nodes from ZooKeeper... (1) -> (2)
   [junit4]   2> 1968484 INFO  (TEST-TestReqParamsAPI.test-seed#[39E6725A3B60CB1A]) [n:127.0.0.1:35217_f_kda%2Fcd    ] o.a.s.c.CoreContainer Security conf doesn't exist. Skipping setup for authorization module.
   [junit4]   2> 1968484 INFO  (TEST-TestReqParamsAPI.test-seed#[39E6725A3B60CB1A]) [n:127.0.0.1:35217_f_kda%2Fcd    ] o.a.s.c.CoreContainer No authentication plugin used.
   [junit4]   2> 1968485 INFO  (TEST-TestReqParamsAPI.test-seed#[39E6725A3B60CB1A]) [n:127.0.0.1:35217_f_kda%2Fcd    ] o.a.s.c.CorePropertiesLocator Looking for core definitions underneath /x1/jenkins/jenkins-slave/workspace/Lucene-Solr-Tests-trunk-Java8/solr/build/solr-core/test/J2/../../../../../../../../../../x1/jenkins/jenkins-slave/workspace/Lucene-Solr-Tests-trunk-Java8/solr/build/solr-core/test/J2/temp/solr.handler.TestReqParamsAPI_39E6725A3B60CB1A-001/shard-1-001/cores
   [junit4]   2> 1968486 INFO  (TEST-TestReqParamsAPI.test-seed#[39E6725A3B60CB1A]) [n:127.0.0.1:35217_f_kda%2Fcd    ] o.a.s.c.CoreDescriptor Created CoreDescriptor: {name=collection1, config=solrconfig.xml, transient=false, schema=schema.xml, loadOnStartup=true, configSetProperties=configsetprops.json, collection=collection1, coreNodeName=, dataDir=data/, shard=}
   [junit4]   2> 1968486 INFO  (TEST-TestReqParamsAPI.test-seed#[39E6725A3B60CB1A]) [n:127.0.0.1:35217_f_kda%2Fcd    ] o.a.s.c.CorePropertiesLocator Found core collection1 in /x1/jenkins/jenkins-slave/workspace/Lucene-Solr-Tests-trunk-Java8/solr/build/solr-core/test/J2/../../../../../../../../../../x1/jenkins/jenkins-slave/workspace/Lucene-Solr-Tests-trunk-Java8/solr/build/solr-core/test/J2/temp/solr.handler.TestReqParamsAPI_39E6725A3B60CB1A-001/shard-1-001/cores/collection1
   [junit4]   2> 1968486 INFO  (TEST-TestReqParamsAPI.test-seed#[39E6725A3B60CB1A]) [n:127.0.0.1:35217_f_kda%2Fcd    ] o.a.s.c.CorePropertiesLocator Found 1 core definitions
   [junit4]   2> 1968488 INFO  (TEST-TestReqParamsAPI.test-seed#[39E6725A3B60CB1A]) [n:127.0.0.1:35217_f_kda%2Fcd    ] o.a.s.s.SolrDispatchFilter user.dir=/x1/jenkins/jenkins-slave/workspace/Lucene-Solr-Tests-trunk-Java8/solr/build/solr-core/test/J2
   [junit4]   2> 1968488 INFO  (TEST-TestReqParamsAPI.test-seed#[39E6725A3B60CB1A]) [n:127.0.0.1:35217_f_kda%2Fcd    ] o.a.s.s.SolrDispatchFilter SolrDispatchFilter.init() done
   [junit4]   2> 1968488 INFO  (coreLoadExecutor-6242-thread-1-processing-n:127.0.0.1:35217_f_kda%2Fcd) [n:127.0.0.1:35217_f_kda%2Fcd c:collection1   x:collection1] o.a.s.c.ZkController publishing state=down
   [junit4]   2> 1968488 INFO  (coreLoadExecutor-6242-thread-1-processing-n:127.0.0.1:35217_f_kda%2Fcd) [n:127.0.0.1:35217_f_kda%2Fcd c:collection1   x:collection1] o.a.s.c.ZkController numShards not found on descriptor - reading it from system property
   [junit4]   2> 1968489 INFO  (coreLoadExecutor-6242-thread-1-processing-n:127.0.0.1:35217_f_kda%2Fcd) [n:127.0.0.1:35217_f_kda%2Fcd c:collection1   x:collection1] o.a.s.c.ZkController Registering watch for collection collection1
   [junit4]   2> 1968489 INFO  (coreLoadExecutor-6242-thread-1-processing-n:127.0.0.1:35217_f_kda%2Fcd) [n:127.0.0.1:35217_f_kda%2Fcd c:collection1   x:collection1] o.a.s.c.c.ZkStateReader addZkWatch [collection1]
   [junit4]   2> 1968489 INFO  (OverseerStateUpdate-95484407989534725-127.0.0.1:50989_f_kda%2Fcd-n_0000000000) [n:127.0.0.1:50989_f_kda%2Fcd    ] o.a.s.c.Overseer processMessage: queueSize: 1, message = {
   [junit4]   2>   "core":"collection1",
   [junit4]   2>   "roles":null,
   [junit4]   2>   "base_url":"https://127.0.0.1:35217/f_kda/cd",
   [junit4]   2>   "node_name":"127.0.0.1:35217_f_kda%2Fcd",
   [junit4]   2>   "numShards":"2",
   [junit4]   2>   "state":"down",
   [junit4]   2>   "shard":null,
   [junit4]   2>   "collection":"collection1",
   [junit4]   2>   "operation":"state"} current state version: 4
   [junit4]   2> 1968490 INFO  (coreLoadExecutor-6242-thread-1-processing-n:127.0.0.1:35217_f_kda%2Fcd) [n:127.0.0.1:35217_f_kda%2Fcd c:collection1   x:collection1] o.a.s.c.c.ZkStateReader Add data for [collection1] ver [1]
   [junit4]   2> 1968490 INFO  (coreLoadExecutor-6242-thread-1-processing-n:127.0.0.1:35217_f_kda%2Fcd) [n:127.0.0.1:35217_f_kda%2Fcd c:collection1   x:collection1] o.a.s.c.ZkController look for our core node name
   [junit4]   2> 1968490 INFO  (OverseerStateUpdate-95484407989534725-127.0.0.1:50989_f_kda%2Fcd-n_0000000000) [n:127.0.0.1:50989_f_kda%2Fcd    ] o.a.s.c.o.ReplicaMutator Update state numShards=2 message={
   [junit4]   2>   "core":"collection1",
   [junit4]   2>   "roles":null,
   [junit4]   2>   "base_url":"https://127.0.0.1:35217/f_kda/cd",
   [junit4]   2>   "node_name":"127.0.0.1:35217_f_kda%2Fcd",
   [junit4]   2>   "numShards":"2",
   [junit4]   2>   "state":"down",
   [junit4]   2>   "shard":null,
   [junit4]   2>   "collection":"collection1",
   [junit4]   2>   "operation":"state"}
   [junit4]   2> 1968490 INFO  (OverseerStateUpdate-95484407989534725-127.0.0.1:50989_f_kda%2Fcd-n_0000000000) [n:127.0.0.1:50989_f_kda%2Fcd    ] o.a.s.c.o.ReplicaMutator Collection already exists with numShards=2
   [junit4]   2> 1968490 INFO  (OverseerStateUpdate-95484407989534725-127.0.0.1:50989_f_kda%2Fcd-n_0000000000) [n:127.0.0.1:50989_f_kda%2Fcd    ] o.a.s.c.o.ReplicaMutator Assigning new node to shard shard=shard2
   [junit4]   2> 1968592 INFO  (OverseerStateUpdate-95484407989534725-127.0.0.1:50989_f_kda%2Fcd-n_0000000000) [n:127.0.0.1:50989_f_kda%2Fcd    ] o.a.s.c.o.ZkStateWriter going to update_collection /collections/collection1/state.json version: 1
   [junit4]   2> 1968593 INFO  (zkCallback-2371-thread-1-processing-n:127.0.0.1:35217_f_kda%2Fcd) [n:127.0.0.1:35217_f_kda%2Fcd    ] o.a.s.c.c.ZkStateReader A cluster state change: [WatchedEvent state:SyncConnected type:NodeDataChanged path:/collections/collection1/state.json] for collection [collection1] has occurred - updating... (live nodes size: [2])
   [junit4]   2> 1968593 INFO  (zkCallback-2371-thread-1-processing-n:127.0.0.1:35217_f_kda%2Fcd) [n:127.0.0.1:35217_f_kda%2Fcd    ] o.a.s.c.c.ZkStateReader Updating data for [collection1] from [1] to [2]
   [junit4]   2> 1969490 INFO  (coreLoadExecutor-6242-thread-1-processing-n:127.0.0.1:35217_f_kda%2Fcd) [n:127.0.0.1:35217_f_kda%2Fcd c:collection1   x:collection1] o.a.s.c.ZkController waiting to find shard id in clusterstate for collection1
   [junit4]   2> 1969490 INFO  (coreLoadExecutor-6242-thread-1-processing-n:127.0.0.1:35217_f_kda%2Fcd) [n:127.0.0.1:35217_f_kda%2Fcd c:collection1   x:collection1] o.a.s.c.ZkController Check for collection zkNode:collection1
   [junit4]   2> 1969490 INFO  (coreLoadExecutor-6242-thread-1-processing-n:127.0.0.1:35217_f_kda%2Fcd) [n:127.0.0.1:35217_f_kda%2Fcd c:collection1   x:collection1] o.a.s.c.ZkController Collection zkNode exists
   [junit4]   2> 1969491 

[...truncated too long message...]

erProcess(ElectionContext.java:455)
   [junit4]   2> 	at org.apache.solr.cloud.LeaderElector.runIamLeaderProcess(LeaderElector.java:173)
   [junit4]   2> 	at org.apache.solr.cloud.LeaderElector.checkIfIamLeader(LeaderElector.java:138)
   [junit4]   2> 	at org.apache.solr.cloud.LeaderElector.access$200(LeaderElector.java:59)
   [junit4]   2> 	at org.apache.solr.cloud.LeaderElector$ElectionWatcher.process(LeaderElector.java:351)
   [junit4]   2> 	at org.apache.solr.common.cloud.SolrZkClient$3$1.run(SolrZkClient.java:269)
   [junit4]   2> 	at java.util.concurrent.Executors$RunnableAdapter.call(Executors.java:511)
   [junit4]   2> 	at java.util.concurrent.FutureTask.run(FutureTask.java:266)
   [junit4]   2> 	at org.apache.solr.common.util.ExecutorUtil$MDCAwareThreadPoolExecutor$1.run(ExecutorUtil.java:231)
   [junit4]   2> 	at java.util.concurrent.ThreadPoolExecutor.runWorker(ThreadPoolExecutor.java:1142)
   [junit4]   2> 	at java.util.concurrent.ThreadPoolExecutor$Worker.run(ThreadPoolExecutor.java:617)
   [junit4]   2> 	at java.lang.Thread.run(Thread.java:745)
   [junit4]   2> 1995347 INFO  (TEST-TestReqParamsAPI.test-seed#[39E6725A3B60CB1A]) [    ] o.e.j.s.ServerConnector Stopped ServerConnector@4926022{SSL,[ssl, http/1.1]}{127.0.0.1:0}
   [junit4]   2> 1995347 INFO  (TEST-TestReqParamsAPI.test-seed#[39E6725A3B60CB1A]) [    ] o.e.j.s.h.ContextHandler Stopped o.e.j.s.ServletContextHandler@58a63067{/f_kda/cd,null,UNAVAILABLE}
   [junit4]   2> 1995349 INFO  (TEST-TestReqParamsAPI.test-seed#[39E6725A3B60CB1A]) [    ] o.a.s.c.ZkTestServer connecting to 127.0.0.1:58444 58444
   [junit4]   2> 1995603 INFO  (Thread-6185) [    ] o.a.s.c.ZkTestServer connecting to 127.0.0.1:58444 58444
   [junit4]   2> 1995605 WARN  (Thread-6185) [    ] o.a.s.c.ZkTestServer Watch limit violations: 
   [junit4]   2> Maximum concurrent create/delete watches above limit:
   [junit4]   2> 
   [junit4]   2> 	25	/solr/configs/conf1
   [junit4]   2> 	6	/solr/aliases.json
   [junit4]   2> 	5	/solr/security.json
   [junit4]   2> 
   [junit4]   2> Maximum concurrent data watches above limit:
   [junit4]   2> 
   [junit4]   2> 	6	/solr/clusterstate.json
   [junit4]   2> 	4	/solr/collections/collection1/state.json
   [junit4]   2> 
   [junit4]   2> Maximum concurrent children watches above limit:
   [junit4]   2> 
   [junit4]   2> 	6	/solr/live_nodes
   [junit4]   2> 	6	/solr/collections
   [junit4]   2> 	5	/solr/overseer/queue
   [junit4]   2> 	5	/solr/overseer/collection-queue-work
   [junit4]   2> 
   [junit4]   2> NOTE: reproduce with: ant test  -Dtestcase=TestReqParamsAPI -Dtests.method=test -Dtests.seed=39E6725A3B60CB1A -Dtests.multiplier=2 -Dtests.slow=true -Dtests.locale=it -Dtests.timezone=US/Arizona -Dtests.asserts=true -Dtests.file.encoding=ISO-8859-1
   [junit4] FAILURE 31.0s J2 | TestReqParamsAPI.test <<<
   [junit4]    > Throwable #1: java.lang.AssertionError: Could not get expected value  'CY val' for path 'response/params/y/c' full output: {
   [junit4]    >   "responseHeader":{
   [junit4]    >     "status":0,
   [junit4]    >     "QTime":0},
   [junit4]    >   "response":{
   [junit4]    >     "znodeVersion":0,
   [junit4]    >     "params":{"x":{
   [junit4]    >         "a":"A val",
   [junit4]    >         "b":"B val",
   [junit4]    >         "":{"v":0}}}}}
   [junit4]    > 	at __randomizedtesting.SeedInfo.seed([39E6725A3B60CB1A:B1B24D80959CA6E2]:0)
   [junit4]    > 	at org.apache.solr.core.TestSolrConfigHandler.testForResponseElement(TestSolrConfigHandler.java:458)
   [junit4]    > 	at org.apache.solr.handler.TestReqParamsAPI.testReqParams(TestReqParamsAPI.java:165)
   [junit4]    > 	at org.apache.solr.handler.TestReqParamsAPI.test(TestReqParamsAPI.java:67)
   [junit4]    > 	at org.apache.solr.BaseDistributedSearchTestCase$ShardsRepeatRule$ShardsFixedStatement.callStatement(BaseDistributedSearchTestCase.java:996)
   [junit4]    > 	at org.apache.solr.BaseDistributedSearchTestCase$ShardsRepeatRule$ShardsStatement.evaluate(BaseDistributedSearchTestCase.java:971)
   [junit4]    > 	at java.lang.Thread.run(Thread.java:745)
   [junit4]   2> 1995609 INFO  (SUITE-TestReqParamsAPI-seed#[39E6725A3B60CB1A]-worker) [    ] o.a.s.SolrTestCaseJ4 ###deleteCore
   [junit4]   2> NOTE: leaving temporary files on disk at: /x1/jenkins/jenkins-slave/workspace/Lucene-Solr-Tests-trunk-Java8/solr/build/solr-core/test/J2/temp/solr.handler.TestReqParamsAPI_39E6725A3B60CB1A-001
   [junit4]   2> NOTE: test params are: codec=CheapBastard, sim=RandomSimilarity(queryNorm=true,coord=crazy): {}, locale=it, timezone=US/Arizona
   [junit4]   2> NOTE: Linux 3.13.0-52-generic amd64/Oracle Corporation 1.8.0_66 (64-bit)/cpus=4,threads=1,free=274821272,total=529530880
   [junit4]   2> NOTE: All tests run in this JVM: [TestZkChroot, TestFuzzyAnalyzedSuggestions, TestCoreDiscovery, DistributedFacetPivotSmallTest, BasicDistributedZk2Test, OverseerRolesTest, TlogReplayBufferedWhileIndexingTest, LukeRequestHandlerTest, FieldMutatingUpdateProcessorTest, TestSolrConfigHandlerConcurrent, SegmentsInfoRequestHandlerTest, HdfsChaosMonkeySafeLeaderTest, TestStressRecovery, RegexBoostProcessorTest, TestStressReorder, TestRecovery, BufferStoreTest, TestExtendedDismaxParser, SliceStateTest, BadComponentTest, RequestHandlersTest, HLLSerializationTest, TestCryptoKeys, TestRestoreCore, SuggesterWFSTTest, TestBlendedInfixSuggestions, DistributedQueryComponentOptimizationTest, TestSchemaManager, BasicAuthIntegrationTest, TestScoreJoinQPNoScore, TestDefaultSearchFieldResource, TestSearchPerf, TestComplexPhraseQParserPlugin, TermVectorComponentDistributedTest, PrimitiveFieldTypeTest, TestObjectReleaseTracker, SuggesterTest, TestReload, OutOfBoxZkACLAndCredentialsProvidersTest, HighlighterConfigTest, RestartWhileUpdatingTest, TestCloudSchemaless, SuggesterTSTTest, TestHdfsUpdateLog, TestJettySolrRunner, DeleteReplicaTest, DirectUpdateHandlerOptimizeTest, TestSuggestSpellingConverter, OverseerTest, TestSolrQueryParser, TestFilteredDocIdSet, CleanupOldIndexTest, TestSolrIndexConfig, HdfsUnloadDistributedZkTest, CustomCollectionTest, TestBulkSchemaConcurrent, DocValuesMultiTest, TestDFISimilarityFactory, CdcrRequestHandlerTest, TestRawTransformer, CloudMLTQParserTest, TestXIncludeConfig, TestIndexSearcher, ClusterStateTest, TestTrackingShardHandlerFactory, TestReloadDeadlock, TestSort, CurrencyFieldXmlFileTest, ConcurrentDeleteAndCreateCollectionTest, StatelessScriptUpdateProcessorFactoryTest, AssignTest, TestMiniSolrCloudCluster, BitVectorTest, TestJmxIntegration, HdfsRecoverLeaseTest, StatsComponentTest, TestAddFieldRealTimeGet, UpdateParamsTest, CircularListTest, AddBlockUpdateTest, DirectSolrConnectionTest, TestShortCircuitedRequests, TestSortByMinMaxFunction, LeaderElectionTest, TestSweetSpotSimilarityFactory, TestSmileRequest, DataDrivenBlockJoinTest, TestIndexingPerformance, TestDistributedStatsComponentCardinality, HdfsBasicDistributedZk2Test, CoreMergeIndexesAdminHandlerTest, FullSolrCloudDistribCmdsTest, SearchHandlerTest, SharedFSAutoReplicaFailoverUtilsTest, BinaryUpdateRequestHandlerTest, BasicDistributedZkTest, SyncSliceTest, BasicZkTest, RecoveryZkTest, TestHashPartitioner, TestRealTimeGet, TestGroupingSearch, PeerSyncTest, BasicFunctionalityTest, DirectUpdateHandlerTest, HighlighterTest, ShowFileRequestHandlerTest, SolrRequestParserTest, DocValuesTest, NoCacheHeaderTest, SolrCoreCheckLockOnStartupTest, DistanceFunctionTest, CacheHeaderTest, TestQueryUtils, TestReversedWildcardFilterFactory, TermsComponentTest, TermVectorComponentTest, TestArbitraryIndexDir, TestCollationField, TestCSVResponseWriter, TestAnalyzedSuggestions, CSVRequestHandlerTest, TestBinaryResponseWriter, TestQuerySenderNoQuery, ResponseLogComponentTest, SampleTest, TestDocSet, TestSolrCoreProperties, TestPostingsSolrHighlighter, SynonymTokenizerTest, TestLMDirichletSimilarityFactory, TestFastWriter, TimeZoneUtilsTest, TestFastOutputStream, PluginInfoTest, TestFastLRUCache, DateMathParserTest, TestSystemIdResolver, PrimUtilsTest, SpellingQueryConverterTest, DOMUtilTest, TestSolrJ, TestUtils, TestDocumentBuilder, ZkNodePropsTest, UUIDFieldTest, DistributedMLTComponentTest, TestRTGBase, DistributedIntervalFacetingTest, AliasIntegrationTest, CollectionTooManyReplicasTest, DistribCursorPagingTest, ForceLeaderTest, SSLMigrationTest, SharedFSAutoReplicaFailoverTest, SolrCloudExampleTest, SolrXmlInZkTest, TestAuthenticationFramework, TestConfigOverlay, TestConfigSetImmutable, TestImplicitCoreProperties, TestInitParams, TestReloadAndDeleteDocs, TestShardHandlerFactory, TestSolrXml, RequestLoggingTest, TestBlobHandler, TestReqParamsAPI]
   [junit4] Completed [490/581 (1!)] on J2 in 31.00s, 1 test, 1 failure <<< FAILURES!

[...truncated 299 lines...]
BUILD FAILED
/x1/jenkins/jenkins-slave/workspace/Lucene-Solr-Tests-trunk-Java8/build.xml:740: The following error occurred while executing this line:
/x1/jenkins/jenkins-slave/workspace/Lucene-Solr-Tests-trunk-Java8/build.xml:684: The following error occurred while executing this line:
/x1/jenkins/jenkins-slave/workspace/Lucene-Solr-Tests-trunk-Java8/build.xml:59: The following error occurred while executing this line:
/x1/jenkins/jenkins-slave/workspace/Lucene-Solr-Tests-trunk-Java8/solr/build.xml:233: The following error occurred while executing this line:
/x1/jenkins/jenkins-slave/workspace/Lucene-Solr-Tests-trunk-Java8/solr/common-build.xml:524: The following error occurred while executing this line:
/x1/jenkins/jenkins-slave/workspace/Lucene-Solr-Tests-trunk-Java8/lucene/common-build.xml:1457: The following error occurred while executing this line:
/x1/jenkins/jenkins-slave/workspace/Lucene-Solr-Tests-trunk-Java8/lucene/common-build.xml:1014: There were test failures: 581 suites (8 ignored), 2345 tests, 1 failure, 87 ignored (71 assumptions) [seed: 39E6725A3B60CB1A]

Total time: 62 minutes 0 seconds
Build step 'Invoke Ant' marked build as failure
Archiving artifacts
Recording test results
Email was triggered for: Failure - Any
Sending email for trigger: Failure - Any



Mime
View raw message