lucene-dev mailing list archives

Site index · List index
Message view « Date » · « Thread »
Top « Date » · « Thread »
From Apache Jenkins Server <jenk...@builds.apache.org>
Subject [JENKINS] Lucene-Solr-NightlyTests-trunk - Build # 948 - Still Failing
Date Tue, 01 Mar 2016 12:55:13 GMT
Build: https://builds.apache.org/job/Lucene-Solr-NightlyTests-trunk/948/

2 tests failed.
FAILED:  org.apache.lucene.search.TestPointQueries.testRandomBinaryBig

Error Message:
Test abandoned because suite timeout was reached.

Stack Trace:
java.lang.Exception: Test abandoned because suite timeout was reached.
	at __randomizedtesting.SeedInfo.seed([C68A48CE5395856C]:0)


FAILED:  junit.framework.TestSuite.org.apache.lucene.search.TestPointQueries

Error Message:
Suite timeout exceeded (>= 7200000 msec).

Stack Trace:
java.lang.Exception: Suite timeout exceeded (>= 7200000 msec).
	at __randomizedtesting.SeedInfo.seed([C68A48CE5395856C]:0)




Build Log:
[...truncated 1764 lines...]
   [junit4] Suite: org.apache.lucene.search.TestPointQueries
   [junit4]   2> ??? 01, 2016 5:27:27 ? com.carrotsearch.randomizedtesting.ThreadLeakControl$2
evaluate
   [junit4]   2> WARNING: Suite execution timed out: org.apache.lucene.search.TestPointQueries
   [junit4]   2>    1) Thread[id=4394, name=TEST-TestPointQueries.testRandomBinaryBig-seed#[C68A48CE5395856C],
state=RUNNABLE, group=TGRP-TestPointQueries]
   [junit4]   2>         at org.apache.lucene.util.Sorter.siftDown(Sorter.java:234)
   [junit4]   2>         at org.apache.lucene.util.Sorter.heapSort(Sorter.java:221)
   [junit4]   2>         at org.apache.lucene.util.IntroSorter.quicksort(IntroSorter.java:49)
   [junit4]   2>         at org.apache.lucene.util.IntroSorter.quicksort(IntroSorter.java:87)
   [junit4]   2>         at org.apache.lucene.util.IntroSorter.quicksort(IntroSorter.java:87)
   [junit4]   2>         at org.apache.lucene.util.IntroSorter.quicksort(IntroSorter.java:87)
   [junit4]   2>         at org.apache.lucene.util.IntroSorter.quicksort(IntroSorter.java:87)
   [junit4]   2>         at org.apache.lucene.util.IntroSorter.quicksort(IntroSorter.java:87)
   [junit4]   2>         at org.apache.lucene.util.IntroSorter.quicksort(IntroSorter.java:87)
   [junit4]   2>         at org.apache.lucene.util.IntroSorter.quicksort(IntroSorter.java:87)
   [junit4]   2>         at org.apache.lucene.util.IntroSorter.quicksort(IntroSorter.java:87)
   [junit4]   2>         at org.apache.lucene.util.IntroSorter.quicksort(IntroSorter.java:87)
   [junit4]   2>         at org.apache.lucene.util.IntroSorter.quicksort(IntroSorter.java:87)
   [junit4]   2>         at org.apache.lucene.util.IntroSorter.quicksort(IntroSorter.java:87)
   [junit4]   2>         at org.apache.lucene.util.IntroSorter.quicksort(IntroSorter.java:87)
   [junit4]   2>         at org.apache.lucene.util.IntroSorter.quicksort(IntroSorter.java:87)
   [junit4]   2>         at org.apache.lucene.util.IntroSorter.quicksort(IntroSorter.java:87)
   [junit4]   2>         at org.apache.lucene.util.IntroSorter.quicksort(IntroSorter.java:87)
   [junit4]   2>         at org.apache.lucene.util.IntroSorter.quicksort(IntroSorter.java:87)
   [junit4]   2>         at org.apache.lucene.util.IntroSorter.quicksort(IntroSorter.java:87)
   [junit4]   2>         at org.apache.lucene.util.IntroSorter.sort(IntroSorter.java:41)
   [junit4]   2>         at org.apache.lucene.util.BytesRefArray.sort(BytesRefArray.java:149)
   [junit4]   2>         at org.apache.lucene.util.BytesRefArray.iterator(BytesRefArray.java:177)
   [junit4]   2>         at org.apache.lucene.util.OfflineSorter.sortPartition(OfflineSorter.java:293)
   [junit4]   2>         at org.apache.lucene.util.OfflineSorter.sort(OfflineSorter.java:244)
   [junit4]   2>         at org.apache.lucene.util.bkd.BKDWriter.sort(BKDWriter.java:739)
   [junit4]   2>         at org.apache.lucene.util.bkd.BKDWriter.finish(BKDWriter.java:814)
   [junit4]   2>         at org.apache.lucene.codecs.lucene60.Lucene60PointWriter.writeField(Lucene60PointWriter.java:110)
   [junit4]   2>         at org.apache.lucene.codecs.PointWriter.mergeOneField(PointWriter.java:44)
   [junit4]   2>         at org.apache.lucene.codecs.lucene60.Lucene60PointWriter.merge(Lucene60PointWriter.java:174)
   [junit4]   2>         at org.apache.lucene.index.SegmentMerger.mergePoints(SegmentMerger.java:168)
   [junit4]   2>         at org.apache.lucene.index.SegmentMerger.merge(SegmentMerger.java:117)
   [junit4]   2>         at org.apache.lucene.index.IndexWriter.mergeMiddle(IndexWriter.java:4099)
   [junit4]   2>         at org.apache.lucene.index.IndexWriter.merge(IndexWriter.java:3679)
   [junit4]   2>         at org.apache.lucene.index.SerialMergeScheduler.merge(SerialMergeScheduler.java:40)
   [junit4]   2>         at org.apache.lucene.index.IndexWriter.maybeMerge(IndexWriter.java:1946)
   [junit4]   2>         at org.apache.lucene.index.IndexWriter.doAfterSegmentFlushed(IndexWriter.java:4740)
   [junit4]   2>         at org.apache.lucene.index.DocumentsWriter$MergePendingEvent.process(DocumentsWriter.java:689)
   [junit4]   2>         at org.apache.lucene.index.IndexWriter.processEvents(IndexWriter.java:4778)
   [junit4]   2>         at org.apache.lucene.index.IndexWriter.processEvents(IndexWriter.java:4769)
   [junit4]   2>         at org.apache.lucene.index.IndexWriter.updateDocument(IndexWriter.java:1493)
   [junit4]   2>         at org.apache.lucene.index.IndexWriter.addDocument(IndexWriter.java:1271)
   [junit4]   2>         at org.apache.lucene.index.RandomIndexWriter.addDocument(RandomIndexWriter.java:170)
   [junit4]   2>         at org.apache.lucene.search.TestPointQueries.verifyBinary(TestPointQueries.java:591)
   [junit4]   2>         at org.apache.lucene.search.TestPointQueries.doTestRandomBinary(TestPointQueries.java:536)
   [junit4]   2>         at org.apache.lucene.search.TestPointQueries.testRandomBinaryBig(TestPointQueries.java:501)
   [junit4]   2>         at sun.reflect.NativeMethodAccessorImpl.invoke0(Native Method)
   [junit4]   2>         at sun.reflect.NativeMethodAccessorImpl.invoke(NativeMethodAccessorImpl.java:62)
   [junit4]   2>         at sun.reflect.DelegatingMethodAccessorImpl.invoke(DelegatingMethodAccessorImpl.java:43)
   [junit4]   2>         at java.lang.reflect.Method.invoke(Method.java:497)
   [junit4]   2>         at com.carrotsearch.randomizedtesting.RandomizedRunner.invoke(RandomizedRunner.java:1764)
   [junit4]   2>         at com.carrotsearch.randomizedtesting.RandomizedRunner$8.evaluate(RandomizedRunner.java:871)
   [junit4]   2>         at com.carrotsearch.randomizedtesting.RandomizedRunner$9.evaluate(RandomizedRunner.java:907)
   [junit4]   2>         at com.carrotsearch.randomizedtesting.RandomizedRunner$10.evaluate(RandomizedRunner.java:921)
   [junit4]   2>         at org.apache.lucene.util.TestRuleSetupTeardownChained$1.evaluate(TestRuleSetupTeardownChained.java:49)
   [junit4]   2>         at org.apache.lucene.util.AbstractBeforeAfterRule$1.evaluate(AbstractBeforeAfterRule.java:45)
   [junit4]   2>         at org.apache.lucene.util.TestRuleThreadAndTestName$1.evaluate(TestRuleThreadAndTestName.java:48)
   [junit4]   2>         at org.apache.lucene.util.TestRuleIgnoreAfterMaxFailures$1.evaluate(TestRuleIgnoreAfterMaxFailures.java:64)
   [junit4]   2>         at org.apache.lucene.util.TestRuleMarkFailure$1.evaluate(TestRuleMarkFailure.java:47)
   [junit4]   2>         at com.carrotsearch.randomizedtesting.rules.StatementAdapter.evaluate(StatementAdapter.java:36)
   [junit4]   2>         at com.carrotsearch.randomizedtesting.ThreadLeakControl$StatementRunner.run(ThreadLeakControl.java:367)
   [junit4]   2>         at com.carrotsearch.randomizedtesting.ThreadLeakControl.forkTimeoutingTask(ThreadLeakControl.java:809)
   [junit4]   2>         at com.carrotsearch.randomizedtesting.ThreadLeakControl$3.evaluate(ThreadLeakControl.java:460)
   [junit4]   2>         at com.carrotsearch.randomizedtesting.RandomizedRunner.runSingleTest(RandomizedRunner.java:880)
   [junit4]   2>         at com.carrotsearch.randomizedtesting.RandomizedRunner$5.evaluate(RandomizedRunner.java:781)
   [junit4]   2>         at com.carrotsearch.randomizedtesting.RandomizedRunner$6.evaluate(RandomizedRunner.java:816)
   [junit4]   2>         at com.carrotsearch.randomizedtesting.RandomizedRunner$7.evaluate(RandomizedRunner.java:827)
   [junit4]   2>         at org.apache.lucene.util.AbstractBeforeAfterRule$1.evaluate(AbstractBeforeAfterRule.java:45)
   [junit4]   2>         at com.carrotsearch.randomizedtesting.rules.StatementAdapter.evaluate(StatementAdapter.java:36)
   [junit4]   2>         at org.apache.lucene.util.TestRuleStoreClassName$1.evaluate(TestRuleStoreClassName.java:41)
   [junit4]   2>         at com.carrotsearch.randomizedtesting.rules.NoShadowingOrOverridesOnMethodsRule$1.evaluate(NoShadowingOrOverridesOnMethodsRule.java:40)
   [junit4]   2>         at com.carrotsearch.randomizedtesting.rules.NoShadowingOrOverridesOnMethodsRule$1.evaluate(NoShadowingOrOverridesOnMethodsRule.java:40)
   [junit4]   2>         at com.carrotsearch.randomizedtesting.rules.StatementAdapter.evaluate(StatementAdapter.java:36)
   [junit4]   2>         at com.carrotsearch.randomizedtesting.rules.StatementAdapter.evaluate(StatementAdapter.java:36)
   [junit4]   2>         at com.carrotsearch.randomizedtesting.rules.StatementAdapter.evaluate(StatementAdapter.java:36)
   [junit4]   2>         at org.apache.lucene.util.TestRuleAssertionsRequired$1.evaluate(TestRuleAssertionsRequired.java:53)
   [junit4]   2>         at org.apache.lucene.util.TestRuleMarkFailure$1.evaluate(TestRuleMarkFailure.java:47)
   [junit4]   2>         at org.apache.lucene.util.TestRuleIgnoreAfterMaxFailures$1.evaluate(TestRuleIgnoreAfterMaxFailures.java:64)
   [junit4]   2>         at org.apache.lucene.util.TestRuleIgnoreTestSuites$1.evaluate(TestRuleIgnoreTestSuites.java:54)
   [junit4]   2>         at com.carrotsearch.randomizedtesting.rules.StatementAdapter.evaluate(StatementAdapter.java:36)
   [junit4]   2>         at com.carrotsearch.randomizedtesting.ThreadLeakControl$StatementRunner.run(ThreadLeakControl.java:367)
   [junit4]   2>         at java.lang.Thread.run(Thread.java:745)
   [junit4]   2>    2) Thread[id=1, name=main, state=WAITING, group=main]
   [junit4]   2>         at java.lang.Object.wait(Native Method)
   [junit4]   2>         at java.lang.Thread.join(Thread.java:1245)
   [junit4]   2>         at java.lang.Thread.join(Thread.java:1319)
   [junit4]   2>         at com.carrotsearch.randomizedtesting.RandomizedRunner.runSuite(RandomizedRunner.java:601)
   [junit4]   2>         at com.carrotsearch.randomizedtesting.RandomizedRunner.run(RandomizedRunner.java:450)
   [junit4]   2>         at com.carrotsearch.ant.tasks.junit4.slave.SlaveMain.execute(SlaveMain.java:243)
   [junit4]   2>         at com.carrotsearch.ant.tasks.junit4.slave.SlaveMain.main(SlaveMain.java:354)
   [junit4]   2>         at com.carrotsearch.ant.tasks.junit4.slave.SlaveMainSafe.main(SlaveMainSafe.java:10)
   [junit4]   2>    3) Thread[id=9, name=JUnit4-serializer-daemon, state=TIMED_WAITING,
group=main]
   [junit4]   2>         at java.lang.Thread.sleep(Native Method)
   [junit4]   2>         at com.carrotsearch.ant.tasks.junit4.events.Serializer$1.run(Serializer.java:47)
   [junit4]   2>    4) Thread[id=4393, name=SUITE-TestPointQueries-seed#[C68A48CE5395856C],
state=RUNNABLE, group=TGRP-TestPointQueries]
   [junit4]   2>         at java.lang.Thread.getStackTrace(Thread.java:1552)
   [junit4]   2>         at com.carrotsearch.randomizedtesting.ThreadLeakControl$4.run(ThreadLeakControl.java:688)
   [junit4]   2>         at com.carrotsearch.randomizedtesting.ThreadLeakControl$4.run(ThreadLeakControl.java:685)
   [junit4]   2>         at java.security.AccessController.doPrivileged(Native Method)
   [junit4]   2>         at com.carrotsearch.randomizedtesting.ThreadLeakControl.getStackTrace(ThreadLeakControl.java:685)
   [junit4]   2>         at com.carrotsearch.randomizedtesting.ThreadLeakControl.getThreadsWithTraces(ThreadLeakControl.java:701)
   [junit4]   2>         at com.carrotsearch.randomizedtesting.ThreadLeakControl.formatThreadStacksFull(ThreadLeakControl.java:681)
   [junit4]   2>         at com.carrotsearch.randomizedtesting.ThreadLeakControl.access$1000(ThreadLeakControl.java:64)
   [junit4]   2>         at com.carrotsearch.randomizedtesting.ThreadLeakControl$2.evaluate(ThreadLeakControl.java:414)
   [junit4]   2>         at com.carrotsearch.randomizedtesting.RandomizedRunner.runSuite(RandomizedRunner.java:681)
   [junit4]   2>         at com.carrotsearch.randomizedtesting.RandomizedRunner.access$200(RandomizedRunner.java:140)
   [junit4]   2>         at com.carrotsearch.randomizedtesting.RandomizedRunner$2.run(RandomizedRunner.java:591)
   [junit4]   2> NOTE: download the large Jenkins line-docs file by running 'ant get-jenkins-line-docs'
in the lucene directory.
   [junit4]   2> NOTE: reproduce with: ant test  -Dtestcase=TestPointQueries -Dtests.method=testRandomBinaryBig
-Dtests.seed=C68A48CE5395856C -Dtests.multiplier=2 -Dtests.nightly=true -Dtests.slow=true
-Dtests.linedocsfile=/x1/jenkins/lucene-data/enwiki.random.lines.txt -Dtests.locale=ar-DZ
-Dtests.timezone=America/Chihuahua -Dtests.asserts=true -Dtests.file.encoding=ISO-8859-1
   [junit4] ERROR   6488s J1 | TestPointQueries.testRandomBinaryBig <<<
   [junit4]    > Throwable #1: java.lang.Exception: Test abandoned because suite timeout
was reached.
   [junit4]    > 	at __randomizedtesting.SeedInfo.seed([C68A48CE5395856C]:0)
   [junit4]   2> ??? 01, 2016 5:27:27 ? com.carrotsearch.randomizedtesting.ThreadLeakControl
checkThreadLeaks
   [junit4]   2> WARNING: Will linger awaiting termination of 1 leaked thread(s).
   [junit4]   2> ??? 01, 2016 5:27:47 ? com.carrotsearch.randomizedtesting.ThreadLeakControl
checkThreadLeaks
   [junit4]   2> SEVERE: 1 thread leaked from SUITE scope at org.apache.lucene.search.TestPointQueries:

   [junit4]   2>    1) Thread[id=4394, name=TEST-TestPointQueries.testRandomBinaryBig-seed#[C68A48CE5395856C],
state=RUNNABLE, group=TGRP-TestPointQueries]
   [junit4]   2>         at org.apache.lucene.util.BytesRefArray$1.comparePivot(BytesRefArray.java:142)
   [junit4]   2>         at org.apache.lucene.util.IntroSorter.quicksort(IntroSorter.java:75)
   [junit4]   2>         at org.apache.lucene.util.IntroSorter.quicksort(IntroSorter.java:87)
   [junit4]   2>         at org.apache.lucene.util.IntroSorter.quicksort(IntroSorter.java:87)
   [junit4]   2>         at org.apache.lucene.util.IntroSorter.quicksort(IntroSorter.java:87)
   [junit4]   2>         at org.apache.lucene.util.IntroSorter.quicksort(IntroSorter.java:87)
   [junit4]   2>         at org.apache.lucene.util.IntroSorter.quicksort(IntroSorter.java:88)
   [junit4]   2>         at org.apache.lucene.util.IntroSorter.quicksort(IntroSorter.java:88)
   [junit4]   2>         at org.apache.lucene.util.IntroSorter.quicksort(IntroSorter.java:87)
   [junit4]   2>         at org.apache.lucene.util.IntroSorter.quicksort(IntroSorter.java:88)
   [junit4]   2>         at org.apache.lucene.util.IntroSorter.quicksort(IntroSorter.java:87)
   [junit4]   2>         at org.apache.lucene.util.IntroSorter.quicksort(IntroSorter.java:88)
   [junit4]   2>         at org.apache.lucene.util.IntroSorter.sort(IntroSorter.java:41)
   [junit4]   2>         at org.apache.lucene.util.BytesRefArray.sort(BytesRefArray.java:149)
   [junit4]   2>         at org.apache.lucene.util.BytesRefArray.iterator(BytesRefArray.java:177)
   [junit4]   2>         at org.apache.lucene.util.OfflineSorter.sortPartition(OfflineSorter.java:293)
   [junit4]   2>         at org.apache.lucene.util.OfflineSorter.sort(OfflineSorter.java:244)
   [junit4]   2>         at org.apache.lucene.util.bkd.BKDWriter.sort(BKDWriter.java:739)
   [junit4]   2>         at org.apache.lucene.util.bkd.BKDWriter.finish(BKDWriter.java:814)
   [junit4]   2>         at org.apache.lucene.codecs.lucene60.Lucene60PointWriter.writeField(Lucene60PointWriter.java:110)
   [junit4]   2>         at org.apache.lucene.codecs.PointWriter.mergeOneField(PointWriter.java:44)
   [junit4]   2>         at org.apache.lucene.codecs.PointWriter.merge(PointWriter.java:126)
   [junit4]   2>         at org.apache.lucene.codecs.lucene60.Lucene60PointWriter.merge(Lucene60PointWriter.java:120)
   [junit4]   2>         at org.apache.lucene.index.SegmentMerger.mergePoints(SegmentMerger.java:168)
   [junit4]   2>         at org.apache.lucene.index.SegmentMerger.merge(SegmentMerger.java:117)
   [junit4]   2>         at org.apache.lucene.index.IndexWriter.mergeMiddle(IndexWriter.java:4099)
   [junit4]   2>         at org.apache.lucene.index.IndexWriter.merge(IndexWriter.java:3679)
   [junit4]   2>         at org.apache.lucene.index.SerialMergeScheduler.merge(SerialMergeScheduler.java:40)
   [junit4]   2>         at org.apache.lucene.index.IndexWriter.maybeMerge(IndexWriter.java:1946)
   [junit4]   2>         at org.apache.lucene.index.IndexWriter.doAfterSegmentFlushed(IndexWriter.java:4740)
   [junit4]   2>         at org.apache.lucene.index.DocumentsWriter$MergePendingEvent.process(DocumentsWriter.java:689)
   [junit4]   2>         at org.apache.lucene.index.IndexWriter.processEvents(IndexWriter.java:4778)
   [junit4]   2>         at org.apache.lucene.index.IndexWriter.processEvents(IndexWriter.java:4769)
   [junit4]   2>         at org.apache.lucene.index.IndexWriter.updateDocument(IndexWriter.java:1493)
   [junit4]   2>         at org.apache.lucene.index.IndexWriter.addDocument(IndexWriter.java:1271)
   [junit4]   2>         at org.apache.lucene.index.RandomIndexWriter.addDocument(RandomIndexWriter.java:170)
   [junit4]   2>         at org.apache.lucene.search.TestPointQueries.verifyBinary(TestPointQueries.java:591)
   [junit4]   2>         at org.apache.lucene.search.TestPointQueries.doTestRandomBinary(TestPointQueries.java:536)
   [junit4]   2>         at org.apache.lucene.search.TestPointQueries.testRandomBinaryBig(TestPointQueries.java:501)
   [junit4]   2>         at sun.reflect.NativeMethodAccessorImpl.invoke0(Native Method)
   [junit4]   2>         at sun.reflect.NativeMethodAccessorImpl.invoke(NativeMethodAccessorImpl.java:62)
   [junit4]   2>         at sun.reflect.DelegatingMethodAccessorImpl.invoke(DelegatingMethodAccessorImpl.java:43)
   [junit4]   2>         at java.lang.reflect.Method.invoke(Method.java:497)
   [junit4]   2>         at com.carrotsearch.randomizedtesting.RandomizedRunner.invoke(RandomizedRunner.java:1764)
   [junit4]   2>         at com.carrotsearch.randomizedtesting.RandomizedRunner$8.evaluate(RandomizedRunner.java:871)
   [junit4]   2>         at com.carrotsearch.randomizedtesting.RandomizedRunner$9.evaluate(RandomizedRunner.java:907)
   [junit4]   2>         at com.carrotsearch.randomizedtesting.RandomizedRunner$10.evaluate(RandomizedRunner.java:921)
   [junit4]   2>         at org.apache.lucene.util.TestRuleSetupTeardownChained$1.evaluate(TestRuleSetupTeardownChained.java:49)
   [junit4]   2>         at org.apache.lucene.util.AbstractBeforeAfterRule$1.evaluate(AbstractBeforeAfterRule.java:45)
   [junit4]   2>         at org.apache.lucene.util.TestRuleThreadAndTestName$1.evaluate(TestRuleThreadAndTestName.java:48)
   [junit4]   2>         at org.apache.lucene.util.TestRuleIgnoreAfterMaxFailures$1.evaluate(TestRuleIgnoreAfterMaxFailures.java:64)
   [junit4]   2>         at org.apache.lucene.util.TestRuleMarkFailure$1.evaluate(TestRuleMarkFailure.java:47)
   [junit4]   2>         at com.carrotsearch.randomizedtesting.rules.StatementAdapter.evaluate(StatementAdapter.java:36)
   [junit4]   2>         at com.carrotsearch.randomizedtesting.ThreadLeakControl$StatementRunner.run(ThreadLeakControl.java:367)
   [junit4]   2>         at com.carrotsearch.randomizedtesting.ThreadLeakControl.forkTimeoutingTask(ThreadLeakControl.java:809)
   [junit4]   2>         at com.carrotsearch.randomizedtesting.ThreadLeakControl$3.evaluate(ThreadLeakControl.java:460)
   [junit4]   2>         at com.carrotsearch.randomizedtesting.RandomizedRunner.runSingleTest(RandomizedRunner.java:880)
   [junit4]   2>         at com.carrotsearch.randomizedtesting.RandomizedRunner$5.evaluate(RandomizedRunner.java:781)
   [junit4]   2>         at com.carrotsearch.randomizedtesting.RandomizedRunner$6.evaluate(RandomizedRunner.java:816)
   [junit4]   2>         at com.carrotsearch.randomizedtesting.RandomizedRunner$7.evaluate(RandomizedRunner.java:827)
   [junit4]   2>         at org.apache.lucene.util.AbstractBeforeAfterRule$1.evaluate(AbstractBeforeAfterRule.java:45)
   [junit4]   2>         at com.carrotsearch.randomizedtesting.rules.StatementAdapter.evaluate(StatementAdapter.java:36)
   [junit4]   2>         at org.apache.lucene.util.TestRuleStoreClassName$1.evaluate(TestRuleStoreClassName.java:41)
   [junit4]   2>         at com.carrotsearch.randomizedtesting.rules.NoShadowingOrOverridesOnMethodsRule$1.evaluate(NoShadowingOrOverridesOnMethodsRule.java:40)
   [junit4]   2>         at com.carrotsearch.randomizedtesting.rules.NoShadowingOrOverridesOnMethodsRule$1.evaluate(NoShadowingOrOverridesOnMethodsRule.java:40)
   [junit4]   2>         at com.carrotsearch.randomizedtesting.rules.StatementAdapter.evaluate(StatementAdapter.java:36)
   [junit4]   2>         at com.carrotsearch.randomizedtesting.rules.StatementAdapter.evaluate(StatementAdapter.java:36)
   [junit4]   2>         at com.carrotsearch.randomizedtesting.rules.StatementAdapter.evaluate(StatementAdapter.java:36)
   [junit4]   2>         at org.apache.lucene.util.TestRuleAssertionsRequired$1.evaluate(TestRuleAssertionsRequired.java:53)
   [junit4]   2>         at org.apache.lucene.util.TestRuleMarkFailure$1.evaluate(TestRuleMarkFailure.java:47)
   [junit4]   2>         at org.apache.lucene.util.TestRuleIgnoreAfterMaxFailures$1.evaluate(TestRuleIgnoreAfterMaxFailures.java:64)
   [junit4]   2>         at org.apache.lucene.util.TestRuleIgnoreTestSuites$1.evaluate(TestRuleIgnoreTestSuites.java:54)
   [junit4]   2>         at com.carrotsearch.randomizedtesting.rules.StatementAdapter.evaluate(StatementAdapter.java:36)
   [junit4]   2>         at com.carrotsearch.randomizedtesting.ThreadLeakControl$StatementRunner.run(ThreadLeakControl.java:367)
   [junit4]   2>         at java.lang.Thread.run(Thread.java:745)
   [junit4]   2> ??? 01, 2016 5:27:47 ? com.carrotsearch.randomizedtesting.ThreadLeakControl
tryToInterruptAll
   [junit4]   2> INFO: Starting to interrupt leaked threads:
   [junit4]   2>    1) Thread[id=4394, name=TEST-TestPointQueries.testRandomBinaryBig-seed#[C68A48CE5395856C],
state=RUNNABLE, group=TGRP-TestPointQueries]
   [junit4]   2> NOTE: leaving temporary files on disk at: /x1/jenkins/jenkins-slave/workspace/Lucene-Solr-NightlyTests-trunk/lucene/build/core/test/J1/temp/lucene.search.TestPointQueries_C68A48CE5395856C-001
   [junit4]   2> Mar 01, 2016 12:27:47 PM com.carrotsearch.randomizedtesting.ThreadLeakControl
tryToInterruptAll
   [junit4]   2> INFO: All leaked threads terminated.
   [junit4]   2> NOTE: test params are: codec=CheapBastard, sim=RandomSimilarity(queryNorm=true,coord=yes):
{}, locale=ar-DZ, timezone=America/Chihuahua
   [junit4]   2> NOTE: Linux 3.13.0-52-generic amd64/Oracle Corporation 1.8.0_66 (64-bit)/cpus=4,threads=1,free=291295816,total=438829056
   [junit4]   2> NOTE: All tests run in this JVM: [TestSetOnce, TestSpanMultiTermQueryWrapper,
TestCodecUtil, TestDocumentsWriterStallControl, TestFlushByRamOrCountsPolicy, TestRoaringDocIdSet,
TestNRTCachingDirectory, TestReaderWrapperDVTypeCheck, TestVersion, TestPrefixInBooleanQuery,
TestTermdocPerf, TestFSTs, TestMultiCollector, TestSingleInstanceLockFactory, TestParallelLeafReader,
TestCachingTokenFilter, TestClassicSimilarity, Test2BPostings, TestSpanCollection, TestMatchAllDocsQuery,
TestSynonymQuery, TestDuelingCodecs, TestLogMergePolicy, TestRamUsageEstimator, TestOmitTf,
TestSimpleExplanations, TestStressIndexing, TestByteBlockPool, TestSimilarity, TestRecyclingIntBlockAllocator,
TestCompiledAutomaton, TestFileSwitchDirectory, TestAddIndexes, TestSpansEnum, TestDocumentsWriterDeleteQueue,
TestIndexWriterExceptions, TestSameScoresWithThreads, TestSegmentMerger, TestQueryRescorer,
TestFixedBitDocIdSet, TestFieldsReader, TestTopFieldCollector, TestIndexWriterOnJRECrash,
TestSmallFloat, TestIndexWriterNRTIsCurrent, TestConjunctionDISI, TestSwappedIndexFiles, TestRateLimiter,
TestExitableDirectoryReader, TestSortedNumericSortField, TestLRUQueryCache, TestIntArrayDocIdSet,
TestHugeRamFile, TestStressAdvance, TestOrdinalMap, TestRAMDirectory, TestOmitPositions, TestMergePolicyWrapper,
TestPositiveScoresOnlyCollector, LimitedFiniteStringsIteratorTest, TestDirectoryReaderReopen,
TestLegacyNumericUtils, TestBooleanCoord, TestCollectionUtil, TestAssertions, TestLucene50StoredFieldsFormatHighCompression,
TestDocument, TestSpanNotQuery, TestMultiTermConstantScore, TestForTooMuchCloning, TestSpanSearchEquivalence,
TestNoMergePolicy, TestNoMergeScheduler, TestNamedSPILoader, TestRollback, TestCloseableThreadLocal,
MultiCollectorTest, TestScoreCachingWrappingScorer, Test2BPositions, TestTerm, TestIOUtils,
TestNewestSegment, Test2BPagedBytes, TestPackedTokenAttributeImpl, TestGrowableByteArrayDataOutput,
TestLucene54DocValuesFormat, TestIndexWriterOutOfFileDescriptors, TestManyFields, TestMergeRateLimiter,
TestMultiTermsEnum, TestNumericDocValuesUpdates, TestPointValues, TestReadOnlyIndex, TestSegmentInfos,
TestTerms, TestTragicIndexWriterDeadlock, TestUpgradeIndexMergePolicy, FuzzyTermOnShortTermsTest,
TestBlendedTermQuery, TestEarlyTermination, TestFieldValueQuery, TestMatchNoDocsQuery, TestMinShouldMatch2,
TestMultiPhraseEnum, TestMultiset, TestNeedsScores, TestPointQueries]
   [junit4]   2> NOTE: download the large Jenkins line-docs file by running 'ant get-jenkins-line-docs'
in the lucene directory.
   [junit4]   2> NOTE: reproduce with: ant test  -Dtestcase=TestPointQueries -Dtests.seed=C68A48CE5395856C
-Dtests.multiplier=2 -Dtests.nightly=true -Dtests.slow=true -Dtests.linedocsfile=/x1/jenkins/lucene-data/enwiki.random.lines.txt
-Dtests.locale=ar-DZ -Dtests.timezone=America/Chihuahua -Dtests.asserts=true -Dtests.file.encoding=ISO-8859-1
   [junit4] ERROR   0.00s J1 | TestPointQueries (suite) <<<
   [junit4]    > Throwable #1: java.lang.Exception: Suite timeout exceeded (>= 7200000
msec).
   [junit4]    > 	at __randomizedtesting.SeedInfo.seed([C68A48CE5395856C]:0)
   [junit4] Completed [375/411 (1!)] on J1 in 7220.38s, 35 tests, 2 errors <<< FAILURES!

[...truncated 147 lines...]
BUILD FAILED
/x1/jenkins/jenkins-slave/workspace/Lucene-Solr-NightlyTests-trunk/build.xml:747: The following
error occurred while executing this line:
/x1/jenkins/jenkins-slave/workspace/Lucene-Solr-NightlyTests-trunk/build.xml:684: The following
error occurred while executing this line:
/x1/jenkins/jenkins-slave/workspace/Lucene-Solr-NightlyTests-trunk/build.xml:59: The following
error occurred while executing this line:
/x1/jenkins/jenkins-slave/workspace/Lucene-Solr-NightlyTests-trunk/lucene/build.xml:50: The
following error occurred while executing this line:
/x1/jenkins/jenkins-slave/workspace/Lucene-Solr-NightlyTests-trunk/lucene/common-build.xml:1457:
The following error occurred while executing this line:
/x1/jenkins/jenkins-slave/workspace/Lucene-Solr-NightlyTests-trunk/lucene/common-build.xml:1014:
There were test failures: 411 suites (1 ignored), 3420 tests, 1 suite-level error, 1 error,
33 ignored (29 assumptions) [seed: C68A48CE5395856C]

Total time: 211 minutes 11 seconds
Build step 'Invoke Ant' marked build as failure
Archiving artifacts
No prior successful build to compare, so performing full copy of artifacts
Recording test results
Email was triggered for: Failure - Any
Sending email for trigger: Failure - Any



Mime
View raw message