lucene-dev mailing list archives

Site index · List index
Message view « Date » · « Thread »
Top « Date » · « Thread »
From Policeman Jenkins Server <jenk...@thetaphi.de>
Subject [JENKINS] Lucene-Solr-6.x-Linux (32bit/jdk1.8.0_72) - Build # 237 - Failure!
Date Fri, 25 Mar 2016 05:31:06 GMT
Build: http://jenkins.thetaphi.de/job/Lucene-Solr-6.x-Linux/237/
Java: 32bit/jdk1.8.0_72 -server -XX:+UseG1GC

1 tests failed.
FAILED:  org.apache.solr.cloud.TestAuthenticationFramework.testStopAllStartAll

Error Message:
Address already in use

Stack Trace:
java.net.BindException: Address already in use
	at __randomizedtesting.SeedInfo.seed([178FF9B920E45E7C:61B1E6CA61D3F353]:0)
	at sun.nio.ch.Net.bind0(Native Method)
	at sun.nio.ch.Net.bind(Net.java:433)
	at sun.nio.ch.Net.bind(Net.java:425)
	at sun.nio.ch.ServerSocketChannelImpl.bind(ServerSocketChannelImpl.java:223)
	at sun.nio.ch.ServerSocketAdaptor.bind(ServerSocketAdaptor.java:74)
	at org.eclipse.jetty.server.ServerConnector.open(ServerConnector.java:326)
	at org.eclipse.jetty.server.AbstractNetworkConnector.doStart(AbstractNetworkConnector.java:80)
	at org.eclipse.jetty.server.ServerConnector.doStart(ServerConnector.java:244)
	at org.eclipse.jetty.util.component.AbstractLifeCycle.start(AbstractLifeCycle.java:68)
	at org.eclipse.jetty.server.Server.doStart(Server.java:384)
	at org.eclipse.jetty.util.component.AbstractLifeCycle.start(AbstractLifeCycle.java:68)
	at org.apache.solr.client.solrj.embedded.JettySolrRunner.start(JettySolrRunner.java:327)
	at org.apache.solr.cloud.MiniSolrCloudCluster.startJettySolrRunner(MiniSolrCloudCluster.java:356)
	at org.apache.solr.cloud.TestMiniSolrCloudCluster.testStopAllStartAll(TestMiniSolrCloudCluster.java:443)
	at sun.reflect.NativeMethodAccessorImpl.invoke0(Native Method)
	at sun.reflect.NativeMethodAccessorImpl.invoke(NativeMethodAccessorImpl.java:62)
	at sun.reflect.DelegatingMethodAccessorImpl.invoke(DelegatingMethodAccessorImpl.java:43)
	at java.lang.reflect.Method.invoke(Method.java:498)
	at com.carrotsearch.randomizedtesting.RandomizedRunner.invoke(RandomizedRunner.java:1764)
	at com.carrotsearch.randomizedtesting.RandomizedRunner$8.evaluate(RandomizedRunner.java:871)
	at com.carrotsearch.randomizedtesting.RandomizedRunner$9.evaluate(RandomizedRunner.java:907)
	at com.carrotsearch.randomizedtesting.RandomizedRunner$10.evaluate(RandomizedRunner.java:921)
	at com.carrotsearch.randomizedtesting.rules.SystemPropertiesRestoreRule$1.evaluate(SystemPropertiesRestoreRule.java:57)
	at org.apache.lucene.util.TestRuleSetupTeardownChained$1.evaluate(TestRuleSetupTeardownChained.java:49)
	at org.apache.lucene.util.AbstractBeforeAfterRule$1.evaluate(AbstractBeforeAfterRule.java:45)
	at org.apache.lucene.util.TestRuleThreadAndTestName$1.evaluate(TestRuleThreadAndTestName.java:48)
	at org.apache.lucene.util.TestRuleIgnoreAfterMaxFailures$1.evaluate(TestRuleIgnoreAfterMaxFailures.java:64)
	at org.apache.lucene.util.TestRuleMarkFailure$1.evaluate(TestRuleMarkFailure.java:47)
	at com.carrotsearch.randomizedtesting.rules.StatementAdapter.evaluate(StatementAdapter.java:36)
	at com.carrotsearch.randomizedtesting.ThreadLeakControl$StatementRunner.run(ThreadLeakControl.java:367)
	at com.carrotsearch.randomizedtesting.ThreadLeakControl.forkTimeoutingTask(ThreadLeakControl.java:809)
	at com.carrotsearch.randomizedtesting.ThreadLeakControl$3.evaluate(ThreadLeakControl.java:460)
	at com.carrotsearch.randomizedtesting.RandomizedRunner.runSingleTest(RandomizedRunner.java:880)
	at com.carrotsearch.randomizedtesting.RandomizedRunner$5.evaluate(RandomizedRunner.java:781)
	at com.carrotsearch.randomizedtesting.RandomizedRunner$6.evaluate(RandomizedRunner.java:816)
	at com.carrotsearch.randomizedtesting.RandomizedRunner$7.evaluate(RandomizedRunner.java:827)
	at com.carrotsearch.randomizedtesting.rules.StatementAdapter.evaluate(StatementAdapter.java:36)
	at com.carrotsearch.randomizedtesting.rules.SystemPropertiesRestoreRule$1.evaluate(SystemPropertiesRestoreRule.java:57)
	at org.apache.lucene.util.AbstractBeforeAfterRule$1.evaluate(AbstractBeforeAfterRule.java:45)
	at com.carrotsearch.randomizedtesting.rules.StatementAdapter.evaluate(StatementAdapter.java:36)
	at org.apache.lucene.util.TestRuleStoreClassName$1.evaluate(TestRuleStoreClassName.java:41)
	at com.carrotsearch.randomizedtesting.rules.NoShadowingOrOverridesOnMethodsRule$1.evaluate(NoShadowingOrOverridesOnMethodsRule.java:40)
	at com.carrotsearch.randomizedtesting.rules.NoShadowingOrOverridesOnMethodsRule$1.evaluate(NoShadowingOrOverridesOnMethodsRule.java:40)
	at com.carrotsearch.randomizedtesting.rules.StatementAdapter.evaluate(StatementAdapter.java:36)
	at com.carrotsearch.randomizedtesting.rules.StatementAdapter.evaluate(StatementAdapter.java:36)
	at com.carrotsearch.randomizedtesting.rules.StatementAdapter.evaluate(StatementAdapter.java:36)
	at org.apache.lucene.util.TestRuleAssertionsRequired$1.evaluate(TestRuleAssertionsRequired.java:53)
	at org.apache.lucene.util.TestRuleMarkFailure$1.evaluate(TestRuleMarkFailure.java:47)
	at org.apache.lucene.util.TestRuleIgnoreAfterMaxFailures$1.evaluate(TestRuleIgnoreAfterMaxFailures.java:64)
	at org.apache.lucene.util.TestRuleIgnoreTestSuites$1.evaluate(TestRuleIgnoreTestSuites.java:54)
	at com.carrotsearch.randomizedtesting.rules.StatementAdapter.evaluate(StatementAdapter.java:36)
	at com.carrotsearch.randomizedtesting.ThreadLeakControl$StatementRunner.run(ThreadLeakControl.java:367)
	at java.lang.Thread.run(Thread.java:745)




Build Log:
[...truncated 11997 lines...]
   [junit4] Suite: org.apache.solr.cloud.TestAuthenticationFramework
   [junit4]   2> 1443216 INFO  (TEST-TestAuthenticationFramework.testCollectionCreateSearchDelete-seed#[178FF9B920E45E7C]) [    ] o.a.s.c.ZkTestServer STARTING ZK TEST SERVER
   [junit4]   2> 1443217 INFO  (Thread-3291) [    ] o.a.s.c.ZkTestServer client port:0.0.0.0/0.0.0.0:0
   [junit4]   2> 1443218 INFO  (Thread-3291) [    ] o.a.s.c.ZkTestServer Starting server
   [junit4]   2> 1443318 INFO  (TEST-TestAuthenticationFramework.testCollectionCreateSearchDelete-seed#[178FF9B920E45E7C]) [    ] o.a.s.c.ZkTestServer start zk server on port:42570
   [junit4]   2> 1443318 INFO  (TEST-TestAuthenticationFramework.testCollectionCreateSearchDelete-seed#[178FF9B920E45E7C]) [    ] o.a.s.c.c.SolrZkClient Using default ZkCredentialsProvider
   [junit4]   2> 1443318 INFO  (TEST-TestAuthenticationFramework.testCollectionCreateSearchDelete-seed#[178FF9B920E45E7C]) [    ] o.a.s.c.c.ConnectionManager Waiting for client to connect to ZooKeeper
   [junit4]   2> 1443357 INFO  (zkCallback-1208-thread-1) [    ] o.a.s.c.c.ConnectionManager Watcher org.apache.solr.common.cloud.ConnectionManager@b18eee name:ZooKeeperConnection Watcher:127.0.0.1:42570 got event WatchedEvent state:SyncConnected type:None path:null path:null type:None
   [junit4]   2> 1443357 INFO  (TEST-TestAuthenticationFramework.testCollectionCreateSearchDelete-seed#[178FF9B920E45E7C]) [    ] o.a.s.c.c.ConnectionManager Client is connected to ZooKeeper
   [junit4]   2> 1443358 INFO  (TEST-TestAuthenticationFramework.testCollectionCreateSearchDelete-seed#[178FF9B920E45E7C]) [    ] o.a.s.c.c.SolrZkClient Using default ZkACLProvider
   [junit4]   2> 1443358 INFO  (TEST-TestAuthenticationFramework.testCollectionCreateSearchDelete-seed#[178FF9B920E45E7C]) [    ] o.a.s.c.c.SolrZkClient makePath: /solr/solr.xml
   [junit4]   2> 1443371 INFO  (jetty-launcher-1207-thread-2) [    ] o.e.j.s.Server jetty-9.3.8.v20160314
   [junit4]   2> 1443371 INFO  (jetty-launcher-1207-thread-3) [    ] o.e.j.s.Server jetty-9.3.8.v20160314
   [junit4]   2> 1443371 INFO  (jetty-launcher-1207-thread-5) [    ] o.e.j.s.Server jetty-9.3.8.v20160314
   [junit4]   2> 1443371 INFO  (jetty-launcher-1207-thread-1) [    ] o.e.j.s.Server jetty-9.3.8.v20160314
   [junit4]   2> 1443371 INFO  (jetty-launcher-1207-thread-4) [    ] o.e.j.s.Server jetty-9.3.8.v20160314
   [junit4]   2> 1443373 INFO  (jetty-launcher-1207-thread-1) [    ] o.e.j.s.h.ContextHandler Started o.e.j.s.ServletContextHandler@8b2130{/solr,null,AVAILABLE}
   [junit4]   2> 1443373 INFO  (jetty-launcher-1207-thread-3) [    ] o.e.j.s.h.ContextHandler Started o.e.j.s.ServletContextHandler@f17eaa{/solr,null,AVAILABLE}
   [junit4]   2> 1443373 INFO  (jetty-launcher-1207-thread-5) [    ] o.e.j.s.h.ContextHandler Started o.e.j.s.ServletContextHandler@10c6259{/solr,null,AVAILABLE}
   [junit4]   2> 1443373 INFO  (jetty-launcher-1207-thread-4) [    ] o.e.j.s.h.ContextHandler Started o.e.j.s.ServletContextHandler@a9d629{/solr,null,AVAILABLE}
   [junit4]   2> 1443373 INFO  (jetty-launcher-1207-thread-2) [    ] o.e.j.s.h.ContextHandler Started o.e.j.s.ServletContextHandler@c26fed{/solr,null,AVAILABLE}
   [junit4]   2> 1443377 INFO  (jetty-launcher-1207-thread-3) [    ] o.e.j.s.ServerConnector Started ServerConnector@10f757d{HTTP/1.1,[http/1.1]}{127.0.0.1:46561}
   [junit4]   2> 1443377 INFO  (jetty-launcher-1207-thread-1) [    ] o.e.j.s.ServerConnector Started ServerConnector@1785a70{HTTP/1.1,[http/1.1]}{127.0.0.1:44933}
   [junit4]   2> 1443377 INFO  (jetty-launcher-1207-thread-3) [    ] o.e.j.s.Server Started @1445214ms
   [junit4]   2> 1443377 INFO  (jetty-launcher-1207-thread-1) [    ] o.e.j.s.Server Started @1445214ms
   [junit4]   2> 1443377 INFO  (jetty-launcher-1207-thread-3) [    ] o.a.s.c.s.e.JettySolrRunner Jetty properties: {hostContext=/solr, hostPort=46561}
   [junit4]   2> 1443378 INFO  (jetty-launcher-1207-thread-1) [    ] o.a.s.c.s.e.JettySolrRunner Jetty properties: {hostContext=/solr, hostPort=44933}
   [junit4]   2> 1443377 INFO  (jetty-launcher-1207-thread-4) [    ] o.e.j.s.ServerConnector Started ServerConnector@5cdc8a{HTTP/1.1,[http/1.1]}{127.0.0.1:44888}
   [junit4]   2> 1443377 INFO  (jetty-launcher-1207-thread-2) [    ] o.e.j.s.ServerConnector Started ServerConnector@593e9d{HTTP/1.1,[http/1.1]}{127.0.0.1:40485}
   [junit4]   2> 1443378 INFO  (jetty-launcher-1207-thread-1) [    ] o.a.s.s.SolrDispatchFilter SolrDispatchFilter.init(): sun.misc.Launcher$AppClassLoader@1d16e93
   [junit4]   2> 1443378 INFO  (jetty-launcher-1207-thread-2) [    ] o.e.j.s.Server Started @1445214ms
   [junit4]   2> 1443378 INFO  (jetty-launcher-1207-thread-1) [    ] o.a.s.c.SolrResourceLoader new SolrResourceLoader for directory: '/home/jenkins/workspace/Lucene-Solr-6.x-Linux/solr/build/solr-core/test/J1/temp/solr.cloud.TestAuthenticationFramework_178FF9B920E45E7C-001/tempDir-001/node1'
   [junit4]   2> 1443378 INFO  (jetty-launcher-1207-thread-2) [    ] o.a.s.c.s.e.JettySolrRunner Jetty properties: {hostContext=/solr, hostPort=40485}
   [junit4]   2> 1443377 INFO  (jetty-launcher-1207-thread-5) [    ] o.e.j.s.ServerConnector Started ServerConnector@e18406{HTTP/1.1,[http/1.1]}{127.0.0.1:37131}
   [junit4]   2> 1443378 INFO  (jetty-launcher-1207-thread-1) [    ] o.a.s.c.SolrResourceLoader JNDI not configured for solr (NoInitialContextEx)
   [junit4]   2> 1443378 INFO  (jetty-launcher-1207-thread-5) [    ] o.e.j.s.Server Started @1445214ms
   [junit4]   2> 1443378 INFO  (jetty-launcher-1207-thread-1) [    ] o.a.s.c.SolrResourceLoader solr home defaulted to 'solr/' (could not find system property or JNDI)
   [junit4]   2> 1443378 INFO  (jetty-launcher-1207-thread-5) [    ] o.a.s.c.s.e.JettySolrRunner Jetty properties: {hostContext=/solr, hostPort=37131}
   [junit4]   2> 1443378 INFO  (jetty-launcher-1207-thread-2) [    ] o.a.s.s.SolrDispatchFilter SolrDispatchFilter.init(): sun.misc.Launcher$AppClassLoader@1d16e93
   [junit4]   2> 1443378 INFO  (jetty-launcher-1207-thread-4) [    ] o.e.j.s.Server Started @1445214ms
   [junit4]   2> 1443378 INFO  (jetty-launcher-1207-thread-2) [    ] o.a.s.c.SolrResourceLoader new SolrResourceLoader for directory: '/home/jenkins/workspace/Lucene-Solr-6.x-Linux/solr/build/solr-core/test/J1/temp/solr.cloud.TestAuthenticationFramework_178FF9B920E45E7C-001/tempDir-001/node2'
   [junit4]   2> 1443378 INFO  (jetty-launcher-1207-thread-4) [    ] o.a.s.c.s.e.JettySolrRunner Jetty properties: {hostContext=/solr, hostPort=44888}
   [junit4]   2> 1443378 INFO  (jetty-launcher-1207-thread-3) [    ] o.a.s.s.SolrDispatchFilter SolrDispatchFilter.init(): sun.misc.Launcher$AppClassLoader@1d16e93
   [junit4]   2> 1443378 INFO  (jetty-launcher-1207-thread-2) [    ] o.a.s.c.SolrResourceLoader JNDI not configured for solr (NoInitialContextEx)
   [junit4]   2> 1443378 INFO  (jetty-launcher-1207-thread-3) [    ] o.a.s.c.SolrResourceLoader new SolrResourceLoader for directory: '/home/jenkins/workspace/Lucene-Solr-6.x-Linux/solr/build/solr-core/test/J1/temp/solr.cloud.TestAuthenticationFramework_178FF9B920E45E7C-001/tempDir-001/node3'
   [junit4]   2> 1443378 INFO  (jetty-launcher-1207-thread-4) [    ] o.a.s.s.SolrDispatchFilter SolrDispatchFilter.init(): sun.misc.Launcher$AppClassLoader@1d16e93
   [junit4]   2> 1443378 INFO  (jetty-launcher-1207-thread-2) [    ] o.a.s.c.SolrResourceLoader solr home defaulted to 'solr/' (could not find system property or JNDI)
   [junit4]   2> 1443378 INFO  (jetty-launcher-1207-thread-3) [    ] o.a.s.c.SolrResourceLoader JNDI not configured for solr (NoInitialContextEx)
   [junit4]   2> 1443378 INFO  (jetty-launcher-1207-thread-4) [    ] o.a.s.c.SolrResourceLoader new SolrResourceLoader for directory: '/home/jenkins/workspace/Lucene-Solr-6.x-Linux/solr/build/solr-core/test/J1/temp/solr.cloud.TestAuthenticationFramework_178FF9B920E45E7C-001/tempDir-001/node4'
   [junit4]   2> 1443378 INFO  (jetty-launcher-1207-thread-3) [    ] o.a.s.c.SolrResourceLoader solr home defaulted to 'solr/' (could not find system property or JNDI)
   [junit4]   2> 1443378 INFO  (jetty-launcher-1207-thread-2) [    ] o.a.s.c.c.SolrZkClient Using default ZkCredentialsProvider
   [junit4]   2> 1443379 INFO  (jetty-launcher-1207-thread-4) [    ] o.a.s.c.SolrResourceLoader JNDI not configured for solr (NoInitialContextEx)
   [junit4]   2> 1443378 INFO  (jetty-launcher-1207-thread-1) [    ] o.a.s.c.c.SolrZkClient Using default ZkCredentialsProvider
   [junit4]   2> 1443379 INFO  (jetty-launcher-1207-thread-3) [    ] o.a.s.c.c.SolrZkClient Using default ZkCredentialsProvider
   [junit4]   2> 1443378 INFO  (jetty-launcher-1207-thread-5) [    ] o.a.s.s.SolrDispatchFilter SolrDispatchFilter.init(): sun.misc.Launcher$AppClassLoader@1d16e93
   [junit4]   2> 1443379 INFO  (jetty-launcher-1207-thread-4) [    ] o.a.s.c.SolrResourceLoader solr home defaulted to 'solr/' (could not find system property or JNDI)
   [junit4]   2> 1443379 INFO  (jetty-launcher-1207-thread-2) [    ] o.a.s.c.c.ConnectionManager Waiting for client to connect to ZooKeeper
   [junit4]   2> 1443379 INFO  (jetty-launcher-1207-thread-5) [    ] o.a.s.c.SolrResourceLoader new SolrResourceLoader for directory: '/home/jenkins/workspace/Lucene-Solr-6.x-Linux/solr/build/solr-core/test/J1/temp/solr.cloud.TestAuthenticationFramework_178FF9B920E45E7C-001/tempDir-001/node5'
   [junit4]   2> 1443379 INFO  (jetty-launcher-1207-thread-3) [    ] o.a.s.c.c.ConnectionManager Waiting for client to connect to ZooKeeper
   [junit4]   2> 1443379 INFO  (jetty-launcher-1207-thread-4) [    ] o.a.s.c.c.SolrZkClient Using default ZkCredentialsProvider
   [junit4]   2> 1443379 INFO  (jetty-launcher-1207-thread-5) [    ] o.a.s.c.SolrResourceLoader JNDI not configured for solr (NoInitialContextEx)
   [junit4]   2> 1443379 INFO  (jetty-launcher-1207-thread-1) [    ] o.a.s.c.c.ConnectionManager Waiting for client to connect to ZooKeeper
   [junit4]   2> 1443379 INFO  (jetty-launcher-1207-thread-5) [    ] o.a.s.c.SolrResourceLoader solr home defaulted to 'solr/' (could not find system property or JNDI)
   [junit4]   2> 1443379 INFO  (jetty-launcher-1207-thread-4) [    ] o.a.s.c.c.ConnectionManager Waiting for client to connect to ZooKeeper
   [junit4]   2> 1443379 INFO  (jetty-launcher-1207-thread-5) [    ] o.a.s.c.c.SolrZkClient Using default ZkCredentialsProvider
   [junit4]   2> 1443380 INFO  (jetty-launcher-1207-thread-5) [    ] o.a.s.c.c.ConnectionManager Waiting for client to connect to ZooKeeper
   [junit4]   2> 1443381 INFO  (zkCallback-1209-thread-1) [    ] o.a.s.c.c.ConnectionManager Watcher org.apache.solr.common.cloud.ConnectionManager@af4609 name:ZooKeeperConnection Watcher:127.0.0.1:42570/solr got event WatchedEvent state:SyncConnected type:None path:null path:null type:None
   [junit4]   2> 1443381 INFO  (jetty-launcher-1207-thread-1) [    ] o.a.s.c.c.ConnectionManager Client is connected to ZooKeeper
   [junit4]   2> 1443381 INFO  (jetty-launcher-1207-thread-1) [    ] o.a.s.c.c.SolrZkClient Using default ZkACLProvider
   [junit4]   2> 1443382 INFO  (zkCallback-1211-thread-1) [    ] o.a.s.c.c.ConnectionManager Watcher org.apache.solr.common.cloud.ConnectionManager@18f2d95 name:ZooKeeperConnection Watcher:127.0.0.1:42570/solr got event WatchedEvent state:SyncConnected type:None path:null path:null type:None
   [junit4]   2> 1443382 INFO  (jetty-launcher-1207-thread-3) [    ] o.a.s.c.c.ConnectionManager Client is connected to ZooKeeper
   [junit4]   2> 1443382 INFO  (zkCallback-1210-thread-1) [    ] o.a.s.c.c.ConnectionManager Watcher org.apache.solr.common.cloud.ConnectionManager@1ef3d53 name:ZooKeeperConnection Watcher:127.0.0.1:42570/solr got event WatchedEvent state:SyncConnected type:None path:null path:null type:None
   [junit4]   2> 1443382 INFO  (jetty-launcher-1207-thread-2) [    ] o.a.s.c.c.ConnectionManager Client is connected to ZooKeeper
   [junit4]   2> 1443383 INFO  (jetty-launcher-1207-thread-1) [    ] o.a.s.s.SolrDispatchFilter solr.xml found in ZooKeeper. Loading...
   [junit4]   2> 1443383 INFO  (jetty-launcher-1207-thread-3) [    ] o.a.s.c.c.SolrZkClient Using default ZkACLProvider
   [junit4]   2> 1443383 INFO  (zkCallback-1212-thread-1) [    ] o.a.s.c.c.ConnectionManager Watcher org.apache.solr.common.cloud.ConnectionManager@1aeeabc name:ZooKeeperConnection Watcher:127.0.0.1:42570/solr got event WatchedEvent state:SyncConnected type:None path:null path:null type:None
   [junit4]   2> 1443383 INFO  (jetty-launcher-1207-thread-2) [    ] o.a.s.c.c.SolrZkClient Using default ZkACLProvider
   [junit4]   2> 1443383 INFO  (jetty-launcher-1207-thread-4) [    ] o.a.s.c.c.ConnectionManager Client is connected to ZooKeeper
   [junit4]   2> 1443383 INFO  (zkCallback-1213-thread-1) [    ] o.a.s.c.c.ConnectionManager Watcher org.apache.solr.common.cloud.ConnectionManager@1b14193 name:ZooKeeperConnection Watcher:127.0.0.1:42570/solr got event WatchedEvent state:SyncConnected type:None path:null path:null type:None
   [junit4]   2> 1443383 INFO  (jetty-launcher-1207-thread-3) [    ] o.a.s.s.SolrDispatchFilter solr.xml found in ZooKeeper. Loading...
   [junit4]   2> 1443383 INFO  (jetty-launcher-1207-thread-2) [    ] o.a.s.s.SolrDispatchFilter solr.xml found in ZooKeeper. Loading...
   [junit4]   2> 1443383 INFO  (jetty-launcher-1207-thread-4) [    ] o.a.s.c.c.SolrZkClient Using default ZkACLProvider
   [junit4]   2> 1443383 INFO  (jetty-launcher-1207-thread-5) [    ] o.a.s.c.c.ConnectionManager Client is connected to ZooKeeper
   [junit4]   2> 1443383 INFO  (jetty-launcher-1207-thread-4) [    ] o.a.s.s.SolrDispatchFilter solr.xml found in ZooKeeper. Loading...
   [junit4]   2> 1443383 INFO  (jetty-launcher-1207-thread-5) [    ] o.a.s.c.c.SolrZkClient Using default ZkACLProvider
   [junit4]   2> 1443383 INFO  (jetty-launcher-1207-thread-5) [    ] o.a.s.s.SolrDispatchFilter solr.xml found in ZooKeeper. Loading...
   [junit4]   2> 1443389 INFO  (jetty-launcher-1207-thread-4) [    ] o.a.s.c.CorePropertiesLocator Config-defined core root directory: /home/jenkins/workspace/Lucene-Solr-6.x-Linux/solr/build/solr-core/test/J1/temp/solr.cloud.TestAuthenticationFramework_178FF9B920E45E7C-001/tempDir-001/node4/.
   [junit4]   2> 1443389 INFO  (jetty-launcher-1207-thread-2) [    ] o.a.s.c.CorePropertiesLocator Config-defined core root directory: /home/jenkins/workspace/Lucene-Solr-6.x-Linux/solr/build/solr-core/test/J1/temp/solr.cloud.TestAuthenticationFramework_178FF9B920E45E7C-001/tempDir-001/node2/.
   [junit4]   2> 1443389 INFO  (jetty-launcher-1207-thread-4) [    ] o.a.s.c.CoreContainer New CoreContainer 29461503
   [junit4]   2> 1443389 INFO  (jetty-launcher-1207-thread-2) [    ] o.a.s.c.CoreContainer New CoreContainer 10899680
   [junit4]   2> 1443389 INFO  (jetty-launcher-1207-thread-4) [    ] o.a.s.c.CoreContainer Loading cores into CoreContainer [instanceDir=/home/jenkins/workspace/Lucene-Solr-6.x-Linux/solr/build/solr-core/test/J1/temp/solr.cloud.TestAuthenticationFramework_178FF9B920E45E7C-001/tempDir-001/node4]
   [junit4]   2> 1443389 INFO  (jetty-launcher-1207-thread-2) [    ] o.a.s.c.CoreContainer Loading cores into CoreContainer [instanceDir=/home/jenkins/workspace/Lucene-Solr-6.x-Linux/solr/build/solr-core/test/J1/temp/solr.cloud.TestAuthenticationFramework_178FF9B920E45E7C-001/tempDir-001/node2]
   [junit4]   2> 1443389 WARN  (NIOServerCxn.Factory:0.0.0.0/0.0.0.0:0) [    ] o.a.z.s.NIOServerCnxn caught end of stream exception
   [junit4]   2> EndOfStreamException: Unable to read additional data from client sessionid 0x153ac3a1a790004, likely client has closed socket
   [junit4]   2> 	at org.apache.zookeeper.server.NIOServerCnxn.doIO(NIOServerCnxn.java:228)
   [junit4]   2> 	at org.apache.zookeeper.server.NIOServerCnxnFactory.run(NIOServerCnxnFactory.java:208)
   [junit4]   2> 	at java.lang.Thread.run(Thread.java:745)
   [junit4]   2> 1443389 INFO  (jetty-launcher-1207-thread-1) [    ] o.a.s.c.CorePropertiesLocator Config-defined core root directory: /home/jenkins/workspace/Lucene-Solr-6.x-Linux/solr/build/solr-core/test/J1/temp/solr.cloud.TestAuthenticationFramework_178FF9B920E45E7C-001/tempDir-001/node1/.
   [junit4]   2> 1443389 WARN  (jetty-launcher-1207-thread-2) [    ] o.a.s.c.CoreContainer Couldn't add files from /home/jenkins/workspace/Lucene-Solr-6.x-Linux/solr/build/solr-core/test/J1/temp/solr.cloud.TestAuthenticationFramework_178FF9B920E45E7C-001/tempDir-001/node2/lib to classpath: /home/jenkins/workspace/Lucene-Solr-6.x-Linux/solr/build/solr-core/test/J1/temp/solr.cloud.TestAuthenticationFramework_178FF9B920E45E7C-001/tempDir-001/node2/lib
   [junit4]   2> 1443390 INFO  (jetty-launcher-1207-thread-1) [    ] o.a.s.c.CoreContainer New CoreContainer 25384955
   [junit4]   2> 1443389 WARN  (jetty-launcher-1207-thread-4) [    ] o.a.s.c.CoreContainer Couldn't add files from /home/jenkins/workspace/Lucene-Solr-6.x-Linux/solr/build/solr-core/test/J1/temp/solr.cloud.TestAuthenticationFramework_178FF9B920E45E7C-001/tempDir-001/node4/lib to classpath: /home/jenkins/workspace/Lucene-Solr-6.x-Linux/solr/build/solr-core/test/J1/temp/solr.cloud.TestAuthenticationFramework_178FF9B920E45E7C-001/tempDir-001/node4/lib
   [junit4]   2> 1443390 INFO  (jetty-launcher-1207-thread-1) [    ] o.a.s.c.CoreContainer Loading cores into CoreContainer [instanceDir=/home/jenkins/workspace/Lucene-Solr-6.x-Linux/solr/build/solr-core/test/J1/temp/solr.cloud.TestAuthenticationFramework_178FF9B920E45E7C-001/tempDir-001/node1]
   [junit4]   2> 1443390 INFO  (jetty-launcher-1207-thread-4) [    ] o.a.s.h.c.HttpShardHandlerFactory created with socketTimeout : 90000,urlScheme : ,connTimeout : 15000,maxConnectionsPerHost : 20,maxConnections : 10000,corePoolSize : 0,maximumPoolSize : 2147483647,maxThreadIdleTime : 5,sizeOfQueue : -1,fairnessPolicy : false,useRetries : false,
   [junit4]   2> 1443390 INFO  (jetty-launcher-1207-thread-2) [    ] o.a.s.h.c.HttpShardHandlerFactory created with socketTimeout : 90000,urlScheme : ,connTimeout : 15000,maxConnectionsPerHost : 20,maxConnections : 10000,corePoolSize : 0,maximumPoolSize : 2147483647,maxThreadIdleTime : 5,sizeOfQueue : -1,fairnessPolicy : false,useRetries : false,
   [junit4]   2> 1443390 WARN  (jetty-launcher-1207-thread-1) [    ] o.a.s.c.CoreContainer Couldn't add files from /home/jenkins/workspace/Lucene-Solr-6.x-Linux/solr/build/solr-core/test/J1/temp/solr.cloud.TestAuthenticationFramework_178FF9B920E45E7C-001/tempDir-001/node1/lib to classpath: /home/jenkins/workspace/Lucene-Solr-6.x-Linux/solr/build/solr-core/test/J1/temp/solr.cloud.TestAuthenticationFramework_178FF9B920E45E7C-001/tempDir-001/node1/lib
   [junit4]   2> 1443390 WARN  (NIOServerCxn.Factory:0.0.0.0/0.0.0.0:0) [    ] o.a.z.s.NIOServerCnxn caught end of stream exception
   [junit4]   2> EndOfStreamException: Unable to read additional data from client sessionid 0x153ac3a1a790003, likely client has closed socket
   [junit4]   2> 	at org.apache.zookeeper.server.NIOServerCnxn.doIO(NIOServerCnxn.java:228)
   [junit4]   2> 	at org.apache.zookeeper.server.NIOServerCnxnFactory.run(NIOServerCnxnFactory.java:208)
   [junit4]   2> 	at java.lang.Thread.run(Thread.java:745)
   [junit4]   2> 1443390 INFO  (jetty-launcher-1207-thread-1) [    ] o.a.s.h.c.HttpShardHandlerFactory created with socketTimeout : 90000,urlScheme : ,connTimeout : 15000,maxConnectionsPerHost : 20,maxConnections : 10000,corePoolSize : 0,maximumPoolSize : 2147483647,maxThreadIdleTime : 5,sizeOfQueue : -1,fairnessPolicy : false,useRetries : false,
   [junit4]   2> 1443390 INFO  (jetty-launcher-1207-thread-3) [    ] o.a.s.c.CorePropertiesLocator Config-defined core root directory: /home/jenkins/workspace/Lucene-Solr-6.x-Linux/solr/build/solr-core/test/J1/temp/solr.cloud.TestAuthenticationFramework_178FF9B920E45E7C-001/tempDir-001/node3/.
   [junit4]   2> 1443390 INFO  (jetty-launcher-1207-thread-3) [    ] o.a.s.c.CoreContainer New CoreContainer 1288563
   [junit4]   2> 1443390 INFO  (jetty-launcher-1207-thread-3) [    ] o.a.s.c.CoreContainer Loading cores into CoreContainer [instanceDir=/home/jenkins/workspace/Lucene-Solr-6.x-Linux/solr/build/solr-core/test/J1/temp/solr.cloud.TestAuthenticationFramework_178FF9B920E45E7C-001/tempDir-001/node3]
   [junit4]   2> 1443390 INFO  (jetty-launcher-1207-thread-5) [    ] o.a.s.c.CorePropertiesLocator Config-defined core root directory: /home/jenkins/workspace/Lucene-Solr-6.x-Linux/solr/build/solr-core/test/J1/temp/solr.cloud.TestAuthenticationFramework_178FF9B920E45E7C-001/tempDir-001/node5/.
   [junit4]   2> 1443390 WARN  (jetty-launcher-1207-thread-3) [    ] o.a.s.c.CoreContainer Couldn't add files from /home/jenkins/workspace/Lucene-Solr-6.x-Linux/solr/build/solr-core/test/J1/temp/solr.cloud.TestAuthenticationFramework_178FF9B920E45E7C-001/tempDir-001/node3/lib to classpath: /home/jenkins/workspace/Lucene-Solr-6.x-Linux/solr/build/solr-core/test/J1/temp/solr.cloud.TestAuthenticationFramework_178FF9B920E45E7C-001/tempDir-001/node3/lib
   [junit4]   2> 1443390 INFO  (jetty-launcher-1207-thread-5) [    ] o.a.s.c.CoreContainer New CoreContainer 10970721
   [junit4]   2> 1443391 INFO  (jetty-launcher-1207-thread-4) [    ] o.a.s.u.UpdateShardHandler Creating UpdateShardHandler HTTP client with params: socketTimeout=340000&connTimeout=45000&retry=true
   [junit4]   2> 1443391 INFO  (jetty-launcher-1207-thread-3) [    ] o.a.s.h.c.HttpShardHandlerFactory created with socketTimeout : 90000,urlScheme : ,connTimeout : 15000,maxConnectionsPerHost : 20,maxConnections : 10000,corePoolSize : 0,maximumPoolSize : 2147483647,maxThreadIdleTime : 5,sizeOfQueue : -1,fairnessPolicy : false,useRetries : false,
   [junit4]   2> 1443391 INFO  (jetty-launcher-1207-thread-1) [    ] o.a.s.u.UpdateShardHandler Creating UpdateShardHandler HTTP client with params: socketTimeout=340000&connTimeout=45000&retry=true
   [junit4]   2> 1443391 INFO  (jetty-launcher-1207-thread-5) [    ] o.a.s.c.CoreContainer Loading cores into CoreContainer [instanceDir=/home/jenkins/workspace/Lucene-Solr-6.x-Linux/solr/build/solr-core/test/J1/temp/solr.cloud.TestAuthenticationFramework_178FF9B920E45E7C-001/tempDir-001/node5]
   [junit4]   2> 1443391 INFO  (jetty-launcher-1207-thread-2) [    ] o.a.s.u.UpdateShardHandler Creating UpdateShardHandler HTTP client with params: socketTimeout=340000&connTimeout=45000&retry=true
   [junit4]   2> 1443391 WARN  (jetty-launcher-1207-thread-5) [    ] o.a.s.c.CoreContainer Couldn't add files from /home/jenkins/workspace/Lucene-Solr-6.x-Linux/solr/build/solr-core/test/J1/temp/solr.cloud.TestAuthenticationFramework_178FF9B920E45E7C-001/tempDir-001/node5/lib to classpath: /home/jenkins/workspace/Lucene-Solr-6.x-Linux/solr/build/solr-core/test/J1/temp/solr.cloud.TestAuthenticationFramework_178FF9B920E45E7C-001/tempDir-001/node5/lib
   [junit4]   2> 1443391 INFO  (jetty-launcher-1207-thread-4) [    ] o.a.s.l.LogWatcher SLF4J impl is org.slf4j.impl.Log4jLoggerFactory
   [junit4]   2> 1443391 INFO  (jetty-launcher-1207-thread-4) [    ] o.a.s.l.LogWatcher Registering Log Listener [Log4j (org.slf4j.impl.Log4jLoggerFactory)]
   [junit4]   2> 1443391 INFO  (jetty-launcher-1207-thread-5) [    ] o.a.s.h.c.HttpShardHandlerFactory created with socketTimeout : 90000,urlScheme : ,connTimeout : 15000,maxConnectionsPerHost : 20,maxConnections : 10000,corePoolSize : 0,maximumPoolSize : 2147483647,maxThreadIdleTime : 5,sizeOfQueue : -1,fairnessPolicy : false,useRetries : false,
   [junit4]   2> 1443391 INFO  (jetty-launcher-1207-thread-3) [    ] o.a.s.u.UpdateShardHandler Creating UpdateShardHandler HTTP client with params: socketTimeout=340000&connTimeout=45000&retry=true
   [junit4]   2> 1443391 INFO  (jetty-launcher-1207-thread-4) [    ] o.a.s.c.ZkContainer Zookeeper client=127.0.0.1:42570/solr
   [junit4]   2> 1443392 INFO  (jetty-launcher-1207-thread-4) [    ] o.a.s.c.ZkController zkHost includes chroot
   [junit4]   2> 1443392 INFO  (jetty-launcher-1207-thread-4) [    ] o.a.s.c.c.SolrZkClient Using default ZkCredentialsProvider
   [junit4]   2> 1443392 INFO  (jetty-launcher-1207-thread-1) [    ] o.a.s.l.LogWatcher SLF4J impl is org.slf4j.impl.Log4jLoggerFactory
   [junit4]   2> 1443392 INFO  (jetty-launcher-1207-thread-2) [    ] o.a.s.l.LogWatcher SLF4J impl is org.slf4j.impl.Log4jLoggerFactory
   [junit4]   2> 1443392 INFO  (jetty-launcher-1207-thread-1) [    ] o.a.s.l.LogWatcher Registering Log Listener [Log4j (org.slf4j.impl.Log4jLoggerFactory)]
   [junit4]   2> 1443392 INFO  (jetty-launcher-1207-thread-2) [    ] o.a.s.l.LogWatcher Registering Log Listener [Log4j (org.slf4j.impl.Log4jLoggerFactory)]
   [junit4]   2> 1443392 INFO  (jetty-launcher-1207-thread-5) [    ] o.a.s.u.UpdateShardHandler Creating UpdateShardHandler HTTP client with params: socketTimeout=340000&connTimeout=45000&retry=true
   [junit4]   2> 1443392 INFO  (jetty-launcher-1207-thread-4) [    ] o.a.s.c.c.ConnectionManager Waiting for client to connect to ZooKeeper
   [junit4]   2> 1443392 INFO  (jetty-launcher-1207-thread-3) [    ] o.a.s.l.LogWatcher SLF4J impl is org.slf4j.impl.Log4jLoggerFactory
   [junit4]   2> 1443392 INFO  (jetty-launcher-1207-thread-3) [    ] o.a.s.l.LogWatcher Registering Log Listener [Log4j (org.slf4j.impl.Log4jLoggerFactory)]
   [junit4]   2> 1443392 INFO  (jetty-launcher-1207-thread-3) [    ] o.a.s.c.ZkContainer Zookeeper client=127.0.0.1:42570/solr
   [junit4]   2> 1443392 INFO  (jetty-launcher-1207-thread-1) [    ] o.a.s.c.ZkContainer Zookeeper client=127.0.0.1:42570/solr
   [junit4]   2> 1443392 INFO  (jetty-launcher-1207-thread-2) [    ] o.a.s.c.ZkContainer Zookeeper client=127.0.0.1:42570/solr
   [junit4]   2> 1443394 INFO  (jetty-launcher-1207-thread-1) [    ] o.a.s.c.ZkController zkHost includes chroot
   [junit4]   2> 1443394 INFO  (jetty-launcher-1207-thread-2) [    ] o.a.s.c.ZkController zkHost includes chroot
   [junit4]   2> 1443394 INFO  (jetty-launcher-1207-thread-1) [    ] o.a.s.c.c.SolrZkClient Using default ZkCredentialsProvider
   [junit4]   2> 1443394 INFO  (jetty-launcher-1207-thread-2) [    ] o.a.s.c.c.SolrZkClient Using default ZkCredentialsProvider
   [junit4]   2> 1443392 INFO  (jetty-launcher-1207-thread-5) [    ] o.a.s.l.LogWatcher SLF4J impl is org.slf4j.impl.Log4jLoggerFactory
   [junit4]   2> 1443392 INFO  (jetty-launcher-1207-thread-3) [    ] o.a.s.c.ZkController zkHost includes chroot
   [junit4]   2> 1443394 INFO  (jetty-launcher-1207-thread-5) [    ] o.a.s.l.LogWatcher Registering Log Listener [Log4j (org.slf4j.impl.Log4jLoggerFactory)]
   [junit4]   2> 1443394 INFO  (jetty-launcher-1207-thread-3) [    ] o.a.s.c.c.SolrZkClient Using default ZkCredentialsProvider
   [junit4]   2> 1443394 INFO  (jetty-launcher-1207-thread-1) [    ] o.a.s.c.c.ConnectionManager Waiting for client to connect to ZooKeeper
   [junit4]   2> 1443394 INFO  (jetty-launcher-1207-thread-5) [    ] o.a.s.c.ZkContainer Zookeeper client=127.0.0.1:42570/solr
   [junit4]   2> 1443394 INFO  (jetty-launcher-1207-thread-2) [    ] o.a.s.c.c.ConnectionManager Waiting for client to connect to ZooKeeper
   [junit4]   2> 1443395 INFO  (jetty-launcher-1207-thread-5) [    ] o.a.s.c.ZkController zkHost includes chroot
   [junit4]   2> 1443395 INFO  (jetty-launcher-1207-thread-5) [    ] o.a.s.c.c.SolrZkClient Using default ZkCredentialsProvider
   [junit4]   2> 1443395 INFO  (jetty-launcher-1207-thread-3) [    ] o.a.s.c.c.ConnectionManager Waiting for client to connect to ZooKeeper
   [junit4]   2> 1443395 INFO  (jetty-launcher-1207-thread-5) [    ] o.a.s.c.c.ConnectionManager Waiting for client to connect to ZooKeeper
   [junit4]   2> 1443395 INFO  (zkCallback-1222-thread-1) [    ] o.a.s.c.c.ConnectionManager Watcher org.apache.solr.common.cloud.ConnectionManager@1fa3df4 name:ZooKeeperConnection Watcher:127.0.0.1:42570 got event WatchedEvent state:SyncConnected type:None path:null path:null type:None
   [junit4]   2> 1443395 INFO  (jetty-launcher-1207-thread-4) [    ] o.a.s.c.c.ConnectionManager Client is connected to ZooKeeper
   [junit4]   2> 1443396 INFO  (jetty-launcher-1207-thread-4) [    ] o.a.s.c.c.SolrZkClient Using default ZkACLProvider
   [junit4]   2> 1443397 INFO  (zkCallback-1225-thread-1) [    ] o.a.s.c.c.ConnectionManager Watcher org.apache.solr.common.cloud.ConnectionManager@11a09ca name:ZooKeeperConnection Watcher:127.0.0.1:42570 got event WatchedEvent state:SyncConnected type:None path:null path:null type:None
   [junit4]   2> 1443397 INFO  (jetty-launcher-1207-thread-1) [    ] o.a.s.c.c.ConnectionManager Client is connected to ZooKeeper
   [junit4]   2> 1443397 INFO  (zkCallback-1226-thread-1) [    ] o.a.s.c.c.ConnectionManager Watcher org.apache.solr.common.cloud.ConnectionManager@62a5c3 name:ZooKeeperConnection Watcher:127.0.0.1:42570 got event WatchedEvent state:SyncConnected type:None path:null path:null type:None
   [junit4]   2> 1443398 INFO  (jetty-launcher-1207-thread-2) [    ] o.a.s.c.c.ConnectionManager Client is connected to ZooKeeper
   [junit4]   2> 1443398 INFO  (jetty-launcher-1207-thread-1) [    ] o.a.s.c.c.SolrZkClient Using default ZkACLProvider
   [junit4]   2> 1443398 INFO  (jetty-launcher-1207-thread-2) [    ] o.a.s.c.c.SolrZkClient Using default ZkACLProvider
   [junit4]   2> 1443399 INFO  (zkCallback-1227-thread-1) [    ] o.a.s.c.c.ConnectionManager Watcher org.apache.solr.common.cloud.ConnectionManager@136339b name:ZooKeeperConnection Watcher:127.0.0.1:42570 got event WatchedEvent state:SyncConnected type:None path:null path:null type:None
   [junit4]   2> 1443399 INFO  (jetty-launcher-1207-thread-3) [    ] o.a.s.c.c.ConnectionManager Client is connected to ZooKeeper
   [junit4]   2> 1443399 INFO  (zkCallback-1228-thread-1) [    ] o.a.s.c.c.ConnectionManager Watcher org.apache.solr.common.cloud.ConnectionManager@18ebd52 name:ZooKeeperConnection Watcher:127.0.0.1:42570 got event WatchedEvent state:SyncConnected type:None path:null path:null type:None
   [junit4]   2> 1443399 INFO  (jetty-launcher-1207-thread-5) [    ] o.a.s.c.c.ConnectionManager Client is connected to ZooKeeper
   [junit4]   2> 1443399 INFO  (jetty-launcher-1207-thread-3) [    ] o.a.s.c.c.SolrZkClient Using default ZkACLProvider
   [junit4]   2> 1443399 INFO  (jetty-launcher-1207-thread-5) [    ] o.a.s.c.c.SolrZkClient Using default ZkACLProvider
   [junit4]   2> 1443400 WARN  (NIOServerCxn.Factory:0.0.0.0/0.0.0.0:0) [    ] o.a.z.s.NIOServerCnxn caught end of stream exception
   [junit4]   2> EndOfStreamException: Unable to read additional data from client sessionid 0x153ac3a1a790006, likely client has closed socket
   [junit4]   2> 	at org.apache.zookeeper.server.NIOServerCnxn.doIO(NIOServerCnxn.java:228)
   [junit4]   2> 	at org.apache.zookeeper.server.NIOServerCnxnFactory.run(NIOServerCnxnFactory.java:208)
   [junit4]   2> 	at java.lang.Thread.run(Thread.java:745)
   [junit4]   2> 1443402 INFO  (jetty-launcher-1207-thread-4) [n:127.0.0.1:44888_solr    ] o.a.s.c.c.ConnectionManager Waiting for client to connect to ZooKeeper
   [junit4]   2> 1443402 INFO  (jetty-launcher-1207-thread-2) [n:127.0.0.1:40485_solr    ] o.a.s.c.c.ConnectionManager Waiting for client to connect to ZooKeeper
   [junit4]   2> 1443402 INFO  (jetty-launcher-1207-thread-1) [n:127.0.0.1:44933_solr    ] o.a.s.c.c.ConnectionManager Waiting for client to connect to ZooKeeper
   [junit4]   2> 1443403 INFO  (jetty-launcher-1207-thread-5) [n:127.0.0.1:37131_solr    ] o.a.s.c.c.ConnectionManager Waiting for client to connect to ZooKeeper
   [junit4]   2> 1443405 INFO  (zkCallback-1229-thread-1-processing-n:127.0.0.1:44888_solr) [n:127.0.0.1:44888_solr    ] o.a.s.c.c.ConnectionManager Watcher org.apache.solr.common.cloud.ConnectionManager@11a1a35 name:ZooKeeperConnection Watcher:127.0.0.1:42570/solr got event WatchedEvent state:SyncConnected type:None path:null path:null type:None
   [junit4]   2> 1443405 INFO  (jetty-launcher-1207-thread-4) [n:127.0.0.1:44888_solr    ] o.a.s.c.c.ConnectionManager Client is connected to ZooKeeper
   [junit4]   2> 1443405 INFO  (zkCallback-1230-thread-1-processing-n:127.0.0.1:40485_solr) [n:127.0.0.1:40485_solr    ] o.a.s.c.c.ConnectionManager Watcher org.apache.solr.common.cloud.ConnectionManager@441bd0 name:ZooKeeperConnection Watcher:127.0.0.1:42570/solr got event WatchedEvent state:SyncConnected type:None path:null path:null type:None
   [junit4]   2> 1443405 INFO  (jetty-launcher-1207-thread-3) [n:127.0.0.1:46561_solr    ] o.a.s.c.c.ConnectionManager Waiting for client to connect to ZooKeeper
   [junit4]   2> 1443405 INFO  (jetty-launcher-1207-thread-2) [n:127.0.0.1:40485_solr    ] o.a.s.c.c.ConnectionManager Client is connected to ZooKeeper
   [junit4]   2> 1443405 INFO  (zkCallback-1231-thread-1-processing-n:127.0.0.1:44933_solr) [n:127.0.0.1:44933_solr    ] o.a.s.c.c.ConnectionManager Watcher org.apache.solr.common.cloud.ConnectionManager@1eeb5da name:ZooKeeperConnection Watcher:127.0.0.1:42570/solr got event WatchedEvent state:SyncConnected type:None path:null path:null type:None
   [junit4]   2> 1443405 INFO  (jetty-launcher-1207-thread-1) [n:127.0.0.1:44933_solr    ] o.a.s.c.c.ConnectionManager Client is connected to ZooKeeper
   [junit4]   2> 1443406 INFO  (zkCallback-1232-thread-1-processing-n:127.0.0.1:37131_solr) [n:127.0.0.1:37131_solr    ] o.a.s.c.c.ConnectionManager Watcher org.apache.solr.common.cloud.ConnectionManager@c973a6 name:ZooKeeperConnection Watcher:127.0.0.1:42570/solr got event WatchedEvent state:SyncConnected type:None path:null path:null type:None
   [junit4]   2> 1443406 INFO  (jetty-launcher-1207-thread-5) [n:127.0.0.1:37131_solr    ] o.a.s.c.c.ConnectionManager Client is connected to ZooKeeper
   [junit4]   2> 1443408 INFO  (zkCallback-1233-thread-1-processing-n:127.0.0.1:46561_solr) [n:127.0.0.1:46561_solr    ] o.a.s.c.c.ConnectionManager Watcher org.apache.solr.common.cloud.ConnectionManager@1fa86bb name:ZooKeeperConnection Watcher:127.0.0.1:42570/solr got event WatchedEvent state:SyncConnected type:None path:null path:null type:None
   [junit4]   2> 1443408 INFO  (jetty-launcher-1207-thread-3) [n:127.0.0.1:46561_solr    ] o.a.s.c.c.ConnectionManager Client is connected to ZooKeeper
   [junit4]   2> 1443410 INFO  (jetty-launcher-1207-thread-4) [n:127.0.0.1:44888_solr    ] o.a.s.c.c.SolrZkClient makePath: /overseer/queue
   [junit4]   2> 1443410 INFO  (jetty-launcher-1207-thread-2) [n:127.0.0.1:40485_solr    ] o.a.s.c.c.SolrZkClient makePath: /overseer/queue
   [junit4]   2> 1443410 INFO  (jetty-launcher-1207-thread-1) [n:127.0.0.1:44933_solr    ] o.a.s.c.c.SolrZkClient makePath: /overseer/queue
   [junit4]   2> 1443411 INFO  (jetty-launcher-1207-thread-5) [n:127.0.0.1:37131_solr    ] o.a.s.c.c.SolrZkClient makePath: /overseer/queue
   [junit4]   2> 1443411 INFO  (jetty-launcher-1207-thread-3) [n:127.0.0.1:46561_solr    ] o.a.s.c.c.SolrZkClient makePath: /overseer/queue
   [junit4]   2> 1443434 INFO  (jetty-launcher-1207-thread-4) [n:127.0.0.1:44888_solr    ] o.a.s.c.c.SolrZkClient makePath: /overseer/collection-queue-work
   [junit4]   2> 1443434 INFO  (jetty-launcher-1207-thread-5) [n:127.0.0.1:37131_solr    ] o.a.s.c.c.SolrZkClient makePath: /overseer/collection-queue-work
   [junit4]   2> 1443434 INFO  (jetty-launcher-1207-thread-1) [n:127.0.0.1:44933_solr    ] o.a.s.c.c.SolrZkClient makePath: /overseer/collection-queue-work
   [junit4]   2> 1443434 INFO  (jetty-launcher-1207-thread-2) [n:127.0.0.1:40485_solr    ] o.a.s.c.c.SolrZkClient makePath: /overseer/collection-queue-work
   [junit4]   2> 1443434 INFO  (jetty-launcher-1207-thread-3) [n:127.0.0.1:46561_solr    ] o.a.s.c.c.SolrZkClient makePath: /overseer/collection-queue-work
   [junit4]   2> 1443460 INFO  (jetty-launcher-1207-thread-5) [n:127.0.0.1:37131_solr    ] o.a.s.c.c.SolrZkClient makePath: /overseer/collection-map-running
   [junit4]   2> 1443461 INFO  (jetty-launcher-1207-thread-1) [n:127.0.0.1:44933_solr    ] o.a.s.c.c.SolrZkClient makePath: /overseer/collection-map-running
   [junit4]   2> 1443461 INFO  (jetty-launcher-1207-thread-4) [n:127.0.0.1:44888_solr    ] o.a.s.c.c.SolrZkClient makePath: /overseer/collection-map-running
   [junit4]   2> 1443462 INFO  (jetty-launcher-1207-thread-3) [n:127.0.0.1:46561_solr    ] o.a.s.c.c.SolrZkClient makePath: /overseer/collection-map-running
   [junit4]   2> 1443462 INFO  (jetty-launcher-1207-thread-2) [n:127.0.0.1:40485_solr    ] o.a.s.c.c.SolrZkClient makePath: /overseer/collection-map-running
   [junit4]   2> 1443468 INFO  (jetty-launcher-1207-thread-5) [n:127.0.0.1:37131_solr    ] o.a.s.c.c.SolrZkClient makePath: /overseer/collection-map-completed
   [junit4]   2> 1443470 INFO  (jetty-launcher-1207-thread-1) [n:127.0.0.1:44933_solr    ] o.a.s.c.c.SolrZkClient makePath: /overseer/collection-map-completed
   [junit4]   2> 1443470 INFO  (jetty-launcher-1207-thread-4) [n:127.0.0.1:44888_solr    ] o.a.s.c.c.SolrZkClient makePath: /overseer/collection-map-completed
   [junit4]   2> 1443470 INFO  (jetty-launcher-1207-thread-3) [n:127.0.0.1:46561_solr    ] o.a.s.c.c.SolrZkClient makePath: /overseer/collection-map-completed
   [junit4]   2> 1443470 INFO  (jetty-launcher-1207-thread-2) [n:127.0.0.1:40485_solr    ] o.a.s.c.c.SolrZkClient makePath: /overseer/collection-map-completed
   [junit4]   2> 1443476 INFO  (jetty-launcher-1207-thread-5) [n:127.0.0.1:37131_solr    ] o.a.s.c.c.SolrZkClient makePath: /overseer/collection-map-failure
   [junit4]   2> 1443476 INFO  (jetty-launcher-1207-thread-1) [n:127.0.0.1:44933_solr    ] o.a.s.c.c.SolrZkClient makePath: /overseer/collection-map-failure
   [junit4]   2> 1443488 INFO  (jetty-launcher-1207-thread-3) [n:127.0.0.1:46561_solr    ] o.a.s.c.c.SolrZkClient makePath: /overseer/collection-map-failure
   [junit4]   2> 1443488 INFO  (jetty-launcher-1207-thread-2) [n:127.0.0.1:40485_solr    ] o.a.s.c.c.SolrZkClient makePath: /overseer/collection-map-failure
   [junit4]   2> 1443488 INFO  (jetty-launcher-1207-thread-4) [n:127.0.0.1:44888_solr    ] o.a.s.c.c.SolrZkClient makePath: /overseer/collection-map-failure
   [junit4]   2> 1443494 INFO  (jetty-launcher-1207-thread-5) [n:127.0.0.1:37131_solr    ] o.a.s.c.c.SolrZkClient makePath: /live_nodes
   [junit4]   2> 1443494 INFO  (jetty-launcher-1207-thread-1) [n:127.0.0.1:44933_solr    ] o.a.s.c.c.SolrZkClient makePath: /live_nodes
   [junit4]   2> 1443494 INFO  (jetty-launcher-1207-thread-3) [n:127.0.0.1:46561_solr    ] o.a.s.c.c.SolrZkClient makePath: /live_nodes
   [junit4]   2> 1443494 INFO  (jetty-launcher-1207-thread-2) [n:127.0.0.1:40485_solr    ] o.a.s.c.c.SolrZkClient makePath: /live_nodes
   [junit4]   2> 1443494 INFO  (jetty-launcher-1207-thread-4) [n:127.0.0.1:44888_solr    ] o.a.s.c.c.SolrZkClient makePath: /live_nodes
   [junit4]   2> 1443498 INFO  (jetty-launcher-1207-thread-5) [n:127.0.0.1:37131_solr    ] o.a.s.c.c.SolrZkClient makePath: /collections
   [junit4]   2> 1443499 INFO  (jetty-launcher-1207-thread-1) [n:127.0.0.1:44933_solr    ] o.a.s.c.c.SolrZkClient makePath: /collections
   [junit4]   2> 1443499 INFO  (jetty-launcher-1207-thread-3) [n:127.0.0.1:46561_solr    ] o.a.s.c.c.SolrZkClient makePath: /collections
   [junit4]   2> 1443499 INFO  (jetty-launcher-1207-thread-4) [n:127.0.0.1:44888_solr    ] o.a.s.c.c.SolrZkClient makePath: /collections
   [junit4]   2> 1443499 INFO  (jetty-launcher-1207-thread-2) [n:127.0.0.1:40485_solr    ] o.a.s.c.c.SolrZkClient makePath: /collections
   [junit4]   2> 1443504 INFO  (jetty-launcher-1207-thread-3) [n:127.0.0.1:46561_solr    ] o.a.s.c.c.SolrZkClient makePath: /aliases.json
   [junit4]   2> 1443504 INFO  (jetty-launcher-1207-thread-5) [n:127.0.0.1:37131_solr    ] o.a.s.c.c.SolrZkClient makePath: /aliases.json
   [junit4]   2> 1443504 INFO  (jetty-launcher-1207-thread-1) [n:127.0.0.1:44933_solr    ] o.a.s.c.c.SolrZkClient makePath: /aliases.json
   [junit4]   2> 1443504 INFO  (jetty-launcher-1207-thread-4) [n:127.0.0.1:44888_solr    ] o.a.s.c.c.SolrZkClient makePath: /aliases.json
   [junit4]   2> 1443504 INFO  (jetty-launcher-1207-thread-2) [n:127.0.0.1:40485_solr    ] o.a.s.c.c.SolrZkClient makePath: /aliases.json
   [junit4]   2> 1443509 INFO  (jetty-launcher-1207-thread-5) [n:127.0.0.1:37131_solr    ] o.a.s.c.c.SolrZkClient makePath: /clusterstate.json
   [junit4]   2> 1443509 INFO  (jetty-launcher-1207-thread-3) [n:127.0.0.1:46561_solr    ] o.a.s.c.c.SolrZkClient makePath: /clusterstate.json
   [junit4]   2> 1443510 INFO  (jetty-launcher-1207-thread-1) [n:127.0.0.1:44933_solr    ] o.a.s.c.c.SolrZkClient makePath: /clusterstate.json
   [junit4]   2> 1443510 INFO  (jetty-launcher-1207-thread-4) [n:127.0.0.1:44888_solr    ] o.a.s.c.c.SolrZkClient makePath: /clusterstate.json
   [junit4]   2> 1443510 INFO  (jetty-launcher-1207-thread-2) [n:127.0.0.1:40485_solr    ] o.a.s.c.c.SolrZkClient makePath: /clusterstate.json
   [junit4]   2> 1443514 INFO  (jetty-launcher-1207-thread-3) [n:127.0.0.1:46561_solr    ] o.a.s.c.c.SolrZkClient makePath: /security.json
   [junit4]   2> 1443515 INFO  (jetty-launcher-1207-thread-5) [n:127.0.0.1:37131_solr    ] o.a.s.c.c.SolrZkClient makePath: /security.json
   [junit4]   2> 1443515 INFO  (jetty-launcher-1207-thread-1) [n:127.0.0.1:44933_solr    ] o.a.s.c.c.SolrZkClient makePath: /security.json
   [junit4]   2> 1443515 INFO  (jetty-launcher-1207-thread-2) [n:127.0.0.1:40485_solr    ] o.a.s.c.c.SolrZkClient makePath: /security.json
   [junit4]   2> 1443515 INFO  (jetty-launcher-1207-thread-4) [n:127.0.0.1:44888_solr    ] o.a.s.c.c.SolrZkClient makePath: /security.json
   [junit4]   2> 1443518 INFO  (jetty-launcher-1207-thread-5) [n:127.0.0.1:37131_solr    ] o.a.s.c.c.ZkStateReader Updating cluster state from ZooKeeper... 
   [junit4]   2> 1443518 INFO  (jetty-launcher-1207-thread-3) [n:127.0.0.1:46561_solr    ] o.a.s.c.c.ZkStateReader Updating cluster state from ZooKeeper... 
   [junit4]   2> 1443526 INFO  (jetty-launcher-1207-thread-1) [n:127.0.0.1:44933_solr    ] o.a.s.c.c.ZkStateReader Updating cluster state from ZooKeeper... 
   [junit4]   2> 1443534 INFO  (jetty-launcher-1207-thread-2) [n:127.0.0.1:40485_solr    ] o.a.s.c.c.ZkStateReader Updating cluster state from ZooKeeper... 
   [junit4]   2> 1443534 INFO  (jetty-launcher-1207-thread-4) [n:127.0.0.1:44888_solr    ] o.a.s.c.c.ZkStateReader Updating cluster state from ZooKeeper... 
   [junit4]   2> 1443535 INFO  (jetty-launcher-1207-thread-5) [n:127.0.0.1:37131_solr    ] o.a.s.c.c.ZkStateReader Updated live nodes from ZooKeeper... (0) -> (0)
   [junit4]   2> 1443535 INFO  (jetty-launcher-1207-thread-3) [n:127.0.0.1:46561_solr    ] o.a.s.c.c.ZkStateReader Updated live nodes from ZooKeeper... (0) -> (0)
   [junit4]   2> 1443535 INFO  (jetty-launcher-1207-thread-1) [n:127.0.0.1:44933_solr    ] o.a.s.c.c.ZkStateReader Updated live nodes from ZooKeeper... (0) -> (0)
   [junit4]   2> 1443535 INFO  (jetty-launcher-1207-thread-2) [n:127.0.0.1:40485_solr    ] o.a.s.c.c.ZkStateReader Updated live nodes from ZooKeeper... (0) -> (0)
   [junit4]   2> 1443535 INFO  (jetty-launcher-1207-thread-4) [n:127.0.0.1:44888_solr    ] o.a.s.c.c.ZkStateReader Updated live nodes from ZooKeeper... (0) -> (0)
   [junit4]   2> 1443536 INFO  (jetty-launcher-1207-thread-5) [n:127.0.0.1:37131_solr    ] o.a.s.c.c.SolrZkClient makePath: /overseer_elect
   [junit4]   2> 1443536 INFO  (jetty-launcher-1207-thread-3) [n:127.0.0.1:46561_solr    ] o.a.s.c.c.SolrZkClient makePath: /overseer_elect
   [junit4]   2> 1443536 INFO  (jetty-launcher-1207-thread-1) [n:127.0.0.1:44933_solr    ] o.a.s.c.c.SolrZkClient makePath: /overseer_elect
   [junit4]   2> 1443536 INFO  (jetty-launcher-1207-thread-2) [n:127.0.0.1:40485_solr    ] o.a.s.c.c.SolrZkClient makePath: /overseer_elect
   [junit4]   2> 1443536 INFO  (jetty-launcher-1207-thread-4) [n:127.0.0.1:44888_solr    ] o.a.s.c.c.SolrZkClient makePath: /overseer_elect
   [junit4]   2> 1443547 INFO  (jetty-launcher-1207-thread-5) [n:127.0.0.1:37131_solr    ] o.a.s.c.c.SolrZkClient makePath: /overseer_elect/election
   [junit4]   2> 1443547 INFO  (jetty-launcher-1207-thread-3) [n:127.0.0.1:46561_solr    ] o.a.s.c.c.SolrZkClient makePath: /overseer_elect/election
   [junit4]   2> 1443547 INFO  (jetty-launcher-1207-thread-2) [n:127.0.0.1:40485_solr    ] o.a.s.c.c.SolrZkClient makePath: /overseer_elect/election
   [junit4]   2> 1443547 INFO  (jetty-launcher-1207-thread-1) [n:127.0.0.1:44933_solr    ] o.a.s.c.c.SolrZkClient makePath: /overseer_elect/election
   [junit4]   2> 1443547 INFO  (jetty-launcher-1207-thread-4) [n:127.0.0.1:44888_solr    ] o.a.s.c.c.SolrZkClient makePath: /overseer_elect/election
   [junit4]   2> 1443550 INFO  (jetty-launcher-1207-thread-2) [n:127.0.0.1:40485_solr    ] o.a.s.c.Overseer Overseer (id=null) closing
   [junit4]   2> 1443550 INFO  (jetty-launcher-1207-thread-3) [n:127.0.0.1:46561_solr    ] o.a.s.c.Overseer Overseer (id=null) closing
   [junit4]   2> 1443550 INFO  (jetty-launcher-1207-thread-5) [n:127.0.0.1:37131_solr    ] o.a.s.c.Overseer Overseer (id=null) closing
   [junit4]   2> 1443552 INFO  (jetty-launcher-1207-thread-1) [n:127.0.0.1:44933_solr    ] o.a.s.c.Overseer Overseer (id=null) closing
   [junit4]   2> 1443552 INFO  (jetty-launcher-1207-thread-4) [n:127.0.0.1:44888_solr    ] o.a.s.c.Overseer Overseer (id=null) closing
   [junit4]   2> 1443563 INFO  (jetty-launcher-1207-thread-2) [n:127.0.0.1:40485_solr    ] o.a.s.c.LeaderElector Joined leadership election with path: /overseer_elect/election/95609382657130508-127.0.0.1:40485_solr-n_0000000000
   [junit4]   2> 1443563 INFO  (jetty-launcher-1207-thread-3) [n:127.0.0.1:46561_solr    ] o.a.s.c.LeaderElector Joined leadership election with path: /overseer_elect/election/95609382657130511-127.0.0.1:46561_solr-n_0000000001
   [junit4]   2> 1443563 INFO  (jetty-launcher-1207-thread-5) [n:127.0.0.1:37131_solr    ] o.a.s.c.LeaderElector Joined leadership election with path: /overseer_elect/election/95609382657130510-127.0.0.1:37131_solr-n_0000000002
   [junit4]   2> 1443564 INFO  (jetty-launcher-1207-thread-1) [n:127.0.0.1:44933_solr    ] o.a.s.c.LeaderElector Joined leadership election with path: /overseer_elect/election/95609382657130509-127.0.0.1:44933_solr-n_0000000003
   [junit4]   2> 1443564 INFO  (jetty-launcher-1207-thread-4) [n:127.0.0.1:44888_solr    ] o.a.s.c.LeaderElector Joined leadership election with path: /overseer_elect/election/95609382657130507-127.0.0.1:44888_solr-n_0000000004
   [junit4]   2> 1443564 INFO  (jetty-launcher-1207-thread-2) [n:127.0.0.1:40485_solr    ] o.a.s.c.OverseerElectionContext I am going to be the leader 127.0.0.1:40485_solr
   [junit4]   2> 1443564 INFO  (jetty-launcher-1207-thread-2) [n:127.0.0.1:40485_solr    ] o.a.s.c.c.SolrZkClient makePath: /overseer_elect/leader
   [junit4]   2> 1443565 INFO  (jetty-launcher-1207-thread-3) [n:127.0.0.1:46561_solr    ] o.a.s.c.LeaderElector Watching path /overseer_elect/election/95609382657130508-127.0.0.1:40485_solr-n_0000000000 to know if I could be the leader
   [junit4]   2> 1443565 INFO  (jetty-launcher-1207-thread-5) [n:127.0.0.1:37131_solr    ] o.a.s.c.LeaderElector Watching path /overseer_elect/election/95609382657130511-127.0.0.1:46561_solr-n_0000000001 to know if I could be the leader
   [junit4]   2> 1443565 INFO  (jetty-launcher-1207-thread-1) [n:127.0.0.1:44933_solr    ] o.a.s.c.LeaderElector Watching path /overseer_elect/election/95609382657130510-127.0.0.1:37131_solr-n_0000000002 to know if I could be the leader
   [junit4]   2> 1443565 INFO  (jetty-launcher-1207-thread-4) [n:127.0.0.1:44888_solr    ] o.a.s.c.LeaderElector Watching path /overseer_elect/election/95609382657130509-127.0.0.1:44933_solr-n_0000000003 to know if I could be the leader
   [junit4]   2> 1443565 INFO  (jetty-launcher-1207-thread-3) [n:127.0.0.1:46561_solr    ] o.a.s.c.ZkController Register node as live in ZooKeeper:/live_nodes/127.0.0.1:46561_solr
   [junit4]   2> 1443565 INFO  (jetty-launcher-1207-thread-5) [n:127.0.0.1:37131_solr    ] o.a.s.c.ZkController Register node as live in ZooKeeper:/live_nodes/127.0.0.1:37131_solr
   [junit4]   2> 1443565 INFO  (jetty-launcher-1207-thread-1) [n:127.0.0.1:44933_solr    ] o.a.s.c.ZkController Register node as live in ZooKeeper:/live_nodes/127.0.0.1:44933_solr
   [junit4]   2> 1443566 INFO  (jetty-launcher-1207-thread-4) [n:127.0.0.1:44888_solr    ] o.a.s.c.ZkController Register node as live in ZooKeeper:/live_nodes/127.0.0.1:44888_solr
   [junit4]   2> 1443568 INFO  (jetty-launcher-1207-thread-3) [n:127.0.0.1:46561_solr    ] o.a.s.c.c.SolrZkClient makePath: /live_nodes/127.0.0.1:46561_solr
   [junit4]   2> 1443568 INFO  (jetty-launcher-1207-thread-2) [n:127.0.0.1:40485_solr    ] o.a.s.c.Overseer Overseer (id=95609382657130508-127.0.0.1:40485_solr-n_0000000000) starting
   [junit4]   2> 1443568 INFO  (jetty-launcher-1207-thread-1) [n:127.0.0.1:44933_solr    ] o.a.s.c.c.SolrZkClient makePath: /live_nodes/127.0.0.1:44933_solr
   [junit4]   2> 1443568 INFO  (jetty-launcher-1207-thread-5) [n:127.0.0.1:37131_solr    ] o.a.s.c.c.SolrZkClient makePath: /live_nodes/127.0.0.1:37131_solr
   [junit4]   2> 1443569 INFO  (jetty-launcher-1207-thread-4) [n:127.0.0.1:44888_solr    ] o.a.s.c.c.SolrZkClient makePath: /live_nodes/127.0.0.1:44888_solr
   [junit4]   2> 1443574 INFO  (zkCallback-1231-thread-1-processing-n:127.0.0.1:44933_solr) [n:127.0.0.1:44933_solr    ] o.a.s.c.c.ZkStateReader A live node change: [WatchedEvent state:SyncConnected type:NodeChildrenChanged path:/live_nodes], has occurred - updating... (live nodes size: [0])
   [junit4]   2> 1443574 INFO  (zkCallback-1230-thread-1-processing-n:127.0.0.1:40485_solr) [n:127.0.0.1:40485_solr    ] o.a.s.c.c.ZkStateReader A live node change: [WatchedEvent state:SyncConnected type:NodeChildrenChanged path:/live_nodes], has occurred - updating... (live nodes size: [0])
   [junit4]   2> 1443574 INFO  (zkCallback-1229-thread-1-processing-n:127.0.0.1:44888_solr) [n:127.0.0.1:44888_solr    ] o.a.s.c.c.ZkStateReader A live node change: [WatchedEvent state:SyncConnected type:NodeChildrenChanged path:/live_nodes], has occurred - updating... (live nodes size: [0])
   [junit4]   2> 1443574 INFO  (zkCallback-1233-thread-1-processing-n:127.0.0.1:46561_solr) [n:127.0.0.1:46561_solr    ] o.a.s.c.c.ZkStateReader A live node change: [WatchedEvent state:SyncConnected type:NodeChildrenChanged path:/live_nodes], has occurred - updating... (live nodes size: [0])
   [junit4]   2> 1443574 INFO  (zkCallback-1232-thread-1-processing-n:127.0.0.1:37131_solr) [n:127.0.0.1:37131_solr    ] o.a.s.c.c.ZkStateReader A live node change: [WatchedEvent state:SyncConnected type:NodeChildrenChanged path:/live_nodes], has occurred - updating... (live nodes size: [0])
   [junit4]   2> 1443578 INFO  (zkCallback-1230-thread-1-processing-n:127.0.0.1:40485_solr) [n:127.0.0.1:40485_solr    ] o.a.s.c.c.ZkStateReader Updated live nodes from ZooKeeper... (0) -> (4)
   [junit4]   2> 1443578 INFO  (zkCallback-1231-thread-1-processing-n:127.0.0.1:44933_solr) [n:127.0.0.1:44933_solr    ] o.a.s.c.c.ZkStateReader Updated live nodes from ZooKeeper... (0) -> (4)
   [junit4]   2> 1443579 INFO  (zkCallback-1229-thread-1-processing-n:127.0.0.1:44888_solr) [n:127.0.0.1:44888_solr    ] o.a.s.c.c.ZkStateReader Updated live nodes from ZooKeeper... (0) -> (4)
   [junit4]   2> 1443580 INFO  (zkCallback-1232-thread-1-processing-n:127.0.0.1:37131_solr) [n:127.0.0.1:37131_solr    ] o.a.s.c.c.ZkStateReader Updated live nodes from ZooKeeper... (0) -> (4)
   [junit4]   2> 1443579 INFO  (zkCallback-1233-thread-1-processing-n:127.0.0.1:46561_solr) [n:127.0.0.1:46561_solr    ] o.a.s.c.c.ZkStateReader Updated live nodes from ZooKeeper... (0) -> (4)
   [junit4]   2> 1443581 INFO  (jetty-launcher-1207-thread-2) [n:127.0.0.1:40485_solr    ] o.a.s.c.c.SolrZkClient makePath: /overseer/queue-work
   [junit4]   2> 1443592 INFO  (jetty-launcher-1207-thread-1) [n:127.0.0.1:44933_solr    ] o.a.s.c.CoreContainer Security conf doesn't exist. Skipping setup for authorization module.
   [junit4]   2> 1443592 INFO  (jetty-launcher-1207-thread-1) [n:127.0.0.1:44933_solr    ] o.a.s.c.CoreContainer Authentication plugin class obtained from system property 'authenticationPlugin': org.apache.solr.cloud.TestAuthenticationFramework$MockAuthenticationPlugin
   [junit4]   2> 1443593 INFO  (jetty-launcher-1207-thread-1) [n:127.0.0.1:44933_solr    ] o.a.s.c.CoreContainer Reconfiguring the shard handler factory and update shard handler.
   [junit4]   2> 1443593 INFO  (jetty-launcher-1207-thread-1) [n:127.0.0.1:44933_solr    ] o.a.s.h.c.HttpShardHandlerFactory Reconfiguring the default client with: org.apache.solr.cloud.TestAuthenticationFramework$MockAuthenticationPlugin$MockClientConfigurer@1787c30
   [junit4]   2> 1443593 INFO  (jetty-launcher-1207-thread-1) [n:127.0.0.1:44933_solr    ] o.a.s.u.UpdateShardHandler Reconfiguring the default client with: org.apache.solr.cloud.TestAuthenticationFramework$MockAuthenticationPlugin$MockClientConfigurer@1787c30
   [junit4]   2> 1443594 INFO  (jetty-launcher-1207-thread-1) [n:127.0.0.1:44933_solr    ] o.a.s.c.CorePropertiesLocator Looking for core definitions underneath /home/jenkins/workspace/Lucene-Solr-6.x-Linux/solr/build/solr-core/test/J1/temp/solr.cloud.TestAuthenticationFramework_178FF9B920E45E7C-001/tempDir-001/node1/.
   [junit4]   2> 1443594 INFO  (jetty-launcher-1207-thread-1) [n:127.0.0.1:44933_solr    ] o.a.s.c.CorePropertiesLocator Found 0 core definitions
   [junit4]   2> 1443598 INFO  (jetty-launcher-1207-thread-1) [n:127.0.0.1:44933_solr    ] o.a.s.s.SolrDispatchFilter user.dir=/home/jenkins/workspace/Lucene-Solr-6.x-Linux/solr/build/solr-core/test/J1
   [junit4]   2> 1443598 INFO  (jetty-launcher-1207-thread-1) [n:127.0.0.1:44933_solr    ] o.a.s.s.SolrDispatchFilter SolrDispatchFilter.init() done
   [junit4]   2> 1443606 INFO  (jetty-launcher-1207-thread-3) [n:127.0.0.1:46561_solr    ] o.a.s.c.CoreContainer Security conf doesn't exist. Skipping setup for authorization module.
   [junit4]   2> 1443606 INFO  (jetty-launcher-1207-thread-3) [n:127.0.0.1:46561_solr    ] o.a.s.c.CoreContainer Authentication plugin class obtained from system property 'authenticationPlugin': org.apache.solr.cloud.TestAuthenticationFramework$MockAuthenticationPlugin
   [junit4]   2> 1443606 INFO  (jetty-launcher-1207-thread-3) [n:127.0.0.1:46561_solr    ] o.a.s.c.CoreContainer Reconfiguring the shard handler factory and update shard handler.
   [junit4]   2> 1443606 INFO  (jetty-launcher-1207-thread-3) [n:127.0.0.1:46561_solr    ] o.a.s.h.c.HttpShardHandlerFactory Reconfiguring the default client with: org.apache.solr.cloud.TestAuthenticationFramework$MockAuthenticationPlugin$MockClientConfigurer@31624c
   [junit4]   2> 1443606 INFO  (jetty-launcher-1207-thread-3) [n:127.0.0.1:46561_solr    ] o.a.s.u.UpdateShardHandler Reconfiguring the default client with: org.apache.solr.cloud.TestAuthenticationFramework$MockAuthenticationPlugin$MockClientConfigurer@31624c
   [junit4]   2> 1443607 INFO  (jetty-launcher-1207-thread-3) [n:127.0.0.1:46561_solr    ] o.a.s.c.CorePropertiesLocator Looking for core definitions underneath /home/jenkins/workspace/Lucene-Solr-6.x-Linux/solr/build/solr-core/test/J1/temp/solr.cloud.TestAuthenticationFramework_178FF9B920E45E7C-001/tempDir-001/node3/.
   [junit4]   2> 1443607 INFO  (jetty-launcher-1207-thread-3) [n:127.0.0.1:46561_solr    ] o.a.s.c.CorePropertiesLocator Found 0 core definitions
   [junit4]   2> 1443607 INFO  (jetty-launcher-1207-thread-3) [n:127.0.0.1:46561_solr    ] o.a.s.s.SolrDispatchFilter user.dir=/home/jenkins/workspace/Lucene-Solr-6.x-Linux/solr/build/solr-core/test/J1
   [junit4]   2> 1443607 INFO  (jetty-launcher-1207-thread-5) [n:127.0.0.1:37131_solr    ] o.a.s.c.CoreContainer Security conf doesn't exist. Skipping setup for authorization module.
   [junit4]   2> 1443607 INFO  (jetty-launcher-1207-thread-3) [n:127.0.0.1:46561_solr    ] o.a.s.s.SolrDispatchFilter SolrDispatchFilter.init() done
   [junit4]   2> 1443607 INFO  (jetty-launcher-1207-thread-5) [n:127.0.0.1:37131_solr    ] o.a.s.c.CoreContainer Authentication plugin class obtained from system property 'authenticationPlugin': org.apache.solr.cloud.TestAuthenticationFramework$MockAuthenticationPlugin
   [junit4]   2> 1443607 INFO  (jetty-launcher-1207-thread-5) [n:127.0.0.1:37131_solr    ] o.a.s.c.CoreContainer Reconfiguring the shard handler factory and update shard handler.
   [junit4]   2> 1443607 INFO  (jetty-launcher-1207-thread-5) [n:127.0.0.1:37131_solr    ] o.a.s.h.c.HttpShardHandlerFactory Reconfiguring the default client with: org.apache.solr.cloud.TestAuthenticationFramework$MockAuthenticationPlugin$MockClientConfigurer@b6eb5d
   [junit4]   2> 1443607 INFO  (jetty-launcher-1207-thread-5) [n:127.0.0.1:37131_solr    ] o.a.s.u.UpdateShardHandler Reconfiguring the default client with: org.apache.solr.cloud.TestAuthenticationFramework$MockAuthenticationPlugin$MockClientConfigurer@b6eb5d
   [junit4]   2> 1443608 INFO  (jetty-launcher-1207-thread-5) [n:127.0.0.1:37131_solr    ] o.a.s.c.CorePropertiesLocator Looking for core definitions underneath /home/jenkins/workspace/Lucene-Solr-6.x-Linux/solr/build/solr-core/test/J1/temp/solr.cloud.TestAuthenticationFramework_178FF9B920E45E7C-001/tempDir-001/node5/.
   [junit4]   2> 1443608 INFO  (jetty-launcher-1207-thread-5) [n:127.0.0.1:37131_solr    ] o.a.s.c.CorePropertiesLocator Found 0 core definitions
   [junit4]   2> 1443609 INFO  (jetty-launcher-1207-thread-5) [n:127.0.0.1:37131_solr    ] o.a.s.s.SolrDispatchFilter user.dir=/home/jenkins/workspace/Lucene-Solr-6.x-Linux/solr/build/solr-core/test/J1
   [junit4]   2> 1443609 INFO  (jetty-launcher-1207-thread-5) [n:127.0.0.1:37131_solr    ] o.a.s.s.SolrDispatchFilter SolrDispatchFilter.init() done
   [junit4]   2> 1443609 INFO  (jetty-launcher-1207-thread-2) [n:127.0.0.1:40485_solr    ] o.a.s.c.OverseerAutoReplicaFailoverThread Starting OverseerAutoReplicaFailoverThread autoReplicaFailoverWorkLoopDelay=10000 autoReplicaFailoverWaitAfterExpiration=30000 autoReplicaFailoverBadNodeExpiration=60000
   [junit4]   2> 1443609 INFO  (OverseerCollectionConfigSetProcessor-95609382657130508-127.0.0.1:40485_solr-n_0000000000) [n:127.0.0.1:40485_solr    ] o.a.s.c.OverseerTaskProcessor Process current queue of overseer operations
   [junit4]   2> 1443610 INFO  (jetty-launcher-1207-thread-4) [n:127.0.0.1:44888_solr    ] o.a.s.c.CoreContainer Security conf doesn't exist. Skipping setup for authorization module.
   [junit4]   2> 1443610 INFO  (jetty-launcher-1207-thread-4) [n:127.0.0.1:44888_solr    ] o.a.s.c.CoreContainer Authentication plugin class obtained from system property 'authenticationPlugin': org.apache.solr.cloud.TestAuthenticationFramework$MockAuthenticationPlugin
   [junit4]   2> 1443610 INFO  (OverseerStateUpdate-95609382657130508-127.0.0.1:40485_solr-n_0000000000) [n:127.0.0.1:40485_solr    ] o.a.s.c.Overseer Starting to work on the main queue
   [junit4]   2> 1443610 INFO  (jetty-launcher-1207-thread-2) [n:127.0.0.1:40485_solr    ] o.a.s.c.ZkController Publish node=127.0.0.1:40485_solr as DOWN
   [junit4]   2> 1443610 INFO  (jetty-launcher-1207-thread-4) [n:127.0.0.1:44888_solr    ] o.a.s.c.CoreContainer Reconfiguring the shard handler factory and update shard handler.
   [junit4]   2> 1443611 INFO  (jetty-launcher-1207-thread-4) [n:127.0.0.1:44888_solr    ] o.a.s.h.c.HttpShardHandlerFactory Reconfiguring the default client with: org.apache.solr.cloud.TestAuthenticationFramework$MockAuthenticationPlugin$MockClientConfigurer@16481e7
   [junit4]   2> 1443611 INFO  (jetty-launcher-1207-thread-4) [n:127.0.0.1:44888_solr    ] o.a.s.u.UpdateShardHandler Reconfiguring the default client with: org.apache.solr.cloud.TestAuthenticationFramework$MockAuthenticationPlugin$MockClientConfigurer@16481e7
   [junit4]   2> 1443611 INFO  (jetty-launcher-1207-thread-4) [n:127.0.0.1:44888_solr    ] o.a.s.c.CorePropertiesLocator Looking for core definitions underneath /home/jenkins/workspace/Lucene-Solr-6.x-Linux/solr/build/solr-core/test/J1/temp/solr.cloud.TestAuthenticationFramework_178FF9B920E45E7C-001/tempDir-001/node4/.
   [junit4]   2> 1443611 INFO  (jetty-launcher-1207-thread-4) [n:127.0.0.1:44888_solr    ] o.a.s.c.CorePropertiesLocator Found 0 core definitions
   [junit4]   2> 1443612 INFO  (jetty-launcher-1207-thread-4) [n:127.0.0.1:44888_solr    ] o.a.s.s.SolrDispatchFilter user.dir=/home/jenkins/workspace/Lucene-Solr-6.x-Linux/solr/build/solr-core/test/J1
   [junit4]   2> 1443612 INFO  (jetty-launcher-1207-thread-4) [n:127.0.0.1:44888_solr    ] o.a.s.s.SolrDispatchFilter SolrDispatchFilter.init() done
   [junit4]   2> 1443614 INFO  (OverseerStateUpdate-95609382657130508-127.0.0.1:40485_solr-n_0000000000) [n:127.0.0.1:40485_solr    ] o.a.s.c.c.ZkStateReader Updated live nodes from ZooKeeper... (4) -> (4)
   [junit4]   2> 1443614 INFO  (OverseerStateUpdate-95609382657130508-127.0.0.1:40485_solr-n_0000000000) [n:127.0.0.1:40485_solr    ] o.a.s.c.Overseer processMessage: queueSize: 1, message = {
   [junit4]   2>   "operation":"downnode",
   [junit4]   2>   "node_name":"127.0.0.1:40485_solr"} current state version: 0
   [junit4]   2> 1443614 INFO  (OverseerStateUpdate-95609382657130508-127.0.0.1:40485_solr-n_0000000000) [n:127.0.0.1:40485_solr    ] o.a.s.c.o.NodeMutator DownNode state invoked for node: 127.0.0.1:40485_solr
   [junit4]   2> 1444614 INFO  (jetty-launcher-1207-thread-2) [n:127.0.0.1:40485_solr    ] o.a.s.c.ZkController Register node as live in ZooKeeper:/live_nodes/127.0.0.1:40485_solr
   [junit4]   2> 1444626 INFO  (jetty-launcher-1207-thread-2) [n:127.0.0.1:40485_solr    ] o.a.s.c.c.SolrZkClient makePath: /live_nodes/127.0.0.1:40485_solr
   [junit4]   2> 1444628 INFO  (zkCallback-1231-thread-1-processing-n:127.0.0.1:44933_solr) [n:127.0.0.1:44933_solr    ] o.a.s.c.c.ZkStateReader A live node change: [WatchedEvent state:SyncConnected type:NodeChildrenChanged path:/live_nodes], has occurred - updating... (live nodes size: [4])
   [junit4]   2> 1444628 INFO  (zkCallback-1233-thread-1-processing-n:127.0.0.1:46561_solr) [n:127.0.0.1:46561_solr    ] o.a.s.c.c.ZkStateReader A live node change: [WatchedEvent state:SyncConnected type:NodeChildrenChanged path:/live_nodes], has occurred - updating... (live nodes size: [4])
   [junit4]   2> 1444628 INFO  (zkCallback-1232-thread-1-processing-n:127.0.0.1:37131_solr) [n:127.0.0.1:37131_solr    ] o.a.s.c.c.ZkStateReader A live node change: [WatchedEvent state:SyncConnected type:NodeChildrenChanged path:/live_nodes], has occurred - updating... (live nodes size: [4])
   [junit4]   2> 1444628 INFO  (zkCallback-1230-thread-1-processing-n:127.0.0.1:40485_solr) [n:127.0.0.1:40485_solr    ] o.a.s.c.c.ZkStateReader A live node change: [WatchedEvent state:SyncConnected type:NodeChildrenChanged path:/live_nodes], has occurred - updating... (live nodes size: [4])
   [junit4]   2> 1444628 INFO  (zkCallback-1229-thread-1-processing-n:127.0.0.1:44888_solr) [n:127.0.0.1:44888_solr    ] o.a.s.c.c.ZkStateReader A live node change: [WatchedEvent state:SyncConnected type:NodeChildrenChanged path:/live_nodes], has occurred - updating... (live nodes size: [4])
   [junit4]   2> 1444628 INFO  (zkCallback-1233-thread-1-processing-n:127.0.0.1:46561_solr) [n:127.0.0.1:46561_solr    ] o.a.s.c.c.ZkStateReader Updated live nodes from ZooKeeper... (4) -> (5)
   [junit4]   2> 1444628 INFO  (zkCallback-1232-thread-1-processing-n:127.0.0.1:37131_solr) [n:127.0.0.1:37131_solr    ] o.a.s.c.c.ZkStateReader Updated live nodes from ZooKeeper... (4) -> (5)
   [junit4]   2> 1444628 INFO  (zkCallback-1230-thread-1-processing-n:127.0.0.1:40485_solr) [n:127.0.0.1:40485_solr    ] o.a.s.c.c.ZkStateReader Updated live nodes from ZooKeeper... (4) -> (5)
   [junit4]   2> 1444628 INFO  (zkCallback-1229-thread-1-processing-n:127.0.0.1:44888_solr) [n:127.0.0.1:44888_solr    ] o.a.s.c.c.ZkStateReader Updated live nodes from ZooKeeper... (4) -> (5)
   [junit4]   2> 1444628 INFO  (zkCallback-1231-thread-1-processing-n:127.0.0.1:44933_solr) [n:127.0.0.1:44933_solr    ] o.a.s.c.c.ZkStateReader Updated live nodes from ZooKeeper... (4) -> (5)
   [junit4]   2> 1444671 INFO  (jetty-launcher-1207-thread-2) [n:127.0.0.1:40485_solr    ] o.a.s.c.CoreContainer Security conf doesn't exist. Skipping setup for authorization module.
   [junit4]   2> 1444672 INFO  (jetty-launcher-1207-thread-2) [n:127.0.0.1:40485_solr    ] o.a.s.c.CoreContainer Authentication plugin class obtained from system property 'authenticationPlugin': org.apache.solr.cloud.TestAuthenticationFramework$MockAuthenticationPlugin
   [junit4]   2> 1444672 INFO  (jetty-launcher-1207-thread-2) [n:127.0.0.1:40485_solr    ] o.a.s.c.CoreContainer Reconfiguring the shard handler factory and update shard handler.
   [junit4]   2> 1444672 INFO  (jetty-launcher-1207-thread-2) [n:127.0.0.1:40485_solr    ] o.a.s.h.c.HttpShardHandlerFactory Reconfiguring the default client with: org.apache.solr.cloud.TestAuthenticationFramework$MockAuthenticationPlugin$MockClientConfigurer@1457c53
   [junit4]   2> 1444672 INFO  (jetty-launcher-1207-thread-2) [n:127.0.0.1:40485_solr    ] o.a.s.u.UpdateShardHandler Reconfiguring the default client with: org.apache.solr.cloud.TestAuthenticationFramework$MockAuthenticationPlugin$MockClientConfigurer@1457c53
   [junit4]   2> 1444672 INFO  (jetty-launcher-1207-thread-2) [n:127.0.0.1:40485_solr    ] o.a.s.c.CorePropertiesLocator Looking for core definitions underneath /home/jenkins/workspace/Lucene-Solr-6.x-Linux/solr/build/solr-core/test/J1/temp/solr.cloud.TestAuthenticationFramework_178FF9B920E45E7C-001/tempDir-001/node2/.
   [junit4]   2> 1444672 INFO  (jetty-launcher-1207-thread-2) [n:127.0.0.1:40485_solr    ] o.a.s.c.CorePropertiesLocator Found 0 core definitions
   [junit4]   2> 1444673 INFO  (jetty-launcher-1207-thread-2) [n:127.0.0.1:40485_solr    ] o.a.s.s.SolrDispatchFilter user.dir=/home/jenkins/workspace/Lucene-Solr-6.x-Linux/solr/build/solr-core/test/J1
   [junit4]   2> 1444673 INFO  (jetty-launcher-1207-thread-2) [n:127.0.0.1:40485_solr    ] o.a.s.s.SolrDispatchFilter SolrDispatchFilter.init() done
   [junit4]   2> 1444673 INFO  (TEST-TestAuthenticationFramework.testCollectionCreateSearchDelete-seed#[178FF9B920E45E7C]) [    ] o.a.s.c.c.SolrZkClient Using default ZkCredentialsProvider
   [junit4]   2> 1444673 INFO  (TEST-TestAuthenticationFramework.testCollectionCreateSearchDelete-seed#[178FF9B920E45E7C]) [    ] o.a.s.c.c.ConnectionManager Waiting for client to connect to ZooKeeper
   [junit4]   2> 1444675 INFO  (zkCallback-1234-thread-1) [    ] o.a.s.c.c.ConnectionManager Watcher org.apache.solr.common.cloud.ConnectionManager@74ddcb name:ZooKeeperConnection Watcher:127.0.0.1:42570 got event WatchedEvent state:SyncConnected type:None path:null path:null type:None
   [junit4]   2> 1444676 INFO  (TEST-TestAuthenticationFramework.testCollectionCreateSearchDelete-seed#[178FF9B920E45E7C]) [    ] o.a.s.c.c.ConnectionManager Client is connected to ZooKeeper
   [junit4]   2> 1444676 INFO  (TEST-TestAuthenticationFramework.testCollectionCreateSearchDelete-seed#[178FF9B920E45E7C]) [    ] o.a.s.c.c.SolrZkClient Using default ZkACLProvider
   [junit4]   2> 1444678 INFO  (TEST-TestAuthenticationFramework.testCollectionCreateSearchDelete-seed#[178FF9B920E45E7C]) [    ] o.a.s.c.TestMiniSolrCloudCluster #### Stopping a server
   [junit4]   2> 1444678 INFO  (TEST-TestAuthenticationFramework.testCollectionCreateSearchDelete-seed#[178FF9B920E45E7C]) [    ] o.e.j.s.ServerConnector Stopped ServerConnector@1785a70{HTTP/1.1,[http/1.1]}{127.0.0.1:0}
   [junit4]   2> 1444679 INFO  (TEST-TestAuthenticationFramework.testCollectionCreateSearchDelete-seed#[178FF9B920E45E7C]) [    ] o.a.s.c.CoreContainer Shutting down CoreContainer instance=25384955
   [junit4]   2> 1444679 INFO  (TEST-TestAuthenticationFramework.testCollectionCreateSearchDelete-seed#[178FF9B920E45E7C]) [    ] o.a.s.c.ZkController Publish node=127.0.0.1:44933_solr as DOWN
   [junit4]   2> 1444684 ERROR (OverseerStateUpdate-95609382657130508-127.0.0.1:40485_solr-n_0000000000) [n:127.0.0.1:40485_solr    ] o.a.s.c.Overseer Exception in Overseer main queue loop
   [junit4]   2> java.lang.NullPointerException
   [junit4]   2> 	at org.apache.solr.cloud.Overseer$ClusterStateUpdater.run(Overseer.java:214)
   [junit4]   2> 	at java.lang.Thread.run(Thread.java:745)
   [junit4]   2> 1444687 INFO  (zkCallback-1231-thread-1-processing-n:127.0.0.1:44933_solr) [n:127.0.0.1:44933_solr    ] o.a.s.c.c.ZkStateReader A live node change: [WatchedEvent state:SyncConnected type:NodeChildrenChanged path:/live_nodes], has occurred - updating... (live nodes size: [5])
   [junit4]   2> 1444687 INFO  (zkCallback-1232-thread-1-processing-n:127.0.0.1:37131_solr) [n:127.0.0.1:37131_solr    ] o.a.s.c.c.ZkStateReader A live node change: [WatchedEvent state:SyncConnected type:NodeChildrenChanged path:/live_nodes], has occurred - updating... (live nodes size: [5])
   [junit4]   2> 1444687 INFO  (zkCallback-1230-thread-1-processing-n:127.0.0.1:40485_solr) [n:127.0.0.1:40485_solr    ] o.a.s.c.c.ZkStateReader A live node change: [WatchedEvent state:SyncConnected type:NodeChildrenChanged path:/live_nodes], has occurred - updating... (live nodes size: [5])
   [junit4]   2> 1444687 INFO  (zkCallback-1229-thread-2-processing-n:127.0.0.1:44888_solr) [n:127.0.0.1:44888_solr    ] o.a.s.c.c.ZkStateReader A live node change: [WatchedEvent state:SyncConnected type:NodeChildrenChanged path:/live_nodes], has occurred - updating... (live nodes size: [5])
   [junit4]   2> 1444687 INFO  (zkCallback-1233-thread-1-processing-n:127.0.0.1:46561_solr) [n:127.0.0.1:46561_solr    ] o.a.s.c.c.ZkStateReader A live node change: [WatchedEvent state:SyncConnected type:NodeChildrenChanged path:/live_nodes], has occurred - updating... (live nodes size: [5])
   [junit4]   2> 1444687 INFO  (zkCallback-1232-thread-1-processing-n:127.0.0.1:37131_solr) [n:127.0.0.1:37131_solr    ] o.a.s.c.c.ZkStateReader Updated live nodes from ZooKeeper... (5) -> (4)
   [junit4]   2> 1444687 INFO  (zkCallback-1229-thread-2-processing-n:127.0.0.1:44888_solr) [n:127.0.0.1:44888_solr    ] o.a.s.c.c.ZkStateReader Updated live nodes from ZooKeeper... (5) -> (4)
   [junit4]   2> 1444687 INFO  (zkCallback-1233-thread-1-processing-n:127.0.0.1:46561_solr) [n:127.0.0.1:46561_solr    ] o.a.s.c.c.ZkStateReader Updated live nodes from ZooKeeper... (5) -> (4)
   [junit4]   2> 1444687 INFO  (zkCallback-1229-thread-1-processing-n:127.0.0.1:44888_solr) [n:127.0.0.1:44888_solr    ] o.a.s.c.LeaderElector Watching path /overseer_elect/election/95609382657130510-127.0.0.1:37131_solr-n_0000000002 to know if I could be the leader
   [junit4]   2> 1444690 INFO  (OverseerStateUpdate-95609382657130508-127.0.0.1:40485_solr-n_0000000000) [n:127.0.0.1:40485_solr    ] o.a.s.c.c.ZkStateReader Updated live nodes from ZooKeeper... (5) -> (4)
   [junit4]   2> 1444690 INFO  (zkCallback-1230-thread-1-processing-n:127.0.0.1:40485_solr) [n:127.0.0.1:40485_solr    ] o.a.s.c.c.ZkStateReader Updated live nodes from ZooKeeper... (4) -> (4)
   [junit4]   2> 1444690 INFO  (OverseerStateUpdate-95609382657130508-127.0.0.1:40485_solr-n_0000000000) [n:127.0.0.1:40485_solr    ] o.a.s.c.Overseer processMessage: queueSize: 1, message = {
   [junit4]   2>   "operation":"downnode",
   [junit4]   2>   "node_name":"127.0.0.1:44933_solr"} current state version: 0
   [junit4]   2> 1444690 INFO  (OverseerStateUpdate-95609382657130508-127.0.0.1:40485_solr-n_0000000000) [n:127.0.0.1:40485_solr    ] o.a.s.c.o.NodeMutator DownNode state invoked for node: 127.0.0.1:44933_solr
   [junit4]   2> 1446187 WARN  (zkCallback-1231-thread-1-processing-n:127.0.0.1:44933_solr) [n:127.0.0.1:44933_solr    ] o.a.s.c.c.ZkStateReader ZooKeeper watch triggered, but Solr cannot talk to ZK: [KeeperErrorCode = Session expired for /live_nodes]
   [junit4]   2> 1446187 INFO  (TEST-TestAuthenticationFramework.testCollectionCreateSearchDelete-seed#[178FF9B920E45E7C]) [    ] o.e.j.s.h.ContextHandler Stopped o.e.j.s.ServletContextHandler@8b2130{/solr,null,UNAVAILABLE}
   [junit4]   2> 1446187 INFO  (TEST-TestAuthenticationFramework.testCollectionCreateSearchDelete-seed#[178FF9B920E45E7C]) [    ] o.a.s.c.TestMiniSolrCloudCluster #### Starting a server
   [junit4]   2> 1446189 INFO  (TEST-TestAuthenticationFramework.testCollectionCreateSearchDelete-seed#[178FF9B920E45E7C]) [    ] o.e.j.s.Server jetty-9.3.8.v20160314
   [junit4]   2> 1446190 INFO  (TEST-TestAuthenticationFramework.testCollectionCreateSearchDelete-seed#[178FF9B920E45E7C]) [    ] o.e.j.s.h.ContextHandler Started o.e.j.s.ServletContextHandler@47c422{/solr,null,AVAILABLE}
   [junit4]   2> 1446191 INFO  (TEST-TestAuthenticationFramework.testCollectionCreateSearchDelete-seed#[178FF9B920E45E7C]) [    ] o.e.j.s.ServerConnector Started ServerConnector@f132c2{HTTP/1.1,[http/1.1]}{127.0.0.1:34226}
   [junit4]   2> 1446191 INFO  (TEST-TestAuthenticationFramework.testCollectionCreateSearchDelete-seed#[178FF9B920E45E7C]) [    ] o.e.j.s.Server Started @1448028ms
   [junit4]   2> 1446191 INFO  (TEST-TestAuthenticationFramework.testCollectionCreateSearchDelete-seed#[178FF9B920E45E7C]) [    ] o.a.s.c.s.e.JettySolrRunner Jetty properties: {hostContext=/solr, hostPort=34226}
   [junit4]   2> 1446191 INFO  (TEST-TestAuthenticationFramework.testCollectionCreateSearchDelete-seed#[178FF9B920E45E7C]) [    ] o.a.s.s.SolrDispatchFilter SolrDispatchFilter.init(): sun.misc.Launcher$AppClassLoader@1d16e93
   [junit4]   2> 1446191 INFO  (TEST-TestAuthenticationFramework.testCollectionCreateSearchDelete-seed#[178FF9B920E45E7C]) [    ] o.a.s.c.SolrResourceLoader new SolrResourceLoader for directory: '/home/jenkins/workspace/Lucene-Solr-6.x-Linux/solr/build/solr-core/test/J1/temp/solr.cloud.TestAuthenticationFramework_178FF9B920E45E7C-001/tempDir-001/node6'
   [junit4]   2> 1446191 INFO  (TEST-TestAuthenticationFramework.testCollectionCreateSearchDelete-seed#[178FF9B920E45E7C]) [    ] o.a.s.c.SolrResourceLoader JNDI not configured for solr (NoInitialContextEx)
   [junit4]   2> 1446191 INFO  (TEST-TestAuthenticationFramework.testCollectionCreateSearchDelete-seed#[178FF9B920E45E7C]) [    ] o.a.s.c.SolrResourceLoader solr home defaulted to 'solr/' (could not find system property or JNDI)
   [junit4]   2> 1446192 INFO  (TEST-TestAuthenticationFramework.testCollectionCreateSearchDelete-seed#[178FF9B920E45E7C]) [    ] o.a.s.c.c.SolrZkClient Using default ZkCredentialsProvider
   [junit4]   2> 1446192 INFO  (TEST-TestAuthenticationFramework.testCollectionCreateSearchDelete-seed#[178FF9B920E45E7C]) [    ] o.a.s.c.c.ConnectionManager Waiting for client to connect to ZooKeeper
   [junit4]   2> 1446198 INFO  (zkCallback-1236-thread-1) [    ] o.a.s.c.c.ConnectionManager Watcher org.apache.solr.common.cloud.ConnectionManager@1f026ad name:ZooKeeperConnection Watcher:127.0.0.1:42570/solr got event WatchedEvent state:SyncConnected type:None path:null path:null type:None
   [junit4]   2> 1446198 INFO  (TEST-TestAuthenticationFramework.testCollectionCreateSearchDelete-seed#[178FF9B920E45E7C]) [    ] o.a.s.c.c.ConnectionManager Client is connected to ZooKeeper
   [junit4]   2> 1446198 INFO  (TEST-TestAuthenticationFramework.testCollectionCreateSearchDelete-seed#[178FF9B920E45E7C]) [    ] o.a.s.c.c.SolrZkClient Using default ZkACLProvider
   [junit4]   2> 1446198 INFO  (TEST-TestAuthenticationFramework.testCollectionCreateSearchDelete-seed#[178FF9B920E45E7C]) [    ] o.a.s.s.SolrDispatchFilter solr.xml found in ZooKeeper. Loading...
   [junit4]   2> 1446214 INFO  (TEST-TestAuthenticationFramework.testCollectionCreateSearchDelete-seed#[178FF9B920E45E7C]) [    ] o.a.s.c.CorePropertiesLocator Config-defined core root directory: /home/jenkins/workspace/Lucene-Solr-6.x-Linux/solr/build/solr-core/test/J1/temp/solr.cloud.TestAuthenticationFramework_178FF9B920E45E7C-001/tempDir-001/node6/.
   [junit4]   2> 1446214 INFO  (TEST-TestAuthenticationFramework.testCollectionCreateSearchDelete-seed#[178FF9B920E45E7C]) [    ] o.a.s.c.CoreContainer New CoreContainer 6962374
   [junit4]   2> 1446214 INFO  (TEST-TestAuthenticationFramework.testCollectionCreateSearchDelete-seed#[178FF9B920E45E7C]) [    ] o.a.s.c.CoreContainer Loading cores into CoreContainer [instanceDir=/home/jenkins/workspace/Lucene-Solr-6.x-Linux/solr/build/solr-core/test/J1/temp/solr.cloud.TestAuthenticationFramework_178FF9B920E45E7C-001/tempDir-001/node6]
   [junit4]   2> 1446214 WARN  (TEST-TestAuthenticationFramework.testCollectionCreateSearchDelete-seed#[178FF9B920E45E7C]) [    ] o.a.s.c.CoreContainer Couldn't add files from /home/jenkins/workspace/Lucene-Solr-6.x-Linux/solr/build/solr-core/test/J1/temp/solr.cloud.TestAuthenticationFramework_178FF9B920E45E7C-001/tempDir-001/node6/lib to classpath: /home/jenkins/workspace/Lucene-Solr-6.x-Linux/solr/build/solr-core/test/J1/temp/solr.cloud.TestAuthenticationFramework_178FF9B920E45E7C-001/tempDir-001/node6/lib
   [junit4]   2> 1446214 INFO  (TEST-TestAuthenticationFramework.testCollectionCreateSearchDelete-seed#[178FF9B920E45E7C]) [    ] o.a.s.h.c.HttpShardHandlerFactory created with socketTimeout : 90000,urlScheme : ,connTimeout : 15000,maxConnectionsPerHost : 20,maxConnections : 10000,corePoolSize : 0,maximumPoolSize : 2147483647,maxThreadIdleTime : 5,sizeOfQueue : -1,fairnessPolicy : false,useRetries : false,
   [junit4]   2> 1446215 INFO  (TEST-TestAuthenticationFramework.testCollectionCreateSearchDelete-seed#[178FF9B920E45E7C]) [    ] o.a.s.u.UpdateShardHandler Creating UpdateShardHandler HTTP client with params: socketTimeout=340000&connTimeout=45000&retry=true
   [junit4]   2> 1446215 INFO  (TEST-TestAuthenticationFramework.testCollectionCreateSearchDelete-seed#[178FF9B920E45E7C]) [    ] o.a.s.l.LogWatcher SLF4J impl is org.slf4j.impl.Log4jLoggerFactory
   [junit4]   2> 1446215 INFO  (TEST-TestAuthenticationFramework.testCollectionCreateSearchDelete-seed#[178FF9B920E45E7C]) [    ] o.a.s.l.LogWatcher Registering Log Listener [Log4j (org.slf4j.impl.Log4jLoggerFactory)]
   [junit4]   2> 1446215 INFO  (TEST-TestAuthenticationFramework.testCollectionCreateSearchDelete-seed#[178FF9B920E45E7C]) [    ] o.a.s.c.ZkContainer Zookeeper client=127.0.0.1:42570/solr
   [junit4]   2> 1446215 INFO  (TEST-TestAuthenticationFramework.testCollectionCreateSearchDelete-seed#[178FF9B920E45E7C]) [    ] o.a.s.c.ZkController zkHost includes chroot
   [junit4]   2> 1446215 INFO  (TEST-TestAuthenticationFramework.testCollectionCreateSearchDelete-seed#[178FF9B920E45E7C]) [    ] o.a.s.c.c.SolrZkClient Using default ZkCredentialsProvider
   [junit4]   2> 1446215 INFO  (TEST-TestAuthenticationFramework.testCollectionCreateSearchDelete-seed#[178FF9B920E45E7C]) [    ] o.a.s.c.c.ConnectionManager Waiting for client to connect to ZooKeeper
   [junit4]   2> 1446218 INFO  (zkCallback-1239-thread-1) [    ] o.a.s.c.c.ConnectionManager Watcher org.apache.solr.common.cloud.ConnectionManager@1c58a4a name:ZooKeeperConnection Watcher:127.0.0.1:42570 got event WatchedEvent state:SyncConnected type:None path:null path:null type:None
   [junit4]   2> 1446219 INFO  (TEST-TestAuthenticationFramework.testCollectionCreateSearchDelete-seed#[178FF9B920E45E7C]) [    ] o.a.s.c.c.ConnectionManager Client is connected to ZooKeeper
   [junit4]   2> 1446219 INFO  (TEST-TestAuthenticationFramework.testCollectionCreateSearchDelete-seed#[178FF9B920E45E7C]) [    ] o.a.s.c.c.SolrZkClient Using default ZkACLProvider
   [junit4]   2> 1446228 INFO  (TEST-TestAuthenticationFramework.testCollectionCreateSearchDelete-seed#[178FF9B920E45E7C]) [n:127.0.0.1:34226_solr    ] o.a.s.c.c.ConnectionManager Waiting for client to connect to ZooKeeper
   [junit4]   2> 1446237 INFO  (zkCallback-1240-thread-1-processing-n:127.0.0.1:34226_solr) [n:127.0.0.1:34226_solr    ] o.a.s.c.c.ConnectionManager Watcher org.apache.solr.common.cloud.ConnectionManager@1b35714 name:ZooKeeperConnection Watcher:127.0.0.1:42570/solr got event WatchedEvent state:SyncConnected type:None path:null path:null type:None
   [junit4]   2> 1446237 INFO  (TEST-TestAuthenticationFramework.testCollectionCreateSearchDelete-seed#[178FF9B920E45E7C]) [n:127.0.0.1:34226_solr    ] o.a.s.c.c.ConnectionManager Client is connected to ZooKeeper
   [junit4]   2> 1446259 INFO  (TEST-TestAuthenticationFramework.testCollectionCreateSearchDelete-seed#[178FF9B920E45E7C]) [n:127.0.0.1:34226_solr    ] o.a.s.c.c.ZkStateReader Updating cluster state from ZooKeeper... 
   [junit4]   2> 1446259 INFO  (TEST-TestAuthenticationFramework.testCollectionCreateSearchDelete-seed#[178FF9B920E45E7C]) [n:127.0.0.1:34226_solr    ] o.a.s.c.c.ZkStateReader Updated live nodes from ZooKeeper... (0) -> (4)
   [junit4]   2> 1446260 INFO  (TEST-TestAuthenticationFramework.testCollectionCreateSearchDelete-seed#[178FF9B920E45E7C]) [n:127.0.0.1:34226_solr    ] o.a.s.c.Overseer Overseer (id=null) closing
   [junit4]   2> 1446262 INFO  (TEST-TestAuthenticationFramework.testCollectionCreateSearchDelete-seed#[178FF9B920E45E7C]) [n:127.0.0.1:34226_solr    ] o.a.s.c.LeaderElector Joined leadership election with path: /overseer_elect/election/95609382657130515-127.0.0.1:34226_solr-n_0000000005
   [junit4]   2> 1446262 INFO  (TEST-TestAuthenticationFramework.testCollectionCreateSearchDelete-seed#[178FF9B920E45E7C]) [n:127.0.0.1:34226_solr    ] o.a.s.c.LeaderElector Watching path /overseer_elect/election/95609382657130507-127.0.0.1:44888_solr-n_0000000004 to know if I could be the leader
   [junit4]   2> 1446262 INFO  (TEST-TestAuthenticationFramework.testCollectionCreateSearchDelete-seed#[178FF9B920E45E7C]) [n:127.0.0.1:34226_solr    ] o.a.s.c.ZkController Publish node=127.0.0.1:34226_solr as DOWN
   [junit4]   2> 1446266 ERROR (OverseerStateUpdate-95609382657130508-127.0.0.1:40485_solr-n_0000000000) [n:127.0.0.1:40485_solr    ] o.a.s.c.Overseer Exception in Overseer main queue loop
   [junit4]   2> java.lang.NullPointerException
   [junit4]   2> 	at org.apache.solr.cloud.Overseer$ClusterStateUpdater.run(Overseer.java:214)
   [junit4]   2> 	at java.lang.Thread.run(Thread.java:745)
   [junit4]   2> 1446266 INFO  (OverseerStateUpdate-95609382657130508-127.0.0.1:40485_solr-n_0000000000) [n:127.0.0.1:40485_solr    ] o.a.s.c.c.ZkStateReader Updated live nodes from ZooKeeper... (4) -> (4)
   [junit4]   2> 1446266 INFO  (OverseerStateUpdate-95609382657130508-127.0.0.1:40485_solr-n_0000000000) [n:127.0.0.1:40485_solr    ] o.a.s.c.Overseer processMessage: queueSize: 1, message = {
   [junit4]   2>   "operation":"downnode",
   [junit4]   2>   "node_name":"127.0.0.1:34226_solr"} current state version: 0
   [junit4]   2> 1446266 INFO  (OverseerStateUpdate-95609382657130508-127.0.0.1:40485_solr-n_0000000000) [n:127.0.0.1:40485_solr    ] o.a.s.c.o.NodeMutator DownNode state invoked for node: 127.0.0.1:34226_solr
   [junit4]   2> 1447265 INFO  (TEST-TestAuthenticationFramework.testCollectionCreateSearchDelete-seed#[178FF9B920E45E7C]) [n:127.0.0.1:34226_solr    ] o.a.s.c.ZkController Register node as live in ZooKeeper:/live_nodes/127.0.0.1:34226_solr
   [junit4]   2> 1447270 INFO  (TEST-TestAuthenticationFramework.testCollectionCreateSearchDelete-seed#[178FF9B920E45E7C]) [n:127.0.0.1:34226_solr    ] o.a.s.c.c.SolrZkClient makePath: /live_nodes/127.0.0.1:34226_solr
   [junit4]   2> 1447295 INFO  (zkCallback-1230-thread-1-processing-n:127.0.0.1:40485_solr) [n:127.0.0.1:40485_solr    ] o.a.s.c.c.ZkStateReader A live node change: [WatchedEvent state:SyncConnected type:NodeChildrenChanged path:/live_nodes], has occurred - updating... (live nodes size: [4])
   [junit4]   2> 1447295 INFO  (zkCallback-1240-thread-1-processing-n:127.0.0.1:34226_solr) [n:127.0.0.1:34226_solr    ] o.a.s.c.c.ZkStateReader A live node change: [WatchedEvent state:SyncConnected type:NodeChildrenChanged path:/live_nodes], has occurred - updating... (live nodes size: [4])
   [junit4]   2> 1447295 INFO  (zkCallback-1232-thread-1-processing-n:127.0.0.1:37131_solr) [n:127.0.0.1:37131_solr    ] o.a.s.c.c.ZkStateReader A live node change: [WatchedEvent state:SyncConnected type:NodeChildrenChanged path:/live_nodes], has occurred - updating... (live nodes size: [4])
   [junit4]   2> 1447295 INFO  (zkCallback-1229-thread-1-processing-n:127.0.0.1:44888_solr) [n:127.0.0.1:44888_solr    ] o.a.s.c.c.ZkStateReader A live node change: [WatchedEvent state:SyncConnected type:NodeChildrenChanged path:/live_nodes], has occurred - updating... (live nodes size: [4])
   [junit4]   2> 1447295 INFO  (zkCallback-1233-thread-1-processing-n:127.0.0.1:46561_solr) [n:127.0.0.1:46561_solr    ] o.a.s.c.c.ZkStateReader A live node change: [WatchedEvent state:SyncConnected type:NodeChildrenChanged path:/live_nodes], has occurred - updating... (live nodes size: [4])
   [junit4]   2> 1447296 INFO  (zkCallback-1240-thread-1-processing-n:127.0.0.1:34226_solr) [n:127.0.0.1:34226_solr    ] o.a.s.c.c.ZkStateReader Updated live nodes from ZooKeeper... (4) -> (5)
   [junit4]   2> 1447296 INFO  (zkCallback-1232-thread-1-processing-n:127.0.0.1:37131_solr) [n:127.0.0.1:37131_solr    ] o.a.s.c.c.ZkStateReader Updated live nodes from ZooKeeper... (4) -> 

[...truncated too long message...]

INFO  (zkCallback-1504-thread-1-processing-n:127.0.0.1:45214_solr) [n:127.0.0.1:45214_solr    ] o.a.s.c.c.ZkStateReader A live node change: [WatchedEvent state:SyncConnected type:NodeChildrenChanged path:/live_nodes], has occurred - updating... (live nodes size: [3])
   [junit4]   2> 1588079 INFO  (zkCallback-1506-thread-1-processing-n:127.0.0.1:46862_solr) [n:127.0.0.1:46862_solr    ] o.a.s.c.c.ZkStateReader A live node change: [WatchedEvent state:SyncConnected type:NodeChildrenChanged path:/live_nodes], has occurred - updating... (live nodes size: [3])
   [junit4]   2> 1588079 INFO  (zkCallback-1505-thread-1-processing-n:127.0.0.1:41678_solr) [n:127.0.0.1:41678_solr    ] o.a.s.c.c.ZkStateReader A live node change: [WatchedEvent state:SyncConnected type:NodeChildrenChanged path:/live_nodes], has occurred - updating... (live nodes size: [3])
   [junit4]   2> 1588079 WARN  (zkCallback-1506-thread-1-processing-n:127.0.0.1:46862_solr) [n:127.0.0.1:46862_solr    ] o.a.s.c.c.ZkStateReader ZooKeeper watch triggered, but Solr cannot talk to ZK: [KeeperErrorCode = Session expired for /live_nodes]
   [junit4]   2> 1588080 INFO  (jetty-launcher-1490-thread-3) [    ] o.e.j.s.h.ContextHandler Stopped o.e.j.s.ServletContextHandler@15c337d{/solr,null,UNAVAILABLE}
   [junit4]   2> 1589579 WARN  (zkCallback-1504-thread-1-processing-n:127.0.0.1:45214_solr) [n:127.0.0.1:45214_solr    ] o.a.s.c.c.ZkStateReader ZooKeeper watch triggered, but Solr cannot talk to ZK: [KeeperErrorCode = Session expired for /live_nodes]
   [junit4]   2> 1589579 WARN  (zkCallback-1505-thread-1-processing-n:127.0.0.1:41678_solr) [n:127.0.0.1:41678_solr    ] o.a.s.c.c.ZkStateReader ZooKeeper watch triggered, but Solr cannot talk to ZK: [KeeperErrorCode = Session expired for /live_nodes]
   [junit4]   2> 1589579 WARN  (zkCallback-1505-thread-2-processing-n:127.0.0.1:41678_solr) [n:127.0.0.1:41678_solr    ] o.a.s.c.LeaderElector 
   [junit4]   2> org.apache.zookeeper.KeeperException$SessionExpiredException: KeeperErrorCode = Session expired for /overseer_elect/election
   [junit4]   2> 	at org.apache.zookeeper.KeeperException.create(KeeperException.java:127)
   [junit4]   2> 	at org.apache.zookeeper.KeeperException.create(KeeperException.java:51)
   [junit4]   2> 	at org.apache.zookeeper.ZooKeeper.getChildren(ZooKeeper.java:1472)
   [junit4]   2> 	at org.apache.solr.common.cloud.SolrZkClient$6.execute(SolrZkClient.java:331)
   [junit4]   2> 	at org.apache.solr.common.cloud.SolrZkClient$6.execute(SolrZkClient.java:328)
   [junit4]   2> 	at org.apache.solr.common.cloud.ZkCmdExecutor.retryOperation(ZkCmdExecutor.java:60)
   [junit4]   2> 	at org.apache.solr.common.cloud.SolrZkClient.getChildren(SolrZkClient.java:328)
   [junit4]   2> 	at org.apache.solr.cloud.LeaderElector.checkIfIamLeader(LeaderElector.java:105)
   [junit4]   2> 	at org.apache.solr.cloud.LeaderElector.access$200(LeaderElector.java:56)
   [junit4]   2> 	at org.apache.solr.cloud.LeaderElector$ElectionWatcher.process(LeaderElector.java:348)
   [junit4]   2> 	at org.apache.solr.common.cloud.SolrZkClient$3.lambda$process$0(SolrZkClient.java:266)
   [junit4]   2> 	at java.util.concurrent.Executors$RunnableAdapter.call(Executors.java:511)
   [junit4]   2> 	at java.util.concurrent.FutureTask.run(FutureTask.java:266)
   [junit4]   2> 	at org.apache.solr.common.util.ExecutorUtil$MDCAwareThreadPoolExecutor.lambda$execute$0(ExecutorUtil.java:229)
   [junit4]   2> 	at java.util.concurrent.ThreadPoolExecutor.runWorker(ThreadPoolExecutor.java:1142)
   [junit4]   2> 	at java.util.concurrent.ThreadPoolExecutor$Worker.run(ThreadPoolExecutor.java:617)
   [junit4]   2> 	at java.lang.Thread.run(Thread.java:745)
   [junit4]   2> 1589580 INFO  (jetty-launcher-1490-thread-1) [    ] o.e.j.s.h.ContextHandler Stopped o.e.j.s.ServletContextHandler@5ac2ea{/solr,null,UNAVAILABLE}
   [junit4]   2> 1589580 INFO  (jetty-launcher-1490-thread-2) [    ] o.e.j.s.h.ContextHandler Stopped o.e.j.s.ServletContextHandler@160c1a0{/solr,null,UNAVAILABLE}
   [junit4]   2> 1589581 INFO  (TEST-TestAuthenticationFramework.testErrorsInShutdown-seed#[178FF9B920E45E7C]) [    ] o.a.s.c.ZkTestServer connecting to 127.0.0.1:36605 36605
   [junit4]   2> 1594601 INFO  (Thread-3841) [    ] o.a.s.c.ZkTestServer connecting to 127.0.0.1:36605 36605
   [junit4]   2> 1594602 WARN  (Thread-3841) [    ] o.a.s.c.ZkTestServer Watch limit violations: 
   [junit4]   2> Maximum concurrent create/delete watches above limit:
   [junit4]   2> 
   [junit4]   2> 	3	/solr/aliases.json
   [junit4]   2> 	3	/solr/security.json
   [junit4]   2> 
   [junit4]   2> Maximum concurrent data watches above limit:
   [junit4]   2> 
   [junit4]   2> 	3	/solr/clusterstate.json
   [junit4]   2> 
   [junit4]   2> Maximum concurrent children watches above limit:
   [junit4]   2> 
   [junit4]   2> 	3	/solr/live_nodes
   [junit4]   2> 	3	/solr/collections
   [junit4]   2> 
   [junit4]   2> NOTE: leaving temporary files on disk at: /home/jenkins/workspace/Lucene-Solr-6.x-Linux/solr/build/solr-core/test/J1/temp/solr.cloud.TestAuthenticationFramework_178FF9B920E45E7C-001
   [junit4]   2> NOTE: test params are: codec=Asserting(Lucene60): {quad_l1=PostingsFormat(name=LuceneVarGapFixedInterval), range_facet_l_dv=PostingsFormat(name=Memory doPackFST= true), _version_=PostingsFormat(name=MockRandom), multiDefault=PostingsFormat(name=LuceneFixedGap), intDefault=PostingsFormat(name=MockRandom), id=PostingsFormat(name=Memory doPackFST= true), range_facet_i_dv=PostingsFormat(name=LuceneFixedGap), range_facet_l=PostingsFormat(name=LuceneFixedGap), timestamp=PostingsFormat(name=LuceneFixedGap), odd_l1=PostingsFormat(name=LuceneVarGapFixedInterval)}, docValues:{range_facet_l_dv=DocValuesFormat(name=Lucene54), range_facet_i_dv=DocValuesFormat(name=Memory), timestamp=DocValuesFormat(name=Memory)}, maxPointsInLeafNode=1542, maxMBSortInHeap=6.938026731415992, sim=RandomSimilarity(queryNorm=true,coord=yes): {}, locale=es-UY, timezone=Etc/GMT+5
   [junit4]   2> NOTE: Linux 4.2.0-34-generic i386/Oracle Corporation 1.8.0_72 (32-bit)/cpus=12,threads=1,free=82430472,total=536870912
   [junit4]   2> NOTE: All tests run in this JVM: [CdcrReplicationHandlerTest, TestCoreContainer, TestCustomSort, CoreAdminCreateDiscoverTest, SolrPluginUtilsTest, SolrCmdDistributorTest, UniqFieldsUpdateProcessorFactoryTest, TestQuerySenderNoQuery, TestReRankQParserPlugin, AliasIntegrationTest, DirectoryFactoryTest, DocumentBuilderTest, DeleteShardTest, ShardSplitTest, TestRandomRequestDistribution, TimeZoneUtilsTest, JavabinLoaderTest, SpatialFilterTest, DistanceFunctionTest, TestPerFieldSimilarityWithDefaultOverride, TestReplicationHandlerBackup, TestFastLRUCache, LoggingHandlerTest, DocValuesTest, TestWordDelimiterFilterFactory, FastVectorHighlighterTest, FileUtilsTest, ClusterStateUpdateTest, DistributedTermsComponentTest, TestSolrConfigHandler, ExplicitHLLTest, CloudMLTQParserTest, TestExpandComponent, MinimalSchemaTest, LeaderFailoverAfterPartitionTest, TestQueryTypes, SpellPossibilityIteratorTest, SpellCheckCollatorTest, HdfsRecoveryZkTest, TestSimpleTrackingShardHandler, TestLRUStatsCache, ZkStateReaderTest, TestImplicitCoreProperties, TestConfigSetProperties, UpdateRequestProcessorFactoryTest, DirectSolrSpellCheckerTest, DistribDocExpirationUpdateProcessorTest, SolrIndexConfigTest, MigrateRouteKeyTest, TestRequestForwarding, TestCloudManagedSchema, TestDistribDocBasedVersion, SimplePostToolTest, TestUseDocValuesAsStored, ConvertedLegacyTest, SchemaVersionSpecificBehaviorTest, TestQuerySenderListener, TestSolrQueryParserDefaultOperatorResource, TestLeaderElectionZkExpiry, RuleEngineTest, TestSearcherReuse, SuggestComponentContextFilterQueryTest, TestSizeLimitedDistributedMap, CSVRequestHandlerTest, BlockDirectoryTest, HdfsWriteToMultipleCollectionsTest, DistributedVersionInfoTest, TestStressUserVersions, OpenCloseCoreStressTest, TestDistributedGrouping, ChangedSchemaMergeTest, ChaosMonkeySafeLeaderTest, TestCollationFieldDocValues, AsyncMigrateRouteKeyTest, CollectionsAPIDistributedZkTest, EnumFieldTest, MBeansHandlerTest, CheckHdfsIndexTest, RankQueryTest, DistributedIntervalFacetingTest, DOMUtilTest, BigEndianAscendingWordDeserializerTest, TestRawTransformer, TestSolr4Spatial2, TestPartialUpdateDeduplication, AnalyticsQueryTest, DistributedMLTComponentTest, DeleteInactiveReplicaTest, SpellCheckComponentTest, OverseerStatusTest, TestSortByMinMaxFunction, SolrIndexSplitterTest, HLLUtilTest, CollectionsAPIAsyncDistributedZkTest, ConnectionManagerTest, CustomCollectionTest, RestartWhileUpdatingTest, RollingRestartTest, SharedFSAutoReplicaFailoverUtilsTest, SimpleCollectionCreateDeleteTest, TestAuthenticationFramework]
   [junit4] Completed [444/582 (1!)] on J1 in 151.40s, 8 tests, 1 error <<< FAILURES!

[...truncated 466 lines...]
BUILD FAILED
/home/jenkins/workspace/Lucene-Solr-6.x-Linux/build.xml:740: The following error occurred while executing this line:
/home/jenkins/workspace/Lucene-Solr-6.x-Linux/build.xml:684: The following error occurred while executing this line:
/home/jenkins/workspace/Lucene-Solr-6.x-Linux/build.xml:59: The following error occurred while executing this line:
/home/jenkins/workspace/Lucene-Solr-6.x-Linux/solr/build.xml:233: The following error occurred while executing this line:
/home/jenkins/workspace/Lucene-Solr-6.x-Linux/solr/common-build.xml:529: The following error occurred while executing this line:
/home/jenkins/workspace/Lucene-Solr-6.x-Linux/lucene/common-build.xml:1457: The following error occurred while executing this line:
/home/jenkins/workspace/Lucene-Solr-6.x-Linux/lucene/common-build.xml:1014: There were test failures: 582 suites (10 ignored), 2331 tests, 1 error, 115 ignored (70 assumptions) [seed: 178FF9B920E45E7C]

Total time: 52 minutes 8 seconds
Build step 'Invoke Ant' marked build as failure
Archiving artifacts
[WARNINGS] Skipping publisher since build result is FAILURE
Recording test results
Email was triggered for: Failure - Any
Sending email for trigger: Failure - Any



Mime
View raw message