lucene-dev mailing list archives

Site index · List index
Message view « Date » · « Thread »
Top « Date » · « Thread »
From Policeman Jenkins Server <jenk...@thetaphi.de>
Subject [JENKINS] Lucene-Solr-6.x-Solaris (64bit/jdk1.8.0) - Build # 23 - Failure!
Date Mon, 21 Mar 2016 21:04:07 GMT
Build: http://jenkins.thetaphi.de/job/Lucene-Solr-6.x-Solaris/23/
Java: 64bit/jdk1.8.0 -XX:-UseCompressedOops -XX:+UseSerialGC

1 tests failed.
FAILED:  org.apache.solr.update.AutoCommitTest.testMaxDocs

Error Message:
Exception during query

Stack Trace:
java.lang.RuntimeException: Exception during query
	at __randomizedtesting.SeedInfo.seed([5E6A38C7C7029FF9:E7EBEE18EBE89B73]:0)
	at org.apache.solr.SolrTestCaseJ4.assertQ(SolrTestCaseJ4.java:765)
	at org.apache.solr.update.AutoCommitTest.testMaxDocs(AutoCommitTest.java:198)
	at sun.reflect.NativeMethodAccessorImpl.invoke0(Native Method)
	at sun.reflect.NativeMethodAccessorImpl.invoke(NativeMethodAccessorImpl.java:62)
	at sun.reflect.DelegatingMethodAccessorImpl.invoke(DelegatingMethodAccessorImpl.java:43)
	at java.lang.reflect.Method.invoke(Method.java:498)
	at com.carrotsearch.randomizedtesting.RandomizedRunner.invoke(RandomizedRunner.java:1764)
	at com.carrotsearch.randomizedtesting.RandomizedRunner$8.evaluate(RandomizedRunner.java:871)
	at com.carrotsearch.randomizedtesting.RandomizedRunner$9.evaluate(RandomizedRunner.java:907)
	at com.carrotsearch.randomizedtesting.RandomizedRunner$10.evaluate(RandomizedRunner.java:921)
	at com.carrotsearch.randomizedtesting.rules.SystemPropertiesRestoreRule$1.evaluate(SystemPropertiesRestoreRule.java:57)
	at org.apache.lucene.util.TestRuleSetupTeardownChained$1.evaluate(TestRuleSetupTeardownChained.java:49)
	at org.apache.lucene.util.AbstractBeforeAfterRule$1.evaluate(AbstractBeforeAfterRule.java:45)
	at org.apache.lucene.util.TestRuleThreadAndTestName$1.evaluate(TestRuleThreadAndTestName.java:48)
	at org.apache.lucene.util.TestRuleIgnoreAfterMaxFailures$1.evaluate(TestRuleIgnoreAfterMaxFailures.java:64)
	at org.apache.lucene.util.TestRuleMarkFailure$1.evaluate(TestRuleMarkFailure.java:47)
	at com.carrotsearch.randomizedtesting.rules.StatementAdapter.evaluate(StatementAdapter.java:36)
	at com.carrotsearch.randomizedtesting.ThreadLeakControl$StatementRunner.run(ThreadLeakControl.java:367)
	at com.carrotsearch.randomizedtesting.ThreadLeakControl.forkTimeoutingTask(ThreadLeakControl.java:809)
	at com.carrotsearch.randomizedtesting.ThreadLeakControl$3.evaluate(ThreadLeakControl.java:460)
	at com.carrotsearch.randomizedtesting.RandomizedRunner.runSingleTest(RandomizedRunner.java:880)
	at com.carrotsearch.randomizedtesting.RandomizedRunner$5.evaluate(RandomizedRunner.java:781)
	at com.carrotsearch.randomizedtesting.RandomizedRunner$6.evaluate(RandomizedRunner.java:816)
	at com.carrotsearch.randomizedtesting.RandomizedRunner$7.evaluate(RandomizedRunner.java:827)
	at com.carrotsearch.randomizedtesting.rules.StatementAdapter.evaluate(StatementAdapter.java:36)
	at com.carrotsearch.randomizedtesting.rules.SystemPropertiesRestoreRule$1.evaluate(SystemPropertiesRestoreRule.java:57)
	at org.apache.lucene.util.AbstractBeforeAfterRule$1.evaluate(AbstractBeforeAfterRule.java:45)
	at com.carrotsearch.randomizedtesting.rules.StatementAdapter.evaluate(StatementAdapter.java:36)
	at org.apache.lucene.util.TestRuleStoreClassName$1.evaluate(TestRuleStoreClassName.java:41)
	at com.carrotsearch.randomizedtesting.rules.NoShadowingOrOverridesOnMethodsRule$1.evaluate(NoShadowingOrOverridesOnMethodsRule.java:40)
	at com.carrotsearch.randomizedtesting.rules.NoShadowingOrOverridesOnMethodsRule$1.evaluate(NoShadowingOrOverridesOnMethodsRule.java:40)
	at com.carrotsearch.randomizedtesting.rules.StatementAdapter.evaluate(StatementAdapter.java:36)
	at com.carrotsearch.randomizedtesting.rules.StatementAdapter.evaluate(StatementAdapter.java:36)
	at com.carrotsearch.randomizedtesting.rules.StatementAdapter.evaluate(StatementAdapter.java:36)
	at org.apache.lucene.util.TestRuleAssertionsRequired$1.evaluate(TestRuleAssertionsRequired.java:53)
	at org.apache.lucene.util.TestRuleMarkFailure$1.evaluate(TestRuleMarkFailure.java:47)
	at org.apache.lucene.util.TestRuleIgnoreAfterMaxFailures$1.evaluate(TestRuleIgnoreAfterMaxFailures.java:64)
	at org.apache.lucene.util.TestRuleIgnoreTestSuites$1.evaluate(TestRuleIgnoreTestSuites.java:54)
	at com.carrotsearch.randomizedtesting.rules.StatementAdapter.evaluate(StatementAdapter.java:36)
	at com.carrotsearch.randomizedtesting.ThreadLeakControl$StatementRunner.run(ThreadLeakControl.java:367)
	at java.lang.Thread.run(Thread.java:745)
Caused by: java.lang.RuntimeException: REQUEST FAILED: xpath=//result[@numFound=1]
	xml response was: <?xml version="1.0" encoding="UTF-8"?>
<response>
<lst name="responseHeader"><int name="status">0</int><int name="QTime">0</int></lst><result name="response" numFound="0" start="0"></result>
</response>

	request was:q=id:14&qt=standard&start=0&rows=20&version=2.2
	at org.apache.solr.SolrTestCaseJ4.assertQ(SolrTestCaseJ4.java:758)
	... 40 more




Build Log:
[...truncated 11509 lines...]
   [junit4] Suite: org.apache.solr.update.AutoCommitTest
   [junit4]   2> Creating dataDir: /export/home/jenkins/workspace/Lucene-Solr-6.x-Solaris/solr/build/solr-core/test/J0/temp/solr.update.AutoCommitTest_5E6A38C7C7029FF9-001/init-core-data-001
   [junit4]   2> 1585042 INFO  (SUITE-AutoCommitTest-seed#[5E6A38C7C7029FF9]-worker) [    ] o.a.s.SolrTestCaseJ4 Randomized ssl (false) and clientAuth (false)
   [junit4]   2> 1585042 INFO  (SUITE-AutoCommitTest-seed#[5E6A38C7C7029FF9]-worker) [    ] o.a.s.SolrTestCaseJ4 ####initCore
   [junit4]   2> 1585042 INFO  (SUITE-AutoCommitTest-seed#[5E6A38C7C7029FF9]-worker) [    ] o.a.s.c.SolrResourceLoader new SolrResourceLoader for directory: '/export/home/jenkins/workspace/Lucene-Solr-6.x-Solaris/solr/core/src/test-files/solr/collection1'
   [junit4]   2> 1585042 INFO  (SUITE-AutoCommitTest-seed#[5E6A38C7C7029FF9]-worker) [    ] o.a.s.c.SolrResourceLoader JNDI not configured for solr (NoInitialContextEx)
   [junit4]   2> 1585042 INFO  (SUITE-AutoCommitTest-seed#[5E6A38C7C7029FF9]-worker) [    ] o.a.s.c.SolrResourceLoader using system property solr.solr.home: /export/home/jenkins/workspace/Lucene-Solr-6.x-Solaris/solr/core/src/test-files/solr
   [junit4]   2> 1585043 INFO  (SUITE-AutoCommitTest-seed#[5E6A38C7C7029FF9]-worker) [    ] o.a.s.c.SolrResourceLoader Adding 'file:/export/home/jenkins/workspace/Lucene-Solr-6.x-Solaris/solr/core/src/test-files/solr/collection1/lib/classes/' to classloader
   [junit4]   2> 1585043 INFO  (SUITE-AutoCommitTest-seed#[5E6A38C7C7029FF9]-worker) [    ] o.a.s.c.SolrResourceLoader Adding 'file:/export/home/jenkins/workspace/Lucene-Solr-6.x-Solaris/solr/core/src/test-files/solr/collection1/lib/README' to classloader
   [junit4]   2> 1585073 INFO  (SUITE-AutoCommitTest-seed#[5E6A38C7C7029FF9]-worker) [    ] o.a.s.c.SolrConfig current version of requestparams : -1
   [junit4]   2> 1585102 WARN  (SUITE-AutoCommitTest-seed#[5E6A38C7C7029FF9]-worker) [    ] o.a.s.c.Config Beginning with Solr 5.5, <mergePolicy> is deprecated, use <mergePolicyFactory> instead.
   [junit4]   2> 1585104 INFO  (SUITE-AutoCommitTest-seed#[5E6A38C7C7029FF9]-worker) [    ] o.a.s.c.SolrConfig Using Lucene MatchVersion: 6.1.0
   [junit4]   2> 1585121 INFO  (SUITE-AutoCommitTest-seed#[5E6A38C7C7029FF9]-worker) [    ] o.a.s.c.SolrConfig Loaded SolrConfig: solrconfig.xml
   [junit4]   2> 1585126 INFO  (SUITE-AutoCommitTest-seed#[5E6A38C7C7029FF9]-worker) [    ] o.a.s.s.IndexSchema [null] Schema name=test
   [junit4]   2> 1585203 INFO  (SUITE-AutoCommitTest-seed#[5E6A38C7C7029FF9]-worker) [    ] o.a.s.s.OpenExchangeRatesOrgProvider Initialized with rates=open-exchange-rates.json, refreshInterval=1440.
   [junit4]   2> 1585209 INFO  (SUITE-AutoCommitTest-seed#[5E6A38C7C7029FF9]-worker) [    ] o.a.s.s.IndexSchema default search field in schema is text
   [junit4]   2> 1585209 INFO  (SUITE-AutoCommitTest-seed#[5E6A38C7C7029FF9]-worker) [    ] o.a.s.s.IndexSchema unique key field: id
   [junit4]   2> 1585213 INFO  (SUITE-AutoCommitTest-seed#[5E6A38C7C7029FF9]-worker) [    ] o.a.s.s.FileExchangeRateProvider Reloading exchange rates from file currency.xml
   [junit4]   2> 1585215 INFO  (SUITE-AutoCommitTest-seed#[5E6A38C7C7029FF9]-worker) [    ] o.a.s.s.FileExchangeRateProvider Reloading exchange rates from file currency.xml
   [junit4]   2> 1585217 INFO  (SUITE-AutoCommitTest-seed#[5E6A38C7C7029FF9]-worker) [    ] o.a.s.s.OpenExchangeRatesOrgProvider Reloading exchange rates from open-exchange-rates.json
   [junit4]   2> 1585217 INFO  (SUITE-AutoCommitTest-seed#[5E6A38C7C7029FF9]-worker) [    ] o.a.s.s.OpenExchangeRatesOrgProvider Reloading exchange rates from open-exchange-rates.json
   [junit4]   2> 1585217 INFO  (SUITE-AutoCommitTest-seed#[5E6A38C7C7029FF9]-worker) [    ] o.a.s.c.SolrResourceLoader JNDI not configured for solr (NoInitialContextEx)
   [junit4]   2> 1585217 INFO  (SUITE-AutoCommitTest-seed#[5E6A38C7C7029FF9]-worker) [    ] o.a.s.c.SolrResourceLoader using system property solr.solr.home: /export/home/jenkins/workspace/Lucene-Solr-6.x-Solaris/solr/core/src/test-files/solr
   [junit4]   2> 1585218 INFO  (SUITE-AutoCommitTest-seed#[5E6A38C7C7029FF9]-worker) [    ] o.a.s.c.SolrResourceLoader new SolrResourceLoader for directory: '/export/home/jenkins/workspace/Lucene-Solr-6.x-Solaris/solr/core/src/test-files/solr'
   [junit4]   2> 1585218 INFO  (SUITE-AutoCommitTest-seed#[5E6A38C7C7029FF9]-worker) [    ] o.a.s.c.SolrResourceLoader JNDI not configured for solr (NoInitialContextEx)
   [junit4]   2> 1585218 INFO  (SUITE-AutoCommitTest-seed#[5E6A38C7C7029FF9]-worker) [    ] o.a.s.c.SolrResourceLoader using system property solr.solr.home: /export/home/jenkins/workspace/Lucene-Solr-6.x-Solaris/solr/core/src/test-files/solr
   [junit4]   2> 1585218 INFO  (SUITE-AutoCommitTest-seed#[5E6A38C7C7029FF9]-worker) [    ] o.a.s.c.CoreContainer New CoreContainer 1966804216
   [junit4]   2> 1585218 INFO  (SUITE-AutoCommitTest-seed#[5E6A38C7C7029FF9]-worker) [    ] o.a.s.c.CoreContainer Loading cores into CoreContainer [instanceDir=/export/home/jenkins/workspace/Lucene-Solr-6.x-Solaris/solr/core/src/test-files/solr]
   [junit4]   2> 1585218 WARN  (SUITE-AutoCommitTest-seed#[5E6A38C7C7029FF9]-worker) [    ] o.a.s.c.CoreContainer Couldn't add files from /export/home/jenkins/workspace/Lucene-Solr-6.x-Solaris/solr/core/src/test-files/solr/lib to classpath: /export/home/jenkins/workspace/Lucene-Solr-6.x-Solaris/solr/core/src/test-files/solr/lib
   [junit4]   2> 1585218 INFO  (SUITE-AutoCommitTest-seed#[5E6A38C7C7029FF9]-worker) [    ] o.a.s.h.c.HttpShardHandlerFactory created with socketTimeout : 600000,connTimeout : 60000,maxConnectionsPerHost : 20,maxConnections : 10000,corePoolSize : 0,maximumPoolSize : 2147483647,maxThreadIdleTime : 5,sizeOfQueue : -1,fairnessPolicy : false,useRetries : false,
   [junit4]   2> 1585225 INFO  (SUITE-AutoCommitTest-seed#[5E6A38C7C7029FF9]-worker) [    ] o.a.s.u.UpdateShardHandler Creating UpdateShardHandler HTTP client with params: socketTimeout=30000&connTimeout=30000&retry=true
   [junit4]   2> 1585226 INFO  (SUITE-AutoCommitTest-seed#[5E6A38C7C7029FF9]-worker) [    ] o.a.s.l.LogWatcher SLF4J impl is org.slf4j.impl.Log4jLoggerFactory
   [junit4]   2> 1585226 INFO  (SUITE-AutoCommitTest-seed#[5E6A38C7C7029FF9]-worker) [    ] o.a.s.l.LogWatcher Registering Log Listener [Log4j (org.slf4j.impl.Log4jLoggerFactory)]
   [junit4]   2> 1585226 INFO  (SUITE-AutoCommitTest-seed#[5E6A38C7C7029FF9]-worker) [    ] o.a.s.c.CoreContainer Security conf doesn't exist. Skipping setup for authorization module.
   [junit4]   2> 1585226 INFO  (SUITE-AutoCommitTest-seed#[5E6A38C7C7029FF9]-worker) [    ] o.a.s.c.CoreContainer No authentication plugin used.
   [junit4]   2> 1585227 INFO  (SUITE-AutoCommitTest-seed#[5E6A38C7C7029FF9]-worker) [    ] o.a.s.c.CoreDescriptor Created CoreDescriptor: {name=collection1, config=solrconfig.xml, transient=false, schema=schema.xml, loadOnStartup=true, configSetProperties=configsetprops.json, collection=collection1, dataDir=/export/home/jenkins/workspace/Lucene-Solr-6.x-Solaris/solr/build/solr-core/test/J0/temp/solr.update.AutoCommitTest_5E6A38C7C7029FF9-001/init-core-data-001, shard=shard1}
   [junit4]   2> 1585228 INFO  (coreLoadExecutor-4862-thread-1) [    ] o.a.s.c.SolrResourceLoader new SolrResourceLoader for directory: '/export/home/jenkins/workspace/Lucene-Solr-6.x-Solaris/solr/core/src/test-files/solr/collection1'
   [junit4]   2> 1585229 INFO  (coreLoadExecutor-4862-thread-1) [    ] o.a.s.c.SolrResourceLoader JNDI not configured for solr (NoInitialContextEx)
   [junit4]   2> 1585229 INFO  (coreLoadExecutor-4862-thread-1) [    ] o.a.s.c.SolrResourceLoader using system property solr.solr.home: /export/home/jenkins/workspace/Lucene-Solr-6.x-Solaris/solr/core/src/test-files/solr
   [junit4]   2> 1585229 INFO  (coreLoadExecutor-4862-thread-1) [    ] o.a.s.c.SolrResourceLoader Adding 'file:/export/home/jenkins/workspace/Lucene-Solr-6.x-Solaris/solr/core/src/test-files/solr/collection1/lib/classes/' to classloader
   [junit4]   2> 1585229 INFO  (coreLoadExecutor-4862-thread-1) [    ] o.a.s.c.SolrResourceLoader Adding 'file:/export/home/jenkins/workspace/Lucene-Solr-6.x-Solaris/solr/core/src/test-files/solr/collection1/lib/README' to classloader
   [junit4]   2> 1585252 INFO  (coreLoadExecutor-4862-thread-1) [    ] o.a.s.c.SolrConfig current version of requestparams : -1
   [junit4]   2> 1585260 WARN  (coreLoadExecutor-4862-thread-1) [    ] o.a.s.c.Config Beginning with Solr 5.5, <mergePolicy> is deprecated, use <mergePolicyFactory> instead.
   [junit4]   2> 1585262 INFO  (coreLoadExecutor-4862-thread-1) [    ] o.a.s.c.SolrConfig Using Lucene MatchVersion: 6.1.0
   [junit4]   2> 1585293 INFO  (coreLoadExecutor-4862-thread-1) [    ] o.a.s.c.SolrConfig Loaded SolrConfig: solrconfig.xml
   [junit4]   2> 1585298 INFO  (coreLoadExecutor-4862-thread-1) [    ] o.a.s.s.IndexSchema [collection1] Schema name=test
   [junit4]   2> 1585385 INFO  (coreLoadExecutor-4862-thread-1) [    ] o.a.s.s.OpenExchangeRatesOrgProvider Initialized with rates=open-exchange-rates.json, refreshInterval=1440.
   [junit4]   2> 1585389 INFO  (coreLoadExecutor-4862-thread-1) [    ] o.a.s.s.IndexSchema default search field in schema is text
   [junit4]   2> 1585390 INFO  (coreLoadExecutor-4862-thread-1) [    ] o.a.s.s.IndexSchema unique key field: id
   [junit4]   2> 1585394 INFO  (coreLoadExecutor-4862-thread-1) [    ] o.a.s.s.FileExchangeRateProvider Reloading exchange rates from file currency.xml
   [junit4]   2> 1585395 INFO  (coreLoadExecutor-4862-thread-1) [    ] o.a.s.s.FileExchangeRateProvider Reloading exchange rates from file currency.xml
   [junit4]   2> 1585397 INFO  (coreLoadExecutor-4862-thread-1) [    ] o.a.s.s.OpenExchangeRatesOrgProvider Reloading exchange rates from open-exchange-rates.json
   [junit4]   2> 1585397 INFO  (coreLoadExecutor-4862-thread-1) [    ] o.a.s.s.OpenExchangeRatesOrgProvider Reloading exchange rates from open-exchange-rates.json
   [junit4]   2> 1585399 INFO  (coreLoadExecutor-4862-thread-1) [    ] o.a.s.c.ConfigSetProperties Did not find ConfigSet properties, assuming default properties: Can't find resource 'configsetprops.json' in classpath or '/export/home/jenkins/workspace/Lucene-Solr-6.x-Solaris/solr/core/src/test-files/solr/collection1'
   [junit4]   2> 1585399 INFO  (coreLoadExecutor-4862-thread-1) [    ] o.a.s.c.CoreContainer Creating SolrCore 'collection1' using configuration from instancedir /export/home/jenkins/workspace/Lucene-Solr-6.x-Solaris/solr/core/src/test-files/solr/collection1
   [junit4]   2> 1585399 INFO  (coreLoadExecutor-4862-thread-1) [    x:collection1] o.a.s.c.SolrCore org.apache.solr.core.MockDirectoryFactory
   [junit4]   2> 1585400 INFO  (coreLoadExecutor-4862-thread-1) [    x:collection1] o.a.s.c.SolrCore [[collection1] ] Opening new SolrCore at [/export/home/jenkins/workspace/Lucene-Solr-6.x-Solaris/solr/core/src/test-files/solr/collection1], dataDir=[/export/home/jenkins/workspace/Lucene-Solr-6.x-Solaris/solr/build/solr-core/test/J0/temp/solr.update.AutoCommitTest_5E6A38C7C7029FF9-001/init-core-data-001/]
   [junit4]   2> 1585400 INFO  (coreLoadExecutor-4862-thread-1) [    x:collection1] o.a.s.c.JmxMonitoredMap JMX monitoring is enabled. Adding Solr mbeans to JMX Server: com.sun.jmx.mbeanserver.JmxMBeanServer@759dfd56
   [junit4]   2> 1585400 INFO  (coreLoadExecutor-4862-thread-1) [    x:collection1] o.a.s.c.CachingDirectoryFactory return new directory for /export/home/jenkins/workspace/Lucene-Solr-6.x-Solaris/solr/build/solr-core/test/J0/temp/solr.update.AutoCommitTest_5E6A38C7C7029FF9-001/init-core-data-001
   [junit4]   2> 1585400 INFO  (coreLoadExecutor-4862-thread-1) [    x:collection1] o.a.s.c.SolrCore New index directory detected: old=null new=/export/home/jenkins/workspace/Lucene-Solr-6.x-Solaris/solr/build/solr-core/test/J0/temp/solr.update.AutoCommitTest_5E6A38C7C7029FF9-001/init-core-data-001/index/
   [junit4]   2> 1585400 WARN  (coreLoadExecutor-4862-thread-1) [    x:collection1] o.a.s.c.SolrCore [collection1] Solr index directory '/export/home/jenkins/workspace/Lucene-Solr-6.x-Solaris/solr/build/solr-core/test/J0/temp/solr.update.AutoCommitTest_5E6A38C7C7029FF9-001/init-core-data-001/index' doesn't exist. Creating new index...
   [junit4]   2> 1585400 INFO  (coreLoadExecutor-4862-thread-1) [    x:collection1] o.a.s.c.CachingDirectoryFactory return new directory for /export/home/jenkins/workspace/Lucene-Solr-6.x-Solaris/solr/build/solr-core/test/J0/temp/solr.update.AutoCommitTest_5E6A38C7C7029FF9-001/init-core-data-001/index
   [junit4]   2> 1585401 INFO  (coreLoadExecutor-4862-thread-1) [    x:collection1] o.a.s.u.RandomMergePolicy RandomMergePolicy wrapping class org.apache.lucene.index.LogDocMergePolicy: [LogDocMergePolicy: minMergeSize=1000, mergeFactor=25, maxMergeSize=9223372036854775807, maxMergeSizeForForcedMerge=9223372036854775807, calibrateSizeByDeletes=false, maxMergeDocs=2147483647, maxCFSSegmentSizeMB=8.796093022207999E12, noCFSRatio=0.0]
   [junit4]   2> 1585401 INFO  (coreLoadExecutor-4862-thread-1) [    x:collection1] o.a.s.c.SolrDeletionPolicy SolrDeletionPolicy.onCommit: commits: num=1
   [junit4]   2> 	commit{dir=MockDirectoryWrapper(RAMDirectory@3fb3e029 lockFactory=org.apache.lucene.store.SingleInstanceLockFactory@7ed24371),segFN=segments_1,generation=1}
   [junit4]   2> 1585401 INFO  (coreLoadExecutor-4862-thread-1) [    x:collection1] o.a.s.c.SolrDeletionPolicy newest commit generation = 1
   [junit4]   2> 1585401 INFO  (OldIndexDirectoryCleanupThreadForCore-collection1) [    x:collection1] o.a.s.c.SolrCore Looking for old index directories to cleanup for core collection1 in /export/home/jenkins/workspace/Lucene-Solr-6.x-Solaris/solr/build/solr-core/test/J0/temp/solr.update.AutoCommitTest_5E6A38C7C7029FF9-001/init-core-data-001/
   [junit4]   2> 1585423 INFO  (coreLoadExecutor-4862-thread-1) [    x:collection1] o.a.s.u.p.UpdateRequestProcessorChain creating updateRequestProcessorChain "dedupe"
   [junit4]   2> 1585424 INFO  (coreLoadExecutor-4862-thread-1) [    x:collection1] o.a.s.u.p.UpdateRequestProcessorChain inserting DistributedUpdateProcessorFactory into updateRequestProcessorChain "dedupe"
   [junit4]   2> 1585424 INFO  (coreLoadExecutor-4862-thread-1) [    x:collection1] o.a.s.u.p.UpdateRequestProcessorChain creating updateRequestProcessorChain "dedupe-allfields"
   [junit4]   2> 1585424 INFO  (coreLoadExecutor-4862-thread-1) [    x:collection1] o.a.s.u.p.UpdateRequestProcessorChain inserting DistributedUpdateProcessorFactory into updateRequestProcessorChain "dedupe-allfields"
   [junit4]   2> 1585424 INFO  (coreLoadExecutor-4862-thread-1) [    x:collection1] o.a.s.u.p.UpdateRequestProcessorChain creating updateRequestProcessorChain "stored_sig"
   [junit4]   2> 1585424 INFO  (coreLoadExecutor-4862-thread-1) [    x:collection1] o.a.s.u.p.UpdateRequestProcessorChain inserting DistributedUpdateProcessorFactory into updateRequestProcessorChain "stored_sig"
   [junit4]   2> 1585424 INFO  (coreLoadExecutor-4862-thread-1) [    x:collection1] o.a.s.u.p.UpdateRequestProcessorChain creating updateRequestProcessorChain "uniq-fields"
   [junit4]   2> 1585424 INFO  (coreLoadExecutor-4862-thread-1) [    x:collection1] o.a.s.u.p.UpdateRequestProcessorChain inserting DistributedUpdateProcessorFactory into updateRequestProcessorChain "uniq-fields"
   [junit4]   2> 1585424 INFO  (coreLoadExecutor-4862-thread-1) [    x:collection1] o.a.s.u.p.UpdateRequestProcessorChain creating updateRequestProcessorChain "distrib-dup-test-chain-explicit"
   [junit4]   2> 1585424 INFO  (coreLoadExecutor-4862-thread-1) [    x:collection1] o.a.s.u.p.UpdateRequestProcessorChain creating updateRequestProcessorChain "distrib-dup-test-chain-implicit"
   [junit4]   2> 1585424 INFO  (coreLoadExecutor-4862-thread-1) [    x:collection1] o.a.s.u.p.UpdateRequestProcessorChain inserting DistributedUpdateProcessorFactory into updateRequestProcessorChain "distrib-dup-test-chain-implicit"
   [junit4]   2> 1585424 INFO  (coreLoadExecutor-4862-thread-1) [    x:collection1] o.a.s.c.SolrCore no updateRequestProcessorChain defined as default, creating implicit default
   [junit4]   2> 1585427 INFO  (coreLoadExecutor-4862-thread-1) [    x:collection1] o.a.s.h.l.XMLLoader xsltCacheLifetimeSeconds=60
   [junit4]   2> 1585428 INFO  (coreLoadExecutor-4862-thread-1) [    x:collection1] o.a.s.h.l.XMLLoader xsltCacheLifetimeSeconds=60
   [junit4]   2> 1585428 INFO  (coreLoadExecutor-4862-thread-1) [    x:collection1] o.a.s.h.l.XMLLoader xsltCacheLifetimeSeconds=60
   [junit4]   2> 1585429 INFO  (coreLoadExecutor-4862-thread-1) [    x:collection1] o.a.s.h.l.XMLLoader xsltCacheLifetimeSeconds=60
   [junit4]   2> 1585434 INFO  (coreLoadExecutor-4862-thread-1) [    x:collection1] o.a.s.c.PluginBag requestHandler : 'lazy' created with startup=lazy 
   [junit4]   2> 1585435 INFO  (coreLoadExecutor-4862-thread-1) [    x:collection1] o.a.s.c.RequestHandlers Registered paths: /admin/mbeans,standard,spellCheckCompRH,lazy,/update/json/docs,/admin/luke,/export,spellCheckWithWordbreak_Direct,tvrh,/get,/admin/properties,/update/json,mltrh,/admin/threads,/search-facet-def,/update/csv,/sql,/search-facet-invariants,/admin/segments,spellCheckCompRH1,/mlt,/admin/system,/replication,dismax,defaults,/config,/stream,/schema,/admin/plugins,/admin/logging,spellCheckWithWordbreak,mock,/admin/ping,/update,/admin/file,/terms,spellCheckCompRH_Direct,/debug/dump
   [junit4]   2> 1585435 INFO  (coreLoadExecutor-4862-thread-1) [    x:collection1] o.a.s.c.SolrCore Using default statsCache cache: org.apache.solr.search.stats.LocalStatsCache
   [junit4]   2> 1585436 INFO  (coreLoadExecutor-4862-thread-1) [    x:collection1] o.a.s.u.UpdateHandler Using UpdateLog implementation: org.apache.solr.update.UpdateLog
   [junit4]   2> 1585436 INFO  (coreLoadExecutor-4862-thread-1) [    x:collection1] o.a.s.u.UpdateLog Initializing UpdateLog: dataDir= defaultSyncLevel=FLUSH numRecordsToKeep=100 maxNumLogsToKeep=10 numVersionBuckets=65536
   [junit4]   2> 1585437 INFO  (coreLoadExecutor-4862-thread-1) [    x:collection1] o.a.s.u.CommitTracker Hard AutoCommit: disabled
   [junit4]   2> 1585437 INFO  (coreLoadExecutor-4862-thread-1) [    x:collection1] o.a.s.u.CommitTracker Soft AutoCommit: disabled
   [junit4]   2> 1585437 INFO  (coreLoadExecutor-4862-thread-1) [    x:collection1] o.a.s.u.RandomMergePolicy RandomMergePolicy wrapping class org.apache.lucene.index.LogDocMergePolicy: [LogDocMergePolicy: minMergeSize=1000, mergeFactor=10, maxMergeSize=9223372036854775807, maxMergeSizeForForcedMerge=9223372036854775807, calibrateSizeByDeletes=true, maxMergeDocs=2147483647, maxCFSSegmentSizeMB=8.796093022207999E12, noCFSRatio=1.0]
   [junit4]   2> 1585437 INFO  (coreLoadExecutor-4862-thread-1) [    x:collection1] o.a.s.c.SolrDeletionPolicy SolrDeletionPolicy.onInit: commits: num=1
   [junit4]   2> 	commit{dir=MockDirectoryWrapper(RAMDirectory@3fb3e029 lockFactory=org.apache.lucene.store.SingleInstanceLockFactory@7ed24371),segFN=segments_1,generation=1}
   [junit4]   2> 1585437 INFO  (coreLoadExecutor-4862-thread-1) [    x:collection1] o.a.s.c.SolrDeletionPolicy newest commit generation = 1
   [junit4]   2> 1585437 INFO  (coreLoadExecutor-4862-thread-1) [    x:collection1] o.a.s.s.SolrIndexSearcher Opening [Searcher@2bc558b3[collection1] main]
   [junit4]   2> 1585438 INFO  (coreLoadExecutor-4862-thread-1) [    x:collection1] o.a.s.r.RestManager Initializing RestManager with initArgs: {storageIO=org.apache.solr.rest.ManagedResourceStorage$InMemoryStorageIO}
   [junit4]   2> 1585438 INFO  (coreLoadExecutor-4862-thread-1) [    x:collection1] o.a.s.r.ManagedResourceStorage Reading _rest_managed.json using InMemoryStorage
   [junit4]   2> 1585438 INFO  (coreLoadExecutor-4862-thread-1) [    x:collection1] o.a.s.r.RestManager Initializing 0 registered ManagedResources
   [junit4]   2> 1585438 INFO  (coreLoadExecutor-4862-thread-1) [    x:collection1] o.a.s.h.c.SpellCheckComponent Initializing spell checkers
   [junit4]   2> 1585472 INFO  (coreLoadExecutor-4862-thread-1) [    x:collection1] o.a.s.s.DirectSolrSpellChecker init: {name=direct,classname=DirectSolrSpellChecker,field=lowerfilt,minQueryLength=3}
   [junit4]   2> 1585613 INFO  (coreLoadExecutor-4862-thread-1) [    x:collection1] o.a.s.h.ReplicationHandler Commits will be reserved for  10000
   [junit4]   2> 1585613 INFO  (searcherExecutor-4863-thread-1-processing-x:collection1) [    x:collection1] o.a.s.h.c.SpellCheckComponent Loading spell index for spellchecker: default
   [junit4]   2> 1585613 INFO  (searcherExecutor-4863-thread-1-processing-x:collection1) [    x:collection1] o.a.s.h.c.SpellCheckComponent Loading spell index for spellchecker: direct
   [junit4]   2> 1585613 INFO  (searcherExecutor-4863-thread-1-processing-x:collection1) [    x:collection1] o.a.s.h.c.SpellCheckComponent Loading spell index for spellchecker: wordbreak
   [junit4]   2> 1585613 INFO  (searcherExecutor-4863-thread-1-processing-x:collection1) [    x:collection1] o.a.s.h.c.SpellCheckComponent Loading spell index for spellchecker: multipleFields
   [junit4]   2> 1585613 INFO  (coreLoadExecutor-4862-thread-1) [    x:collection1] o.a.s.u.UpdateLog Looking up max value of version field to seed version buckets
   [junit4]   2> 1585613 INFO  (coreLoadExecutor-4862-thread-1) [    x:collection1] o.a.s.u.VersionInfo Refreshing highest value of _version_ for 65536 version buckets from index
   [junit4]   2> 1585614 INFO  (coreLoadExecutor-4862-thread-1) [    x:collection1] o.a.s.u.VersionInfo No terms found for _version_, cannot seed version bucket highest value from index
   [junit4]   2> 1585614 INFO  (searcherExecutor-4863-thread-1-processing-x:collection1) [    x:collection1] o.a.s.h.c.SpellCheckComponent Loading spell index for spellchecker: jarowinkler
   [junit4]   2> 1585614 INFO  (coreLoadExecutor-4862-thread-1) [    x:collection1] o.a.s.u.UpdateLog Could not find max version in index or recent updates, using new clock 1529445217960198144
   [junit4]   2> 1585614 INFO  (searcherExecutor-4863-thread-1-processing-x:collection1) [    x:collection1] o.a.s.h.c.SpellCheckComponent Loading spell index for spellchecker: external
   [junit4]   2> 1585615 INFO  (searcherExecutor-4863-thread-1-processing-x:collection1) [    x:collection1] o.a.s.h.c.SpellCheckComponent Loading spell index for spellchecker: freq
   [junit4]   2> 1585615 INFO  (searcherExecutor-4863-thread-1-processing-x:collection1) [    x:collection1] o.a.s.h.c.SpellCheckComponent Loading spell index for spellchecker: fqcn
   [junit4]   2> 1585615 INFO  (searcherExecutor-4863-thread-1-processing-x:collection1) [    x:collection1] o.a.s.h.c.SpellCheckComponent Loading spell index for spellchecker: perDict
   [junit4]   2> 1585616 INFO  (searcherExecutor-4863-thread-1-processing-x:collection1) [    x:collection1] o.a.s.c.SolrCore [collection1] Registered new searcher Searcher@2bc558b3[collection1] main{ExitableDirectoryReader(UninvertingDirectoryReader())}
   [junit4]   2> 1585616 INFO  (coreLoadExecutor-4862-thread-1) [    x:collection1] o.a.s.u.UpdateLog Took 3.0ms to seed version buckets with highest version 1529445217960198144
   [junit4]   2> 1585617 INFO  (coreLoadExecutor-4862-thread-1) [    x:collection1] o.a.s.c.CoreContainer registering core: collection1
   [junit4]   2> 1585618 INFO  (SUITE-AutoCommitTest-seed#[5E6A38C7C7029FF9]-worker) [    ] o.a.s.SolrTestCaseJ4 ####initCore end
   [junit4]   2> 1585620 INFO  (TEST-AutoCommitTest.testMaxTime-seed#[5E6A38C7C7029FF9]) [    ] o.a.s.SolrTestCaseJ4 ###Starting testMaxTime
   [junit4]   2> 1585622 INFO  (TEST-AutoCommitTest.testMaxTime-seed#[5E6A38C7C7029FF9]) [    ] o.a.s.u.p.LogUpdateProcessorFactory [collection1]  webapp=null path=null params={}{deleteByQuery=*:* (-1529445217966489600)} 0 2
   [junit4]   2> 1585624 INFO  (TEST-AutoCommitTest.testMaxTime-seed#[5E6A38C7C7029FF9]) [    ] o.a.s.c.SolrResourceLoader new SolrResourceLoader for directory: '/export/home/jenkins/workspace/Lucene-Solr-6.x-Solaris/solr/core/src/test-files/solr/collection1'
   [junit4]   2> 1585624 INFO  (TEST-AutoCommitTest.testMaxTime-seed#[5E6A38C7C7029FF9]) [    ] o.a.s.c.SolrResourceLoader JNDI not configured for solr (NoInitialContextEx)
   [junit4]   2> 1585624 INFO  (TEST-AutoCommitTest.testMaxTime-seed#[5E6A38C7C7029FF9]) [    ] o.a.s.c.SolrResourceLoader using system property solr.solr.home: /export/home/jenkins/workspace/Lucene-Solr-6.x-Solaris/solr/core/src/test-files/solr
   [junit4]   2> 1585624 INFO  (TEST-AutoCommitTest.testMaxTime-seed#[5E6A38C7C7029FF9]) [    ] o.a.s.c.SolrResourceLoader Adding 'file:/export/home/jenkins/workspace/Lucene-Solr-6.x-Solaris/solr/core/src/test-files/solr/collection1/lib/classes/' to classloader
   [junit4]   2> 1585625 INFO  (TEST-AutoCommitTest.testMaxTime-seed#[5E6A38C7C7029FF9]) [    ] o.a.s.c.SolrResourceLoader Adding 'file:/export/home/jenkins/workspace/Lucene-Solr-6.x-Solaris/solr/core/src/test-files/solr/collection1/lib/README' to classloader
   [junit4]   2> 1585654 INFO  (TEST-AutoCommitTest.testMaxTime-seed#[5E6A38C7C7029FF9]) [    ] o.a.s.c.SolrConfig current version of requestparams : -1
   [junit4]   2> 1585658 WARN  (TEST-AutoCommitTest.testMaxTime-seed#[5E6A38C7C7029FF9]) [    ] o.a.s.c.Config Beginning with Solr 5.5, <mergePolicy> is deprecated, use <mergePolicyFactory> instead.
   [junit4]   2> 1585662 INFO  (TEST-AutoCommitTest.testMaxTime-seed#[5E6A38C7C7029FF9]) [    ] o.a.s.c.SolrConfig Using Lucene MatchVersion: 6.1.0
   [junit4]   2> 1585699 INFO  (TEST-AutoCommitTest.testMaxTime-seed#[5E6A38C7C7029FF9]) [    ] o.a.s.c.SolrConfig Loaded SolrConfig: solrconfig.xml
   [junit4]   2> 1585704 INFO  (TEST-AutoCommitTest.testMaxTime-seed#[5E6A38C7C7029FF9]) [    ] o.a.s.s.IndexSchema [collection1] Schema name=test
   [junit4]   2> 1585792 INFO  (TEST-AutoCommitTest.testMaxTime-seed#[5E6A38C7C7029FF9]) [    ] o.a.s.s.OpenExchangeRatesOrgProvider Initialized with rates=open-exchange-rates.json, refreshInterval=1440.
   [junit4]   2> 1585796 INFO  (TEST-AutoCommitTest.testMaxTime-seed#[5E6A38C7C7029FF9]) [    ] o.a.s.s.IndexSchema default search field in schema is text
   [junit4]   2> 1585797 INFO  (TEST-AutoCommitTest.testMaxTime-seed#[5E6A38C7C7029FF9]) [    ] o.a.s.s.IndexSchema unique key field: id
   [junit4]   2> 1585800 INFO  (TEST-AutoCommitTest.testMaxTime-seed#[5E6A38C7C7029FF9]) [    ] o.a.s.s.FileExchangeRateProvider Reloading exchange rates from file currency.xml
   [junit4]   2> 1585802 INFO  (TEST-AutoCommitTest.testMaxTime-seed#[5E6A38C7C7029FF9]) [    ] o.a.s.s.FileExchangeRateProvider Reloading exchange rates from file currency.xml
   [junit4]   2> 1585803 INFO  (TEST-AutoCommitTest.testMaxTime-seed#[5E6A38C7C7029FF9]) [    ] o.a.s.s.OpenExchangeRatesOrgProvider Reloading exchange rates from open-exchange-rates.json
   [junit4]   2> 1585804 INFO  (TEST-AutoCommitTest.testMaxTime-seed#[5E6A38C7C7029FF9]) [    ] o.a.s.s.OpenExchangeRatesOrgProvider Reloading exchange rates from open-exchange-rates.json
   [junit4]   2> 1585806 INFO  (TEST-AutoCommitTest.testMaxTime-seed#[5E6A38C7C7029FF9]) [    ] o.a.s.c.ConfigSetProperties Did not find ConfigSet properties, assuming default properties: Can't find resource 'configsetprops.json' in classpath or '/export/home/jenkins/workspace/Lucene-Solr-6.x-Solaris/solr/core/src/test-files/solr/collection1'
   [junit4]   2> 1585806 INFO  (TEST-AutoCommitTest.testMaxTime-seed#[5E6A38C7C7029FF9]) [    ] o.a.s.c.CoreContainer Reloading SolrCore 'collection1' using configuration from instancedir /export/home/jenkins/workspace/Lucene-Solr-6.x-Solaris/solr/core/src/test-files/solr/collection1
   [junit4]   2> 1585806 INFO  (TEST-AutoCommitTest.testMaxTime-seed#[5E6A38C7C7029FF9]) [    x:collection1] o.a.s.c.SolrCore [[collection1] ] Opening new SolrCore at [/export/home/jenkins/workspace/Lucene-Solr-6.x-Solaris/solr/core/src/test-files/solr/collection1], dataDir=[/export/home/jenkins/workspace/Lucene-Solr-6.x-Solaris/solr/build/solr-core/test/J0/temp/solr.update.AutoCommitTest_5E6A38C7C7029FF9-001/init-core-data-001/]
   [junit4]   2> 1585806 INFO  (TEST-AutoCommitTest.testMaxTime-seed#[5E6A38C7C7029FF9]) [    x:collection1] o.a.s.c.JmxMonitoredMap JMX monitoring is enabled. Adding Solr mbeans to JMX Server: com.sun.jmx.mbeanserver.JmxMBeanServer@759dfd56
   [junit4]   2> 1585806 INFO  (TEST-AutoCommitTest.testMaxTime-seed#[5E6A38C7C7029FF9]) [    x:collection1] o.a.s.c.SolrCore New index directory detected: old=null new=/export/home/jenkins/workspace/Lucene-Solr-6.x-Solaris/solr/build/solr-core/test/J0/temp/solr.update.AutoCommitTest_5E6A38C7C7029FF9-001/init-core-data-001/index/
   [junit4]   2> 1585807 INFO  (OldIndexDirectoryCleanupThreadForCore-collection1) [    x:collection1] o.a.s.c.SolrCore Looking for old index directories to cleanup for core collection1 in /export/home/jenkins/workspace/Lucene-Solr-6.x-Solaris/solr/build/solr-core/test/J0/temp/solr.update.AutoCommitTest_5E6A38C7C7029FF9-001/init-core-data-001/
   [junit4]   2> 1585810 INFO  (TEST-AutoCommitTest.testMaxTime-seed#[5E6A38C7C7029FF9]) [    x:collection1] o.a.s.u.p.UpdateRequestProcessorChain creating updateRequestProcessorChain "dedupe"
   [junit4]   2> 1585811 INFO  (TEST-AutoCommitTest.testMaxTime-seed#[5E6A38C7C7029FF9]) [    x:collection1] o.a.s.u.p.UpdateRequestProcessorChain inserting DistributedUpdateProcessorFactory into updateRequestProcessorChain "dedupe"
   [junit4]   2> 1585811 INFO  (TEST-AutoCommitTest.testMaxTime-seed#[5E6A38C7C7029FF9]) [    x:collection1] o.a.s.u.p.UpdateRequestProcessorChain creating updateRequestProcessorChain "dedupe-allfields"
   [junit4]   2> 1585811 INFO  (TEST-AutoCommitTest.testMaxTime-seed#[5E6A38C7C7029FF9]) [    x:collection1] o.a.s.u.p.UpdateRequestProcessorChain inserting DistributedUpdateProcessorFactory into updateRequestProcessorChain "dedupe-allfields"
   [junit4]   2> 1585811 INFO  (TEST-AutoCommitTest.testMaxTime-seed#[5E6A38C7C7029FF9]) [    x:collection1] o.a.s.u.p.UpdateRequestProcessorChain creating updateRequestProcessorChain "stored_sig"
   [junit4]   2> 1585811 INFO  (TEST-AutoCommitTest.testMaxTime-seed#[5E6A38C7C7029FF9]) [    x:collection1] o.a.s.u.p.UpdateRequestProcessorChain inserting DistributedUpdateProcessorFactory into updateRequestProcessorChain "stored_sig"
   [junit4]   2> 1585811 INFO  (TEST-AutoCommitTest.testMaxTime-seed#[5E6A38C7C7029FF9]) [    x:collection1] o.a.s.u.p.UpdateRequestProcessorChain creating updateRequestProcessorChain "uniq-fields"
   [junit4]   2> 1585811 INFO  (TEST-AutoCommitTest.testMaxTime-seed#[5E6A38C7C7029FF9]) [    x:collection1] o.a.s.u.p.UpdateRequestProcessorChain inserting DistributedUpdateProcessorFactory into updateRequestProcessorChain "uniq-fields"
   [junit4]   2> 1585811 INFO  (TEST-AutoCommitTest.testMaxTime-seed#[5E6A38C7C7029FF9]) [    x:collection1] o.a.s.u.p.UpdateRequestProcessorChain creating updateRequestProcessorChain "distrib-dup-test-chain-explicit"
   [junit4]   2> 1585811 INFO  (TEST-AutoCommitTest.testMaxTime-seed#[5E6A38C7C7029FF9]) [    x:collection1] o.a.s.u.p.UpdateRequestProcessorChain creating updateRequestProcessorChain "distrib-dup-test-chain-implicit"
   [junit4]   2> 1585811 INFO  (TEST-AutoCommitTest.testMaxTime-seed#[5E6A38C7C7029FF9]) [    x:collection1] o.a.s.u.p.UpdateRequestProcessorChain inserting DistributedUpdateProcessorFactory into updateRequestProcessorChain "distrib-dup-test-chain-implicit"
   [junit4]   2> 1585811 INFO  (TEST-AutoCommitTest.testMaxTime-seed#[5E6A38C7C7029FF9]) [    x:collection1] o.a.s.c.SolrCore no updateRequestProcessorChain defined as default, creating implicit default
   [junit4]   2> 1585813 INFO  (TEST-AutoCommitTest.testMaxTime-seed#[5E6A38C7C7029FF9]) [    x:collection1] o.a.s.h.l.XMLLoader xsltCacheLifetimeSeconds=60
   [junit4]   2> 1585814 INFO  (TEST-AutoCommitTest.testMaxTime-seed#[5E6A38C7C7029FF9]) [    x:collection1] o.a.s.h.l.XMLLoader xsltCacheLifetimeSeconds=60
   [junit4]   2> 1585815 INFO  (TEST-AutoCommitTest.testMaxTime-seed#[5E6A38C7C7029FF9]) [    x:collection1] o.a.s.h.l.XMLLoader xsltCacheLifetimeSeconds=60
   [junit4]   2> 1585816 INFO  (TEST-AutoCommitTest.testMaxTime-seed#[5E6A38C7C7029FF9]) [    x:collection1] o.a.s.h.l.XMLLoader xsltCacheLifetimeSeconds=60
   [junit4]   2> 1585821 INFO  (TEST-AutoCommitTest.testMaxTime-seed#[5E6A38C7C7029FF9]) [    x:collection1] o.a.s.c.PluginBag requestHandler : 'lazy' created with startup=lazy 
   [junit4]   2> 1585823 INFO  (TEST-AutoCommitTest.testMaxTime-seed#[5E6A38C7C7029FF9]) [    x:collection1] o.a.s.c.RequestHandlers Registered paths: /admin/mbeans,standard,spellCheckCompRH,lazy,/update/json/docs,/admin/luke,/export,spellCheckWithWordbreak_Direct,tvrh,/get,/admin/properties,/update/json,mltrh,/admin/threads,/search-facet-def,/update/csv,/sql,/search-facet-invariants,/admin/segments,spellCheckCompRH1,/mlt,/admin/system,/replication,dismax,defaults,/config,/stream,/schema,/admin/plugins,/admin/logging,spellCheckWithWordbreak,mock,/admin/ping,/update,/admin/file,/terms,spellCheckCompRH_Direct,/debug/dump
   [junit4]   2> 1585823 INFO  (TEST-AutoCommitTest.testMaxTime-seed#[5E6A38C7C7029FF9]) [    x:collection1] o.a.s.c.SolrCore Using default statsCache cache: org.apache.solr.search.stats.LocalStatsCache
   [junit4]   2> 1585823 INFO  (TEST-AutoCommitTest.testMaxTime-seed#[5E6A38C7C7029FF9]) [    x:collection1] o.a.s.u.CommitTracker Hard AutoCommit: disabled
   [junit4]   2> 1585823 INFO  (TEST-AutoCommitTest.testMaxTime-seed#[5E6A38C7C7029FF9]) [    x:collection1] o.a.s.u.CommitTracker Soft AutoCommit: disabled
   [junit4]   2> 1585823 INFO  (TEST-AutoCommitTest.testMaxTime-seed#[5E6A38C7C7029FF9]) [    x:collection1] o.a.s.s.SolrIndexSearcher Opening [Searcher@7c73dab2[collection1] main]
   [junit4]   2> 1585823 INFO  (TEST-AutoCommitTest.testMaxTime-seed#[5E6A38C7C7029FF9]) [    x:collection1] o.a.s.r.RestManager Initializing RestManager with initArgs: {storageIO=org.apache.solr.rest.ManagedResourceStorage$InMemoryStorageIO}
   [junit4]   2> 1585824 INFO  (TEST-AutoCommitTest.testMaxTime-seed#[5E6A38C7C7029FF9]) [    x:collection1] o.a.s.r.ManagedResourceStorage Reading _rest_managed.json using InMemoryStorage
   [junit4]   2> 1585824 INFO  (TEST-AutoCommitTest.testMaxTime-seed#[5E6A38C7C7029FF9]) [    x:collection1] o.a.s.r.RestManager Initializing 0 registered ManagedResources
   [junit4]   2> 1585824 INFO  (TEST-AutoCommitTest.testMaxTime-seed#[5E6A38C7C7029FF9]) [    x:collection1] o.a.s.h.c.SpellCheckComponent Initializing spell checkers
   [junit4]   2> 1585825 INFO  (TEST-AutoCommitTest.testMaxTime-seed#[5E6A38C7C7029FF9]) [    x:collection1] o.a.s.s.DirectSolrSpellChecker init: {name=direct,classname=DirectSolrSpellChecker,field=lowerfilt,minQueryLength=3}
   [junit4]   2> 1585828 INFO  (TEST-AutoCommitTest.testMaxTime-seed#[5E6A38C7C7029FF9]) [    x:collection1] o.a.s.h.ReplicationHandler Commits will be reserved for  10000
   [junit4]   2> 1585829 INFO  (searcherExecutor-4868-thread-1-processing-x:collection1) [    x:collection1] o.a.s.h.c.SpellCheckComponent Loading spell index for spellchecker: default
   [junit4]   2> 1585829 INFO  (TEST-AutoCommitTest.testMaxTime-seed#[5E6A38C7C7029FF9]) [    x:collection1] o.a.s.u.UpdateLog Looking up max value of version field to seed version buckets
   [junit4]   2> 1585829 INFO  (searcherExecutor-4868-thread-1-processing-x:collection1) [    x:collection1] o.a.s.h.c.SpellCheckComponent Loading spell index for spellchecker: direct
   [junit4]   2> 1585830 INFO  (searcherExecutor-4868-thread-1-processing-x:collection1) [    x:collection1] o.a.s.h.c.SpellCheckComponent Loading spell index for spellchecker: wordbreak
   [junit4]   2> 1585830 INFO  (searcherExecutor-4868-thread-1-processing-x:collection1) [    x:collection1] o.a.s.h.c.SpellCheckComponent Loading spell index for spellchecker: multipleFields
   [junit4]   2> 1585830 INFO  (TEST-AutoCommitTest.testMaxTime-seed#[5E6A38C7C7029FF9]) [    x:collection1] o.a.s.u.VersionInfo Refreshing highest value of _version_ for 65536 version buckets from index
   [junit4]   2> 1585830 INFO  (TEST-AutoCommitTest.testMaxTime-seed#[5E6A38C7C7029FF9]) [    x:collection1] o.a.s.u.VersionInfo No terms found for _version_, cannot seed version bucket highest value from index
   [junit4]   2> 1585830 INFO  (searcherExecutor-4868-thread-1-processing-x:collection1) [    x:collection1] o.a.s.h.c.SpellCheckComponent Loading spell index for spellchecker: jarowinkler
   [junit4]   2> 1585830 INFO  (searcherExecutor-4868-thread-1-processing-x:collection1) [    x:collection1] o.a.s.h.c.SpellCheckComponent Loading spell index for spellchecker: external
   [junit4]   2> 1585831 INFO  (searcherExecutor-4868-thread-1-processing-x:collection1) [    x:collection1] o.a.s.h.c.SpellCheckComponent Loading spell index for spellchecker: freq
   [junit4]   2> 1585831 INFO  (searcherExecutor-4868-thread-1-processing-x:collection1) [    x:collection1] o.a.s.h.c.SpellCheckComponent Loading spell index for spellchecker: fqcn
   [junit4]   2> 1585832 INFO  (TEST-AutoCommitTest.testMaxTime-seed#[5E6A38C7C7029FF9]) [    x:collection1] o.a.s.u.UpdateLog Took 2.0ms to seed version buckets with highest version 1529445217966489600
   [junit4]   2> 1585832 INFO  (searcherExecutor-4868-thread-1-processing-x:collection1) [    x:collection1] o.a.s.h.c.SpellCheckComponent Loading spell index for spellchecker: perDict
   [junit4]   2> 1585832 INFO  (TEST-AutoCommitTest.testMaxTime-seed#[5E6A38C7C7029FF9]) [    x:collection1] o.a.s.u.DefaultSolrCoreState Closing old IndexWriter... core=collection1
   [junit4]   2> 1585832 INFO  (TEST-AutoCommitTest.testMaxTime-seed#[5E6A38C7C7029FF9]) [    x:collection1] o.a.s.u.RandomMergePolicy RandomMergePolicy wrapping class org.apache.lucene.index.LogByteSizeMergePolicy: [LogByteSizeMergePolicy: minMergeSize=1677721, mergeFactor=32, maxMergeSize=2147483648, maxMergeSizeForForcedMerge=9223372036854775807, calibrateSizeByDeletes=false, maxMergeDocs=2147483647, maxCFSSegmentSizeMB=8.796093022207999E12, noCFSRatio=0.0]
   [junit4]   2> 1585833 INFO  (searcherExecutor-4868-thread-1-processing-x:collection1) [    x:collection1] o.a.s.c.SolrCore [collection1] Registered new searcher Searcher@7c73dab2[collection1] main{ExitableDirectoryReader(UninvertingDirectoryReader())}
   [junit4]   2> 1585834 INFO  (TEST-AutoCommitTest.testMaxTime-seed#[5E6A38C7C7029FF9]) [    x:collection1] o.a.s.c.SolrDeletionPolicy SolrDeletionPolicy.onInit: commits: num=1
   [junit4]   2> 	commit{dir=MockDirectoryWrapper(RAMDirectory@3fb3e029 lockFactory=org.apache.lucene.store.SingleInstanceLockFactory@7ed24371),segFN=segments_1,generation=1}
   [junit4]   2> 1585834 INFO  (TEST-AutoCommitTest.testMaxTime-seed#[5E6A38C7C7029FF9]) [    x:collection1] o.a.s.c.SolrDeletionPolicy newest commit generation = 1
   [junit4]   2> 1585834 INFO  (TEST-AutoCommitTest.testMaxTime-seed#[5E6A38C7C7029FF9]) [    x:collection1] o.a.s.u.DefaultSolrCoreState New IndexWriter is ready to be used.
   [junit4]   2> 1585834 INFO  (TEST-AutoCommitTest.testMaxTime-seed#[5E6A38C7C7029FF9]) [    x:collection1] o.a.s.s.SolrIndexSearcher Opening [Searcher@3cca0785[collection1] main]
   [junit4]   2> 1585834 INFO  (TEST-AutoCommitTest.testMaxTime-seed#[5E6A38C7C7029FF9]) [    x:collection1] o.a.s.c.CoreContainer replacing core: collection1
   [junit4]   2> 1585835 INFO  (TEST-AutoCommitTest.testMaxTime-seed#[5E6A38C7C7029FF9]) [    x:collection1] o.a.s.c.SolrCore [collection1]  CLOSING SolrCore org.apache.solr.core.SolrCore@52fb46d4
   [junit4]   2> 1585835 INFO  (TEST-AutoCommitTest.testMaxTime-seed#[5E6A38C7C7029FF9]) [    x:collection1] o.a.s.u.DirectUpdateHandler2 closing DirectUpdateHandler2{commits=0,autocommits=0,soft autocommits=0,optimizes=0,rollbacks=0,expungeDeletes=0,docsPending=0,adds=0,deletesById=0,deletesByQuery=1,errors=0,cumulative_adds=0,cumulative_deletesById=0,cumulative_deletesByQuery=1,cumulative_errors=0,transaction_logs_total_size=0,transaction_logs_total_number=0}
   [junit4]   2> 1585835 INFO  (TEST-AutoCommitTest.testMaxTime-seed#[5E6A38C7C7029FF9]) [    x:collection1] o.a.s.c.SolrCore [collection1] Closing main searcher on request.
   [junit4]   2> 1585836 INFO  (searcherExecutor-4868-thread-1-processing-x:collection1) [    x:collection1] o.a.s.c.SolrCore [collection1] Registered new searcher Searcher@3cca0785[collection1] main{ExitableDirectoryReader(UninvertingDirectoryReader())}
   [junit4]   2> 1585844 INFO  (TEST-AutoCommitTest.testMaxTime-seed#[5E6A38C7C7029FF9]) [    x:collection1] o.a.s.u.p.LogUpdateProcessorFactory [collection1] {add=[529 (1529445218200322048)]} 0 1
   [junit4]   2> 1585844 INFO  (TEST-AutoCommitTest.testMaxTime-seed#[5E6A38C7C7029FF9]) [    x:collection1] o.a.s.c.S.Request [collection1]  webapp=null path=null params={q=id:529&qt=standard&start=0&rows=20&version=2.2} hits=0 status=0 QTime=0
   [junit4]   2> 1586845 INFO  (commitScheduler-4871-thread-1) [    x:collection1] o.a.s.u.DirectUpdateHandler2 start commit{,optimize=false,openSearcher=true,waitSearcher=true,expungeDeletes=false,softCommit=true,prepareCommit=false}
   [junit4]   2> 1586852 INFO  (commitScheduler-4871-thread-1) [    x:collection1] o.a.s.s.SolrIndexSearcher Opening [Searcher@2a0e4514[collection1] main]
   [junit4]   2> 1586852 INFO  (commitScheduler-4871-thread-1) [    x:collection1] o.a.s.u.DirectUpdateHandler2 end_commit_flush
   [junit4]   2> 1586853 INFO  (searcherExecutor-4868-thread-1-processing-x:collection1) [    x:collection1] o.a.s.c.SolrCore [collection1] Registered new searcher Searcher@2a0e4514[collection1] main{ExitableDirectoryReader(UninvertingDirectoryReader(Uninverting(_0(6.1.0):C1)))}
   [junit4]   2> 1587096 INFO  (TEST-AutoCommitTest.testMaxTime-seed#[5E6A38C7C7029FF9]) [    x:collection1] o.a.s.u.p.LogUpdateProcessorFactory [collection1] {add=[530 (1529445219513139200)]} 0 1254
   [junit4]   2> 1587096 INFO  (TEST-AutoCommitTest.testMaxTime-seed#[5E6A38C7C7029FF9]) [    x:collection1] o.a.s.c.S.Request [collection1]  webapp=null path=null params={q=id:529&qt=standard&start=0&rows=20&version=2.2} hits=1 status=0 QTime=0
   [junit4]   2> 1587097 INFO  (TEST-AutoCommitTest.testMaxTime-seed#[5E6A38C7C7029FF9]) [    x:collection1] o.a.s.c.S.Request [collection1]  webapp=null path=null params={q=id:530&qt=standard&start=0&rows=20&version=2.2} hits=0 status=0 QTime=0
   [junit4]   2> 1587098 INFO  (TEST-AutoCommitTest.testMaxTime-seed#[5E6A38C7C7029FF9]) [    x:collection1] o.a.s.u.p.LogUpdateProcessorFactory [collection1]  webapp=null path=null params={}{delete=[529 (-1529445219516284928)]} 0 0
   [junit4]   2> 1587098 INFO  (TEST-AutoCommitTest.testMaxTime-seed#[5E6A38C7C7029FF9]) [    x:collection1] o.a.s.c.S.Request [collection1]  webapp=null path=null params={q=id:529&qt=standard&start=0&rows=20&version=2.2} hits=1 status=0 QTime=0
   [junit4]   2> 1588097 INFO  (commitScheduler-4871-thread-1) [    x:collection1] o.a.s.u.DirectUpdateHandler2 start commit{,optimize=false,openSearcher=true,waitSearcher=true,expungeDeletes=false,softCommit=true,prepareCommit=false}
   [junit4]   2> 1588101 INFO  (commitScheduler-4871-thread-1) [    x:collection1] o.a.s.s.SolrIndexSearcher Opening [Searcher@37d59e31[collection1] main]
   [junit4]   2> 1588101 INFO  (commitScheduler-4871-thread-1) [    x:collection1] o.a.s.u.DirectUpdateHandler2 end_commit_flush
   [junit4]   2> 1588102 INFO  (searcherExecutor-4868-thread-1-processing-x:collection1) [    x:collection1] o.a.s.c.SolrCore [collection1] Registered new searcher Searcher@37d59e31[collection1] main{ExitableDirectoryReader(UninvertingDirectoryReader(Uninverting(_1(6.1.0):C1)))}
   [junit4]   2> 1588350 INFO  (TEST-AutoCommitTest.testMaxTime-seed#[5E6A38C7C7029FF9]) [    x:collection1] o.a.s.u.p.LogUpdateProcessorFactory [collection1] {add=[550 (1529445220829102080)]} 0 2508
   [junit4]   2> 1588351 INFO  (TEST-AutoCommitTest.testMaxTime-seed#[5E6A38C7C7029FF9]) [    x:collection1] o.a.s.c.S.Request [collection1]  webapp=null path=null params={q=id:529&qt=standard&start=0&rows=20&version=2.2} hits=0 status=0 QTime=0
   [junit4]   2> 1588351 INFO  (TEST-AutoCommitTest.testMaxTime-seed#[5E6A38C7C7029FF9]) [    x:collection1] o.a.s.u.p.LogUpdateProcessorFactory [collection1] {add=[500 (1529445220830150656)]} 0 2509
   [junit4]   2> 1588351 INFO  (TEST-AutoCommitTest.testMaxTime-seed#[5E6A38C7C7029FF9]) [    x:collection1] o.a.s.u.p.LogUpdateProcessorFactory [collection1] {add=[500 (1529445220830150657)]} 0 2509
   [junit4]   2> 1588352 INFO  (TEST-AutoCommitTest.testMaxTime-seed#[5E6A38C7C7029FF9]) [    x:collection1] o.a.s.u.p.LogUpdateProcessorFactory [collection1] {add=[500 (1529445220831199232)]} 0 2509
   [junit4]   2> 1588352 INFO  (TEST-AutoCommitTest.testMaxTime-seed#[5E6A38C7C7029FF9]) [    x:collection1] o.a.s.u.p.LogUpdateProcessorFactory [collection1] {add=[500 (1529445220831199233)]} 0 2510
   [junit4]   2> 1588352 INFO  (TEST-AutoCommitTest.testMaxTime-seed#[5E6A38C7C7029FF9]) [    x:collection1] o.a.s.u.p.LogUpdateProcessorFactory [collection1] {add=[500 (1529445220831199234)]} 0 2510
   [junit4]   2> 1588352 INFO  (TEST-AutoCommitTest.testMaxTime-seed#[5E6A38C7C7029FF9]) [    x:collection1] o.a.s.u.p.LogUpdateProcessorFactory [collection1] {add=[500 (1529445220831199235)]} 0 2510
   [junit4]   2> 1588353 INFO  (TEST-AutoCommitTest.testMaxTime-seed#[5E6A38C7C7029FF9]) [    x:collection1] o.a.s.u.p.LogUpdateProcessorFactory [collection1] {add=[500 (1529445220832247808)]} 0 2510
   [junit4]   2> 1588353 INFO  (TEST-AutoCommitTest.testMaxTime-seed#[5E6A38C7C7029FF9]) [    x:collection1] o.a.s.u.p.LogUpdateProcessorFactory [collection1] {add=[500 (1529445220832247809)]} 0 2510
   [junit4]   2> 1588353 INFO  (TEST-AutoCommitTest.testMaxTime-seed#[5E6A38C7C7029FF9]) [    x:collection1] o.a.s.u.p.LogUpdateProcessorFactory [collection1] {add=[500 (1529445220832247810)]} 0 2511
   [junit4]   2> 1588353 INFO  (TEST-AutoCommitTest.testMaxTime-seed#[5E6A38C7C7029FF9]) [    x:collection1] o.a.s.u.p.LogUpdateProcessorFactory [collection1] {add=[500 (1529445220832247811)]} 0 2511
   [junit4]   2> 1588353 INFO  (TEST-AutoCommitTest.testMaxTime-seed#[5E6A38C7C7029FF9]) [    x:collection1] o.a.s.c.S.Request [collection1]  webapp=null path=null params={q=id:500&qt=standard&start=0&rows=20&version=2.2} hits=0 status=0 QTime=0
   [junit4]   2> 1589351 INFO  (commitScheduler-4871-thread-1) [    x:collection1] o.a.s.u.DirectUpdateHandler2 start commit{,optimize=false,openSearcher=true,waitSearcher=true,expungeDeletes=false,softCommit=true,prepareCommit=false}
   [junit4]   2> 1589374 INFO  (commitScheduler-4871-thread-1) [    x:collection1] o.a.s.s.SolrIndexSearcher Opening [Searcher@7716ceff[collection1] main]
   [junit4]   2> 1589374 INFO  (commitScheduler-4871-thread-1) [    x:collection1] o.a.s.u.DirectUpdateHandler2 end_commit_flush
   [junit4]   2> 1589375 INFO  (searcherExecutor-4868-thread-1-processing-x:collection1) [    x:collection1] o.a.s.c.SolrCore [collection1] Registered new searcher Searcher@7716ceff[collection1] main{ExitableDirectoryReader(UninvertingDirectoryReader(Uninverting(_1(6.1.0):C1) Uninverting(_2(6.1.0):C11/9:delGen=1)))}
   [junit4]   2> 1589624 INFO  (TEST-AutoCommitTest.testMaxTime-seed#[5E6A38C7C7029FF9]) [    x:collection1] o.a.s.u.p.LogUpdateProcessorFactory [collection1] {add=[531 (1529445222163939328)]} 0 3781
   [junit4]   2> 1589624 INFO  (TEST-AutoCommitTest.testMaxTime-seed#[5E6A38C7C7029FF9]) [    x:collection1] o.a.s.c.S.Request [collection1]  webapp=null path=null params={q=id:500&qt=standard&start=0&rows=20&version=2.2} hits=1 status=0 QTime=0
   [junit4]   2> 1589624 INFO  (TEST-AutoCommitTest.testMaxTime-seed#[5E6A38C7C7029FF9]) [    x:collection1] o.a.s.SolrTestCaseJ4 ###Ending testMaxTime
   [junit4]   2> 1589628 INFO  (TEST-AutoCommitTest.testMaxDocs-seed#[5E6A38C7C7029FF9]) [    x:collection1] o.a.s.SolrTestCaseJ4 ###Starting testMaxDocs
   [junit4]   2> 1589637 INFO  (TEST-AutoCommitTest.testMaxDocs-seed#[5E6A38C7C7029FF9]) [    x:collection1] o.a.s.s.SolrIndexSearcher Opening [Searcher@28ce6853[collection1] realtime]
   [junit4]   2> 1589637 INFO  (TEST-AutoCommitTest.testMaxDocs-seed#[5E6A38C7C7029FF9]) [    x:collection1] o.a.s.u.p.LogUpdateProcessorFactory [collection1]  webapp=null path=null params={}{deleteByQuery=*:* (-1529445222169182208)} 0 9
   [junit4]   2> 1589637 INFO  (TEST-AutoCommitTest.testMaxDocs-seed#[5E6A38C7C7029FF9]) [    x:collection1] o.a.s.c.SolrResourceLoader new SolrResourceLoader for directory: '/export/home/jenkins/workspace/Lucene-Solr-6.x-Solaris/solr/core/src/test-files/solr/collection1'
   [junit4]   2> 1589637 INFO  (TEST-AutoCommitTest.testMaxDocs-seed#[5E6A38C7C7029FF9]) [    x:collection1] o.a.s.c.SolrResourceLoader JNDI not configured for solr (NoInitialContextEx)
   [junit4]   2> 1589637 INFO  (TEST-AutoCommitTest.testMaxDocs-seed#[5E6A38C7C7029FF9]) [    x:collection1] o.a.s.c.SolrResourceLoader using system property solr.solr.home: /export/home/jenkins/workspace/Lucene-Solr-6.x-Solaris/solr/core/src/test-files/solr
   [junit4]   2> 1589638 INFO  (TEST-AutoCommitTest.testMaxDocs-seed#[5E6A38C7C7029FF9]) [    x:collection1] o.a.s.c.SolrResourceLoader Adding 'file:/export/home/jenkins/workspace/Lucene-Solr-6.x-Solaris/solr/core/src/test-files/solr/collection1/lib/classes/' to classloader
   [junit4]   2> 1589638 INFO  (TEST-AutoCommitTest.testMaxDocs-seed#[5E6A38C7C7029FF9]) [    x:collection1] o.a.s.c.SolrResourceLoader Adding 'file:/export/home/jenkins/workspace/Lucene-Solr-6.x-Solaris/solr/core/src/test-files/solr/collection1/lib/README' to classloader
   [junit4]   2> 1589666 INFO  (TEST-AutoCommitTest.testMaxDocs-seed#[5E6A38C7C7029FF9]) [    x:collection1] o.a.s.c.SolrConfig current version of requestparams : -1
   [junit4]   2> 1589675 WARN  (TEST-AutoCommitTest.testMaxDocs-seed#[5E6A38C7C7029FF9]) [    x:collection1] o.a.s.c.Config Beginning with Solr 5.5, <mergePolicy> is deprecated, use <mergePolicyFactory> instead.
   [junit4]   2> 1589677 INFO  (TEST-AutoCommitTest.testMaxDocs-seed#[5E6A38C7C7029FF9]) [    x:collection1] o.a.s.c.SolrConfig Using Lucene MatchVersion: 6.1.0
   [junit4]   2> 1589699 INFO  (TEST-AutoCommitTest.testMaxDocs-seed#[5E6A38C7C7029FF9]) [    x:collection1] o.a.s.c.SolrConfig Loaded SolrConfig: solrconfig.xml
   [junit4]   2> 1589705 INFO  (TEST-AutoCommitTest.testMaxDocs-seed#[5E6A38C7C7029FF9]) [    x:collection1] o.a.s.s.IndexSchema [collection1] Schema name=test
   [junit4]   2> 1589801 INFO  (TEST-AutoCommitTest.testMaxDocs-seed#[5E6A38C7C7029FF9]) [    x:collection1] o.a.s.s.OpenExchangeRatesOrgProvider Initialized with rates=open-exchange-rates.json, refreshInterval=1440.
   [junit4]   2> 1589805 INFO  (TEST-AutoCommitTest.testMaxDocs-seed#[5E6A38C7C7029FF9]) [    x:collection1] o.a.s.s.IndexSchema default search field in schema is text
   [junit4]   2> 1589806 INFO  (TEST-AutoCommitTest.testMaxDocs-seed#[5E6A38C7C7029FF9]) [    x:collection1] o.a.s.s.IndexSchema unique key field: id
   [junit4]   2> 1589810 INFO  (TEST-AutoCommitTest.testMaxDocs-seed#[5E6A38C7C7029FF9]) [    x:collection1] o.a.s.s.FileExchangeRateProvider Reloading exchange rates from file currency.xml
   [junit4]   2> 1589813 INFO  (TEST-AutoCommitTest.testMaxDocs-seed#[5E6A38C7C7029FF9]) [    x:collection1] o.a.s.s.FileExchangeRateProvider Reloading exchange rates from file currency.xml
   [junit4]   2> 1589815 INFO  (TEST-AutoCommitTest.testMaxDocs-seed#[5E6A38C7C7029FF9]) [    x:collection1] o.a.s.s.OpenExchangeRatesOrgProvider Reloading exchange rates from open-exchange-rates.json
   [junit4]   2> 1589815 INFO  (TEST-AutoCommitTest.testMaxDocs-seed#[5E6A38C7C7029FF9]) [    x:collection1] o.a.s.s.OpenExchangeRatesOrgProvider Reloading exchange rates from open-exchange-rates.json
   [junit4]   2> 1589818 INFO  (TEST-AutoCommitTest.testMaxDocs-seed#[5E6A38C7C7029FF9]) [    x:collection1] o.a.s.c.ConfigSetProperties Did not find ConfigSet properties, assuming default properties: Can't find resource 'configsetprops.json' in classpath or '/export/home/jenkins/workspace/Lucene-Solr-6.x-Solaris/solr/core/src/test-files/solr/collection1'
   [junit4]   2> 1589818 INFO  (TEST-AutoCommitTest.testMaxDocs-seed#[5E6A38C7C7029FF9]) [    x:collection1] o.a.s.c.CoreContainer Reloading SolrCore 'collection1' using configuration from instancedir /export/home/jenkins/workspace/Lucene-Solr-6.x-Solaris/solr/core/src/test-files/solr/collection1
   [junit4]   2> 1589818 INFO  (TEST-AutoCommitTest.testMaxDocs-seed#[5E6A38C7C7029FF9]) [    x:collection1] o.a.s.c.SolrCore [[collection1] ] Opening new SolrCore at [/export/home/jenkins/workspace/Lucene-Solr-6.x-Solaris/solr/core/src/test-files/solr/collection1], dataDir=[/export/home/jenkins/workspace/Lucene-Solr-6.x-Solaris/solr/build/solr-core/test/J0/temp/solr.update.AutoCommitTest_5E6A38C7C7029FF9-001/init-core-data-001/]
   [junit4]   2> 1589819 INFO  (TEST-AutoCommitTest.testMaxDocs-seed#[5E6A38C7C7029FF9]) [    x:collection1] o.a.s.c.JmxMonitoredMap JMX monitoring is enabled. Adding Solr mbeans to JMX Server: com.sun.jmx.mbeanserver.JmxMBeanServer@759dfd56
   [junit4]   2> 1589819 INFO  (TEST-AutoCommitTest.testMaxDocs-seed#[5E6A38C7C7029FF9]) [    x:collection1] o.a.s.c.SolrCore New index directory detected: old=null new=/export/home/jenkins/workspace/Lucene-Solr-6.x-Solaris/solr/build/solr-core/test/J0/temp/solr.update.AutoCommitTest_5E6A38C7C7029FF9-001/init-core-data-001/index/
   [junit4]   2> 1589819 INFO  (OldIndexDirectoryCleanupThreadForCore-collection1) [    x:collection1] o.a.s.c.SolrCore Looking for old index directories to cleanup for core collection1 in /export/home/jenkins/workspace/Lucene-Solr-6.x-Solaris/solr/build/solr-core/test/J0/temp/solr.update.AutoCommitTest_5E6A38C7C7029FF9-001/init-core-data-001/
   [junit4]   2> 1589824 INFO  (TEST-AutoCommitTest.testMaxDocs-seed#[5E6A38C7C7029FF9]) [    x:collection1] o.a.s.u.p.UpdateRequestProcessorChain creating updateRequestProcessorChain "dedupe"
   [junit4]   2> 1589824 INFO  (TEST-AutoCommitTest.testMaxDocs-seed#[5E6A38C7C7029FF9]) [    x:collection1] o.a.s.u.p.UpdateRequestProcessorChain inserting DistributedUpdateProcessorFactory into updateRequestProcessorChain "dedupe"
   [junit4]   2> 1589824 INFO  (TEST-AutoCommitTest.testMaxDocs-seed#[5E6A38C7C7029FF9]) [    x:collection1] o.a.s.u.p.UpdateRequestProcessorChain creating updateRequestProcessorChain "dedupe-allfields"
   [junit4]   2> 1589825 INFO  (TEST-AutoCommitTest.testMaxDocs-seed#[5E6A38C7C7029FF9]) [    x:collection1] o.a.s.u.p.UpdateRequestProcessorChain inserting DistributedUpdateProcessorFactory into updateRequestProcessorChain "dedupe-allfields"
   [junit4]   2> 1589825 INFO  (TEST-AutoCommitTest.testMaxDocs-seed#[5E6A38C7C7029FF9]) [    x:collection1] o.a.s.u.p.UpdateRequestProcessorChain creating updateRequestProcessorChain "stored_sig"
   [junit4]   2> 1589825 INFO  (TEST-AutoCommitTest.testMaxDocs-seed#[5E6A38C7C7029FF9]) [    x:collection1] o.a.s.u.p.UpdateRequestProcessorChain inserting DistributedUpdateProcessorFactory into updateRequestProcessorChain "stored_sig"
   [junit4]   2> 1589825 INFO  (TEST-AutoCommitTest.testMaxDocs-seed#[5E6A38C7C7029FF9]) [    x:collection1] o.a.s.u.p.UpdateRequestProcessorChain creating updateRequestProcessorChain "uniq-fields"
   [junit4]   2> 1589825 INFO  (TEST-AutoCommitTest.testMaxDocs-seed#[5E6A38C7C7029FF9]) [    x:collection1] o.a.s.u.p.UpdateRequestProcessorChain inserting DistributedUpdateProcessorFactory into updateRequestProcessorChain "uniq-fields"
   [junit4]   2> 1589825 INFO  (TEST-AutoCommitTest.testMaxDocs-seed#[5E6A38C7C7029FF9]) [    x:collection1] o.a.s.u.p.UpdateRequestProcessorChain creating updateRequestProcessorChain "distrib-dup-test-chain-explicit"
   [junit4]   2> 1589826 INFO  (TEST-AutoCommitTest.testMaxDocs-seed#[5E6A38C7C7029FF9]) [    x:collection1] o.a.s.u.p.UpdateRequestProcessorChain creating updateRequestProcessorChain "distrib-dup-test-chain-implicit"
   [junit4]   2> 1589826 INFO  (TEST-AutoCommitTest.testMaxDocs-seed#[5E6A38C7C7029FF9]) [    x:collection1] o.a.s.u.p.UpdateRequestProcessorChain inserting DistributedUpdateProcessorFactory into updateRequestProcessorChain "distrib-dup-test-chain-implicit"
   [junit4]   2> 1589826 INFO  (TEST-AutoCommitTest.testMaxDocs-seed#[5E6A38C7C7029FF9]) [    x:collection1] o.a.s.c.SolrCore no updateRequestProcessorChain defined as default, creating implicit default
   [junit4]   2> 1589829 INFO  (TEST-AutoCommitTest.testMaxDocs-seed#[5E6A38C7C7029FF9]) [    x:collection1] o.a.s.h.l.XMLLoader xsltCacheLifetimeSeconds=60
   [junit4]   2> 1589831 INFO  (TEST-AutoCommitTest.testMaxDocs-seed#[5E6A38C7C7029FF9]) [    x:collection1] o.a.s.h.l.XMLLoader xsltCacheLifetimeSeconds=60
   [junit4]   2> 1589832 INFO  (TEST-AutoCommitTest.testMaxDocs-seed#[5E6A38C7C7029FF9]) [    x:collection1] o.a.s.h.l.XMLLoader xsltCacheLifetimeSeconds=60
   [junit4]   2> 1589834 INFO  (TEST-AutoCommitTest.testMaxDocs-seed#[5E6A38C7C7029FF9]) [    x:collection1] o.a.s.h.l.XMLLoader xsltCacheLifetimeSeconds=60
   [junit4]   2> 1589857 INFO  (TEST-AutoCommitTest.testMaxDocs-seed#[5E6A38C7C7029FF9]) [    x:collection1] o.a.s.c.PluginBag requestHandler : 'lazy' created with startup=lazy 
   [junit4]   2> 1589858 INFO  (TEST-AutoCommitTest.testMaxDocs-seed#[5E6A38C7C7029FF9]) [    x:collection1] o.a.s.c.RequestHandlers Registered paths: /admin/mbeans,standard,spellCheckCompRH,lazy,/update/json/docs,/admin/luke,/export,spellCheckWithWordbreak_Direct,tvrh,/get,/admin/properties,/update/json,mltrh,/admin/threads,/search-facet-def,/update/csv,/sql,/search-facet-invariants,/admin/segments,spellCheckCompRH1,/mlt,/admin/system,/replication,dismax,defaults,/config,/stream,/schema,/admin/plugins,/admin/logging,spellCheckWithWordbreak,mock,/admin/ping,/update,/admin/file,/terms,spellCheckCompRH_Direct,/debug/dump
   [junit4]   2> 1589859 INFO  (TEST-AutoCommitTest.testMaxDocs-seed#[5E6A38C7C7029FF9]) [    x:collection1] o.a.s.c.SolrCore Using default statsCache cache: org.apache.solr.search.stats.LocalStatsCache
   [junit4]   2> 1589859 INFO  (TEST-AutoCommitTest.testMaxDocs-seed#[5E6A38C7C7029FF9]) [    x:collection1] o.a.s.u.CommitTracker Hard AutoCommit: disabled
   [junit4]   2> 1589859 INFO  (TEST-AutoCommitTest.testMaxDocs-seed#[5E6A38C7C7029FF9]) [    x:collection1] o.a.s.u.CommitTracker Soft AutoCommit: disabled
   [junit4]   2> 1589860 INFO  (TEST-AutoCommitTest.testMaxDocs-seed#[5E6A38C7C7029FF9]) [    x:collection1] o.a.s.s.SolrIndexSearcher Opening [Searcher@2560a732[collection1] main]
   [junit4]   2> 1589860 INFO  (TEST-AutoCommitTest.testMaxDocs-seed#[5E6A38C7C7029FF9]) [    x:collection1] o.a.s.r.RestManager Initializing RestManager with initArgs: {storageIO=org.apache.solr.rest.ManagedResourceStorage$InMemoryStorageIO}
   [junit4]   2> 1589860 INFO  (TEST-AutoCommitTest.testMaxDocs-seed#[5E6A38C7C7029FF9]) [    x:collection1] o.a.s.r.ManagedResourceStorage Reading _rest_managed.json using InMemoryStorage
   [junit4]   2> 1589860 INFO  (TEST-AutoCommitTest.testMaxDocs-seed#[5E6A38C7C7029FF9]) [    x:collection1] o.a.s.r.RestManager Initializing 0 registered ManagedResources
   [junit4]   2> 1589860 INFO  (TEST-AutoCommitTest.testMaxDocs-seed#[5E6A38C7C7029FF9]) [    x:collection1] o.a.s.h.c.SpellCheckComponent Initializing spell checkers
   [junit4]   2> 1589861 INFO  (TEST-AutoCommitTest.testMaxDocs-seed#[5E6A38C7C7029FF9]) [    x:collection1] o.a.s.s.DirectSolrSpellChecker init: {name=direct,classname=DirectSolrSpellChecker,field=lowerfilt,minQueryLength=3}
   [junit4]   2> 1589865 INFO  (TEST-AutoCommitTest.testMaxDocs-seed#[5E6A38C7C7029FF9]) [    x:collection1] o.a.s.h.ReplicationHandler Commits will be reserved for  10000
   [junit4]   2> 1589865 INFO  (searcherExecutor-4872-thread-1-processing-x:collection1) [    x:collection1] o.a.s.h.c.SpellCheckComponent Loading spell index for spellchecker: default
   [junit4]   2> 1589865 INFO  (TEST-AutoCommitTest.testMaxDocs-seed#[5E6A38C7C7029FF9]) [    x:collection1] o.a.s.u.UpdateLog Looking up max value of version field to seed version buckets
   [junit4]   2> 1589865 INFO  (searcherExecutor-4872-thread-1-processing-x:collection1) [    x:collection1] o.a.s.h.c.SpellCheckComponent Loading spell index for spellchecker: direct
   [junit4]   2> 1589865 INFO  (searcherExecutor-4872-thread-1-processing-x:collection1) [    x:collection1] o.a.s.h.c.SpellCheckComponent Loading spell index for spellchecker: wordbreak
   [junit4]   2> 1589865 INFO  (searcherExecutor-4872-thread-1-processing-x:collection1) [    x:collection1] o.a.s.h.c.SpellCheckComponent Loading spell index for spellchecker: multipleFields
   [junit4]   2> 1589865 INFO  (TEST-AutoCommitTest.testMaxDocs-seed#[5E6A38C7C7029FF9]) [    x:collection1] o.a.s.u.VersionInfo Refreshing highest value of _version_ for 65536 version buckets from index
   [junit4]   2> 1589866 INFO  (TEST-AutoCommitTest.testMaxDocs-seed#[5E6A38C7C7029FF9]) [    x:collection1] o.a.s.u.VersionInfo No terms found for _version_, cannot seed version bucket highest value from index
   [junit4]   2> 1589866 INFO  (searcherExecutor-4872-thread-1-processing-x:collection1) [    x:collection1] o.a.s.h.c.SpellCheckComponent Loading spell index for spellchecker: jarowinkler
   [junit4]   2> 1589867 INFO  (searcherExecutor-4872-thread-1-processing-x:collection1) [    x:collection1] o.a.s.h.c.SpellCheckComponent Loading spell index for spellchecker: external
   [junit4]   2> 1589867 INFO  (TEST-AutoCommitTest.testMaxDocs-seed#[5E6A38C7C7029FF9]) [    x:collection1] o.a.s.u.UpdateLog Took 2.0ms to seed version buckets with highest version 1529445222169182208
   [junit4]   2> 1589868 INFO  (TEST-AutoCommitTest.testMaxDocs-seed#[5E6A38C7C7029FF9]) [    x:collection1] o.a.s.u.DefaultSolrCoreState Closing old IndexWriter... core=collection1
   [junit4]   2> 1589868 INFO  (TEST-AutoCommitTest.testMaxDocs-seed#[5E6A38C7C7029FF9]) [    x:collection1] o.a.s.c.SolrDeletionPolicy SolrDeletionPolicy.onCommit: commits: num=2
   [junit4]   2> 	commit{dir=MockDirectoryWrapper(RAMDirectory@3fb3e029 lockFactory=org.apache.lucene.store.SingleInstanceLockFactory@7ed24371),segFN=segments_1,generation=1}
   [junit4]   2> 	commit{dir=MockDirectoryWrapper(RAMDirectory@3fb3e029 lockFactory=org.apache.lucene.store.SingleInstanceLockFactory@7ed24371),segFN=segments_2,generation=2}
   [junit4]   2> 1589868 INFO  (TEST-AutoCommitTest.testMaxDocs-seed#[5E6A38C7C7029FF9]) [    x:collection1] o.a.s.c.SolrDeletionPolicy newest commit generation = 2
   [junit4]   2> 1589868 INFO  (searcherExecutor-4872-thread-1-processing-x:collection1) [    x:collection1] o.a.s.h.c.SpellCheckComponent Loading spell index for spellchecker: freq
   [junit4]   2> 1589868 INFO  (TEST-AutoCommitTest.testMaxDocs-seed#[5E6A38C7C7029FF9]) [    x:collection1] o.a.s.u.RandomMergePolicy RandomMergePolicy wrapping class org.apache.lucene.index.TieredMergePolicy: [TieredMergePolicy: maxMergeAtOnce=49, maxMergeAtOnceExplicit=14, maxMergedSegmentMB=16.23828125, floorSegmentMB=1.923828125, forceMergeDeletesPctAllowed=17.862193323091542, segmentsPerTier=42.0, maxCFSSegmentSizeMB=8.796093022207999E12, noCFSRatio=0.8317210649505141
   [junit4]   2> 1589868 INFO  (searcherExecutor-4872-thread-1-processing-x:collection1) [    x:collection1] o.a.s.h.c.SpellCheckComponent Loading spell index for spellchecker: fqcn
   [junit4]   2> 1589869 INFO  (searcherExecutor-4872-thread-1-processing-x:collection1) [    x:collection1] o.a.s.h.c.SpellCheckComponent Loading spell index for spellchecker: perDict
   [junit4]   2> 1589870 INFO  (searcherExecutor-4872-thread-1-processing-x:collection1) [    x:collection1] o.a.s.c.SolrCore [collection1] Registered new searcher Searcher@2560a732[collection1] main{ExitableDirectoryReader(UninvertingDirectoryReader())}
   [junit4]   2> 1589870 INFO  (TEST-AutoCommitTest.testMaxDocs-seed#[5E6A38C7C7029FF9]) [    x:collection1] o.a.s.c.SolrDeletionPolicy SolrDeletionPolicy.onInit: commits: num=1
   [junit4]   2> 	commit{dir=MockDirectoryWrapper(RAMDirectory@3fb3e029 lockFactory=org.apache.lucene.store.SingleInstanceLockFactory@7ed24371),segFN=segments_2,generation=2}
   [junit4]   2> 1589870 INFO  (TEST-AutoCommitTest.testMaxDocs-seed#[5E6A38C7C7029FF9]) [    x:collection1] o.a.s.c.SolrDeletionPolicy newest commit generation = 2
   [junit4]   2> 1589870 INFO  (TEST-AutoCommitTest.testMaxDocs-seed#[5E6A38C7C7029FF9]) [    x:collection1] o.a.s.u.DefaultSolrCoreState New IndexWriter is ready to be used.
   [junit4]   2> 1589870 INFO  (TEST-AutoCommitTest.testMaxDocs-seed#[5E6A38C7C7029FF9]) [    x:collection1] o.a.s.s.SolrIndexSearcher Opening [Searcher@5ab702fa[collection1] main]
   [junit4]   2> 1589871 INFO  (TEST-AutoCommitTest.testMaxDocs-seed#[5E6A38C7C7029FF9]) [    x:collection1] o.a.s.c.CoreContainer replacing core: collection1
   [junit4]   2> 1589871 INFO  (TEST-AutoCommitTest.testMaxDocs-seed#[5E6A38C7C7029FF9]) [    x:collection1] o.a.s.c.SolrCore [collection1]  CLOSING SolrCore org.apache.solr.core.SolrCore@2b5e157e
   [junit4]   2> 1589871 INFO  (TEST-AutoCommitTest.testMaxDocs-seed#[5E6A38C7C7029FF9]) [    x:collection1] o.a.s.u.DirectUpdateHandler2 closing DirectUpdateHandler2{commits=3,autocommits=0,soft autocommit maxTime=1000ms,soft autocommits=3,optimizes=0,rollbacks=0,expungeDeletes=0,docsPending=14,adds=1,deletesById=0,deletesByQuery=1,errors=0,cumulative_adds=14,cumulative_deletesById=1,cumulative_deletesByQuery=1,cumulative_errors=0,transaction_logs_total_size=0,transaction_logs_total_number=0}
   [junit4]   2> 1589872 INFO  (TEST-AutoCommitTest.testMaxDocs-seed#[5E6A38C7C7029FF9]) [    x:collection1] o.a.s.c.SolrCore [collection1] Closing main searcher on request.
   [junit4]   2> 1589880 INFO  (searcherExecutor-4872-thread-1-processing-x:collection1) [    x:collection1] o.a.s.c.SolrCore [collection1] Registered new searcher Searcher@5ab702fa[collection1] main{ExitableDirectoryReader(UninvertingDirectoryReader())}
   [junit4]   2> 1589881 INFO  (TEST-AutoCommitTest.testMaxDocs-seed#[5E6A38C7C7029FF9]) [    x:collection1] o.a.s.u.p.LogUpdateProcessorFactory [collection1] {add=[0 (1529445222432374784)]} 0 2
   [junit4]   2> 1589882 INFO  (TEST-AutoCommitTest.testMaxDocs-seed#[5E6A38C7C7029FF9]) [    x:collection1] o.a.s.u.p.LogUpdateProcessorFactory [collection1] {add=[1 (1529445222434471936)]} 0 2
   [junit4]   2> 1589900 INFO  (TEST-AutoCommitTest.testMaxDocs-seed#[5E6A38C7C7029FF9]) [    x:collection1] o.a.s.u.p.LogUpdateProcessorFactory [collection1] {add=[2 (1529445222435520512)]} 0 21
   [junit4]   2> 1589900 INFO  (TEST-AutoCommitTest.testMaxDocs-seed#[5E6A38C7C7029FF9]) [    x:collection1] o.a.s.u.p.LogUpdateProcessorFactory [collection1] {add=[3 (1529445222454394880)]} 0 21
   [junit4]   2> 1589901 INFO  (TEST-AutoCommitTest.testMaxDocs-seed#[5E6A38C7C7029FF9]) [    x:collection1] o.a.s.u.p.LogUpdateProcessorFactory [collection1] {add=[4 (1529445222455443456)]} 0 22
   [junit4]   2> 1589901 INFO  (TEST-AutoCommitTest.testMaxDocs-seed#[5E6A38C7C7029FF9]) [    x:collection1] o.a.s.u.p.LogUpdateProcessorFactory [collection1] {add=[5 (1529445222455443457)]} 0 22
   [junit4]   2> 1589902 INFO  (TEST-AutoCommitTest.testMaxDocs-seed#[5E6A38C7C7029FF9]) [    x:collection1] o.a.s.u.p.LogUpdateProcessorFactory [collection1] {add=[6 (1529445222455443458)]} 0 22
   [junit4]   2> 1589902 INFO  (TEST-AutoCommitTest.testMaxDocs-seed#[5E6A38C7C7029FF9]) [    x:collection1] o.a.s.u.p.LogUpdateProcessorFactory [collection1] {add=[7 (1529445222456492032)]} 0 22
   [junit4]   2> 1589902 INFO  (TEST-AutoCommitTest.testMaxDocs-seed#[5E6A38C7C7029FF9]) [    x:collection1] o.a.s.u.p.LogUpdateProcessorFactory [collection1] {add=[8 (1529445222456492033)]} 0 23
   [junit4]   2> 1589902 INFO  (TEST-AutoCommitTest.testMaxDocs-seed#[5E6A38C7C7029FF9]) [    x:collection1] o.a.s.u.p.LogUpdateProcessorFactory [collection1] {add=[9 (1529445222456492034)]} 0 23
   [junit4]   2> 1589902 INFO  (TEST-AutoCommitTest.testMaxDocs-seed#[5E6A38C7C7029FF9]) [    x:collection1] o.a.s.u.p.LogUpdateProcessorFactory [collection1] {add=[10 (1529445222456492035)]} 0 23
   [junit4]   2> 1589903 INFO  (TEST-AutoCommitTest.testMaxDocs-seed#[5E6A38C7C7029FF9]) [    x:collection1] o.a.s.u.p.LogUpdateProcessorFactory [collection1] {add=[11 (1529445222456492036)]} 0 23
   [junit4]   2> 1589903 INFO  (TEST-AutoCommitTest.testMaxDocs-seed#[5E6A38C7C7029FF9]) [    x:collection1] o.a.s.u.p.LogUpdateProcessorFactory [collection1] {add=[12 (1529445222457540608)]} 0 24
   [junit4]   2> 1589903 INFO  (TEST-AutoCommitTest.testMaxDocs-seed#[5E6A38C7C7029FF9]) [    x:collection1] o.a.s.u.p.LogUpdateProcessorFactory [collection1] {add=[13 (1529445222457540609)]} 0 24
   [junit4]   2> 1589904 INFO  (TEST-AutoCommitTest.testMaxDocs-seed#[5E6A38C7C7029FF9]) [    x:collection1] o.a.s.c.S.Request [collection1]  webapp=null path=null params={q=id:1&qt=standard&start=0&rows=20&version=2.2} hits=0 status=0 QTime=0
   [junit4]   2> 1589904 INFO  (TEST-AutoCommitTest.testMaxDocs-seed#[5E6A38C7C7029FF9]) [    x:collection1] o.a.s.u.p.LogUpdateProcessorFactory [collection1] {add=[14 (1529445222458589184)]} 0 25
   [junit4]   2> 1589904 INFO  (TEST-AutoCommitTest.testMaxDocs-seed#[5E6A38C7C7029FF9]) [    x:collection1] o.a.s.u.p.LogUpdateProcessorFactory [collection1] {add=[15 (1529445222458589185)]} 0 25
   [junit4]   2> 1589905 INFO  (TEST-AutoCommitTest.testMaxDocs-seed#[5E6A38C7C7029FF9]) [    x:collection1] o.a.s.c.S.Request [collection1]  webapp=null path=null params={q=id:14&qt=standard&start=0&rows=20&version=2.2} hits=0 status=0 QTime=0
   [junit4]   2> 1589905 ERROR (TEST-AutoCommitTest.testMaxDocs-seed#[5E6A38C7C7029FF9]) [    x:collection1] o.a.s.SolrTestCaseJ4 REQUEST FAILED: xpath=//result[@numFound=1]
   [junit4]   2> 	xml response was: <?xml version="1.0" encoding="UTF-8"?>
   [junit4]   2> <response>
   [junit4]   2> <lst name="responseHeader"><int name="status">0</int><int name="QTime">0</int></lst><result name="response" numFound="0" start="0"></result>
   [junit4]   2> </response>
   [junit4]   2> 
   [junit4]   2> 	request was:q=id:14&qt=standard&start=0&rows=20&version=2.2
   [junit4]   2> 1589906 ERROR (TEST-AutoCommitTest.testMaxDocs-seed#[5E6A38C7C7029FF9]) [    x:collection1] o.a.s.SolrTestCaseJ4 REQUEST FAILED: q=id:14&qt=standard&start=0&rows=20&version=2.2:java.lang.RuntimeException: REQUEST FAILED: xpath=//result[@numFound=1]
   [junit4]   2> 	xml response was: <?xml version="1.0" encoding="UTF-8"?>
   [junit4]   2> <response>
   [junit4]   2> <lst name="responseHeader"><int name="status">0</int><int name="QTime">0</int></lst><result name="response" numFound="0" start="0"></result>
   [junit4]   2> </response>
   [junit4]   2> 
   [junit4]   2> 	request was:q=id:14&qt=standard&start=0&rows=20&version=2.2
   [junit4]   2> 	at org.apache.solr.SolrTestCaseJ4.assertQ(SolrTestCaseJ4.java:758)
   [junit4]   2> 	at org.apache.solr.update.AutoCommitTest.testMaxDocs(AutoCommitTest.java:198)
   [junit4]   2> 	at sun.reflect.NativeMethodAccessorImpl.invoke0(Native Method)
   [junit4]   2> 	at sun.reflect.NativeMethodAccessorImpl.invoke(NativeMethodAccessorImpl.java:62)
   [junit4]   2> 	at sun.reflect.DelegatingMethodAccessorImpl.invoke(DelegatingMethodAccessorImpl.java:43)
   [junit4]   2> 	at java.lang.reflect.Method.invoke(Method.java:498)
   [junit4]   2> 	at com.carrotsearch.randomizedtesting.RandomizedRunner.invoke(RandomizedRunner.java:1764)
   [junit4]   2> 	at com.carrotsearch.randomizedtesting.RandomizedRunner$8.evaluate(RandomizedRunner.java:871)
   [junit4]   2> 	at com.carrotsearch.randomizedtesting.RandomizedRunner$9.evaluate(RandomizedRunner.java:907)
   [junit4]   2> 	at com.carrotsearch.randomizedtesting.RandomizedRunner$10.evaluate(RandomizedRunner.java:921)
   [junit4]   2> 	at com.carrotsearch.randomizedtesting.rules.SystemPropertiesRestoreRule$1.evaluate(SystemPropertiesRestoreRule.java:57)
   [junit4]   2> 	at org.apache.lucene.util.TestRuleSetupTeardownChained$1.evaluate(TestRuleSetupTeardownChained.java:49)
   [junit4]   2> 	at org.apache.lucene.util.AbstractBeforeAfterRule$1.evaluate(AbstractBeforeAfterRule.java:45)
   [junit4]   2> 	at org.apache.lucene.util.TestRuleThreadAndTestName$1.evaluate(TestRuleThreadAndTestName.java:48)
   [junit4]   2> 	at org.apache.lucene.util.TestRuleIgnoreAfterMaxFailures$1.evaluate(TestRuleIgnoreAfterMaxFailures.java:64)
   [junit4]   2> 	at org.apache.lucene.util.TestRuleMarkFailure$1.evaluate(TestRuleMarkFailure.java:47)
   [junit4]   2> 	at com.carrotsearch.randomizedtesting.rules.StatementAdapter.evaluate(StatementAdapter.java:36)
   [junit4]   2> 	at com.carrotsearch.randomizedtesting.ThreadLeakControl$StatementRunner.run(ThreadLeakControl.java:367)
   [junit4]   2> 	at com.carrotsearch.randomizedtesting.ThreadLeakControl.forkTimeoutingTask(ThreadLeakControl.java:809)
   [junit4]   2> 	at com.carrotsearch.randomizedtesting.ThreadLeakControl$3.evaluate(ThreadLeakControl.java:460)
   [junit4]   2> 	at com.carrotsearch.randomizedtesting.RandomizedRunner.runSingleTest(RandomizedRunner.java:880)
   [junit4]   2> 	at com.carrotsearch.randomizedtesting.RandomizedRunner$5.evaluate(RandomizedRunner.java:781)
   [junit4]   2> 	at com.carrotsearch.randomizedtesting.RandomizedRunner$6.evaluate(RandomizedRunner.java:816)
   [junit4]   2> 	at com.carrotsearch.randomizedtesting.RandomizedRunner$7.evaluate(RandomizedRunner.java:827)
   [junit4]   2> 	at com.carrotsearch.randomizedtesting.rules.StatementAdapter.evaluate(StatementAdapter.java:36)
   [junit4]   2> 	at com.carrotsearch.randomizedtesting.rules.SystemPropertiesRestoreRule$1.evaluate(SystemPropertiesRestoreRule.java:57)
   [junit4]   2> 	at org.apache.lucene.util.AbstractBeforeAfterRule$1.evaluate(AbstractBeforeAfterRule.java:45)
   [junit4]   2> 	at com.carrotsearch.randomizedtesting.rules.StatementAdapter.evaluate(StatementAdapter.java:36)
   [junit4]   2> 	at org.apache.lucene.util.TestRuleStoreClassName$1.evaluate(TestRuleStoreClassName.java:41)
   [junit4]   2> 	at com.carrotsearch.randomizedtesting.rules.NoShadowingOrOverridesOnMethodsRule$1.evaluate(NoShadowingOrOverridesOnMethodsRule.java:40)
   [junit4]   2> 	at com.carrotsearch.randomizedtesting.rules.NoShadowingOrOverridesOnMethodsRule$1.evaluate(NoShadowingOrOverridesOnMethodsRule.java:40)
   [junit4]   2> 	at com.carrotsearch.randomizedtesting.rules.StatementAdapter.evaluate(StatementAdapter.java:36)
   [junit4]   2> 	at com.carrotsearch.randomizedtesting.rules.StatementAdapter.evaluate(StatementAdapter.java:36)
   [junit4]   2> 	at com.carrotsearch.randomizedtesting.rules.StatementAdapter.evaluate(StatementAdapter.java:36)
   [junit4]   2> 	at org.apache.lucene.util.TestRuleAssertionsRequired$1.evaluate(TestRuleAssertionsRequired.java:53)
   [junit4]   2> 	at org.apache.lucene.util.TestRuleMarkFailure$1.evaluate(TestRuleMarkFailure.java:47)
   [junit4]   2> 	at org.apache.lucene.util.TestRuleIgnoreAfterMaxFailures$1.evaluate(TestRuleIgnoreAfterMaxFailures.java:64)
   [junit4]   2> 	at org.apache.lucene.util.TestRuleIgnoreTestSuites$1.evaluate(TestRuleIgnoreTestSuites.java:54)
   [junit4]   2> 	at com.carrotsearch.randomizedtesting.rules.StatementAdapter.evaluate(StatementAdapter.java:36)
   [junit4]   2> 	at com.carrotsearch.randomizedtesting.ThreadLeakControl$StatementRunner.run(ThreadLeakControl.java:367)
   [junit4]   2> 	at java.lang.Thread.run(Thread.java:745)
   [junit4]   2> 
   [junit4]   2> 1589906 INFO  (commitScheduler-4875-thread-1) [    x:collection1] o.a.s.u.DirectUpdateHandler2 start commit{,optimize=false,openSearcher=true,waitSearcher=true,expungeDeletes=false,softCommit=true,prepareCommit=false}
   [junit4]   2> 1589906 INFO  (TEST-AutoCommitTest.testMaxDocs-seed#[5E6A38C7C7029FF9]) [    x:collection1] o.a.s.SolrTestCaseJ4 ###Ending testMaxDocs
   [junit4]   2> 1589911 INFO  (commitScheduler-4875-thread-1) [    x:collection1] o.a.s.s.SolrIndexSearcher Opening [Searcher@7dfc33bf[collection1] main]
   [junit4]   2> 1589911 INFO  (commitScheduler-4875-thread-1) [    x:collection1] o.a.s.u.DirectUpdateHandler2 end_commit_flush
   [junit4]   2> 1589912 INFO  (searcherExecutor-4872-thread-1-processing-x:collection1) [    x:collection1] o.a.s.c.SolrCore [collection1] Registered new searcher Searcher@7dfc33bf[collection1] main{ExitableDirectoryReader(UninvertingDirectoryReader(Uninverting(_4(6.1.0):C16)))}
   [junit4]   2> NOTE: reproduce with: ant test  -Dtestcase=AutoCommitTest -Dtests.method=testMaxDocs -Dtests.seed=5E6A38C7C7029FF9 -Dtests.slow=true -Dtests.locale=zh-CN -Dtests.timezone=Etc/UTC -Dtests.asserts=true -Dtests.file.encoding=ISO-8859-1
   [junit4] ERROR   0.29s J0 | AutoCommitTest.testMaxDocs <<<
   [junit4]    > Throwable #1: java.lang.RuntimeException: Exception during query
   [junit4]    > 	at __randomizedtesting.SeedInfo.seed([5E6A38C7C7029FF9:E7EBEE18EBE89B73]:0)
   [junit4]    > 	at org.apache.solr.SolrTestCaseJ4.assertQ(SolrTestCaseJ4.java:765)
   [junit4]    > 	at org.apache.solr.update.AutoCommitTest.testMaxDocs(AutoCommitTest.java:198)
   [junit4]    > 	at java.lang.Thread.run(Thread.java:745)
   [junit4]    > Caused by: java.lang.RuntimeException: REQUEST FAILED: xpath=//result[@numFound=1]
   [junit4]    > 	xml response was: <?xml version="1.0" encoding="UTF-8"?>
   [junit4]    > <response>
   [junit4]    > <lst name="responseHeader"><int name="status">0</int><int name="QTime">0</int></lst><result name="response" numFound="0" start="0"></result>
   [junit4]    > </response>
   [junit4]    > 	request was:q=id:14&qt=standard&start=0&rows=20&version=2.2
   [junit4]    > 	at org.apache.solr.SolrTestCaseJ4.assertQ(SolrTestCaseJ4.java:758)
   [junit4]    > 	... 40 more
   [junit4]   2> 1589919 INFO  (TEST-AutoCommitTest.testCommitWithin-seed#[5E6A38C7C7029FF9]) [    x:collection1] o.a.s.SolrTestCaseJ4 ###Starting testCommitWithin
   [junit4]   2> 1589920 INFO  (TEST-AutoCommitTest.testCommitWithin-seed#[5E6A38C7C7029FF9]) [    x:collection1] o.a.s.s.SolrIndexSearcher Opening [Searcher@f82a601[collection1] realtime]
   [junit4]   2> 1589920 INFO  (TEST-AutoCommitTest.testCommitWithin-seed#[5E6A38C7C7029FF9]) [    x:collection1] o.a.s.u.p.LogUpdateProcessorFactory [collection1]  webapp=null path=null params={}{deleteByQuery=*:* (-1529445222474317824)} 0 1
   [junit4]   2> 1589921 INFO  (TEST-AutoCommitTest.testCommitWithin-seed#[5E6A38C7C7029FF9]) [    x:collection1] o.a.s.c.SolrResourceLoader new SolrResourceLoader for directory: '/export/home/jenkins/workspace/Lucene-Solr-6.x-Solaris/solr/core/src/test-files/solr/collection1'
   [junit4]   2> 1589921 INFO  (TEST-AutoCommitTest.testCommitWithin-seed#[5E6A38C7C7029FF9]) [    x:collection1] o.a.s.c.SolrResourceLoader JNDI not configured for solr (NoInitialContextEx)
   [junit4]   2> 1589921 INFO  (TEST-AutoCommitTest.testCommitWithin-seed#[5E6A38C7C7029FF9]) [    x:collection1] o.a.s.c.SolrResourceLoader using system property solr.solr.home: /export/home/jenkins/workspace/Lucene-Solr-6.x-Solaris/solr/core/src/test-files/solr
   [junit4]   2> 1589921 INFO  (TEST-AutoCommitTest.testCommitWithin-seed#[5E6A38C7C7029FF9]) [    x:collection1] o.a.s.c.SolrResourceLoader Adding 'file:/export/home/jenkins/workspace/Lucene-Solr-6.x-Solaris/solr/core/src/test-files/solr/collection1/lib/classes/' to classloader
   [junit4]   2> 1589921 INFO  (TEST-AutoCommitTest.testCommitWithin-seed#[5E6A38C7C7029FF9]) [    x:collection1] o.a.s.c.SolrResourceLoader Adding 'file:/export/home/jenkins/workspace/Lucene-Solr-6.x-Solaris/solr/core/src/test-files/solr/collection1/lib/README' to classloader
   [junit4]   2> 1589953 INFO  (TEST-AutoCommitTest.testCommitWithin-seed#[5E6A38C7C7029FF9]) [    x:collection1] o.a.s.c.SolrConfig current version of requestparams : -1
   [junit4]   2> 1589960 WARN  (TEST-AutoCommitTest.testCommitWithin-seed#[5E6A38C7C7029FF9]) [    x:collection1] o.a.s.c.Config Beginning with Solr 5.5, <mergePolicy> is deprecated, use <mergePolicyFactory> instead.
   [junit4]   2> 1589962 INFO  (TEST-AutoCommitTest.testCommitWithin-seed#[5E6A38C7C7029FF9]) [    x:collection1] o.a.s.c.SolrConfig Using Lucene MatchVersion: 6.1.0
   [junit4]   2> 1589977 INFO  (TEST-AutoCommitTest.testCommitWithin-seed#[5E6A38C7C7029FF9]) [    x:collection1] o.a.s.c.SolrConfig Loaded SolrConfig: solrconfig.xml
   [junit4]   2> 1589982 INFO  (TEST-AutoCommitTest.testCommitWithin-seed#[5E6A38C7C7029FF9]) [    x:collection1] o.a.s.s.IndexSchema [collection1] Schema name=test
   [junit4]   2> 1590109 INFO  (TEST-AutoCommitTest.testCommitWithin-seed#[5E6A38C7C7029FF9]) [    x:collection1] o.a.s.s.OpenExchangeRatesOrgProvider Initialized with rates=open-exchange-rates.json, refreshInterval=1440.
   [junit4]   2> 1590116 INFO  (TEST-AutoCommitTest.testCommitWithin-seed#[5E6A38C7C7029FF9]) [    x:collection1] o.a.s.s.IndexSchema default search field in schema is text
   [junit4]   2> 1590117 INFO  (TEST-AutoCommitTest.testCommitWithin-seed#[5E6A38C7C7029FF9]) [    x:collection1] o.a.s.s.IndexSchema unique key field: id
   [junit4]   2> 1590120 INFO  (TEST-AutoCommitTest.testCommitWithin-seed#[5E6A38C7C7029FF9]) [    x:collection1] o.a.s.s.FileExchangeRateProvider Reloading exchange rates from file currency.xml
   [junit4]   2> 1590122 INFO  (TEST-AutoCommitTest.testCommitWithin-seed#[5E6A38C7C7029FF9]) [    x:collection1] o.a.s.s.FileExchangeRateProvider Reloading exchange rates from file currency.xml
   [junit4]   2> 1590123 INFO  (TEST-AutoCommitTest.testCommitWithin-seed#[5E6A38C7C7029FF9]) [    x:collection1] o.a.s.s.OpenExchangeRatesOrgProvider Reloading exchange rates from open-exchange-rates.json
   [junit4]   2> 1590125 INFO  (TEST-AutoCommitTest.testCommitWithin-seed#[5E6A38C7C7029FF9]) [    x:collection1] o.a.s.s.OpenExchangeRatesOrgProvider Reloading exchange rates from open-exchange-rates.json
   [junit4]   2> 1590126 INFO  (TEST-AutoCommitTest.testCommitWithin-seed#[5E6A38C7C7029FF9]) [    x:collection1] o.a.s.c.ConfigSetProperties Did not find ConfigSet properties, assuming default properties: Can't find resource 'configsetprops.json' in classpath or '/export/home/jenkins/workspace/Lucene-Solr-6.x-Solaris/solr/core/src/test-files/solr/collection1'
   [junit4]   2> 1590126 INFO  (TEST-AutoCommitTest.testCommitWithin-seed#[5E6A38C7C7029FF9]) [    x:collection1] o.a.s.c.CoreContainer Reloading SolrCore 'collection1' using configuration from instancedir /export/home/jenkins/workspace/Lucene-Solr-6.x-Solaris/solr/core/src/test-files/solr/collection1
   [junit4]   2> 1590127 INFO  (TEST-AutoCommitTest.testCommitWithin-seed#[5E6A38C7C7029FF9]) [    x:collection1] o.a.s.c.SolrCore [[collection1] ] Opening new SolrCore at [/export/home/jenkins/workspace/Lucene-Solr-6.x-Solaris/solr/core/src/test-files/solr/collection1], dataDir=[/export/home/jenkins/workspace/Lucene-Solr-6.x-Solaris/solr/build/solr-core/test/J0/temp/solr.update.AutoCommitTest_5E6A38C7C7029FF9-001/init-core-data-001/]
   [junit4]   2> 1590127 INFO  (TEST-AutoCommitTest.testCommitWithin-seed#[5E6A38C7C7029FF9]) [    x:collection1] o.a.s.c.JmxMonitoredMap JMX monitoring is enabled. Adding Solr mbeans to JMX Server: com.sun.jmx.mbeanserver.JmxMBeanServer@759dfd56
   [junit4]   2> 1590127 INFO  (TEST-AutoCommitTest.testCommitWithin-seed#[5E6A38C7C7029FF9]) [    x:collection1] o.a.s.c.SolrCore New index directory detected: old=null new=/export/home/jenkins/workspace/Lucene-Solr-6.x-Solaris/solr/build/solr-core/test/J0/temp/solr.update.AutoCommitTest_5E6A38C7C7029FF9-001/init-core-data-001/index/
   [junit4]   2> 1590127 INFO  (OldIndexDirectoryCleanupThreadForCore-collection1) [    x:collection1] o.a.s.c.SolrCore Looking for old index directories to cleanup for core collection1 in /export/home/jenkins/workspace/Lucene-Solr-6.x-Solaris/solr/build/solr-core/test/J0/temp/solr.update.AutoCommitTest_5E6A38C7C7029FF9-001/init-core-data-001/
   [junit4]   2> 1590132 INFO  (TEST-AutoCommitTest.testCommitWithin-seed#[5E6A38C7C7029FF9]) [    x:collection1] o.a.s.u.p.UpdateRequestProcessorChain creating updateRequestProcessorChain "dedupe"
   [junit4]   2> 1590132 INFO  (TEST-AutoCommitTest.testCommitWithin-seed#[5E6A38C7C7029FF9]) [    x:collection1] o.a.s.u.p.UpdateRequestProcessorChain inserting DistributedUpdateProcessorFactory into updateRequestProcessorChain "dedupe"
   [junit4]   2> 1590132 INFO  (TEST-AutoCommitTest.testCommitWithin-seed#[5E6A38C7C7029FF9]) [    x:collection1] o.a.s.u.p.UpdateRequestProcessorChain creating updateRequestProcessorChain "dedupe-allfields"
   [junit4]   2> 1590132 INFO  (TEST-AutoCommitTest.testCommitWithin-seed#[5E6A38C7C7029FF9]) [    x:collection1] o.a.s.u.p.UpdateRequestProcessorChain inserting DistributedUpdateProcessorFactory into updateRequestProcessorChain "dedupe-allfields"
   [junit4]   2> 1590132 INFO  (TEST-AutoCommitTest.testCommitWithin-seed#[5E6A38C7C7029FF9]) [    x:collection1] o.a.s.u.p.UpdateRequestProcessorChain creating updateRequestProcessorChain "stored_sig"
   [junit4]   2> 1590132 INFO  (TEST-AutoCommitTest.testCommitWithin-seed#[5E6A38C7C7029FF9]) [    x:collection1] o.a.s.u.p.UpdateRequestProcessorChain inserting DistributedUpd

[...truncated too long message...]

commits=3,autocommits=0,soft autocommits=3,optimizes=0,rollbacks=0,expungeDeletes=0,docsPending=12,adds=0,deletesById=0,deletesByQuery=0,errors=0,cumulative_adds=12,cumulative_deletesById=11,cumulative_deletesByQuery=0,cumulative_errors=0,transaction_logs_total_size=0,transaction_logs_total_number=0}
   [junit4]   2> 1596689 INFO  (coreCloseExecutor-4880-thread-1-processing-x:collection1) [    x:collection1] o.a.s.u.SolrCoreState Closing SolrCoreState
   [junit4]   2> 1596689 INFO  (coreCloseExecutor-4880-thread-1-processing-x:collection1) [    x:collection1] o.a.s.u.DefaultSolrCoreState SolrCoreState ref count has reached 0 - closing IndexWriter
   [junit4]   2> 1596689 INFO  (coreCloseExecutor-4880-thread-1-processing-x:collection1) [    x:collection1] o.a.s.u.DefaultSolrCoreState closing IndexWriter with IndexWriterCloser
   [junit4]   2> 1596689 INFO  (coreCloseExecutor-4880-thread-1-processing-x:collection1) [    x:collection1] o.a.s.u.DirectUpdateHandler2 Committing on IndexWriter close.
   [junit4]   2> 1596690 INFO  (coreCloseExecutor-4880-thread-1-processing-x:collection1) [    x:collection1] o.a.s.c.SolrDeletionPolicy SolrDeletionPolicy.onCommit: commits: num=2
   [junit4]   2> 	commit{dir=MockDirectoryWrapper(RAMDirectory@3fb3e029 lockFactory=org.apache.lucene.store.SingleInstanceLockFactory@7ed24371),segFN=segments_3,generation=3}
   [junit4]   2> 	commit{dir=MockDirectoryWrapper(RAMDirectory@3fb3e029 lockFactory=org.apache.lucene.store.SingleInstanceLockFactory@7ed24371),segFN=segments_4,generation=4}
   [junit4]   2> 1596690 INFO  (coreCloseExecutor-4880-thread-1-processing-x:collection1) [    x:collection1] o.a.s.c.SolrDeletionPolicy newest commit generation = 4
   [junit4]   2> 1596690 INFO  (coreCloseExecutor-4880-thread-1-processing-x:collection1) [    x:collection1] o.a.s.c.SolrCore [collection1] Closing main searcher on request.
   [junit4]   2> 1596698 INFO  (coreCloseExecutor-4880-thread-1-processing-x:collection1) [    x:collection1] o.a.s.c.CachingDirectoryFactory Closing MockDirectoryFactory - 2 directories currently being tracked
   [junit4]   2> 1596698 INFO  (coreCloseExecutor-4880-thread-1-processing-x:collection1) [    x:collection1] o.a.s.c.CachingDirectoryFactory looking to close /export/home/jenkins/workspace/Lucene-Solr-6.x-Solaris/solr/build/solr-core/test/J0/temp/solr.update.AutoCommitTest_5E6A38C7C7029FF9-001/init-core-data-001/index [CachedDir<<refCount=0;path=/export/home/jenkins/workspace/Lucene-Solr-6.x-Solaris/solr/build/solr-core/test/J0/temp/solr.update.AutoCommitTest_5E6A38C7C7029FF9-001/init-core-data-001/index;done=false>>]
   [junit4]   2> 1596698 INFO  (coreCloseExecutor-4880-thread-1-processing-x:collection1) [    x:collection1] o.a.s.c.CachingDirectoryFactory Closing directory: /export/home/jenkins/workspace/Lucene-Solr-6.x-Solaris/solr/build/solr-core/test/J0/temp/solr.update.AutoCommitTest_5E6A38C7C7029FF9-001/init-core-data-001/index
   [junit4]   2> 1596698 INFO  (coreCloseExecutor-4880-thread-1-processing-x:collection1) [    x:collection1] o.a.s.c.CachingDirectoryFactory looking to close /export/home/jenkins/workspace/Lucene-Solr-6.x-Solaris/solr/build/solr-core/test/J0/temp/solr.update.AutoCommitTest_5E6A38C7C7029FF9-001/init-core-data-001 [CachedDir<<refCount=0;path=/export/home/jenkins/workspace/Lucene-Solr-6.x-Solaris/solr/build/solr-core/test/J0/temp/solr.update.AutoCommitTest_5E6A38C7C7029FF9-001/init-core-data-001;done=false>>]
   [junit4]   2> 1596698 INFO  (coreCloseExecutor-4880-thread-1-processing-x:collection1) [    x:collection1] o.a.s.c.CachingDirectoryFactory Closing directory: /export/home/jenkins/workspace/Lucene-Solr-6.x-Solaris/solr/build/solr-core/test/J0/temp/solr.update.AutoCommitTest_5E6A38C7C7029FF9-001/init-core-data-001
   [junit4]   2> NOTE: leaving temporary files on disk at: /export/home/jenkins/workspace/Lucene-Solr-6.x-Solaris/solr/build/solr-core/test/J0/temp/solr.update.AutoCommitTest_5E6A38C7C7029FF9-001
   [junit4]   2> NOTE: test params are: codec=Asserting(Lucene60): {range_facet_l_dv=PostingsFormat(name=LuceneVarGapDocFreqInterval), _version_=PostingsFormat(name=MockRandom), field_t=PostingsFormat(name=LuceneVarGapDocFreqInterval), multiDefault=PostingsFormat(name=LuceneVarGapFixedInterval), subject=PostingsFormat(name=LuceneVarGapFixedInterval), intDefault=PostingsFormat(name=MockRandom), id=PostingsFormat(name=LuceneVarGapDocFreqInterval), range_facet_i_dv=PostingsFormat(name=LuceneVarGapFixedInterval), text=Lucene50(blocksize=128), range_facet_l=PostingsFormat(name=LuceneVarGapFixedInterval), timestamp=PostingsFormat(name=LuceneVarGapFixedInterval)}, docValues:{range_facet_l_dv=DocValuesFormat(name=Direct), range_facet_i_dv=DocValuesFormat(name=Lucene54), timestamp=DocValuesFormat(name=Lucene54)}, maxPointsInLeafNode=177, maxMBSortInHeap=4.105853629996652, sim=RandomSimilarity(queryNorm=true,coord=yes): {}, locale=zh-CN, timezone=Etc/UTC
   [junit4]   2> NOTE: SunOS 5.11 amd64/Oracle Corporation 1.8.0_72 (64-bit)/cpus=3,threads=1,free=209063592,total=518979584
   [junit4]   2> NOTE: All tests run in this JVM: [DirectSolrSpellCheckerTest, TestHighFrequencyDictionaryFactory, AnalyticsQueryTest, TestCoreContainer, UUIDFieldTest, SuggestComponentContextFilterQueryTest, HdfsNNFailoverTest, OverseerTest, CachingDirectoryFactoryTest, IndexSchemaTest, SolrCloudExampleTest, TestCursorMarkWithoutUniqueKey, TermsComponentTest, TestPostingsSolrHighlighter, CoreAdminCreateDiscoverTest, AsyncMigrateRouteKeyTest, TestManagedResourceStorage, TestManagedStopFilterFactory, TestBlobHandler, PreAnalyzedFieldTest, DisMaxRequestHandlerTest, TestLFUCache, CurrencyFieldXmlFileTest, TestLuceneMatchVersion, TestRandomRequestDistribution, TestGroupingSearch, SuggesterFSTTest, TestRequestStatusCollectionAPI, SSLMigrationTest, TestCSVLoader, SolrRequestParserTest, SparseHLLTest, LeaderElectionTest, TestSortByMinMaxFunction, TestCollectionAPI, QueryResultKeyTest, TestLeaderElectionZkExpiry, RestartWhileUpdatingTest, TestUpdate, CdcrUpdateLogTest, OverriddenZkACLAndCredentialsProvidersTest, HdfsTlogReplayBufferedWhileIndexingTest, TestDistributedStatsComponentCardinality, TestSolrFieldCacheMBean, TestSolrConfigHandler, DistributedFacetPivotSmallAdvancedTest, VMParamsZkACLAndCredentialsProvidersTest, TestImplicitCoreProperties, DocValuesTest, ExternalFileFieldSortTest, TestComplexPhraseQParserPlugin, TestStressUserVersions, SortSpecParsingTest, TestReplicationHandlerBackup, TestHashQParserPlugin, StatelessScriptUpdateProcessorFactoryTest, DistributedQueryElevationComponentTest, BadCopyFieldTest, TestRTimerTree, ZkStateWriterTest, BlockJoinFacetDistribTest, WrapperMergePolicyFactoryTest, TestCollationFieldDocValues, UpdateParamsTest, HardAutoCommitTest, TestPartialUpdateDeduplication, ShardRoutingTest, IndexBasedSpellCheckerTest, TestLazyCores, CircularListTest, TestTolerantSearch, SimpleMLTQParserTest, DistributedDebugComponentTest, TestAnalyzedSuggestions, TestSchemaSimilarityResource, TestMiniSolrCloudCluster, TestConfigSets, SoftAutoCommitTest, TestSerializedLuceneMatchVersion, DocExpirationUpdateProcessorFactoryTest, RuleEngineTest, TestConfig, PrimUtilsTest, MoreLikeThisHandlerTest, TestDownShardTolerantSearch, TestFunctionQuery, TestSolrXml, TestDFISimilarityFactory, PrimitiveFieldTypeTest, ClassificationUpdateProcessorFactoryTest, TestReplicationHandler, ScriptEngineTest, TestFieldCollectionResource, DistribDocExpirationUpdateProcessorTest, BasicDistributedZkTest, HLLSerializationTest, ConcurrentDeleteAndCreateCollectionTest, URLClassifyProcessorTest, CdcrReplicationDistributedZkTest, SimplePostToolTest, TestRandomDVFaceting, ZkControllerTest, TestStressReorder, HdfsWriteToMultipleCollectionsTest, PolyFieldTest, BadComponentTest, TestJmxIntegration, RegexBoostProcessorTest, TestRuleBasedAuthorizationPlugin, CursorPagingTest, TestSweetSpotSimilarityFactory, AlternateDirectoryTest, SharedFSAutoReplicaFailoverUtilsTest, ZkCLITest, TestSizeLimitedDistributedMap, HdfsChaosMonkeySafeLeaderTest, XmlUpdateRequestHandlerTest, TestDynamicFieldCollectionResource, SystemInfoHandlerTest, TestRawTransformer, UnloadDistributedZkTest, TestIBSimilarityFactory, TestUseDocValuesAsStored2, TestSmileRequest, SyncSliceTest, TimeZoneUtilsTest, TestJsonRequest, TestSort, HdfsRecoveryZkTest, SampleTest, RemoteQueryErrorTest, RequiredFieldsTest, TestHdfsUpdateLog, TestCodecSupport, OverseerTaskQueueTest, TestBulkSchemaConcurrent, TestSchemaManager, SecurityConfHandlerTest, ActionThrottleTest, TestEmbeddedSolrServerConstructors, CollectionsAPIDistributedZkTest, ClusterStateUpdateTest, AutoCommitTest]
   [junit4] Completed [300/582 (1!)] on J0 in 11.67s, 3 tests, 1 error <<< FAILURES!

[...truncated 894 lines...]
BUILD FAILED
/export/home/jenkins/workspace/Lucene-Solr-6.x-Solaris/build.xml:740: The following error occurred while executing this line:
/export/home/jenkins/workspace/Lucene-Solr-6.x-Solaris/build.xml:684: The following error occurred while executing this line:
/export/home/jenkins/workspace/Lucene-Solr-6.x-Solaris/build.xml:59: The following error occurred while executing this line:
/export/home/jenkins/workspace/Lucene-Solr-6.x-Solaris/solr/build.xml:233: The following error occurred while executing this line:
/export/home/jenkins/workspace/Lucene-Solr-6.x-Solaris/solr/common-build.xml:529: The following error occurred while executing this line:
/export/home/jenkins/workspace/Lucene-Solr-6.x-Solaris/lucene/common-build.xml:1457: The following error occurred while executing this line:
/export/home/jenkins/workspace/Lucene-Solr-6.x-Solaris/lucene/common-build.xml:1014: There were test failures: 582 suites (10 ignored), 2331 tests, 1 error, 86 ignored (70 assumptions) [seed: 5E6A38C7C7029FF9]

Total time: 71 minutes 43 seconds
Build step 'Invoke Ant' marked build as failure
Archiving artifacts
[WARNINGS] Skipping publisher since build result is FAILURE
Recording test results
Email was triggered for: Failure - Any
Sending email for trigger: Failure - Any



Mime
View raw message