lucene-dev mailing list archives

Site index · List index
Message view « Date » · « Thread »
Top « Date » · « Thread »
From Apache Jenkins Server <jenk...@builds.apache.org>
Subject [JENKINS] Lucene-Solr-NightlyTests-master - Build # 955 - Still Failing
Date Wed, 09 Mar 2016 15:22:03 GMT
Build: https://builds.apache.org/job/Lucene-Solr-NightlyTests-master/955/

2 tests failed.
FAILED:  org.apache.solr.cloud.CollectionsAPIDistributedZkTest.test

Error Message:
Captured an uncaught exception in thread: Thread[id=21719, name=collection5, state=RUNNABLE, group=TGRP-CollectionsAPIDistributedZkTest]

Stack Trace:
com.carrotsearch.randomizedtesting.UncaughtExceptionError: Captured an uncaught exception in thread: Thread[id=21719, name=collection5, state=RUNNABLE, group=TGRP-CollectionsAPIDistributedZkTest]
Caused by: org.apache.solr.client.solrj.impl.HttpSolrClient$RemoteSolrException: Error from server at http://127.0.0.1:51136: collection already exists: awholynewstresscollection_collection5_0
	at __randomizedtesting.SeedInfo.seed([A9D250C933E907C1]:0)
	at org.apache.solr.client.solrj.impl.HttpSolrClient.executeMethod(HttpSolrClient.java:577)
	at org.apache.solr.client.solrj.impl.HttpSolrClient.request(HttpSolrClient.java:241)
	at org.apache.solr.client.solrj.impl.HttpSolrClient.request(HttpSolrClient.java:230)
	at org.apache.solr.client.solrj.impl.LBHttpSolrClient.doRequest(LBHttpSolrClient.java:372)
	at org.apache.solr.client.solrj.impl.LBHttpSolrClient.request(LBHttpSolrClient.java:325)
	at org.apache.solr.client.solrj.impl.CloudSolrClient.sendRequest(CloudSolrClient.java:1100)
	at org.apache.solr.client.solrj.impl.CloudSolrClient.requestWithRetryOnStaleState(CloudSolrClient.java:870)
	at org.apache.solr.client.solrj.impl.CloudSolrClient.request(CloudSolrClient.java:806)
	at org.apache.solr.client.solrj.SolrClient.request(SolrClient.java:1219)
	at org.apache.solr.cloud.AbstractFullDistribZkTestBase.createCollection(AbstractFullDistribZkTestBase.java:1593)
	at org.apache.solr.cloud.AbstractFullDistribZkTestBase.createCollection(AbstractFullDistribZkTestBase.java:1614)
	at org.apache.solr.cloud.CollectionsAPIDistributedZkTest$1CollectionThread.run(CollectionsAPIDistributedZkTest.java:970)


FAILED:  junit.framework.TestSuite.org.apache.solr.handler.TestReplicationHandler

Error Message:
ObjectTracker found 2 object(s) that were not released!!! [NRTCachingDirectory, NRTCachingDirectory]

Stack Trace:
java.lang.AssertionError: ObjectTracker found 2 object(s) that were not released!!! [NRTCachingDirectory, NRTCachingDirectory]
	at __randomizedtesting.SeedInfo.seed([A9D250C933E907C1]:0)
	at org.junit.Assert.fail(Assert.java:93)
	at org.junit.Assert.assertTrue(Assert.java:43)
	at org.junit.Assert.assertNull(Assert.java:551)
	at org.apache.solr.SolrTestCaseJ4.afterClass(SolrTestCaseJ4.java:238)
	at sun.reflect.GeneratedMethodAccessor47.invoke(Unknown Source)
	at sun.reflect.DelegatingMethodAccessorImpl.invoke(DelegatingMethodAccessorImpl.java:43)
	at java.lang.reflect.Method.invoke(Method.java:497)
	at com.carrotsearch.randomizedtesting.RandomizedRunner.invoke(RandomizedRunner.java:1764)
	at com.carrotsearch.randomizedtesting.RandomizedRunner$7.evaluate(RandomizedRunner.java:834)
	at com.carrotsearch.randomizedtesting.rules.StatementAdapter.evaluate(StatementAdapter.java:36)
	at com.carrotsearch.randomizedtesting.rules.SystemPropertiesRestoreRule$1.evaluate(SystemPropertiesRestoreRule.java:57)
	at org.apache.lucene.util.AbstractBeforeAfterRule$1.evaluate(AbstractBeforeAfterRule.java:45)
	at com.carrotsearch.randomizedtesting.rules.StatementAdapter.evaluate(StatementAdapter.java:36)
	at org.apache.lucene.util.TestRuleStoreClassName$1.evaluate(TestRuleStoreClassName.java:41)
	at com.carrotsearch.randomizedtesting.rules.NoShadowingOrOverridesOnMethodsRule$1.evaluate(NoShadowingOrOverridesOnMethodsRule.java:40)
	at com.carrotsearch.randomizedtesting.rules.NoShadowingOrOverridesOnMethodsRule$1.evaluate(NoShadowingOrOverridesOnMethodsRule.java:40)
	at com.carrotsearch.randomizedtesting.rules.StatementAdapter.evaluate(StatementAdapter.java:36)
	at com.carrotsearch.randomizedtesting.rules.StatementAdapter.evaluate(StatementAdapter.java:36)
	at com.carrotsearch.randomizedtesting.rules.StatementAdapter.evaluate(StatementAdapter.java:36)
	at org.apache.lucene.util.TestRuleAssertionsRequired$1.evaluate(TestRuleAssertionsRequired.java:53)
	at org.apache.lucene.util.TestRuleMarkFailure$1.evaluate(TestRuleMarkFailure.java:47)
	at org.apache.lucene.util.TestRuleIgnoreAfterMaxFailures$1.evaluate(TestRuleIgnoreAfterMaxFailures.java:64)
	at org.apache.lucene.util.TestRuleIgnoreTestSuites$1.evaluate(TestRuleIgnoreTestSuites.java:54)
	at com.carrotsearch.randomizedtesting.rules.StatementAdapter.evaluate(StatementAdapter.java:36)
	at com.carrotsearch.randomizedtesting.ThreadLeakControl$StatementRunner.run(ThreadLeakControl.java:367)
	at java.lang.Thread.run(Thread.java:745)




Build Log:
[...truncated 11767 lines...]
   [junit4] Suite: org.apache.solr.handler.TestReplicationHandler
   [junit4]   2> Creating dataDir: /x1/jenkins/jenkins-slave/workspace/Lucene-Solr-NightlyTests-master/solr/build/solr-core/test/J0/temp/solr.handler.TestReplicationHandler_A9D250C933E907C1-001/init-core-data-001
   [junit4]   2> 1621172 INFO  (TEST-TestReplicationHandler.doTestReplicateAfterCoreReload-seed#[A9D250C933E907C1]) [    ] o.a.s.SolrTestCaseJ4 ###Starting doTestReplicateAfterCoreReload
   [junit4]   2> 1621173 INFO  (TEST-TestReplicationHandler.doTestReplicateAfterCoreReload-seed#[A9D250C933E907C1]) [    ] o.a.s.SolrTestCaseJ4 Writing core.properties file to /x1/jenkins/jenkins-slave/workspace/Lucene-Solr-NightlyTests-master/solr/build/solr-core/test/J0/temp/solr.handler.TestReplicationHandler_A9D250C933E907C1-001/solr-instance-001/collection1
   [junit4]   2> 1621176 INFO  (TEST-TestReplicationHandler.doTestReplicateAfterCoreReload-seed#[A9D250C933E907C1]) [    ] o.e.j.s.Server jetty-9.3.6.v20151106
   [junit4]   2> 1621178 INFO  (TEST-TestReplicationHandler.doTestReplicateAfterCoreReload-seed#[A9D250C933E907C1]) [    ] o.e.j.s.h.ContextHandler Started o.e.j.s.ServletContextHandler@50130cae{/solr,null,AVAILABLE}
   [junit4]   2> 1621179 INFO  (TEST-TestReplicationHandler.doTestReplicateAfterCoreReload-seed#[A9D250C933E907C1]) [    ] o.e.j.s.ServerConnector Started ServerConnector@3c46d3b9{HTTP/1.1,[http/1.1]}{127.0.0.1:36608}
   [junit4]   2> 1621179 INFO  (TEST-TestReplicationHandler.doTestReplicateAfterCoreReload-seed#[A9D250C933E907C1]) [    ] o.e.j.s.Server Started @1624685ms
   [junit4]   2> 1621179 INFO  (TEST-TestReplicationHandler.doTestReplicateAfterCoreReload-seed#[A9D250C933E907C1]) [    ] o.a.s.c.s.e.JettySolrRunner Jetty properties: {solr.data.dir=/x1/jenkins/jenkins-slave/workspace/Lucene-Solr-NightlyTests-master/solr/build/solr-core/test/J0/temp/solr.handler.TestReplicationHandler_A9D250C933E907C1-001/solr-instance-001/collection1/data, hostContext=/solr, hostPort=36608}
   [junit4]   2> 1621179 INFO  (TEST-TestReplicationHandler.doTestReplicateAfterCoreReload-seed#[A9D250C933E907C1]) [    ] o.a.s.s.SolrDispatchFilter SolrDispatchFilter.init(): sun.misc.Launcher$AppClassLoader@4e0e2f2a
   [junit4]   2> 1621179 INFO  (TEST-TestReplicationHandler.doTestReplicateAfterCoreReload-seed#[A9D250C933E907C1]) [    ] o.a.s.c.SolrResourceLoader new SolrResourceLoader for directory: '/x1/jenkins/jenkins-slave/workspace/Lucene-Solr-NightlyTests-master/solr/build/solr-core/test/J0/temp/solr.handler.TestReplicationHandler_A9D250C933E907C1-001/solr-instance-001'
   [junit4]   2> 1621179 INFO  (TEST-TestReplicationHandler.doTestReplicateAfterCoreReload-seed#[A9D250C933E907C1]) [    ] o.a.s.c.SolrResourceLoader JNDI not configured for solr (NoInitialContextEx)
   [junit4]   2> 1621179 INFO  (TEST-TestReplicationHandler.doTestReplicateAfterCoreReload-seed#[A9D250C933E907C1]) [    ] o.a.s.c.SolrResourceLoader solr home defaulted to 'solr/' (could not find system property or JNDI)
   [junit4]   2> 1621180 INFO  (TEST-TestReplicationHandler.doTestReplicateAfterCoreReload-seed#[A9D250C933E907C1]) [    ] o.a.s.c.SolrXmlConfig Loading container configuration from /x1/jenkins/jenkins-slave/workspace/Lucene-Solr-NightlyTests-master/solr/build/solr-core/test/J0/temp/solr.handler.TestReplicationHandler_A9D250C933E907C1-001/solr-instance-001/solr.xml
   [junit4]   2> 1621184 INFO  (TEST-TestReplicationHandler.doTestReplicateAfterCoreReload-seed#[A9D250C933E907C1]) [    ] o.a.s.c.CorePropertiesLocator Config-defined core root directory: /x1/jenkins/jenkins-slave/workspace/Lucene-Solr-NightlyTests-master/solr/build/solr-core/test/J0/temp/solr.handler.TestReplicationHandler_A9D250C933E907C1-001/solr-instance-001/.
   [junit4]   2> 1621184 INFO  (TEST-TestReplicationHandler.doTestReplicateAfterCoreReload-seed#[A9D250C933E907C1]) [    ] o.a.s.c.CoreContainer New CoreContainer 427705031
   [junit4]   2> 1621184 INFO  (TEST-TestReplicationHandler.doTestReplicateAfterCoreReload-seed#[A9D250C933E907C1]) [    ] o.a.s.c.CoreContainer Loading cores into CoreContainer [instanceDir=/x1/jenkins/jenkins-slave/workspace/Lucene-Solr-NightlyTests-master/solr/build/solr-core/test/J0/temp/solr.handler.TestReplicationHandler_A9D250C933E907C1-001/solr-instance-001]
   [junit4]   2> 1621185 WARN  (TEST-TestReplicationHandler.doTestReplicateAfterCoreReload-seed#[A9D250C933E907C1]) [    ] o.a.s.c.CoreContainer Couldn't add files from /x1/jenkins/jenkins-slave/workspace/Lucene-Solr-NightlyTests-master/solr/build/solr-core/test/J0/temp/solr.handler.TestReplicationHandler_A9D250C933E907C1-001/solr-instance-001/lib to classpath: /x1/jenkins/jenkins-slave/workspace/Lucene-Solr-NightlyTests-master/solr/build/solr-core/test/J0/temp/solr.handler.TestReplicationHandler_A9D250C933E907C1-001/solr-instance-001/lib
   [junit4]   2> 1621185 INFO  (TEST-TestReplicationHandler.doTestReplicateAfterCoreReload-seed#[A9D250C933E907C1]) [    ] o.a.s.h.c.HttpShardHandlerFactory created with socketTimeout : 90000,urlScheme : ,connTimeout : 15000,maxConnectionsPerHost : 20,maxConnections : 10000,corePoolSize : 0,maximumPoolSize : 2147483647,maxThreadIdleTime : 5,sizeOfQueue : -1,fairnessPolicy : false,useRetries : false,
   [junit4]   2> 1621186 INFO  (TEST-TestReplicationHandler.doTestReplicateAfterCoreReload-seed#[A9D250C933E907C1]) [    ] o.a.s.u.UpdateShardHandler Creating UpdateShardHandler HTTP client with params: socketTimeout=340000&connTimeout=45000&retry=true
   [junit4]   2> 1621186 INFO  (TEST-TestReplicationHandler.doTestReplicateAfterCoreReload-seed#[A9D250C933E907C1]) [    ] o.a.s.l.LogWatcher SLF4J impl is org.slf4j.impl.Log4jLoggerFactory
   [junit4]   2> 1621186 INFO  (TEST-TestReplicationHandler.doTestReplicateAfterCoreReload-seed#[A9D250C933E907C1]) [    ] o.a.s.l.LogWatcher Registering Log Listener [Log4j (org.slf4j.impl.Log4jLoggerFactory)]
   [junit4]   2> 1621186 INFO  (TEST-TestReplicationHandler.doTestReplicateAfterCoreReload-seed#[A9D250C933E907C1]) [    ] o.a.s.c.CoreContainer Security conf doesn't exist. Skipping setup for authorization module.
   [junit4]   2> 1621186 INFO  (TEST-TestReplicationHandler.doTestReplicateAfterCoreReload-seed#[A9D250C933E907C1]) [    ] o.a.s.c.CoreContainer No authentication plugin used.
   [junit4]   2> 1621187 INFO  (TEST-TestReplicationHandler.doTestReplicateAfterCoreReload-seed#[A9D250C933E907C1]) [    ] o.a.s.c.CorePropertiesLocator Looking for core definitions underneath /x1/jenkins/jenkins-slave/workspace/Lucene-Solr-NightlyTests-master/solr/build/solr-core/test/J0/temp/solr.handler.TestReplicationHandler_A9D250C933E907C1-001/solr-instance-001/.
   [junit4]   2> 1621188 INFO  (TEST-TestReplicationHandler.doTestReplicateAfterCoreReload-seed#[A9D250C933E907C1]) [    ] o.a.s.c.CoreDescriptor Created CoreDescriptor: {name=collection1, config=solrconfig.xml, loadOnStartup=true, schema=schema.xml, configSetProperties=configsetprops.json, transient=false, dataDir=data/}
   [junit4]   2> 1621188 INFO  (TEST-TestReplicationHandler.doTestReplicateAfterCoreReload-seed#[A9D250C933E907C1]) [    ] o.a.s.c.CorePropertiesLocator Found core collection1 in /x1/jenkins/jenkins-slave/workspace/Lucene-Solr-NightlyTests-master/solr/build/solr-core/test/J0/temp/solr.handler.TestReplicationHandler_A9D250C933E907C1-001/solr-instance-001/./collection1
   [junit4]   2> 1621188 INFO  (TEST-TestReplicationHandler.doTestReplicateAfterCoreReload-seed#[A9D250C933E907C1]) [    ] o.a.s.c.CorePropertiesLocator Found 1 core definitions
   [junit4]   2> 1621188 INFO  (coreLoadExecutor-3735-thread-1) [    ] o.a.s.c.SolrResourceLoader new SolrResourceLoader for directory: '/x1/jenkins/jenkins-slave/workspace/Lucene-Solr-NightlyTests-master/solr/build/solr-core/test/J0/temp/solr.handler.TestReplicationHandler_A9D250C933E907C1-001/solr-instance-001/collection1'
   [junit4]   2> 1621188 INFO  (TEST-TestReplicationHandler.doTestReplicateAfterCoreReload-seed#[A9D250C933E907C1]) [    ] o.a.s.s.SolrDispatchFilter user.dir=/x1/jenkins/jenkins-slave/workspace/Lucene-Solr-NightlyTests-master/solr/build/solr-core/test/J0
   [junit4]   2> 1621188 INFO  (TEST-TestReplicationHandler.doTestReplicateAfterCoreReload-seed#[A9D250C933E907C1]) [    ] o.a.s.s.SolrDispatchFilter SolrDispatchFilter.init() done
   [junit4]   2> 1621188 INFO  (coreLoadExecutor-3735-thread-1) [    ] o.a.s.c.SolrResourceLoader JNDI not configured for solr (NoInitialContextEx)
   [junit4]   2> 1621188 INFO  (coreLoadExecutor-3735-thread-1) [    ] o.a.s.c.SolrResourceLoader solr home defaulted to 'solr/' (could not find system property or JNDI)
   [junit4]   2> 1621194 INFO  (coreLoadExecutor-3735-thread-1) [    ] o.a.s.c.SolrConfig current version of requestparams : -1
   [junit4]   2> 1621196 WARN  (coreLoadExecutor-3735-thread-1) [    ] o.a.s.c.Config Beginning with Solr 5.5, <mergePolicy> is deprecated, use <mergePolicyFactory> instead.
   [junit4]   2> 1621197 INFO  (coreLoadExecutor-3735-thread-1) [    ] o.a.s.c.SolrConfig Using Lucene MatchVersion: 7.0.0
   [junit4]   2> 1621203 INFO  (coreLoadExecutor-3735-thread-1) [    ] o.a.s.c.SolrConfig Loaded SolrConfig: solrconfig.xml
   [junit4]   2> 1621205 INFO  (coreLoadExecutor-3735-thread-1) [    ] o.a.s.s.IndexSchema [collection1] Schema name=test
   [junit4]   2> 1621207 INFO  (coreLoadExecutor-3735-thread-1) [    ] o.a.s.s.IndexSchema unique key field: id
   [junit4]   2> 1621209 INFO  (coreLoadExecutor-3735-thread-1) [    ] o.a.s.c.ConfigSetProperties Did not find ConfigSet properties, assuming default properties: Can't find resource 'configsetprops.json' in classpath or '/x1/jenkins/jenkins-slave/workspace/Lucene-Solr-NightlyTests-master/solr/build/solr-core/test/J0/temp/solr.handler.TestReplicationHandler_A9D250C933E907C1-001/solr-instance-001/collection1'
   [junit4]   2> 1621209 INFO  (coreLoadExecutor-3735-thread-1) [    ] o.a.s.c.CoreContainer Creating SolrCore 'collection1' using configuration from instancedir /x1/jenkins/jenkins-slave/workspace/Lucene-Solr-NightlyTests-master/solr/build/solr-core/test/J0/temp/solr.handler.TestReplicationHandler_A9D250C933E907C1-001/solr-instance-001/./collection1
   [junit4]   2> 1621209 INFO  (coreLoadExecutor-3735-thread-1) [    x:collection1] o.a.s.c.SolrCore org.apache.solr.core.MockDirectoryFactory
   [junit4]   2> 1621209 INFO  (coreLoadExecutor-3735-thread-1) [    x:collection1] o.a.s.c.SolrCore [[collection1] ] Opening new SolrCore at [/x1/jenkins/jenkins-slave/workspace/Lucene-Solr-NightlyTests-master/solr/build/solr-core/test/J0/temp/solr.handler.TestReplicationHandler_A9D250C933E907C1-001/solr-instance-001/collection1], dataDir=[/x1/jenkins/jenkins-slave/workspace/Lucene-Solr-NightlyTests-master/solr/build/solr-core/test/J0/temp/solr.handler.TestReplicationHandler_A9D250C933E907C1-001/solr-instance-001/./collection1/data/]
   [junit4]   2> 1621210 INFO  (coreLoadExecutor-3735-thread-1) [    x:collection1] o.a.s.c.SolrCore JMX monitoring not detected for core: collection1
   [junit4]   2> 1621210 INFO  (coreLoadExecutor-3735-thread-1) [    x:collection1] o.a.s.c.CachingDirectoryFactory return new directory for /x1/jenkins/jenkins-slave/workspace/Lucene-Solr-NightlyTests-master/solr/build/solr-core/test/J0/temp/solr.handler.TestReplicationHandler_A9D250C933E907C1-001/solr-instance-001/./collection1/data
   [junit4]   2> 1621210 INFO  (coreLoadExecutor-3735-thread-1) [    x:collection1] o.a.s.c.SolrCore New index directory detected: old=null new=/x1/jenkins/jenkins-slave/workspace/Lucene-Solr-NightlyTests-master/solr/build/solr-core/test/J0/temp/solr.handler.TestReplicationHandler_A9D250C933E907C1-001/solr-instance-001/./collection1/data/index/
   [junit4]   2> 1621210 WARN  (coreLoadExecutor-3735-thread-1) [    x:collection1] o.a.s.c.SolrCore [collection1] Solr index directory '/x1/jenkins/jenkins-slave/workspace/Lucene-Solr-NightlyTests-master/solr/build/solr-core/test/J0/temp/solr.handler.TestReplicationHandler_A9D250C933E907C1-001/solr-instance-001/./collection1/data/index' doesn't exist. Creating new index...
   [junit4]   2> 1621211 INFO  (coreLoadExecutor-3735-thread-1) [    x:collection1] o.a.s.c.CachingDirectoryFactory return new directory for /x1/jenkins/jenkins-slave/workspace/Lucene-Solr-NightlyTests-master/solr/build/solr-core/test/J0/temp/solr.handler.TestReplicationHandler_A9D250C933E907C1-001/solr-instance-001/./collection1/data/index
   [junit4]   2> 1621211 INFO  (coreLoadExecutor-3735-thread-1) [    x:collection1] o.a.s.u.RandomMergePolicy RandomMergePolicy wrapping class org.apache.lucene.index.MockRandomMergePolicy: org.apache.lucene.index.MockRandomMergePolicy@1c2319ae
   [junit4]   2> 1621211 INFO  (coreLoadExecutor-3735-thread-1) [    x:collection1] o.a.s.c.SolrDeletionPolicy SolrDeletionPolicy.onCommit: commits: num=1
   [junit4]   2> 	commit{dir=RawDirectoryWrapper(RAMDirectory@37fdd7d4 lockFactory=org.apache.lucene.store.SingleInstanceLockFactory@76a4fca3),segFN=segments_1,generation=1}
   [junit4]   2> 1621211 INFO  (coreLoadExecutor-3735-thread-1) [    x:collection1] o.a.s.c.SolrDeletionPolicy newest commit generation = 1
   [junit4]   2> 1621212 INFO  (OldIndexDirectoryCleanupThreadForCore-collection1) [    x:collection1] o.a.s.c.SolrCore Looking for old index directories to cleanup for core collection1 in /x1/jenkins/jenkins-slave/workspace/Lucene-Solr-NightlyTests-master/solr/build/solr-core/test/J0/temp/solr.handler.TestReplicationHandler_A9D250C933E907C1-001/solr-instance-001/./collection1/data/
   [junit4]   2> 1621213 INFO  (coreLoadExecutor-3735-thread-1) [    x:collection1] o.a.s.c.SolrCore no updateRequestProcessorChain defined as default, creating implicit default
   [junit4]   2> 1621214 INFO  (coreLoadExecutor-3735-thread-1) [    x:collection1] o.a.s.h.l.XMLLoader xsltCacheLifetimeSeconds=60
   [junit4]   2> 1621215 INFO  (coreLoadExecutor-3735-thread-1) [    x:collection1] o.a.s.h.l.XMLLoader xsltCacheLifetimeSeconds=60
   [junit4]   2> 1621216 INFO  (coreLoadExecutor-3735-thread-1) [    x:collection1] o.a.s.h.l.XMLLoader xsltCacheLifetimeSeconds=60
   [junit4]   2> 1621217 INFO  (coreLoadExecutor-3735-thread-1) [    x:collection1] o.a.s.h.l.XMLLoader xsltCacheLifetimeSeconds=60
   [junit4]   2> 1621218 INFO  (coreLoadExecutor-3735-thread-1) [    x:collection1] o.a.s.c.PluginBag requestHandler : 'lazy' created with startup=lazy 
   [junit4]   2> 1621218 INFO  (coreLoadExecutor-3735-thread-1) [    x:collection1] o.a.s.c.RequestHandlers Registered paths: /admin/mbeans,standard,lazy,/update/json/docs,/admin/luke,/export,/get,/admin/properties,/update/json,/admin/threads,/update/csv,/sql,/admin/segments,/admin/system,/replication,defaults,/config,/stream,/schema,/admin/plugins,/admin/logging,/admin/ping,/update,/admin/file
   [junit4]   2> 1621218 INFO  (coreLoadExecutor-3735-thread-1) [    x:collection1] o.a.s.c.SolrCore Using default statsCache cache: org.apache.solr.search.stats.LocalStatsCache
   [junit4]   2> 1621218 INFO  (coreLoadExecutor-3735-thread-1) [    x:collection1] o.a.s.u.CommitTracker Hard AutoCommit: disabled
   [junit4]   2> 1621218 INFO  (coreLoadExecutor-3735-thread-1) [    x:collection1] o.a.s.u.CommitTracker Soft AutoCommit: disabled
   [junit4]   2> 1621218 INFO  (coreLoadExecutor-3735-thread-1) [    x:collection1] o.a.s.u.RandomMergePolicy RandomMergePolicy wrapping class org.apache.lucene.index.TieredMergePolicy: [TieredMergePolicy: maxMergeAtOnce=48, maxMergeAtOnceExplicit=25, maxMergedSegmentMB=0.7734375, floorSegmentMB=0.2802734375, forceMergeDeletesPctAllowed=16.25810614029274, segmentsPerTier=25.0, maxCFSSegmentSizeMB=8.796093022207999E12, noCFSRatio=1.0
   [junit4]   2> 1621219 INFO  (coreLoadExecutor-3735-thread-1) [    x:collection1] o.a.s.c.SolrDeletionPolicy SolrDeletionPolicy.onInit: commits: num=1
   [junit4]   2> 	commit{dir=RawDirectoryWrapper(RAMDirectory@37fdd7d4 lockFactory=org.apache.lucene.store.SingleInstanceLockFactory@76a4fca3),segFN=segments_1,generation=1}
   [junit4]   2> 1621219 INFO  (coreLoadExecutor-3735-thread-1) [    x:collection1] o.a.s.c.SolrDeletionPolicy newest commit generation = 1
   [junit4]   2> 1621219 INFO  (coreLoadExecutor-3735-thread-1) [    x:collection1] o.a.s.s.SolrIndexSearcher Opening [Searcher@1483536[collection1] main]
   [junit4]   2> 1621219 INFO  (coreLoadExecutor-3735-thread-1) [    x:collection1] o.a.s.r.ManagedResourceStorage File-based storage initialized to use dir: /x1/jenkins/jenkins-slave/workspace/Lucene-Solr-NightlyTests-master/solr/build/solr-core/test/J0/temp/solr.handler.TestReplicationHandler_A9D250C933E907C1-001/solr-instance-001/collection1/conf
   [junit4]   2> 1621219 INFO  (coreLoadExecutor-3735-thread-1) [    x:collection1] o.a.s.r.RestManager Initializing RestManager with initArgs: {storageDir=/x1/jenkins/jenkins-slave/workspace/Lucene-Solr-NightlyTests-master/solr/build/solr-core/test/J0/temp/solr.handler.TestReplicationHandler_A9D250C933E907C1-001/solr-instance-001/collection1/conf}
   [junit4]   2> 1621219 INFO  (coreLoadExecutor-3735-thread-1) [    x:collection1] o.a.s.r.ManagedResourceStorage Reading _rest_managed.json using file:dir=/x1/jenkins/jenkins-slave/workspace/Lucene-Solr-NightlyTests-master/solr/build/solr-core/test/J0/temp/solr.handler.TestReplicationHandler_A9D250C933E907C1-001/solr-instance-001/collection1/conf
   [junit4]   2> 1621219 INFO  (coreLoadExecutor-3735-thread-1) [    x:collection1] o.a.s.r.RestManager Initializing 0 registered ManagedResources
   [junit4]   2> 1621219 INFO  (coreLoadExecutor-3735-thread-1) [    x:collection1] o.a.s.h.ReplicationHandler Replication enabled for following config files: schema.xml,xslt/dummy.xsl
   [junit4]   2> 1621219 INFO  (coreLoadExecutor-3735-thread-1) [    x:collection1] o.a.s.h.ReplicationHandler Commits will be reserved for  10000
   [junit4]   2> 1621220 INFO  (searcherExecutor-3736-thread-1-processing-x:collection1) [    x:collection1] o.a.s.c.SolrCore [collection1] Registered new searcher Searcher@1483536[collection1] main{ExitableDirectoryReader(UninvertingDirectoryReader())}
   [junit4]   2> 1621220 INFO  (coreLoadExecutor-3735-thread-1) [    x:collection1] o.a.s.c.CoreContainer registering core: collection1
   [junit4]   2> 1621690 INFO  (TEST-TestReplicationHandler.doTestReplicateAfterCoreReload-seed#[A9D250C933E907C1]) [    ] o.a.s.SolrTestCaseJ4 Writing core.properties file to /x1/jenkins/jenkins-slave/workspace/Lucene-Solr-NightlyTests-master/solr/build/solr-core/test/J0/temp/solr.handler.TestReplicationHandler_A9D250C933E907C1-001/solr-instance-002/collection1
   [junit4]   2> 1621693 INFO  (TEST-TestReplicationHandler.doTestReplicateAfterCoreReload-seed#[A9D250C933E907C1]) [    ] o.e.j.s.Server jetty-9.3.6.v20151106
   [junit4]   2> 1621694 INFO  (TEST-TestReplicationHandler.doTestReplicateAfterCoreReload-seed#[A9D250C933E907C1]) [    ] o.e.j.s.h.ContextHandler Started o.e.j.s.ServletContextHandler@d25fa35{/solr,null,AVAILABLE}
   [junit4]   2> 1621695 INFO  (TEST-TestReplicationHandler.doTestReplicateAfterCoreReload-seed#[A9D250C933E907C1]) [    ] o.e.j.s.ServerConnector Started ServerConnector@2b1d3851{HTTP/1.1,[http/1.1]}{127.0.0.1:41930}
   [junit4]   2> 1621695 INFO  (TEST-TestReplicationHandler.doTestReplicateAfterCoreReload-seed#[A9D250C933E907C1]) [    ] o.e.j.s.Server Started @1625201ms
   [junit4]   2> 1621695 INFO  (TEST-TestReplicationHandler.doTestReplicateAfterCoreReload-seed#[A9D250C933E907C1]) [    ] o.a.s.c.s.e.JettySolrRunner Jetty properties: {solr.data.dir=/x1/jenkins/jenkins-slave/workspace/Lucene-Solr-NightlyTests-master/solr/build/solr-core/test/J0/temp/solr.handler.TestReplicationHandler_A9D250C933E907C1-001/solr-instance-002/collection1/data, hostContext=/solr, hostPort=41930}
   [junit4]   2> 1621695 INFO  (TEST-TestReplicationHandler.doTestReplicateAfterCoreReload-seed#[A9D250C933E907C1]) [    ] o.a.s.s.SolrDispatchFilter SolrDispatchFilter.init(): sun.misc.Launcher$AppClassLoader@4e0e2f2a
   [junit4]   2> 1621695 INFO  (TEST-TestReplicationHandler.doTestReplicateAfterCoreReload-seed#[A9D250C933E907C1]) [    ] o.a.s.c.SolrResourceLoader new SolrResourceLoader for directory: '/x1/jenkins/jenkins-slave/workspace/Lucene-Solr-NightlyTests-master/solr/build/solr-core/test/J0/temp/solr.handler.TestReplicationHandler_A9D250C933E907C1-001/solr-instance-002'
   [junit4]   2> 1621695 INFO  (TEST-TestReplicationHandler.doTestReplicateAfterCoreReload-seed#[A9D250C933E907C1]) [    ] o.a.s.c.SolrResourceLoader JNDI not configured for solr (NoInitialContextEx)
   [junit4]   2> 1621695 INFO  (TEST-TestReplicationHandler.doTestReplicateAfterCoreReload-seed#[A9D250C933E907C1]) [    ] o.a.s.c.SolrResourceLoader solr home defaulted to 'solr/' (could not find system property or JNDI)
   [junit4]   2> 1621695 INFO  (TEST-TestReplicationHandler.doTestReplicateAfterCoreReload-seed#[A9D250C933E907C1]) [    ] o.a.s.c.SolrXmlConfig Loading container configuration from /x1/jenkins/jenkins-slave/workspace/Lucene-Solr-NightlyTests-master/solr/build/solr-core/test/J0/temp/solr.handler.TestReplicationHandler_A9D250C933E907C1-001/solr-instance-002/solr.xml
   [junit4]   2> 1621699 INFO  (TEST-TestReplicationHandler.doTestReplicateAfterCoreReload-seed#[A9D250C933E907C1]) [    ] o.a.s.c.CorePropertiesLocator Config-defined core root directory: /x1/jenkins/jenkins-slave/workspace/Lucene-Solr-NightlyTests-master/solr/build/solr-core/test/J0/temp/solr.handler.TestReplicationHandler_A9D250C933E907C1-001/solr-instance-002/.
   [junit4]   2> 1621699 INFO  (TEST-TestReplicationHandler.doTestReplicateAfterCoreReload-seed#[A9D250C933E907C1]) [    ] o.a.s.c.CoreContainer New CoreContainer 1154518133
   [junit4]   2> 1621699 INFO  (TEST-TestReplicationHandler.doTestReplicateAfterCoreReload-seed#[A9D250C933E907C1]) [    ] o.a.s.c.CoreContainer Loading cores into CoreContainer [instanceDir=/x1/jenkins/jenkins-slave/workspace/Lucene-Solr-NightlyTests-master/solr/build/solr-core/test/J0/temp/solr.handler.TestReplicationHandler_A9D250C933E907C1-001/solr-instance-002]
   [junit4]   2> 1621699 WARN  (TEST-TestReplicationHandler.doTestReplicateAfterCoreReload-seed#[A9D250C933E907C1]) [    ] o.a.s.c.CoreContainer Couldn't add files from /x1/jenkins/jenkins-slave/workspace/Lucene-Solr-NightlyTests-master/solr/build/solr-core/test/J0/temp/solr.handler.TestReplicationHandler_A9D250C933E907C1-001/solr-instance-002/lib to classpath: /x1/jenkins/jenkins-slave/workspace/Lucene-Solr-NightlyTests-master/solr/build/solr-core/test/J0/temp/solr.handler.TestReplicationHandler_A9D250C933E907C1-001/solr-instance-002/lib
   [junit4]   2> 1621700 INFO  (TEST-TestReplicationHandler.doTestReplicateAfterCoreReload-seed#[A9D250C933E907C1]) [    ] o.a.s.h.c.HttpShardHandlerFactory created with socketTimeout : 90000,urlScheme : ,connTimeout : 15000,maxConnectionsPerHost : 20,maxConnections : 10000,corePoolSize : 0,maximumPoolSize : 2147483647,maxThreadIdleTime : 5,sizeOfQueue : -1,fairnessPolicy : false,useRetries : false,
   [junit4]   2> 1621700 INFO  (TEST-TestReplicationHandler.doTestReplicateAfterCoreReload-seed#[A9D250C933E907C1]) [    ] o.a.s.u.UpdateShardHandler Creating UpdateShardHandler HTTP client with params: socketTimeout=340000&connTimeout=45000&retry=true
   [junit4]   2> 1621701 INFO  (TEST-TestReplicationHandler.doTestReplicateAfterCoreReload-seed#[A9D250C933E907C1]) [    ] o.a.s.l.LogWatcher SLF4J impl is org.slf4j.impl.Log4jLoggerFactory
   [junit4]   2> 1621701 INFO  (TEST-TestReplicationHandler.doTestReplicateAfterCoreReload-seed#[A9D250C933E907C1]) [    ] o.a.s.l.LogWatcher Registering Log Listener [Log4j (org.slf4j.impl.Log4jLoggerFactory)]
   [junit4]   2> 1621701 INFO  (TEST-TestReplicationHandler.doTestReplicateAfterCoreReload-seed#[A9D250C933E907C1]) [    ] o.a.s.c.CoreContainer Security conf doesn't exist. Skipping setup for authorization module.
   [junit4]   2> 1621701 INFO  (TEST-TestReplicationHandler.doTestReplicateAfterCoreReload-seed#[A9D250C933E907C1]) [    ] o.a.s.c.CoreContainer No authentication plugin used.
   [junit4]   2> 1621702 INFO  (TEST-TestReplicationHandler.doTestReplicateAfterCoreReload-seed#[A9D250C933E907C1]) [    ] o.a.s.c.CorePropertiesLocator Looking for core definitions underneath /x1/jenkins/jenkins-slave/workspace/Lucene-Solr-NightlyTests-master/solr/build/solr-core/test/J0/temp/solr.handler.TestReplicationHandler_A9D250C933E907C1-001/solr-instance-002/.
   [junit4]   2> 1621703 INFO  (TEST-TestReplicationHandler.doTestReplicateAfterCoreReload-seed#[A9D250C933E907C1]) [    ] o.a.s.c.CoreDescriptor Created CoreDescriptor: {name=collection1, config=solrconfig.xml, loadOnStartup=true, schema=schema.xml, configSetProperties=configsetprops.json, transient=false, dataDir=data/}
   [junit4]   2> 1621703 INFO  (TEST-TestReplicationHandler.doTestReplicateAfterCoreReload-seed#[A9D250C933E907C1]) [    ] o.a.s.c.CorePropertiesLocator Found core collection1 in /x1/jenkins/jenkins-slave/workspace/Lucene-Solr-NightlyTests-master/solr/build/solr-core/test/J0/temp/solr.handler.TestReplicationHandler_A9D250C933E907C1-001/solr-instance-002/./collection1
   [junit4]   2> 1621703 INFO  (TEST-TestReplicationHandler.doTestReplicateAfterCoreReload-seed#[A9D250C933E907C1]) [    ] o.a.s.c.CorePropertiesLocator Found 1 core definitions
   [junit4]   2> 1621703 INFO  (coreLoadExecutor-3745-thread-1) [    ] o.a.s.c.SolrResourceLoader new SolrResourceLoader for directory: '/x1/jenkins/jenkins-slave/workspace/Lucene-Solr-NightlyTests-master/solr/build/solr-core/test/J0/temp/solr.handler.TestReplicationHandler_A9D250C933E907C1-001/solr-instance-002/collection1'
   [junit4]   2> 1621704 INFO  (coreLoadExecutor-3745-thread-1) [    ] o.a.s.c.SolrResourceLoader JNDI not configured for solr (NoInitialContextEx)
   [junit4]   2> 1621704 INFO  (TEST-TestReplicationHandler.doTestReplicateAfterCoreReload-seed#[A9D250C933E907C1]) [    ] o.a.s.s.SolrDispatchFilter user.dir=/x1/jenkins/jenkins-slave/workspace/Lucene-Solr-NightlyTests-master/solr/build/solr-core/test/J0
   [junit4]   2> 1621704 INFO  (coreLoadExecutor-3745-thread-1) [    ] o.a.s.c.SolrResourceLoader solr home defaulted to 'solr/' (could not find system property or JNDI)
   [junit4]   2> 1621704 INFO  (TEST-TestReplicationHandler.doTestReplicateAfterCoreReload-seed#[A9D250C933E907C1]) [    ] o.a.s.s.SolrDispatchFilter SolrDispatchFilter.init() done
   [junit4]   2> 1621708 INFO  (coreLoadExecutor-3745-thread-1) [    ] o.a.s.c.SolrConfig current version of requestparams : -1
   [junit4]   2> 1621711 WARN  (coreLoadExecutor-3745-thread-1) [    ] o.a.s.c.Config Beginning with Solr 5.5, <mergePolicy> is deprecated, use <mergePolicyFactory> instead.
   [junit4]   2> 1621711 INFO  (coreLoadExecutor-3745-thread-1) [    ] o.a.s.c.SolrConfig Using Lucene MatchVersion: 7.0.0
   [junit4]   2> 1621717 INFO  (coreLoadExecutor-3745-thread-1) [    ] o.a.s.c.SolrConfig Loaded SolrConfig: solrconfig.xml
   [junit4]   2> 1621720 INFO  (coreLoadExecutor-3745-thread-1) [    ] o.a.s.s.IndexSchema [collection1] Schema name=test
   [junit4]   2> 1621722 INFO  (coreLoadExecutor-3745-thread-1) [    ] o.a.s.s.IndexSchema unique key field: id
   [junit4]   2> 1621723 INFO  (coreLoadExecutor-3745-thread-1) [    ] o.a.s.c.ConfigSetProperties Did not find ConfigSet properties, assuming default properties: Can't find resource 'configsetprops.json' in classpath or '/x1/jenkins/jenkins-slave/workspace/Lucene-Solr-NightlyTests-master/solr/build/solr-core/test/J0/temp/solr.handler.TestReplicationHandler_A9D250C933E907C1-001/solr-instance-002/collection1'
   [junit4]   2> 1621723 INFO  (coreLoadExecutor-3745-thread-1) [    ] o.a.s.c.CoreContainer Creating SolrCore 'collection1' using configuration from instancedir /x1/jenkins/jenkins-slave/workspace/Lucene-Solr-NightlyTests-master/solr/build/solr-core/test/J0/temp/solr.handler.TestReplicationHandler_A9D250C933E907C1-001/solr-instance-002/./collection1
   [junit4]   2> 1621723 INFO  (coreLoadExecutor-3745-thread-1) [    x:collection1] o.a.s.c.SolrCore org.apache.solr.core.MockDirectoryFactory
   [junit4]   2> 1621723 INFO  (coreLoadExecutor-3745-thread-1) [    x:collection1] o.a.s.c.SolrCore [[collection1] ] Opening new SolrCore at [/x1/jenkins/jenkins-slave/workspace/Lucene-Solr-NightlyTests-master/solr/build/solr-core/test/J0/temp/solr.handler.TestReplicationHandler_A9D250C933E907C1-001/solr-instance-002/collection1], dataDir=[/x1/jenkins/jenkins-slave/workspace/Lucene-Solr-NightlyTests-master/solr/build/solr-core/test/J0/temp/solr.handler.TestReplicationHandler_A9D250C933E907C1-001/solr-instance-002/./collection1/data/]
   [junit4]   2> 1621723 INFO  (coreLoadExecutor-3745-thread-1) [    x:collection1] o.a.s.c.SolrCore JMX monitoring not detected for core: collection1
   [junit4]   2> 1621724 INFO  (coreLoadExecutor-3745-thread-1) [    x:collection1] o.a.s.c.CachingDirectoryFactory return new directory for /x1/jenkins/jenkins-slave/workspace/Lucene-Solr-NightlyTests-master/solr/build/solr-core/test/J0/temp/solr.handler.TestReplicationHandler_A9D250C933E907C1-001/solr-instance-002/./collection1/data
   [junit4]   2> 1621724 INFO  (coreLoadExecutor-3745-thread-1) [    x:collection1] o.a.s.c.SolrCore New index directory detected: old=null new=/x1/jenkins/jenkins-slave/workspace/Lucene-Solr-NightlyTests-master/solr/build/solr-core/test/J0/temp/solr.handler.TestReplicationHandler_A9D250C933E907C1-001/solr-instance-002/./collection1/data/index/
   [junit4]   2> 1621724 WARN  (coreLoadExecutor-3745-thread-1) [    x:collection1] o.a.s.c.SolrCore [collection1] Solr index directory '/x1/jenkins/jenkins-slave/workspace/Lucene-Solr-NightlyTests-master/solr/build/solr-core/test/J0/temp/solr.handler.TestReplicationHandler_A9D250C933E907C1-001/solr-instance-002/./collection1/data/index' doesn't exist. Creating new index...
   [junit4]   2> 1621725 INFO  (coreLoadExecutor-3745-thread-1) [    x:collection1] o.a.s.c.CachingDirectoryFactory return new directory for /x1/jenkins/jenkins-slave/workspace/Lucene-Solr-NightlyTests-master/solr/build/solr-core/test/J0/temp/solr.handler.TestReplicationHandler_A9D250C933E907C1-001/solr-instance-002/./collection1/data/index
   [junit4]   2> 1621725 INFO  (coreLoadExecutor-3745-thread-1) [    x:collection1] o.a.s.u.RandomMergePolicy RandomMergePolicy wrapping class org.apache.lucene.index.MockRandomMergePolicy: org.apache.lucene.index.MockRandomMergePolicy@7ce48e8b
   [junit4]   2> 1621725 INFO  (coreLoadExecutor-3745-thread-1) [    x:collection1] o.a.s.c.SolrDeletionPolicy SolrDeletionPolicy.onCommit: commits: num=1
   [junit4]   2> 	commit{dir=RawDirectoryWrapper(RAMDirectory@5c713dcf lockFactory=org.apache.lucene.store.SingleInstanceLockFactory@38a3b722),segFN=segments_1,generation=1}
   [junit4]   2> 1621725 INFO  (coreLoadExecutor-3745-thread-1) [    x:collection1] o.a.s.c.SolrDeletionPolicy newest commit generation = 1
   [junit4]   2> 1621726 INFO  (OldIndexDirectoryCleanupThreadForCore-collection1) [    x:collection1] o.a.s.c.SolrCore Looking for old index directories to cleanup for core collection1 in /x1/jenkins/jenkins-slave/workspace/Lucene-Solr-NightlyTests-master/solr/build/solr-core/test/J0/temp/solr.handler.TestReplicationHandler_A9D250C933E907C1-001/solr-instance-002/./collection1/data/
   [junit4]   2> 1621727 INFO  (coreLoadExecutor-3745-thread-1) [    x:collection1] o.a.s.c.SolrCore no updateRequestProcessorChain defined as default, creating implicit default
   [junit4]   2> 1621728 INFO  (coreLoadExecutor-3745-thread-1) [    x:collection1] o.a.s.h.l.XMLLoader xsltCacheLifetimeSeconds=60
   [junit4]   2> 1621728 INFO  (coreLoadExecutor-3745-thread-1) [    x:collection1] o.a.s.h.l.XMLLoader xsltCacheLifetimeSeconds=60
   [junit4]   2> 1621729 INFO  (coreLoadExecutor-3745-thread-1) [    x:collection1] o.a.s.h.l.XMLLoader xsltCacheLifetimeSeconds=60
   [junit4]   2> 1621730 INFO  (coreLoadExecutor-3745-thread-1) [    x:collection1] o.a.s.h.l.XMLLoader xsltCacheLifetimeSeconds=60
   [junit4]   2> 1621731 INFO  (coreLoadExecutor-3745-thread-1) [    x:collection1] o.a.s.c.PluginBag requestHandler : 'lazy' created with startup=lazy 
   [junit4]   2> 1621731 INFO  (coreLoadExecutor-3745-thread-1) [    x:collection1] o.a.s.c.RequestHandlers Registered paths: /admin/mbeans,standard,lazy,/update/json/docs,/admin/luke,/export,/get,/admin/properties,/update/json,/admin/threads,/update/csv,/sql,/admin/segments,/admin/system,/replication,defaults,/config,/stream,/schema,/admin/plugins,/admin/logging,/admin/ping,/update,/admin/file
   [junit4]   2> 1621731 INFO  (coreLoadExecutor-3745-thread-1) [    x:collection1] o.a.s.c.SolrCore Using default statsCache cache: org.apache.solr.search.stats.LocalStatsCache
   [junit4]   2> 1621732 INFO  (coreLoadExecutor-3745-thread-1) [    x:collection1] o.a.s.u.CommitTracker Hard AutoCommit: disabled
   [junit4]   2> 1621732 INFO  (coreLoadExecutor-3745-thread-1) [    x:collection1] o.a.s.u.CommitTracker Soft AutoCommit: disabled
   [junit4]   2> 1621732 INFO  (coreLoadExecutor-3745-thread-1) [    x:collection1] o.a.s.u.RandomMergePolicy RandomMergePolicy wrapping class org.apache.lucene.index.TieredMergePolicy: [TieredMergePolicy: maxMergeAtOnce=48, maxMergeAtOnceExplicit=25, maxMergedSegmentMB=0.7734375, floorSegmentMB=0.2802734375, forceMergeDeletesPctAllowed=16.25810614029274, segmentsPerTier=25.0, maxCFSSegmentSizeMB=8.796093022207999E12, noCFSRatio=1.0
   [junit4]   2> 1621732 INFO  (coreLoadExecutor-3745-thread-1) [    x:collection1] o.a.s.c.SolrDeletionPolicy SolrDeletionPolicy.onInit: commits: num=1
   [junit4]   2> 	commit{dir=RawDirectoryWrapper(RAMDirectory@5c713dcf lockFactory=org.apache.lucene.store.SingleInstanceLockFactory@38a3b722),segFN=segments_1,generation=1}
   [junit4]   2> 1621732 INFO  (coreLoadExecutor-3745-thread-1) [    x:collection1] o.a.s.c.SolrDeletionPolicy newest commit generation = 1
   [junit4]   2> 1621732 INFO  (coreLoadExecutor-3745-thread-1) [    x:collection1] o.a.s.s.SolrIndexSearcher Opening [Searcher@445ec22a[collection1] main]
   [junit4]   2> 1621732 INFO  (coreLoadExecutor-3745-thread-1) [    x:collection1] o.a.s.r.ManagedResourceStorage File-based storage initialized to use dir: /x1/jenkins/jenkins-slave/workspace/Lucene-Solr-NightlyTests-master/solr/build/solr-core/test/J0/temp/solr.handler.TestReplicationHandler_A9D250C933E907C1-001/solr-instance-002/collection1/conf
   [junit4]   2> 1621732 INFO  (coreLoadExecutor-3745-thread-1) [    x:collection1] o.a.s.r.RestManager Initializing RestManager with initArgs: {storageDir=/x1/jenkins/jenkins-slave/workspace/Lucene-Solr-NightlyTests-master/solr/build/solr-core/test/J0/temp/solr.handler.TestReplicationHandler_A9D250C933E907C1-001/solr-instance-002/collection1/conf}
   [junit4]   2> 1621733 INFO  (coreLoadExecutor-3745-thread-1) [    x:collection1] o.a.s.r.ManagedResourceStorage Reading _rest_managed.json using file:dir=/x1/jenkins/jenkins-slave/workspace/Lucene-Solr-NightlyTests-master/solr/build/solr-core/test/J0/temp/solr.handler.TestReplicationHandler_A9D250C933E907C1-001/solr-instance-002/collection1/conf
   [junit4]   2> 1621733 INFO  (coreLoadExecutor-3745-thread-1) [    x:collection1] o.a.s.r.RestManager Initializing 0 registered ManagedResources
   [junit4]   2> 1621734 INFO  (coreLoadExecutor-3745-thread-1) [    x:collection1] o.a.s.h.ReplicationHandler Poll scheduled at an interval of 1000ms
   [junit4]   2> 1621734 INFO  (searcherExecutor-3746-thread-1-processing-x:collection1) [    x:collection1] o.a.s.c.SolrCore [collection1] Registered new searcher Searcher@445ec22a[collection1] main{ExitableDirectoryReader(UninvertingDirectoryReader())}
   [junit4]   2> 1621735 INFO  (coreLoadExecutor-3745-thread-1) [    x:collection1] o.a.s.c.CoreContainer registering core: collection1
   [junit4]   2> 1621737 INFO  (qtp1782869890-61353) [    x:collection1] o.a.s.c.S.Request [collection1]  webapp=/solr path=/replication params={qt=/replication&wt=javabin&version=2&command=indexversion} status=0 QTime=0
   [junit4]   2> 1622205 INFO  (TEST-TestReplicationHandler.doTestReplicateAfterCoreReload-seed#[A9D250C933E907C1]) [    ] o.e.j.s.ServerConnector Stopped ServerConnector@2b1d3851{HTTP/1.1,[http/1.1]}{127.0.0.1:0}
   [junit4]   2> 1622205 INFO  (TEST-TestReplicationHandler.doTestReplicateAfterCoreReload-seed#[A9D250C933E907C1]) [    ] o.a.s.c.CoreContainer Shutting down CoreContainer instance=1154518133
   [junit4]   2> 1622212 INFO  (coreCloseExecutor-3751-thread-1) [    x:collection1] o.a.s.c.SolrCore [collection1]  CLOSING SolrCore org.apache.solr.core.SolrCore@40f13e0
   [junit4]   2> 1622212 INFO  (coreCloseExecutor-3751-thread-1) [    x:collection1] o.a.s.u.DirectUpdateHandler2 closing DirectUpdateHandler2{commits=0,autocommits=0,soft autocommits=0,optimizes=0,rollbacks=0,expungeDeletes=0,docsPending=0,adds=0,deletesById=0,deletesByQuery=0,errors=0,cumulative_adds=0,cumulative_deletesById=0,cumulative_deletesByQuery=0,cumulative_errors=0}
   [junit4]   2> 1622212 INFO  (coreCloseExecutor-3751-thread-1) [    x:collection1] o.a.s.u.SolrCoreState Closing SolrCoreState
   [junit4]   2> 1622212 INFO  (coreCloseExecutor-3751-thread-1) [    x:collection1] o.a.s.u.DefaultSolrCoreState SolrCoreState ref count has reached 0 - closing IndexWriter
   [junit4]   2> 1622212 INFO  (coreCloseExecutor-3751-thread-1) [    x:collection1] o.a.s.u.DefaultSolrCoreState closing IndexWriter with IndexWriterCloser
   [junit4]   2> 1622214 INFO  (coreCloseExecutor-3751-thread-1) [    x:collection1] o.a.s.c.SolrCore [collection1] Closing main searcher on request.
   [junit4]   2> 1622214 INFO  (coreCloseExecutor-3751-thread-1) [    x:collection1] o.a.s.c.CachingDirectoryFactory Closing MockDirectoryFactory - 2 directories currently being tracked
   [junit4]   2> 1622214 INFO  (coreCloseExecutor-3751-thread-1) [    x:collection1] o.a.s.c.CachingDirectoryFactory looking to close /x1/jenkins/jenkins-slave/workspace/Lucene-Solr-NightlyTests-master/solr/build/solr-core/test/J0/temp/solr.handler.TestReplicationHandler_A9D250C933E907C1-001/solr-instance-002/./collection1/data/index [CachedDir<<refCount=0;path=/x1/jenkins/jenkins-slave/workspace/Lucene-Solr-NightlyTests-master/solr/build/solr-core/test/J0/temp/solr.handler.TestReplicationHandler_A9D250C933E907C1-001/solr-instance-002/./collection1/data/index;done=false>>]
   [junit4]   2> 1622214 INFO  (coreCloseExecutor-3751-thread-1) [    x:collection1] o.a.s.c.CachingDirectoryFactory Closing directory: /x1/jenkins/jenkins-slave/workspace/Lucene-Solr-NightlyTests-master/solr/build/solr-core/test/J0/temp/solr.handler.TestReplicationHandler_A9D250C933E907C1-001/solr-instance-002/./collection1/data/index
   [junit4]   2> 1622214 INFO  (coreCloseExecutor-3751-thread-1) [    x:collection1] o.a.s.c.CachingDirectoryFactory looking to close /x1/jenkins/jenkins-slave/workspace/Lucene-Solr-NightlyTests-master/solr/build/solr-core/test/J0/temp/solr.handler.TestReplicationHandler_A9D250C933E907C1-001/solr-instance-002/./collection1/data [CachedDir<<refCount=0;path=/x1/jenkins/jenkins-slave/workspace/Lucene-Solr-NightlyTests-master/solr/build/solr-core/test/J0/temp/solr.handler.TestReplicationHandler_A9D250C933E907C1-001/solr-instance-002/./collection1/data;done=false>>]
   [junit4]   2> 1622214 INFO  (coreCloseExecutor-3751-thread-1) [    x:collection1] o.a.s.c.CachingDirectoryFactory Closing directory: /x1/jenkins/jenkins-slave/workspace/Lucene-Solr-NightlyTests-master/solr/build/solr-core/test/J0/temp/solr.handler.TestReplicationHandler_A9D250C933E907C1-001/solr-instance-002/./collection1/data
   [junit4]   2> 1622215 INFO  (TEST-TestReplicationHandler.doTestReplicateAfterCoreReload-seed#[A9D250C933E907C1]) [    ] o.e.j.s.h.ContextHandler Stopped o.e.j.s.ServletContextHandler@d25fa35{/solr,null,UNAVAILABLE}
   [junit4]   2> 1622217 INFO  (TEST-TestReplicationHandler.doTestReplicateAfterCoreReload-seed#[A9D250C933E907C1]) [    ] o.e.j.s.ServerConnector Stopped ServerConnector@3c46d3b9{HTTP/1.1,[http/1.1]}{127.0.0.1:0}
   [junit4]   2> 1622218 INFO  (TEST-TestReplicationHandler.doTestReplicateAfterCoreReload-seed#[A9D250C933E907C1]) [    ] o.a.s.c.CoreContainer Shutting down CoreContainer instance=427705031
   [junit4]   2> 1622218 INFO  (coreCloseExecutor-3753-thread-1) [    x:collection1] o.a.s.c.SolrCore [collection1]  CLOSING SolrCore org.apache.solr.core.SolrCore@253268d3
   [junit4]   2> 1622218 INFO  (coreCloseExecutor-3753-thread-1) [    x:collection1] o.a.s.u.DirectUpdateHandler2 closing DirectUpdateHandler2{commits=0,autocommits=0,soft autocommits=0,optimizes=0,rollbacks=0,expungeDeletes=0,docsPending=0,adds=0,deletesById=0,deletesByQuery=0,errors=0,cumulative_adds=0,cumulative_deletesById=0,cumulative_deletesByQuery=0,cumulative_errors=0}
   [junit4]   2> 1622218 INFO  (coreCloseExecutor-3753-thread-1) [    x:collection1] o.a.s.u.SolrCoreState Closing SolrCoreState
   [junit4]   2> 1622218 INFO  (coreCloseExecutor-3753-thread-1) [    x:collection1] o.a.s.u.DefaultSolrCoreState SolrCoreState ref count has reached 0 - closing IndexWriter
   [junit4]   2> 1622218 INFO  (coreCloseExecutor-3753-thread-1) [    x:collection1] o.a.s.u.DefaultSolrCoreState closing IndexWriter with IndexWriterCloser
   [junit4]   2> 1622219 INFO  (coreCloseExecutor-3753-thread-1) [    x:collection1] o.a.s.c.SolrCore [collection1] Closing main searcher on request.
   [junit4]   2> 1622219 INFO  (coreCloseExecutor-3753-thread-1) [    x:collection1] o.a.s.c.CachingDirectoryFactory Closing MockDirectoryFactory - 2 directories currently being tracked
   [junit4]   2> 1622219 INFO  (coreCloseExecutor-3753-thread-1) [    x:collection1] o.a.s.c.CachingDirectoryFactory looking to close /x1/jenkins/jenkins-slave/workspace/Lucene-Solr-NightlyTests-master/solr/build/solr-core/test/J0/temp/solr.handler.TestReplicationHandler_A9D250C933E907C1-001/solr-instance-001/./collection1/data [CachedDir<<refCount=0;path=/x1/jenkins/jenkins-slave/workspace/Lucene-Solr-NightlyTests-master/solr/build/solr-core/test/J0/temp/solr.handler.TestReplicationHandler_A9D250C933E907C1-001/solr-instance-001/./collection1/data;done=false>>]
   [junit4]   2> 1622219 INFO  (coreCloseExecutor-3753-thread-1) [    x:collection1] o.a.s.c.CachingDirectoryFactory Closing directory: /x1/jenkins/jenkins-slave/workspace/Lucene-Solr-NightlyTests-master/solr/build/solr-core/test/J0/temp/solr.handler.TestReplicationHandler_A9D250C933E907C1-001/solr-instance-001/./collection1/data
   [junit4]   2> 1622219 INFO  (coreCloseExecutor-3753-thread-1) [    x:collection1] o.a.s.c.CachingDirectoryFactory looking to close /x1/jenkins/jenkins-slave/workspace/Lucene-Solr-NightlyTests-master/solr/build/solr-core/test/J0/temp/solr.handler.TestReplicationHandler_A9D250C933E907C1-001/solr-instance-001/./collection1/data/index [CachedDir<<refCount=0;path=/x1/jenkins/jenkins-slave/workspace/Lucene-Solr-NightlyTests-master/solr/build/solr-core/test/J0/temp/solr.handler.TestReplicationHandler_A9D250C933E907C1-001/solr-instance-001/./collection1/data/index;done=false>>]
   [junit4]   2> 1622219 INFO  (coreCloseExecutor-3753-thread-1) [    x:collection1] o.a.s.c.CachingDirectoryFactory Closing directory: /x1/jenkins/jenkins-slave/workspace/Lucene-Solr-NightlyTests-master/solr/build/solr-core/test/J0/temp/solr.handler.TestReplicationHandler_A9D250C933E907C1-001/solr-instance-001/./collection1/data/index
   [junit4]   2> 1622221 INFO  (TEST-TestReplicationHandler.doTestReplicateAfterCoreReload-seed#[A9D250C933E907C1]) [    ] o.e.j.s.h.ContextHandler Stopped o.e.j.s.ServletContextHandler@50130cae{/solr,null,UNAVAILABLE}
   [junit4]   2> 1622226 INFO  (TEST-TestReplicationHandler.doTestReplicateAfterCoreReload-seed#[A9D250C933E907C1]) [    ] o.e.j.s.Server jetty-9.3.6.v20151106
   [junit4]   2> 1622228 INFO  (TEST-TestReplicationHandler.doTestReplicateAfterCoreReload-seed#[A9D250C933E907C1]) [    ] o.e.j.s.h.ContextHandler Started o.e.j.s.ServletContextHandler@7719d9a5{/solr,null,AVAILABLE}
   [junit4]   2> 1622228 INFO  (TEST-TestReplicationHandler.doTestReplicateAfterCoreReload-seed#[A9D250C933E907C1]) [    ] o.e.j.s.ServerConnector Started ServerConnector@73906f40{HTTP/1.1,[http/1.1]}{127.0.0.1:51682}
   [junit4]   2> 1622228 INFO  (TEST-TestReplicationHandler.doTestReplicateAfterCoreReload-seed#[A9D250C933E907C1]) [    ] o.e.j.s.Server Started @1625735ms
   [junit4]   2> 1622228 INFO  (TEST-TestReplicationHandler.doTestReplicateAfterCoreReload-seed#[A9D250C933E907C1]) [    ] o.a.s.c.s.e.JettySolrRunner Jetty properties: {solr.data.dir=/x1/jenkins/jenkins-slave/workspace/Lucene-Solr-NightlyTests-master/solr/build/solr-core/test/J0/temp/solr.handler.TestReplicationHandler_A9D250C933E907C1-001/solr-instance-001/collection1/data, hostContext=/solr, hostPort=51682}
   [junit4]   2> 1622229 INFO  (TEST-TestReplicationHandler.doTestReplicateAfterCoreReload-seed#[A9D250C933E907C1]) [    ] o.a.s.s.SolrDispatchFilter SolrDispatchFilter.init(): sun.misc.Launcher$AppClassLoader@4e0e2f2a
   [junit4]   2> 1622229 INFO  (TEST-TestReplicationHandler.doTestReplicateAfterCoreReload-seed#[A9D250C933E907C1]) [    ] o.a.s.c.SolrResourceLoader new SolrResourceLoader for directory: '/x1/jenkins/jenkins-slave/workspace/Lucene-Solr-NightlyTests-master/solr/build/solr-core/test/J0/temp/solr.handler.TestReplicationHandler_A9D250C933E907C1-001/solr-instance-001'
   [junit4]   2> 1622229 INFO  (TEST-TestReplicationHandler.doTestReplicateAfterCoreReload-seed#[A9D250C933E907C1]) [    ] o.a.s.c.SolrResourceLoader JNDI not configured for solr (NoInitialContextEx)
   [junit4]   2> 1622229 INFO  (TEST-TestReplicationHandler.doTestReplicateAfterCoreReload-seed#[A9D250C933E907C1]) [    ] o.a.s.c.SolrResourceLoader solr home defaulted to 'solr/' (could not find system property or JNDI)
   [junit4]   2> 1622229 INFO  (TEST-TestReplicationHandler.doTestReplicateAfterCoreReload-seed#[A9D250C933E907C1]) [    ] o.a.s.c.SolrXmlConfig Loading container configuration from /x1/jenkins/jenkins-slave/workspace/Lucene-Solr-NightlyTests-master/solr/build/solr-core/test/J0/temp/solr.handler.TestReplicationHandler_A9D250C933E907C1-001/solr-instance-001/solr.xml
   [junit4]   2> 1622234 INFO  (TEST-TestReplicationHandler.doTestReplicateAfterCoreReload-seed#[A9D250C933E907C1]) [    ] o.a.s.c.CorePropertiesLocator Config-defined core root directory: /x1/jenkins/jenkins-slave/workspace/Lucene-Solr-NightlyTests-master/solr/build/solr-core/test/J0/temp/solr.handler.TestReplicationHandler_A9D250C933E907C1-001/solr-instance-001/.
   [junit4]   2> 1622234 INFO  (TEST-TestReplicationHandler.doTestReplicateAfterCoreReload-seed#[A9D250C933E907C1]) [    ] o.a.s.c.CoreContainer New CoreContainer 1269398063
   [junit4]   2> 1622234 INFO  (TEST-TestReplicationHandler.doTestReplicateAfterCoreReload-seed#[A9D250C933E907C1]) [    ] o.a.s.c.CoreContainer Loading cores into CoreContainer [instanceDir=/x1/jenkins/jenkins-slave/workspace/Lucene-Solr-NightlyTests-master/solr/build/solr-core/test/J0/temp/solr.handler.TestReplicationHandler_A9D250C933E907C1-001/solr-instance-001]
   [junit4]   2> 1622234 WARN  (TEST-TestReplicationHandler.doTestReplicateAfterCoreReload-seed#[A9D250C933E907C1]) [    ] o.a.s.c.CoreContainer Couldn't add files from /x1/jenkins/jenkins-slave/workspace/Lucene-Solr-NightlyTests-master/solr/build/solr-core/test/J0/temp/solr.handler.TestReplicationHandler_A9D250C933E907C1-001/solr-instance-001/lib to classpath: /x1/jenkins/jenkins-slave/workspace/Lucene-Solr-NightlyTests-master/solr/build/solr-core/test/J0/temp/solr.handler.TestReplicationHandler_A9D250C933E907C1-001/solr-instance-001/lib
   [junit4]   2> 1622234 INFO  (TEST-TestReplicationHandler.doTestReplicateAfterCoreReload-seed#[A9D250C933E907C1]) [    ] o.a.s.h.c.HttpShardHandlerFactory created with socketTimeout : 90000,urlScheme : ,connTimeout : 15000,maxConnectionsPerHost : 20,maxConnections : 10000,corePoolSize : 0,maximumPoolSize : 2147483647,maxThreadIdleTime : 5,sizeOfQueue : -1,fairnessPolicy : false,useRetries : false,
   [junit4]   2> 1622235 INFO  (TEST-TestReplicationHandler.doTestReplicateAfterCoreReload-seed#[A9D250C933E907C1]) [    ] o.a.s.u.UpdateShardHandler Creating UpdateShardHandler HTTP client with params: socketTimeout=340000&connTimeout=45000&retry=true
   [junit4]   2> 1622236 INFO  (TEST-TestReplicationHandler.doTestReplicateAfterCoreReload-seed#[A9D250C933E907C1]) [    ] o.a.s.l.LogWatcher SLF4J impl is org.slf4j.impl.Log4jLoggerFactory
   [junit4]   2> 1622236 INFO  (TEST-TestReplicationHandler.doTestReplicateAfterCoreReload-seed#[A9D250C933E907C1]) [    ] o.a.s.l.LogWatcher Registering Log Listener [Log4j (org.slf4j.impl.Log4jLoggerFactory)]
   [junit4]   2> 1622236 INFO  (TEST-TestReplicationHandler.doTestReplicateAfterCoreReload-seed#[A9D250C933E907C1]) [    ] o.a.s.c.CoreContainer Security conf doesn't exist. Skipping setup for authorization module.
   [junit4]   2> 1622236 INFO  (TEST-TestReplicationHandler.doTestReplicateAfterCoreReload-seed#[A9D250C933E907C1]) [    ] o.a.s.c.CoreContainer No authentication plugin used.
   [junit4]   2> 1622236 INFO  (TEST-TestReplicationHandler.doTestReplicateAfterCoreReload-seed#[A9D250C933E907C1]) [    ] o.a.s.c.CorePropertiesLocator Looking for core definitions underneath /x1/jenkins/jenkins-slave/workspace/Lucene-Solr-NightlyTests-master/solr/build/solr-core/test/J0/temp/solr.handler.TestReplicationHandler_A9D250C933E907C1-001/solr-instance-001/.
   [junit4]   2> 1622237 INFO  (TEST-TestReplicationHandler.doTestReplicateAfterCoreReload-seed#[A9D250C933E907C1]) [    ] o.a.s.c.CoreDescriptor Created CoreDescriptor: {name=collection1, config=solrconfig.xml, loadOnStartup=true, schema=schema.xml, configSetProperties=configsetprops.json, transient=false, dataDir=data/}
   [junit4]   2> 1622237 INFO  (TEST-TestReplicationHandler.doTestReplicateAfterCoreReload-seed#[A9D250C933E907C1]) [    ] o.a.s.c.CorePropertiesLocator Found core collection1 in /x1/jenkins/jenkins-slave/workspace/Lucene-Solr-NightlyTests-master/solr/build/solr-core/test/J0/temp/solr.handler.TestReplicationHandler_A9D250C933E907C1-001/solr-instance-001/./collection1
   [junit4]   2> 1622237 INFO  (TEST-TestReplicationHandler.doTestReplicateAfterCoreReload-seed#[A9D250C933E907C1]) [    ] o.a.s.c.CorePropertiesLocator Found 1 core definitions
   [junit4]   2> 1622238 INFO  (coreLoadExecutor-3760-thread-1) [    ] o.a.s.c.SolrResourceLoader new SolrResourceLoader for directory: '/x1/jenkins/jenkins-slave/workspace/Lucene-Solr-NightlyTests-master/solr/build/solr-core/test/J0/temp/solr.handler.TestReplicationHandler_A9D250C933E907C1-001/solr-instance-001/collection1'
   [junit4]   2> 1622238 INFO  (coreLoadExecutor-3760-thread-1) [    ] o.a.s.c.SolrResourceLoader JNDI not configured for solr (NoInitialContextEx)
   [junit4]   2> 1622238 INFO  (coreLoadExecutor-3760-thread-1) [    ] o.a.s.c.SolrResourceLoader solr home defaulted to 'solr/' (could not find system property or JNDI)
   [junit4]   2> 1622239 INFO  (TEST-TestReplicationHandler.doTestReplicateAfterCoreReload-seed#[A9D250C933E907C1]) [    ] o.a.s.s.SolrDispatchFilter user.dir=/x1/jenkins/jenkins-slave/workspace/Lucene-Solr-NightlyTests-master/solr/build/solr-core/test/J0
   [junit4]   2> 1622239 INFO  (TEST-TestReplicationHandler.doTestReplicateAfterCoreReload-seed#[A9D250C933E907C1]) [    ] o.a.s.s.SolrDispatchFilter SolrDispatchFilter.init() done
   [junit4]   2> 1622242 INFO  (coreLoadExecutor-3760-thread-1) [    ] o.a.s.c.SolrConfig current version of requestparams : -1
   [junit4]   2> 1622245 WARN  (coreLoadExecutor-3760-thread-1) [    ] o.a.s.c.Config Beginning with Solr 5.5, <mergePolicy> is deprecated, use <mergePolicyFactory> instead.
   [junit4]   2> 1622245 INFO  (coreLoadExecutor-3760-thread-1) [    ] o.a.s.c.SolrConfig Using Lucene MatchVersion: 7.0.0
   [junit4]   2> 1622251 INFO  (coreLoadExecutor-3760-thread-1) [    ] o.a.s.c.SolrConfig Loaded SolrConfig: solrconfig.xml
   [junit4]   2> 1622254 INFO  (coreLoadExecutor-3760-thread-1) [    ] o.a.s.s.IndexSchema [collection1] Schema name=test
   [junit4]   2> 1622256 INFO  (coreLoadExecutor-3760-thread-1) [    ] o.a.s.s.IndexSchema unique key field: id
   [junit4]   2> 1622256 INFO  (coreLoadExecutor-3760-thread-1) [    ] o.a.s.c.ConfigSetProperties Did not find ConfigSet properties, assuming default properties: Can't find resource 'configsetprops.json' in classpath or '/x1/jenkins/jenkins-slave/workspace/Lucene-Solr-NightlyTests-master/solr/build/solr-core/test/J0/temp/solr.handler.TestReplicationHandler_A9D250C933E907C1-001/solr-instance-001/collection1'
   [junit4]   2> 1622256 INFO  (coreLoadExecutor-3760-thread-1) [    ] o.a.s.c.CoreContainer Creating SolrCore 'collection1' using configuration from instancedir /x1/jenkins/jenkins-slave/workspace/Lucene-Solr-NightlyTests-master/solr/build/solr-core/test/J0/temp/solr.handler.TestReplicationHandler_A9D250C933E907C1-001/solr-instance-001/./collection1
   [junit4]   2> 1622257 INFO  (coreLoadExecutor-3760-thread-1) [    x:collection1] o.a.s.c.SolrCore org.apache.solr.core.MockDirectoryFactory
   [junit4]   2> 1622257 INFO  (coreLoadExecutor-3760-thread-1) [    x:collection1] o.a.s.c.SolrCore [[collection1] ] Opening new SolrCore at [/x1/jenkins/jenkins-slave/workspace/Lucene-Solr-NightlyTests-master/solr/build/solr-core/test/J0/temp/solr.handler.TestReplicationHandler_A9D250C933E907C1-001/solr-instance-001/collection1], dataDir=[/x1/jenkins/jenkins-slave/workspace/Lucene-Solr-NightlyTests-master/solr/build/solr-core/test/J0/temp/solr.handler.TestReplicationHandler_A9D250C933E907C1-001/solr-instance-001/./collection1/data/]
   [junit4]   2> 1622257 INFO  (coreLoadExecutor-3760-thread-1) [    x:collection1] o.a.s.c.SolrCore JMX monitoring not detected for core: collection1
   [junit4]   2> 1622258 INFO  (coreLoadExecutor-3760-thread-1) [    x:collection1] o.a.s.c.CachingDirectoryFactory return new directory for /x1/jenkins/jenkins-slave/workspace/Lucene-Solr-NightlyTests-master/solr/build/solr-core/test/J0/temp/solr.handler.TestReplicationHandler_A9D250C933E907C1-001/solr-instance-001/./collection1/data
   [junit4]   2> 1622258 INFO  (coreLoadExecutor-3760-thread-1) [    x:collection1] o.a.s.c.SolrCore New index directory detected: old=null new=/x1/jenkins/jenkins-slave/workspace/Lucene-Solr-NightlyTests-master/solr/build/solr-core/test/J0/temp/solr.handler.TestReplicationHandler_A9D250C933E907C1-001/solr-instance-001/./collection1/data/index/
   [junit4]   2> 1622258 WARN  (coreLoadExecutor-3760-thread-1) [    x:collection1] o.a.s.c.SolrCore [collection1] Solr index directory '/x1/jenkins/jenkins-slave/workspace/Lucene-Solr-NightlyTests-master/solr/build/solr-core/test/J0/temp/solr.handler.TestReplicationHandler_A9D250C933E907C1-001/solr-instance-001/./collection1/data/index' doesn't exist. Creating new index...
   [junit4]   2> 1622258 INFO  (coreLoadExecutor-3760-thread-1) [    x:collection1] o.a.s.c.CachingDirectoryFactory return new directory for /x1/jenkins/jenkins-slave/workspace/Lucene-Solr-NightlyTests-master/solr/build/solr-core/test/J0/temp/solr.handler.TestReplicationHandler_A9D250C933E907C1-001/solr-instance-001/./collection1/data/index
   [junit4]   2> 1622258 INFO  (coreLoadExecutor-3760-thread-1) [    x:collection1] o.a.s.u.RandomMergePolicy RandomMergePolicy wrapping class org.apache.lucene.index.MockRandomMergePolicy: org.apache.lucene.index.MockRandomMergePolicy@7e0d4da4
   [junit4]   2> 1622259 INFO  (coreLoadExecutor-3760-thread-1) [    x:collection1] o.a.s.c.SolrDeletionPolicy SolrDeletionPolicy.onCommit: commits: num=1
   [junit4]   2> 	commit{dir=RawDirectoryWrapper(RAMDirectory@6211411d lockFactory=org.apache.lucene.store.SingleInstanceLockFactory@1b1b4ba6),segFN=segments_1,generation=1}
   [junit4]   2> 1622259 INFO  (coreLoadExecutor-3760-thread-1) [    x:collection1] o.a.s.c.SolrDeletionPolicy newest commit generation = 1
   [junit4]   2> 1622259 INFO  (OldIndexDirectoryCleanupThreadForCore-collection1) [    x:collection1] o.a.s.c.SolrCore Looking for old index directories to cleanup for core collection1 in /x1/jenkins/jenkins-slave/workspace/Lucene-Solr-NightlyTests-master/solr/build/solr-core/test/J0/temp/solr.handler.TestReplicationHandler_A9D250C933E907C1-001/solr-instance-001/./collection1/data/
   [junit4]   2> 1622261 INFO  (coreLoadExecutor-3760-thread-1) [    x:collection1] o.a.s.c.SolrCore no updateRequestProcessorChain defined as default, creating implicit default
   [junit4]   2> 1622261 INFO  (coreLoadExecutor-3760-thread-1) [    x:collection1] o.a.s.h.l.XMLLoader xsltCacheLifetimeSeconds=60
   [junit4]   2> 1622262 INFO  (coreLoadExecutor-3760-thread-1) [    x:collection1] o.a.s.h.l.XMLLoader xsltCacheLifetimeSeconds=60
   [junit4]   2> 1622263 INFO  (coreLoadExecutor-3760-thread-1) [    x:collection1] o.a.s.h.l.XMLLoader xsltCacheLifetimeSeconds=60
   [junit4]   2> 1622264 INFO  (coreLoadExecutor-3760-thread-1) [    x:collection1] o.a.s.h.l.XMLLoader xsltCacheLifetimeSeconds=60
   [junit4]   2> 1622265 INFO  (coreLoadExecutor-3760-thread-1) [    x:collection1] o.a.s.c.PluginBag requestHandler : 'lazy' created with startup=lazy 
   [junit4]   2> 1622265 INFO  (coreLoadExecutor-3760-thread-1) [    x:collection1] o.a.s.c.RequestHandlers Registered paths: /admin/mbeans,standard,lazy,/update/json/docs,/admin/luke,/export,/get,/admin/properties,/update/json,/admin/threads,/update/csv,/sql,/admin/segments,/admin/system,/replication,defaults,/config,/stream,/schema,/admin/plugins,/admin/logging,/admin/ping,/update,/admin/file
   [junit4]   2> 1622265 INFO  (coreLoadExecutor-3760-thread-1) [    x:collection1] o.a.s.c.SolrCore Using default statsCache cache: org.apache.solr.search.stats.LocalStatsCache
   [junit4]   2> 1622265 INFO  (coreLoadExecutor-3760-thread-1) [    x:collection1] o.a.s.u.CommitTracker Hard AutoCommit: disabled
   [junit4]   2> 1622265 INFO  (coreLoadExecutor-3760-thread-1) [    x:collection1] o.a.s.u.CommitTracker Soft AutoCommit: disabled
   [junit4]   2> 1622266 INFO  (coreLoadExecutor-3760-thread-1) [    x:collection1] o.a.s.u.RandomMergePolicy RandomMergePolicy wrapping class org.apache.lucene.index.TieredMergePolicy: [TieredMergePolicy: maxMergeAtOnce=48, maxMergeAtOnceExplicit=25, maxMergedSegmentMB=0.7734375, floorSegmentMB=0.2802734375, forceMergeDeletesPctAllowed=16.25810614029274, segmentsPerTier=25.0, maxCFSSegmentSizeMB=8.796093022207999E12, noCFSRatio=1.0
   [junit4]   2> 1622266 INFO  (coreLoadExecutor-3760-thread-1) [    x:collection1] o.a.s.c.SolrDeletionPolicy SolrDeletionPolicy.onInit: commits: num=1
   [junit4]   2> 	commit{dir=RawDirectoryWrapper(RAMDirectory@6211411d lockFactory=org.apache.lucene.store.SingleInstanceLockFactory@1b1b4ba6),segFN=segments_1,generation=1}
   [junit4]   2> 1622266 INFO  (coreLoadExecutor-3760-thread-1) [    x:collection1] o.a.s.c.SolrDeletionPolicy newest commit generation = 1
   [junit4]   2> 1622266 INFO  (coreLoadExecutor-3760-thread-1) [    x:collection1] o.a.s.s.SolrIndexSearcher Opening [Searcher@161c6d66[collection1] main]
   [junit4]   2> 1622266 INFO  (coreLoadExecutor-3760-thread-1) [    x:collection1] o.a.s.r.ManagedResourceStorage File-based storage initialized to use dir: /x1/jenkins/jenkins-slave/workspace/Lucene-Solr-NightlyTests-master/solr/build/solr-core/test/J0/temp/solr.handler.TestReplicationHandler_A9D250C933E907C1-001/solr-instance-001/collection1/conf
   [junit4]   2> 1622266 INFO  (coreLoadExecutor-3760-thread-1) [    x:collection1] o.a.s.r.RestManager Initializing RestManager with initArgs: {storageDir=/x1/jenkins/jenkins-slave/workspace/Lucene-Solr-NightlyTests-master/solr/build/solr-core/test/J0/temp/solr.handler.TestReplicationHandler_A9D250C933E907C1-001/solr-instance-001/collection1/conf}
   [junit4]   2> 1622266 INFO  (coreLoadExecutor-3760-thread-1) [    x:collection1] o.a.s.r.ManagedResourceStorage Reading _rest_managed.json using file:dir=/x1/jenkins/jenkins-slave/workspace/Lucene-Solr-NightlyTests-master/solr/build/solr-core/test/J0/temp/solr.handler.TestReplicationHandler_A9D250C933E907C1-001/solr-instance-001/collection1/conf
   [junit4]   2> 1622266 INFO  (coreLoadExecutor-3760-thread-1) [    x:collection1] o.a.s.r.RestManager Initializing 0 registered ManagedResources
   [junit4]   2> 1622267 INFO  (coreLoadExecutor-3760-thread-1) [    x:collection1] o.a.s.h.ReplicationHandler Replication enabled for following config files: schema.xml
   [junit4]   2> 1622267 INFO  (coreLoadExecutor-3760-thread-1) [    x:collection1] o.a.s.h.ReplicationHandler Commits will be reserved for  10000
   [junit4]   2> 1622267 INFO  (searcherExecutor-3761-thread-1-processing-x:collection1) [    x:collection1] o.a.s.c.SolrCore [collection1] Registered new searcher Searcher@161c6d66[collection1] main{ExitableDirectoryReader(UninvertingDirectoryReader())}
   [junit4]   2> 1622267 INFO  (coreLoadExecutor-3760-thread-1) [    x:collection1] o.a.s.c.CoreContainer registering core: collection1
   [junit4]   2> 1622741 INFO  (qtp2059649442-61395) [    x:collection1] o.a.s.u.DirectUpdateHandler2 [collection1] REMOVING ALL DOCUMENTS FROM INDEX
   [junit4]   2> 1622741 INFO  (qtp2059649442-61395) [    x:collection1] o.a.s.u.p.LogUpdateProcessorFactory [collection1]  webapp=/solr path=/update params={wt=javabin&version=2}{deleteByQuery=*:*} 0 0
   [junit4]   2> 1622744 INFO  (qtp2059649442-61396) [    x:collection1] o.a.s.u.p.LogUpdateProcessorFactory [collection1]  webapp=/solr path=/update params={wt=javabin&version=2}{add=[0]} 0 0
   [junit4]   2> 1622745 INFO  (qtp2059649442-61397) [    x:collection1] o.a.s.u.p.LogUpdateProcessorFactory [collection1]  webapp=/solr path=/update params={wt=javabin&version=2}{add=[1]} 0 0
   [junit4]   2> 1622747 INFO  (qtp2059649442-61398) [    x:collection1] o.a.s.u.p.LogUpdateProcessorFactory [collection1]  webapp=/solr path=/update params={wt=javabin&version=2}{add=[2]} 0 0
   [junit4]   2> 1622749 INFO  (qtp2059649442-61399) [    x:collection1] o.a.s.u.p.LogUpdateProcessorFactory [collection1]  webapp=/solr path=/update params={wt=javabin&version=2}{add=[3]} 0 0
   [junit4]   2> 1622750 INFO  (qtp2059649442-61392) [    x:collection1] o.a.s.u.p.LogUpdateProcessorFactory [collection1]  webapp=/solr path=/update params={wt=javabin&version=2}{add=[4]} 0 0
   [junit4]   2> 1622752 INFO  (qtp2059649442-61395) [    x:collection1] o.a.s.u.p.LogUpdateProcessorFactory [collection1]  webapp=/solr path=/update params={wt=javabin&version=2}{add=[5]} 0 0
   [junit4]   2> 1622753 INFO  (qtp2059649442-61396) [    x:collection1] o.a.s.u.p.LogUpdateProcessorFactory [collection1]  webapp=/solr path=/update params={wt=javabin&version=2}{add=[6]} 0 0
   [junit4]   2> 1622755 INFO  (qtp2059649442-61397) [    x:collection1] o.a.s.u.p.LogUpdateProcessorFactory [collection1]  webapp=/solr path=/update params={wt=javabin&version=2}{add=[7]} 0 0
   [junit4]   2> 1622756 INFO  (qtp2059649442-61398) [    x:collection1] o.a.s.u.p.LogUpdateProcessorFactory [collection1]  webapp=/solr path=/update params={wt=javabin&version=2}{add=[8]} 0 0
   [junit4]   2> 1622758 INFO  (qtp2059649442-61399) [    x:collection1] o.a.s.u.p.LogUpdateProcessorFactory [collection1]  webapp=/solr path=/update params={wt=javabin&version=2}{add=[9]} 0 0
   [junit4]   2> 1622759 INFO  (qtp2059649442-61392) [    x:collection1] o.a.s.u.p.LogUpdateProcessorFactory [collection1]  webapp=/solr path=/update params={wt=javabin&version=2}{add=[10]} 0 0
   [junit4]   2> 1622761 INFO  (qtp2059649442-61395) [    x:collection1] o.a.s.u.p.LogUpdateProcessorFactory [collection1]  webapp=/solr path=/update params={wt=javabin&version=2}{add=[11]} 0 0
   [junit4]   2> 1622763 INFO  (qtp2059649442-61396) [    x:collection1] o.a.s.u.p.LogUpdateProcessorFactory [collection1]  webapp=/solr path=/update params={wt=javabin&version=2}{add=[12]} 0 0
   [junit4]   2> 1622764 INFO  (qtp2059649442-61397) [    x:collection1] o.a.s.u.p.LogUpdateProcessorFactory [collection1]  webapp=/solr path=/update params={wt=javabin&version=2}{add=[13]} 0 0
   [junit4]   2> 1622766 INFO  (qtp2059649442-61397) [    x:collection1] o.a.s.u.p.LogUpdateProcessorFactory [collection1]  webapp=/solr path=/update params={wt=javabin&version=2}{add=[14]} 0 0
   [junit4]   2> 1622767 INFO  (qtp2059649442-61399) [    x:collection1] o.a.s.u.p.LogUpdateProcessorFactory [collection1]  webapp=/solr path=/update params={wt=javabin&version=2}{add=[15]} 0 0
   [junit4]   2> 1622769 INFO  (qtp2059649442-61392) [    x:collection1] o.a.s.u.p.LogUpdateProcessorFactory [collection1]  webapp=/solr path=/update params={wt=javabin&version=2}{add=[16]} 0 0
   [junit4]   2> 1622771 INFO  (qtp2059649442-61395) [    x:collection1] o.a.s.u.p.LogUpdateProcessorFactory [collection1]  webapp=/solr path=/update params={wt=javabin&version=2}{add=[17]} 0 0
   [junit4]   2> 1622772 INFO  (qtp2059649442-61396) [    x:collection1] o.a.s.u.p.LogUpdateProcessorFactory [collection1]  webapp=/solr path=/update params={wt=javabin&version=2}{add=[18]} 0 0
   [junit4]   2> 1622774 INFO  (qtp2059649442-61398) [    x:collection1] o.a.s.u.p.LogUpdateProcessorFactory [collection1]  webapp=/solr path=/update params={wt=javabin&version=2}{add=[19]} 0 0
   [junit4]   2> 1622775 INFO  (qtp2059649442-61398) [    x:collection1] o.a.s.u.p.LogUpdateProcessorFactory [collection1]  webapp=/solr path=/update params={wt=javabin&version=2}{add=[20]} 0 0
   [junit4]   2> 1622777 INFO  (qtp2059649442-61399) [    x:collection1] o.a.s.u.p.LogUpdateProcessorFactory [collection1]  webapp=/solr path=/update params={wt=javabin&version=2}{add=[21]} 0 0
   [junit4]   2> 1622778 INFO  (qtp2059649442-61392) [    x:collection1] o.a.s.u.p.LogUpdateProcessorFactory [collection1]  webapp=/solr path=/update params={wt=javabin&version=2}{add=[22]} 0 0
   [junit4]   2> 1622780 INFO  (qtp2059649442-61395) [    x:collection1] o.a.s.u.p.LogUpdateProcessorFactory [collection1]  webapp=/solr path=/update params={wt=javabin&version=2}{add=[23]} 0 0
   [junit4]   2> 1622782 INFO  (qtp2059649442-61396) [    x:collection1] o.a.s.u.p.LogUpdateProcessorFactory [collection1]  webapp=/solr path=/update params={wt=javabin&version=2}{add=[24]} 0 0
   [junit4]   2> 1622783 INFO  (qtp2059649442-61397) [    x:collection1] o.a.s.u.p.LogUpdateProcessorFactory [collection1]  webapp=/solr path=/update params={wt=javabin&version=2}{add=[25]} 0 0
   [junit4]   2> 1622785 INFO  (qtp2059649442-61398) [    x:collection1] o.a.s.u.p.LogUpdateProcessorFactory [collection1]  webapp=/solr path=/update params={wt=javabin&version=2}{add=[26]} 0 0
   [junit4]   2> 1622787 INFO  (qtp2059649442-61399) [    x:collection1] o.a.s.u.p.LogUpdateProcessorFactory [collection1]  webapp=/solr path=/update params={wt=javabin&version=2}{add=[27]} 0 0
   [junit4]   2> 1622788 INFO  (qtp2059649442-61399) [    x:collection1] o.a.s.u.p.LogUpdateProcessorFactory [collection1]  webapp=/solr path=/update params={wt=javabin&version=2}{add=[28]} 0 0
   [junit4]   2> 1622790 INFO  (qtp2059649442-61395) [    x:collection1] o.a.s.u.p.LogUpdateProcessorFactory [collection1]  webapp=/solr path=/update params={wt=javabin&version=2}{add=[29]} 0 0
   [junit4]   2> 1622791 INFO  (qtp2059649442-61396) [    x:collection1] o.a.s.u.p.LogUpdateProcessorFactory [collection1]  webapp=/solr path=/update params={wt=javabin&version=2}{add=[30]} 0 0
   [junit4]   2> 1622793 INFO  (qtp2059649442-61397) [    x:collection1] o.a.s.u.p.LogUpdateProcessorFactory [collection1]  webapp=/solr path=/update params={wt=javabin&version=2}{add=[31]} 0 0
   [junit4]   2> 1622795 INFO  (qtp2059649442-61398) [    x:collection1] o.a.s.u.p.LogUpdateProcessorFactory [collection1]  webapp=/solr path=/update params={wt=javabin&version=2}{add=[32]} 0 0
   [junit4]   2> 1622796 INFO  (qtp2059649442-61392) [    x:collection1] o.a.s.u.p.LogUpdateProcessorFactory [collection1]  webapp=/solr path=/update params={wt=javabin&version=2}{add=[33]} 0 0
   [junit4]   2> 1622798 INFO  (qtp2059649442-61399) [    x:collection1] o.a.s.u.p.LogUpdateProcessorFactory [collection1]  webapp=/solr path=/update params={wt=javabin&version=2}{add=[34]} 0 0
   [junit4]   2> 1622800 INFO  (qtp2059649442-61395) [    x:collection1] o.a.s.u.p.LogUpdateProcessorFactory [collection1]  webapp=/solr path=/update params={wt=javabin&version=2}{add=[35]} 0 0
   [junit4]   2> 1622801 INFO  (qtp2059649442-61396) [    x:collection1] o.a.s.u.p.LogUpdateProcessorFactory [collection1]  webapp=/solr path=/update params={wt=javabin&version=2}{add=[36]} 0 0
   [junit4]   2> 1622804 INFO  (qtp2059649442-61397) [    x:collection1] o.a.s.u.p.LogUpdateProcessorFactory [collection1]  webapp=/solr path=/update params={wt=javabin&version=2}{add=[37]} 0 0
   [junit4]   2> 1622806 INFO  (qtp2059649442-61398) [    x:collection1] o.a.s.u.p.LogUpdateProcessorFactory [collection1]  webapp=/solr path=/update params={wt=javabin&version=2}{add=[38]} 0 0
   [junit4]   2> 1622807 INFO  (qtp2059649442-61398) [    x:collection1] o.a.s.u.p.LogUpdateProcessorFactory [collection1]  webapp=/solr path=/update params={wt=javabin&version=2}{add=[39]} 0 0
   [junit4]   2> 1622809 INFO  (qtp2059649442-61399) [    x:collection1] o.a.s.u.p.LogUpdateProcessorFactory [collection1]  webapp=/solr path=/update params={wt=javabin&version=2}{add=[40]} 0 0
   [junit4]   2> 1622810 INFO  (qtp2059649442-61395) [    x:collection1] o.a.s.u.p.LogUpdateProcessorFactory [collection1]  webapp=/solr path=/update params={wt=javabin&version=2}{add=[41]} 0 0
   [junit4]   2> 1622812 INFO  (qtp2059649442-61396) [    x:collection1] o.a.s.u.p.LogUpdateProcessorFactory [collection1]  webapp=/solr path=/update params={wt=javabin&version=2}{add=[42]} 0 0
   [junit4]   2> 1622814 INFO  (qtp2059649442-61397) [    x:collection1] o.a.s.u.p.LogUpdateProcessorFactory [collection1]  webapp=/solr path=/update params={wt=javabin&version=2}{add=[43]} 0 0
   [junit4]   2> 1622815 INFO  (qtp2059649442-61392) [    x:collection1] o.a.s.u.p.LogUpdateProcessorFactory [collection1]  webapp=/solr path=/update params={wt=javabin&version=2}{add=[44]} 0 0
   [junit4]   2> 1622817 INFO  (qtp2059649442-61398) [    x:collection1] o.a.s.u.p.LogUpdateProcessorFactory [collection1]  webapp=/solr path=/update params={wt=javabin&version=2}{add=[45]} 0 0
   [junit4]   2> 1622818 INFO  (qtp2059649442-61399) [    x:collection1] o.a.s.u.p.LogUpdateProcessorFactory [collection1]  webapp=/solr path=/update params={wt=javabin&version=2}{add=[46]} 0 0
   [junit4]   2> 1622820 INFO  (qtp2059649442-61399) [    x:collection1] o.a.s.u.p.LogUpdateProcessorFactory [collection1]  webapp=/solr path=/update params={wt=javabin&version=2}{add=[47]} 0 0
   [junit4]   2> 1622821 INFO  (qtp2059649442-61396) [    x:collection1] o.a.s.u.p.LogUpdateProcessorFactory [collection1]  webapp=/solr path=/update params={wt=javabin&version=2}{add=[48]} 0 0
   [junit4]   2> 1622823 INFO  (qtp2059649442-61397) [    x:collection1] o.a.s.u.p.LogUpdateProcessorFactory [collection1]  webapp=/solr path=/update params={wt=javabin&version=2}{add=[49]} 0 0
   [junit4]   2> 1622825 INFO  (qtp2059649442-61392) [    x:collection1] o.a.s.u.p.LogUpdateProcessorFactory [collection1]  webapp=/solr path=/update params={wt=javabin&version=2}{add=[50]} 0 0
   [junit4]   2> 1622826 INFO  (qtp2059649442-61398) [    x:collection1] o.a.s.u.p.LogUpdateProcessorFactory [collection1]  webapp=/solr path=/update params={wt=javabin&version=2}{add=[51]} 0 0
   [junit4]   2> 1622828 INFO  (qtp2059649442-61395) [    x:collection1] o.a.s.u.p.LogUpdateProcessorFactory [collection1]  webapp=/solr path=/update params={wt=javabin&version=2}{add=[52]} 0 0
   [junit4]   2> 1622830 INFO  (qtp2059649442-61399) [    x:collection1] o.a.s.u.p.LogUpdateProcessorFactory [collection1]  webapp=/solr path=/update params={wt=javabin&version=2}{add=[53]} 0 0
   [junit4]   2> 1622831 INFO  (qtp2059649442-61396) [    x:collection1] o.a.s.u.p.LogUpdateProcessorFactory [collection1]  webapp=/solr path=/update params={wt=javabin&version=2}{add=[54]} 0 0
   [junit4]   2> 1622833 INFO  (qtp2059649442-61397) [    x:collection1] o.a.s.u.p.LogUpdateProcessorFactory [collection1]  webapp=/solr path=/update params={wt=javabin&version=2}{add=[55]} 0 0
   [junit4]   2> 1622834 INFO  (qtp2059649442-61392) [    x:collection1] o.a.s.u.p.LogUpdateProcessorFactory [collection1]  webapp=/solr path=/update params={wt=javabin&version=2}{add=[56]} 0 0
   [junit4]   2> 1622836 INFO  (qtp2059649442-61398) [    x:collection1] o.a.s.u.p.LogUpdateProcessorFactory [collection1]  webapp=/solr path=/update params={wt=javabin&version=2}{add=[57]} 0 0
   [junit4]   2> 1622838 INFO  (qtp2059649442-61395) [    x:collection1] o.a.s.u.p.LogUpdateProcessorFactory [collection1]  webapp=/solr path=/update params={wt=javabin&version=2}{add=[58]} 0 0
   [junit4]   2> 1622839 INFO  (qtp2059649442-61399) [    x:collection1] o.a.s.u.p.LogUpdateProcessorFactory [collection1]  webapp=/solr path=/update params={wt=javabin&version=2}{add=[59]} 0 0
   [junit4]   2> 1622841 INFO  (qtp2059649442-61396) [    x:collection1] o.a.s.u.p.LogUpdateProcessorFactory [collection1]  webapp=/solr path=/update params={wt=javabin&version=2}{add=[60]} 0 0
   [junit4]   2> 1622842 INFO  (qtp2059649442-61397) [    x:collection1] o.a.s.u.p.LogUpdateProcessorFactory [collection1]  webapp=/solr path=/update params={wt=javabin&version=2}{add=[61]} 0 0
   [junit4]   2> 1622844 INFO  (qtp2059649442-61392) [    x:collection1] o.a.s.u.p.LogUpdateProcessorFactory [collection1]  webapp=/solr path=/update params={wt=javabin&version=2}{add=[62]} 0 0
   [junit4]   2> 1622846 INFO  (qtp2059649442-61398) [    x:collection1] o.a.s.u.p.LogUpdateProcessorFactory [collection1]  webapp=/solr path=/update params={wt=javabin&version=2}{add=[63]} 0 0
   [junit4]   2> 1622848 INFO  (qtp2059649442-61398) [    x:collection1] o.a.s.u.p.LogUpdateProcessorFactory [collection1]  webapp=/solr path=/update params={wt=javabin&version=2}{add=[64]} 0 0
   [junit4]   2> 1622850 INFO  (qtp2059649442-61398) [    x:collection1] o.a.s.u.p.LogUpdateProcessorFactory [collection1]  webapp=/solr path=/update params={wt=javabin&version=2}{add=[65]} 0 0
   [junit4]   2> 1622852 INFO  (qtp2059649442-61396) [    x:collection1] o.a.s.u.p.LogUpdateProcessorFactory [collection1]  webapp=/solr path=/update params={wt=javabin&version=2}{add=[66]} 0 0
   [junit4]   2> 1622854 INFO  (qtp2059649442-61397) [    x:collection1] o.a.s.u.p.LogUpdateProcessorFactory [collection1]  webapp=/solr path=/update params={wt=javabin&version=2}{add=[67]} 0 0
   [junit4]   2> 1622855 INFO  (qtp2059649442-61397) [    x:collection1] o.a.s.u.p.LogUpdateProcessorFactory [collection1]  webapp=/solr path=/update params={wt=javabin&version=2}{add=[68]} 0 0
   [junit4]   2> 1622858 INFO  (qtp2059649442-61395) [    x:collection1] o.a.s.u.p.LogUpdateProcessorFactory [collection1]  webapp=/solr path=/update params={wt=javabin&version=2}{add=[69]} 0 0
   [junit4]   2> 1622860 INFO  (qtp2059649442-61399) [    x:collection1] o.a.s.u.p.LogUpdateProcessorFactory [collection1]  webapp=/solr path=/update params={wt=javabin&version=2}{add=[70]} 0 0
   [junit4]   2> 1622861 INFO  (qtp2059649442-61398) [    x:collection1] o.a.s.u.p.LogUpdateProcessorFactory [collection1]  webapp=/solr path=/update params={wt=javabin&version=2}{add=[71]} 0 0
   [junit4]   2> 1622863 INFO  (qtp2059649442-61396) [    x:collection1] o.a.s.u.p.LogUpdateProcessorFactory [collection1]  webapp=/solr path=/update params={wt=javabin&version=2}{add=[72]} 0 0
   [junit4]   2> 1622865 INFO  (qtp2059649442-61392) [    x:collection1] o.a.s.u.p.LogUpdateProcessorFactory [collection1]  webapp=/solr path=/update params={wt=javabin&version=2}{add=[73]} 0 0
   [junit4]   2> 1622867 INFO  (qtp2059649442-61392) [    x:collection1] o.a.s.u.p.LogUpdateProcessorFactory [collection1]  webapp=/solr path=/update params={wt=javabin&version=2}{add=[74]} 0 0
   [junit4]   2> 1622868 INFO  (qtp2059649442-61395) [    x:collection1] o.a.s.u.p.LogUpdateProcessorFactory [collection1]  webapp=/solr path=/update params={wt=javabin&version=2}{add=[75]} 0 0
   [junit4]   2> 1622870 INFO  (qtp2059649442-61399) [    x:collection1] o.a.s.u.p.LogUpdateProcessorFactory [collection1]  webapp=/solr path=/update params={wt=javabin&version=2}{add=[76]} 0 0
   [junit4]   2> 1622871 INFO  (qtp2059649442-61398) [    x:collection1] o.a.s.u.p.LogUpdateProcessorFactory [collection1]  webapp=/solr path=/update params={wt=javabin&version=2}{add=[77]} 0 0
   [junit4]   2> 1622873 INFO  (qtp2059649442-61398) [    x:collection1] o.a.s.u.p.LogUpdateProcessorFactory [collection1]  webapp=/solr path=/update params={wt=javabin&version=2}{add=[78]} 0 0
   [junit4]   2> 1622874 INFO  (qtp2059649442-61397) [    x:collection1] o.a.s.u.p.LogUpdateProcessorFactory [collection1]  webapp=/solr path=/update params={wt=javabin&version=2}{add=[79]} 0 0
   [junit4]   2> 1622876 INFO  (qtp2059649442-61392) [    x:collection1] o.a.s.u.p.LogUpdateProcessorFactory [collection1]  webapp=/solr path=/update params={wt=javabin&version=2}{add=[80]} 0 0
   [junit4]   2> 1622878 INFO  (qtp2059649442-61395) [    x:collection1] o.a.s.u.p.LogUpdateProcessorFactory [collection1]  webapp=/solr path=/update params={wt=javabin&version=2}{add=[81]} 0 0
   [junit4]   2> 1622879 INFO  (qtp2059649442-61399) [    x:collection1] o.a.s.u.p.LogUpdateProcessorFactory [collection1]  webapp=/solr path=/update params={wt=javabin&version=2}{add=[82]} 0 0
   [junit4]   2> 1622881 INFO  (qtp2059649442-61396) [    x:collection1] o.a.s.u.p.LogUpdateProcessorFactory [collection1]  webapp=/solr path=/update params={wt=javabin&version=2}{add=[83]} 0 0
   [junit4]   2> 1622883 INFO  (qtp2059649442-61398) [    x:collection1] o.a.s.u.p.LogUpdateProcessorFactory [collection1]  webapp=/solr path=/update params={wt=javabin&version=2}{add=[84]} 0 0
   [junit4]   2> 1622884 INFO  (qtp2059649442-61398) [    x:collection1] o.a.s.u.p.LogUpdateProcessorFactory [collection1]  webapp=/solr path=/update params={wt=javabin&version=2}{add=[85]} 0 0
   [junit4]   2> 1622886 INFO  (qtp2059649442-61392) [    x:collection1] o.a.s.u.p.LogUpdateProcessorFactory [collection1]  webapp=/solr path=/update params={wt=javabin&version=2}{add=[86]} 0 0
   [junit4]   2> 1622888 INFO  (qtp2059649442-61395) [    x:collection1] o.a.s.u.p.LogUpdateProcessorFactory [collection1]  webapp=/solr path=/update params={wt=javabin&version=2}{add=[87]} 0 0
   [junit4]   2> 1622889 INFO  (qtp2059649442-61399) [    x:collection1] o.a.s.u.p.LogUpdateProcessorFactory [collection1]  webapp=/solr path=/update params={wt=javabin&version=2}{add=[88]} 0 0
   [junit4]   2> 1622891 INFO  (qtp2059649442-61396) [    x:collection1] o.a.s.u.p.LogUpdateProcessorFactory [collection1]  webapp=/solr path=/update params={wt=javabin&version=2}{add=[89]} 0 0
   [junit4]   2> 1622893 INFO  (qtp2059649442-61397) [    x:collection1] o.a.s.u.p.LogUpdateProcessorFactory [collection1]  webapp=/solr path=/update params={wt=javabin&version=2}{add=[90]} 0 0
   [junit4]   2> 1622894 INFO  (qtp2059649442-61398) [    x:collection1] o.a.s.u.p.LogUpdateProcessorFactory [collection1]  webapp=/solr path=/update params={wt=javabin&version=2}{add=[91]} 0 0
   [junit4]   2> 1622896 INFO  (qtp2059649442-61392) [    x:collection1] o.a.s.u.p.LogUpdateProcessorFactory [collection1]  webapp=/solr path=/update params={wt=javabin&version=2}{add=[92]} 0 0
   [junit4]   2> 1622898 INFO  (qtp2059649442-61395) [    x:collection1] o.a.s.u.p.LogUpdateProcessorFactory [collection1]  webapp=/solr path=/update params={wt=javabin&version=2}{add=[93]} 0 0
   [junit4]   2> 1622899 INFO  (qtp2059649442-61399) [    x:collection1] o.a.s.u.p.LogUpdateProcessorFactory [collection1]  webapp=/solr path=/update params={wt=javabin&version=2}{add=[94]} 0 0
   [junit4]   2> 1622901 INFO  (qtp2059649442-61396) [    x:collection1] o.a.s.u.p.LogUpdateProcessorFactory [collection1]  webapp=/solr path=/update params={wt=javabin&version=2}{add=[95]} 0 0
   [junit4]   2> 1622903 INFO  (qtp2059649442-61397) [    x:collection1] o.a.s.u.p.LogUpdateProcessorFactory [collection1]  webapp=/solr path=/update params={wt=javabin&version=2}{add=[96]} 0 0
   [junit4]   2> 1622904 INFO  (qtp2059649442-61398) [    x:collection1] o.a.s.u.p.LogUpdateProcessorFactory [collection1]  webapp=/solr path=/update params={wt=javabin&version=2}{add=[97]} 0 0
   [junit4]   2> 1622906 INFO  (qtp2059649442-61392) [    x:collection1] o.a.s.u.p.LogUpdateProcessorFactory [collection1]  webapp=/solr path=/update params={wt=javabin&version=2}{add=[98]} 0 0
   [junit4]   2> 1622908 INFO  (qtp2059649442-61395) [    x:collection1] o.a.s.u.p.LogUpdateProcessorFactory [collection1]  webapp=/solr path=/update params={wt=javabin&version=2}{add=[99]} 0 0
   [junit4]   2> 1622909 INFO  (qtp2059649442-61399) [    x:collection1] o.a.s.u.p.LogUpdateProcessorFactory [collection1]  webapp=/solr path=/update params={wt=javabin&version=2}{add=[100]} 0 0
   [junit4]   2> 1622911 INFO  (qtp2059649442-61396) [    x:collection1] o.a.s.u.p.LogUpdateProcessorFactory [collection1]  webapp=/solr path=/update params={wt=javabin&version=2}{add=[101]} 0 0
   [junit4]   2> 1622912 INFO  (qtp2059649442-61397) [    x:collection1] o.a.s.u.p.LogUpdateProcessorFactory [collection1]  webapp=/solr path=/update params={wt=javabin&version=2}{add=[102]} 0 0
   [junit4]   2> 1622914 INFO  (qtp2059649442-61398) [    x:collection1] o.a.s.u.p.LogUpdateProcessorFactory [collection1]  webapp=/solr path=/update params={wt=javabin&version=2}{add=[103]} 0 0
   [junit4]   2> 1622916 INFO  (qtp2059649442-61392) [    x:collection1] o.a.s.u.p.LogUpdateProcessorFactory [collection1]  webapp=/solr path=/update params={wt=javabin&version=2}{add=[104]} 0 0
   [junit4]   2> 1622918 INFO  (qtp2059649442-61395) [    x:collection1] o.a.s.u.p.LogUpdateProcessorFactory [collection1]  webapp=/solr path=/update params={wt=javabin&version=2}{add=[105]} 0 0
   [junit4]   2> 1622920 INFO  (qtp2059649442-61399) [    x:collection1] o.a.s.u.p.LogUpdateProcessorFactory [collection1]  webapp=/solr path=/update params={wt=javabin&version=2}{add=[106]} 0 0
   [junit4]   2> 1622921 INFO  (qtp2059649442-61396) [    x:collection1] o.a.s.u.p.LogUpdateProcessorFactory [collection1]  webapp=/solr path=/update params={wt=javabin&version=2}{add=[107]} 0 0
   [junit4]   2> 1622923 INFO  (qtp2059649442-61397) [    x:collection1] o.a.s.u.p.LogUpdateProcessorFactory [collection1]  webapp=/solr path=/update params={wt=javabin&version=2}{add=[108]} 0 0
   [junit4]   2> 1622924 INFO  (qtp2059649442-61398) [    x:collection1] o.a.s.u.p.LogUpdateProcessorFactory [collection1]  webapp=/solr path=/update params={wt=javabin&version=2}{add=[109]} 0 0
   [junit4]   2> 1622926 INFO  (qtp2059649442-61392) [    x:collection1] o.a.s.u.p.LogUpdateProcessorFactory [collection1]  webapp=/solr path=/update params={wt=javabin&version=2}{add=[110]} 0 0
   [junit4]   2> 1622927 INFO  (qtp2059649442-61395) [    x:collection1] o.a.s.u.p.LogUpdateProcessorFactory [collection1]  webapp=/solr path=/update params={wt=javabin&version=2}{add=[111]} 0 0
   [junit4]   2> 1622929 INFO  (qtp2059649442-61399) [    x:collection1] o.a.s.u.p.LogUpdateProcessorFactory [collection1]  webapp=/solr path=/update params={wt=javabin&version=2}{add=[112]} 0 0
   [junit4]   2> 1622931 INFO  (qtp2059649442-61396) [    x:collection1] o.a.s.u.p.LogUpdateProcessorFactory [collection1]  webapp=/solr path=/update params={wt=javabin&version=2}{add=[113]} 0 0
   [junit4]   2> 1622932 INFO  (qtp2059649442-61397) [    x:collection1] o.a.s.u.p.LogUpdateProcessorFactory [collection1]  webapp=/solr path=/update params={wt=javabin&version=2}{add=[114]} 0 0
   [junit4]   2> 1622934 INFO  (qtp2059649442-61398) [    x:collection1] o.a.s.u.p.LogUpdateProcessorFactory [collection1]  webapp=/solr path=/update params={wt=javabin&version=2}{add=[115]} 0 0
   [junit4]   2> 1622935 INFO  (qtp2059649442-61392) [    x:collection1] o.a.s.u.p.LogUpdateProcessorFactory [collection1]  webapp=/solr path=/update params={wt=javabin&version=2}{add=[116]} 0 0
   [junit4]   2> 1622937 INFO  (qtp2059649442-61395) [    x:collection1] o.a.s.u.p.LogUpdateProcessorFactory [collection1]  webapp=/solr path=/update params={wt=javabin&version=2}{add=[117]} 0 0
   [junit4]   2> 1622938 INFO  (qtp2059649442-61399) [    x:collection1] o.a.s.u.p.LogUpdateProcessorFactory [collection1]  webapp=/solr path=/update params={wt=javabin&version=2}{add=[118]} 0 0
   [junit4]   2> 1622940 INFO  (qtp2059649442-61396) [    x:collection1] o.a.s.u.p.LogUpdateProcessorFactory [collection1]  webapp=/solr path=/update params={wt=javabin&version=2}{add=[119]} 0 0
   [junit4]   2> 1622941 INFO  (qtp2059649442-61397) [    x:collection1] o.a.s.u.p.LogUpdateProcessorFactory [collection1]  webapp=/solr path=/update params={wt=javabin&version=2}{add=[120]} 0 0
   [junit4]   2> 1622943 INFO  (qtp2059649442-61398) [    x:collection1] o.a.s.u.p.LogUpdateProcessorFactory [collection1]  webapp=/solr path=/update params={wt=javabin&version=2}{add=[121]} 0 0
   [junit4]   2> 1622945 INFO  (qtp2059649442-61392) [    x:collection1] o.a.s.u.p.LogUpdateProcessorFactory [collection1]  webapp=/solr path=/update params={wt=javabin&version=2}{add=[122]} 0 0
   [junit4]   2> 1622946 INFO  (qtp2059649442-61395) [    x:collection1] o.a.s.u.p.LogUpdateProcessorFactory [collection1]  webapp=/solr path=/update params={wt=javabin&version=2}{add=[123]} 0 0
   [junit4]   2> 1622948 INFO  (qtp2059649442-61399) [    x:

[...truncated too long message...]

 	at org.apache.solr.client.solrj.impl.LBHttpSolrClient.doRequest(LBHttpSolrClient.java:372)
   [junit4]    > 	at org.apache.solr.client.solrj.impl.LBHttpSolrClient.request(LBHttpSolrClient.java:325)
   [junit4]    > 	at org.apache.solr.client.solrj.impl.CloudSolrClient.sendRequest(CloudSolrClient.java:1100)
   [junit4]    > 	at org.apache.solr.client.solrj.impl.CloudSolrClient.requestWithRetryOnStaleState(CloudSolrClient.java:870)
   [junit4]    > 	at org.apache.solr.client.solrj.impl.CloudSolrClient.request(CloudSolrClient.java:806)
   [junit4]    > 	at org.apache.solr.client.solrj.SolrClient.request(SolrClient.java:1219)
   [junit4]    > 	at org.apache.solr.cloud.AbstractFullDistribZkTestBase.createCollection(AbstractFullDistribZkTestBase.java:1593)
   [junit4]    > 	at org.apache.solr.cloud.AbstractFullDistribZkTestBase.createCollection(AbstractFullDistribZkTestBase.java:1614)
   [junit4]    > 	at org.apache.solr.cloud.CollectionsAPIDistributedZkTest$1CollectionThread.run(CollectionsAPIDistributedZkTest.java:970)Throwable #4: com.carrotsearch.randomizedtesting.UncaughtExceptionError: Captured an uncaught exception in thread: Thread[id=21718, name=collection4, state=RUNNABLE, group=TGRP-CollectionsAPIDistributedZkTest]
   [junit4]    > Caused by: org.apache.solr.client.solrj.impl.HttpSolrClient$RemoteSolrException: Error from server at http://127.0.0.1:51136: collection already exists: awholynewstresscollection_collection4_0
   [junit4]    > 	at __randomizedtesting.SeedInfo.seed([A9D250C933E907C1]:0)
   [junit4]    > 	at org.apache.solr.client.solrj.impl.HttpSolrClient.executeMethod(HttpSolrClient.java:577)
   [junit4]    > 	at org.apache.solr.client.solrj.impl.HttpSolrClient.request(HttpSolrClient.java:241)
   [junit4]    > 	at org.apache.solr.client.solrj.impl.HttpSolrClient.request(HttpSolrClient.java:230)
   [junit4]    > 	at org.apache.solr.client.solrj.impl.LBHttpSolrClient.doRequest(LBHttpSolrClient.java:372)
   [junit4]    > 	at org.apache.solr.client.solrj.impl.LBHttpSolrClient.request(LBHttpSolrClient.java:325)
   [junit4]    > 	at org.apache.solr.client.solrj.impl.CloudSolrClient.sendRequest(CloudSolrClient.java:1100)
   [junit4]    > 	at org.apache.solr.client.solrj.impl.CloudSolrClient.requestWithRetryOnStaleState(CloudSolrClient.java:870)
   [junit4]    > 	at org.apache.solr.client.solrj.impl.CloudSolrClient.request(CloudSolrClient.java:806)
   [junit4]    > 	at org.apache.solr.client.solrj.SolrClient.request(SolrClient.java:1219)
   [junit4]    > 	at org.apache.solr.cloud.AbstractFullDistribZkTestBase.createCollection(AbstractFullDistribZkTestBase.java:1593)
   [junit4]    > 	at org.apache.solr.cloud.AbstractFullDistribZkTestBase.createCollection(AbstractFullDistribZkTestBase.java:1614)
   [junit4]    > 	at org.apache.solr.cloud.CollectionsAPIDistributedZkTest$1CollectionThread.run(CollectionsAPIDistributedZkTest.java:970)Throwable #5: com.carrotsearch.randomizedtesting.UncaughtExceptionError: Captured an uncaught exception in thread: Thread[id=21715, name=collection1, state=RUNNABLE, group=TGRP-CollectionsAPIDistributedZkTest]
   [junit4]    > Caused by: org.apache.solr.client.solrj.impl.HttpSolrClient$RemoteSolrException: Error from server at http://127.0.0.1:51136: collection already exists: awholynewstresscollection_collection1_0
   [junit4]    > 	at __randomizedtesting.SeedInfo.seed([A9D250C933E907C1]:0)
   [junit4]    > 	at org.apache.solr.client.solrj.impl.HttpSolrClient.executeMethod(HttpSolrClient.java:577)
   [junit4]    > 	at org.apache.solr.client.solrj.impl.HttpSolrClient.request(HttpSolrClient.java:241)
   [junit4]    > 	at org.apache.solr.client.solrj.impl.HttpSolrClient.request(HttpSolrClient.java:230)
   [junit4]    > 	at org.apache.solr.client.solrj.impl.LBHttpSolrClient.doRequest(LBHttpSolrClient.java:372)
   [junit4]    > 	at org.apache.solr.client.solrj.impl.LBHttpSolrClient.request(LBHttpSolrClient.java:325)
   [junit4]    > 	at org.apache.solr.client.solrj.impl.CloudSolrClient.sendRequest(CloudSolrClient.java:1100)
   [junit4]    > 	at org.apache.solr.client.solrj.impl.CloudSolrClient.requestWithRetryOnStaleState(CloudSolrClient.java:870)
   [junit4]    > 	at org.apache.solr.client.solrj.impl.CloudSolrClient.request(CloudSolrClient.java:806)
   [junit4]    > 	at org.apache.solr.client.solrj.SolrClient.request(SolrClient.java:1219)
   [junit4]    > 	at org.apache.solr.cloud.AbstractFullDistribZkTestBase.createCollection(AbstractFullDistribZkTestBase.java:1593)
   [junit4]    > 	at org.apache.solr.cloud.AbstractFullDistribZkTestBase.createCollection(AbstractFullDistribZkTestBase.java:1614)
   [junit4]    > 	at org.apache.solr.cloud.CollectionsAPIDistributedZkTest$1CollectionThread.run(CollectionsAPIDistributedZkTest.java:970)
   [junit4]   2> 2557783 INFO  (SUITE-CollectionsAPIDistributedZkTest-seed#[A9D250C933E907C1]-worker) [    ] o.a.s.SolrTestCaseJ4 ###deleteCore
   [junit4]   2> Mar 09, 2016 2:41:17 PM com.carrotsearch.randomizedtesting.ThreadLeakControl checkThreadLeaks
   [junit4]   2> WARNING: Will linger awaiting termination of 1 leaked thread(s).
   [junit4]   2> NOTE: test params are: codec=Asserting(Lucene60): {other_tl1=Lucene50(blocksize=128), range_facet_l_dv=PostingsFormat(name=Direct), _version_=Lucene50(blocksize=128), multiDefault=PostingsFormat(name=LuceneFixedGap), a_t=PostingsFormat(name=LuceneFixedGap), intDefault=Lucene50(blocksize=128), a_i1=PostingsFormat(name=LuceneFixedGap), id=PostingsFormat(name=Direct), range_facet_i_dv=PostingsFormat(name=LuceneFixedGap), text=PostingsFormat(name=LuceneVarGapFixedInterval), range_facet_l=PostingsFormat(name=LuceneFixedGap), timestamp=PostingsFormat(name=LuceneFixedGap)}, docValues:{range_facet_l_dv=DocValuesFormat(name=Direct), range_facet_i_dv=DocValuesFormat(name=Asserting), timestamp=DocValuesFormat(name=Asserting)}, maxPointsInLeafNode=500, maxMBSortInHeap=5.61953527583932, sim=ClassicSimilarity, locale=ar-AE, timezone=Canada/Saskatchewan
   [junit4]   2> NOTE: Linux 3.13.0-52-generic amd64/Oracle Corporation 1.8.0_66 (64-bit)/cpus=4,threads=1,free=95105200,total=501219328
   [junit4]   2> NOTE: All tests run in this JVM: [SpellCheckComponentTest, TestNRTOpen, TestReplicationHandlerBackup, TestManagedResourceStorage, TestBM25SimilarityFactory, TestSystemIdResolver, SoftAutoCommitTest, DistanceFunctionTest, TriLevelCompositeIdRoutingTest, DistributedMLTComponentTest, TestSolrCoreProperties, BlockDirectoryTest, SolrPluginUtilsTest, MBeansHandlerTest, TestTrie, CollectionsAPIAsyncDistributedZkTest, TestManagedSchema, SimplePostToolTest, DocExpirationUpdateProcessorFactoryTest, TestExpandComponent, TestDistributedGrouping, ChaosMonkeySafeLeaderTest, MultiTermTest, PreAnalyzedUpdateProcessorTest, NumericFieldsTest, TestStressVersions, ConfigSetsAPITest, TestDistribIDF, OpenCloseCoreStressTest, OverriddenZkACLAndCredentialsProvidersTest, SpellCheckCollatorTest, RemoteQueryErrorTest, TestSolrDeletionPolicy2, TestCodecSupport, TestSchemaNameResource, TestCloudPivotFacet, TestQueryTypes, TestSolrCLIRunExample, TestRecoveryHdfs, TestFieldSortValues, TestSolrConfigHandler, ShardRoutingCustomTest, TestOrdValues, ClusterStateUpdateTest, HdfsLockFactoryTest, TestIntervalFaceting, TestStandardQParsers, TestJsonRequest, AddSchemaFieldsUpdateProcessorFactoryTest, UniqFieldsUpdateProcessorFactoryTest, DistributedVersionInfoTest, TestSha256AuthenticationProvider, CollectionReloadTest, TestQueryUtils, DeleteShardTest, TestConfigSetProperties, LeaderFailoverAfterPartitionTest, TestPartialUpdateDeduplication, HdfsWriteToMultipleCollectionsTest, AliasIntegrationTest, TestQuerySenderNoQuery, RuleEngineTest, ZkSolrClientTest, FastVectorHighlighterTest, BasicFunctionalityTest, DistributedIntervalFacetingTest, TermVectorComponentTest, ChaosMonkeyNothingIsSafeTest, TestCollapseQParserPlugin, FileUtilsTest, LoggingHandlerTest, SpatialRPTFieldTypeTest, DistributedDebugComponentTest, OverseerStatusTest, TestAuthenticationFramework, BlockJoinFacetDistribTest, TestDFRSimilarityFactory, SolrCmdDistributorTest, UpdateRequestProcessorFactoryTest, TestImplicitCoreProperties, TestManagedSynonymFilterFactory, TestAnalyzeInfixSuggestions, TestWordDelimiterFilterFactory, TestFreeTextSuggestions, CursorMarkTest, TestLeaderElectionZkExpiry, ConvertedLegacyTest, DateRangeFieldTest, ShardRoutingTest, TestSimpleQParserPlugin, DistanceUnitsTest, DirectoryFactoryTest, TestFieldResource, ZkCLITest, TestMiniSolrCloudClusterBase, CollectionsAPIDistributedZkTest]
   [junit4] Completed [291/578 (2!)] on J1 in 535.00s, 1 test, 1 error <<< FAILURES!

[...truncated 942 lines...]
BUILD FAILED
/x1/jenkins/jenkins-slave/workspace/Lucene-Solr-NightlyTests-master/build.xml:747: The following error occurred while executing this line:
/x1/jenkins/jenkins-slave/workspace/Lucene-Solr-NightlyTests-master/build.xml:684: The following error occurred while executing this line:
/x1/jenkins/jenkins-slave/workspace/Lucene-Solr-NightlyTests-master/build.xml:59: The following error occurred while executing this line:
/x1/jenkins/jenkins-slave/workspace/Lucene-Solr-NightlyTests-master/solr/build.xml:233: The following error occurred while executing this line:
/x1/jenkins/jenkins-slave/workspace/Lucene-Solr-NightlyTests-master/solr/common-build.xml:524: The following error occurred while executing this line:
/x1/jenkins/jenkins-slave/workspace/Lucene-Solr-NightlyTests-master/lucene/common-build.xml:1457: The following error occurred while executing this line:
/x1/jenkins/jenkins-slave/workspace/Lucene-Solr-NightlyTests-master/lucene/common-build.xml:1014: There were test failures: 578 suites (10 ignored), 2302 tests, 1 suite-level error, 1 error, 34 ignored (17 assumptions) [seed: A9D250C933E907C1]

Total time: 208 minutes 59 seconds
Build step 'Invoke Ant' marked build as failure
Archiving artifacts
No prior successful build to compare, so performing full copy of artifacts
Recording test results
Email was triggered for: Failure - Any
Sending email for trigger: Failure - Any



Mime
View raw message