lucene-dev mailing list archives

Site index · List index
Message view « Date » · « Thread »
Top « Date » · « Thread »
From Policeman Jenkins Server <jenk...@thetaphi.de>
Subject [JENKINS-EA] Lucene-Solr-6.x-Linux (32bit/jdk-9-ea+111-patched) - Build # 278 - Still Failing!
Date Mon, 28 Mar 2016 18:03:13 GMT
Build: http://jenkins.thetaphi.de/job/Lucene-Solr-6.x-Linux/278/
Java: 32bit/jdk-9-ea+111-patched -server -XX:+UseG1GC -XX:-CompactStrings

1 tests failed.
FAILED:  org.apache.lucene.search.TestLatLonPointQueries.testMultiValued

Error Message:
some hits were wrong

Stack Trace:
java.lang.AssertionError: some hits were wrong
	at __randomizedtesting.SeedInfo.seed([BF1D26D6AEC6846E:6B3D42E46004C426]:0)
	at org.junit.Assert.fail(Assert.java:93)
	at org.apache.lucene.spatial.util.BaseGeoPointTestCase.testMultiValued(BaseGeoPointTestCase.java:496)
	at sun.reflect.NativeMethodAccessorImpl.invoke0(java.base@9-ea/Native Method)
	at sun.reflect.NativeMethodAccessorImpl.invoke(java.base@9-ea/NativeMethodAccessorImpl.java:62)
	at sun.reflect.DelegatingMethodAccessorImpl.invoke(java.base@9-ea/DelegatingMethodAccessorImpl.java:43)
	at java.lang.reflect.Method.invoke(java.base@9-ea/Method.java:531)
	at com.carrotsearch.randomizedtesting.RandomizedRunner.invoke(RandomizedRunner.java:1764)
	at com.carrotsearch.randomizedtesting.RandomizedRunner$8.evaluate(RandomizedRunner.java:871)
	at com.carrotsearch.randomizedtesting.RandomizedRunner$9.evaluate(RandomizedRunner.java:907)
	at com.carrotsearch.randomizedtesting.RandomizedRunner$10.evaluate(RandomizedRunner.java:921)
	at org.apache.lucene.util.TestRuleSetupTeardownChained$1.evaluate(TestRuleSetupTeardownChained.java:49)
	at org.apache.lucene.util.AbstractBeforeAfterRule$1.evaluate(AbstractBeforeAfterRule.java:45)
	at org.apache.lucene.util.TestRuleThreadAndTestName$1.evaluate(TestRuleThreadAndTestName.java:48)
	at org.apache.lucene.util.TestRuleIgnoreAfterMaxFailures$1.evaluate(TestRuleIgnoreAfterMaxFailures.java:64)
	at org.apache.lucene.util.TestRuleMarkFailure$1.evaluate(TestRuleMarkFailure.java:47)
	at com.carrotsearch.randomizedtesting.rules.StatementAdapter.evaluate(StatementAdapter.java:36)
	at com.carrotsearch.randomizedtesting.ThreadLeakControl$StatementRunner.run(ThreadLeakControl.java:367)
	at com.carrotsearch.randomizedtesting.ThreadLeakControl.forkTimeoutingTask(ThreadLeakControl.java:809)
	at com.carrotsearch.randomizedtesting.ThreadLeakControl$3.evaluate(ThreadLeakControl.java:460)
	at com.carrotsearch.randomizedtesting.RandomizedRunner.runSingleTest(RandomizedRunner.java:880)
	at com.carrotsearch.randomizedtesting.RandomizedRunner$5.evaluate(RandomizedRunner.java:781)
	at com.carrotsearch.randomizedtesting.RandomizedRunner$6.evaluate(RandomizedRunner.java:816)
	at com.carrotsearch.randomizedtesting.RandomizedRunner$7.evaluate(RandomizedRunner.java:827)
	at org.apache.lucene.util.AbstractBeforeAfterRule$1.evaluate(AbstractBeforeAfterRule.java:45)
	at com.carrotsearch.randomizedtesting.rules.StatementAdapter.evaluate(StatementAdapter.java:36)
	at org.apache.lucene.util.TestRuleStoreClassName$1.evaluate(TestRuleStoreClassName.java:41)
	at com.carrotsearch.randomizedtesting.rules.NoShadowingOrOverridesOnMethodsRule$1.evaluate(NoShadowingOrOverridesOnMethodsRule.java:40)
	at com.carrotsearch.randomizedtesting.rules.NoShadowingOrOverridesOnMethodsRule$1.evaluate(NoShadowingOrOverridesOnMethodsRule.java:40)
	at com.carrotsearch.randomizedtesting.rules.StatementAdapter.evaluate(StatementAdapter.java:36)
	at com.carrotsearch.randomizedtesting.rules.StatementAdapter.evaluate(StatementAdapter.java:36)
	at com.carrotsearch.randomizedtesting.rules.StatementAdapter.evaluate(StatementAdapter.java:36)
	at org.apache.lucene.util.TestRuleAssertionsRequired$1.evaluate(TestRuleAssertionsRequired.java:53)
	at org.apache.lucene.util.TestRuleMarkFailure$1.evaluate(TestRuleMarkFailure.java:47)
	at org.apache.lucene.util.TestRuleIgnoreAfterMaxFailures$1.evaluate(TestRuleIgnoreAfterMaxFailures.java:64)
	at org.apache.lucene.util.TestRuleIgnoreTestSuites$1.evaluate(TestRuleIgnoreTestSuites.java:54)
	at com.carrotsearch.randomizedtesting.rules.StatementAdapter.evaluate(StatementAdapter.java:36)
	at com.carrotsearch.randomizedtesting.ThreadLeakControl$StatementRunner.run(ThreadLeakControl.java:367)
	at java.lang.Thread.run(java.base@9-ea/Thread.java:804)




Build Log:
[...truncated 8440 lines...]
   [junit4] Suite: org.apache.lucene.search.TestLatLonPointQueries
   [junit4] IGNOR/A 0.02s J0 | TestLatLonPointQueries.testRandomDistanceHuge
   [junit4]    > Assumption #1: 'nightly' test group is disabled (@Nightly())
   [junit4] IGNOR/A 0.00s J0 | TestLatLonPointQueries.testRandomBig
   [junit4]    > Assumption #1: 'nightly' test group is disabled (@Nightly())
   [junit4]   1> TEST: id=26400 docID=26400 should not match but did
   [junit4]   1>   rect=GeoRect(lon=47.765128058152186 TO 47.43894339236013 (crosses dateline!)
lat=57.444666567247886 TO 57.846343714929425)
   [junit4]   1>   lat=57.44466654025018 lon=47.30161730200052
   [junit4]   1>   lat=57.436297670938075 lon=47.95284356921911
   [junit4]   1>   result1=false result2=false
   [junit4]   2> NOTE: reproduce with: ant test  -Dtestcase=TestLatLonPointQueries -Dtests.method=testMultiValued
-Dtests.seed=BF1D26D6AEC6846E -Dtests.multiplier=3 -Dtests.slow=true -Dtests.locale=en-TK
-Dtests.timezone=Etc/GMT+1 -Dtests.asserts=true -Dtests.file.encoding=UTF-8
   [junit4] FAILURE 4.26s J0 | TestLatLonPointQueries.testMultiValued <<<
   [junit4]    > Throwable #1: java.lang.AssertionError: some hits were wrong
   [junit4]    > 	at __randomizedtesting.SeedInfo.seed([BF1D26D6AEC6846E:6B3D42E46004C426]:0)
   [junit4]    > 	at org.apache.lucene.spatial.util.BaseGeoPointTestCase.testMultiValued(BaseGeoPointTestCase.java:496)
   [junit4]    > 	at java.lang.Thread.run(java.base@9-ea/Thread.java:804)
   [junit4]   2> NOTE: leaving temporary files on disk at: /home/jenkins/workspace/Lucene-Solr-6.x-Linux/lucene/build/sandbox/test/J0/temp/lucene.search.TestLatLonPointQueries_BF1D26D6AEC6846E-001
   [junit4]   2> NOTE: test params are: codec=FastCompressingStoredFields(storedFieldsFormat=CompressingStoredFieldsFormat(compressionMode=FAST,
chunkSize=25171, maxDocsPerChunk=8, blockSize=1), termVectorsFormat=CompressingTermVectorsFormat(compressionMode=FAST,
chunkSize=25171, blockSize=1)), sim=ClassicSimilarity, locale=en-TK, timezone=Etc/GMT+1
   [junit4]   2> NOTE: Linux 4.2.0-34-generic i386/Oracle Corporation 9-ea (32-bit)/cpus=12,threads=1,free=67356600,total=105906176
   [junit4]   2> NOTE: All tests run in this JVM: [TestIDVersionPostingsFormat, TestLatLonPointQueries]
   [junit4] Completed [14/15 (1!)] on J0 in 21.13s, 34 tests, 1 failure, 2 skipped <<<
FAILURES!

[...truncated 14 lines...]
BUILD FAILED
/home/jenkins/workspace/Lucene-Solr-6.x-Linux/build.xml:740: The following error occurred
while executing this line:
/home/jenkins/workspace/Lucene-Solr-6.x-Linux/build.xml:684: The following error occurred
while executing this line:
/home/jenkins/workspace/Lucene-Solr-6.x-Linux/build.xml:59: The following error occurred while
executing this line:
/home/jenkins/workspace/Lucene-Solr-6.x-Linux/lucene/build.xml:476: The following error occurred
while executing this line:
/home/jenkins/workspace/Lucene-Solr-6.x-Linux/lucene/common-build.xml:2187: The following
error occurred while executing this line:
/home/jenkins/workspace/Lucene-Solr-6.x-Linux/lucene/module-build.xml:58: The following error
occurred while executing this line:
/home/jenkins/workspace/Lucene-Solr-6.x-Linux/lucene/common-build.xml:1457: The following
error occurred while executing this line:
/home/jenkins/workspace/Lucene-Solr-6.x-Linux/lucene/common-build.xml:1014: There were test
failures: 15 suites, 110 tests, 1 failure, 3 ignored (3 assumptions) [seed: BF1D26D6AEC6846E]

Total time: 21 minutes 22 seconds
Build step 'Invoke Ant' marked build as failure
Archiving artifacts
[WARNINGS] Skipping publisher since build result is FAILURE
Recording test results
Email was triggered for: Failure - Any
Sending email for trigger: Failure - Any



Mime
View raw message