lucene-dev mailing list archives

Site index · List index
Message view « Date » · « Thread »
Top « Date » · « Thread »
From Policeman Jenkins Server <jenk...@thetaphi.de>
Subject [JENKINS-EA] Lucene-Solr-trunk-Linux (32bit/jdk-9-ea+107) - Build # 16052 - Failure!
Date Tue, 01 Mar 2016 00:39:49 GMT
Build: http://jenkins.thetaphi.de/job/Lucene-Solr-trunk-Linux/16052/
Java: 32bit/jdk-9-ea+107 -client -XX:+UseG1GC

1 tests failed.
FAILED:  org.apache.solr.core.TestDynamicLoading.testDynamicLoading

Error Message:
Could not get expected value  'X val changed' for path 'x' full output: {   "responseHeader":{     "status":0,     "QTime":0},   "params":{"wt":"json"},   "context":{     "webapp":"",     "path":"/test1",     "httpMethod":"GET"},   "class":"org.apache.solr.core.BlobStoreTestRequestHandler",   "x":"X val"}

Stack Trace:
java.lang.AssertionError: Could not get expected value  'X val changed' for path 'x' full output: {
  "responseHeader":{
    "status":0,
    "QTime":0},
  "params":{"wt":"json"},
  "context":{
    "webapp":"",
    "path":"/test1",
    "httpMethod":"GET"},
  "class":"org.apache.solr.core.BlobStoreTestRequestHandler",
  "x":"X val"}
	at __randomizedtesting.SeedInfo.seed([74B623A3C362FE88:ACFB0EF434BF5B28]:0)
	at org.junit.Assert.fail(Assert.java:93)
	at org.junit.Assert.assertTrue(Assert.java:43)
	at org.apache.solr.core.TestSolrConfigHandler.testForResponseElement(TestSolrConfigHandler.java:458)
	at org.apache.solr.core.TestDynamicLoading.testDynamicLoading(TestDynamicLoading.java:255)
	at sun.reflect.NativeMethodAccessorImpl.invoke0(Native Method)
	at sun.reflect.NativeMethodAccessorImpl.invoke(NativeMethodAccessorImpl.java:62)
	at sun.reflect.DelegatingMethodAccessorImpl.invoke(DelegatingMethodAccessorImpl.java:43)
	at java.lang.reflect.Method.invoke(Method.java:520)
	at com.carrotsearch.randomizedtesting.RandomizedRunner.invoke(RandomizedRunner.java:1764)
	at com.carrotsearch.randomizedtesting.RandomizedRunner$8.evaluate(RandomizedRunner.java:871)
	at com.carrotsearch.randomizedtesting.RandomizedRunner$9.evaluate(RandomizedRunner.java:907)
	at com.carrotsearch.randomizedtesting.RandomizedRunner$10.evaluate(RandomizedRunner.java:921)
	at org.apache.solr.BaseDistributedSearchTestCase$ShardsRepeatRule$ShardsFixedStatement.callStatement(BaseDistributedSearchTestCase.java:996)
	at org.apache.solr.BaseDistributedSearchTestCase$ShardsRepeatRule$ShardsStatement.evaluate(BaseDistributedSearchTestCase.java:971)
	at com.carrotsearch.randomizedtesting.rules.SystemPropertiesRestoreRule$1.evaluate(SystemPropertiesRestoreRule.java:57)
	at org.apache.lucene.util.TestRuleSetupTeardownChained$1.evaluate(TestRuleSetupTeardownChained.java:49)
	at org.apache.lucene.util.AbstractBeforeAfterRule$1.evaluate(AbstractBeforeAfterRule.java:45)
	at org.apache.lucene.util.TestRuleThreadAndTestName$1.evaluate(TestRuleThreadAndTestName.java:48)
	at org.apache.lucene.util.TestRuleIgnoreAfterMaxFailures$1.evaluate(TestRuleIgnoreAfterMaxFailures.java:64)
	at org.apache.lucene.util.TestRuleMarkFailure$1.evaluate(TestRuleMarkFailure.java:47)
	at com.carrotsearch.randomizedtesting.rules.StatementAdapter.evaluate(StatementAdapter.java:36)
	at com.carrotsearch.randomizedtesting.ThreadLeakControl$StatementRunner.run(ThreadLeakControl.java:367)
	at com.carrotsearch.randomizedtesting.ThreadLeakControl.forkTimeoutingTask(ThreadLeakControl.java:809)
	at com.carrotsearch.randomizedtesting.ThreadLeakControl$3.evaluate(ThreadLeakControl.java:460)
	at com.carrotsearch.randomizedtesting.RandomizedRunner.runSingleTest(RandomizedRunner.java:880)
	at com.carrotsearch.randomizedtesting.RandomizedRunner$5.evaluate(RandomizedRunner.java:781)
	at com.carrotsearch.randomizedtesting.RandomizedRunner$6.evaluate(RandomizedRunner.java:816)
	at com.carrotsearch.randomizedtesting.RandomizedRunner$7.evaluate(RandomizedRunner.java:827)
	at com.carrotsearch.randomizedtesting.rules.StatementAdapter.evaluate(StatementAdapter.java:36)
	at com.carrotsearch.randomizedtesting.rules.SystemPropertiesRestoreRule$1.evaluate(SystemPropertiesRestoreRule.java:57)
	at org.apache.lucene.util.AbstractBeforeAfterRule$1.evaluate(AbstractBeforeAfterRule.java:45)
	at com.carrotsearch.randomizedtesting.rules.StatementAdapter.evaluate(StatementAdapter.java:36)
	at org.apache.lucene.util.TestRuleStoreClassName$1.evaluate(TestRuleStoreClassName.java:41)
	at com.carrotsearch.randomizedtesting.rules.NoShadowingOrOverridesOnMethodsRule$1.evaluate(NoShadowingOrOverridesOnMethodsRule.java:40)
	at com.carrotsearch.randomizedtesting.rules.NoShadowingOrOverridesOnMethodsRule$1.evaluate(NoShadowingOrOverridesOnMethodsRule.java:40)
	at com.carrotsearch.randomizedtesting.rules.StatementAdapter.evaluate(StatementAdapter.java:36)
	at com.carrotsearch.randomizedtesting.rules.StatementAdapter.evaluate(StatementAdapter.java:36)
	at com.carrotsearch.randomizedtesting.rules.StatementAdapter.evaluate(StatementAdapter.java:36)
	at org.apache.lucene.util.TestRuleAssertionsRequired$1.evaluate(TestRuleAssertionsRequired.java:53)
	at org.apache.lucene.util.TestRuleMarkFailure$1.evaluate(TestRuleMarkFailure.java:47)
	at org.apache.lucene.util.TestRuleIgnoreAfterMaxFailures$1.evaluate(TestRuleIgnoreAfterMaxFailures.java:64)
	at org.apache.lucene.util.TestRuleIgnoreTestSuites$1.evaluate(TestRuleIgnoreTestSuites.java:54)
	at com.carrotsearch.randomizedtesting.rules.StatementAdapter.evaluate(StatementAdapter.java:36)
	at com.carrotsearch.randomizedtesting.ThreadLeakControl$StatementRunner.run(ThreadLeakControl.java:367)
	at java.lang.Thread.run(Thread.java:804)




Build Log:
[...truncated 10785 lines...]
   [junit4] Suite: org.apache.solr.core.TestDynamicLoading
   [junit4]   2> Creating dataDir: /home/jenkins/workspace/Lucene-Solr-trunk-Linux/solr/build/solr-core/test/J1/temp/solr.core.TestDynamicLoading_74B623A3C362FE88-001/init-core-data-001
   [junit4]   2> 238863 INFO  (SUITE-TestDynamicLoading-seed#[74B623A3C362FE88]-worker) [    ] o.a.s.SolrTestCaseJ4 Randomized ssl (true) and clientAuth (false)
   [junit4]   2> 238863 INFO  (SUITE-TestDynamicLoading-seed#[74B623A3C362FE88]-worker) [    ] o.a.s.BaseDistributedSearchTestCase Setting hostContext system property: /
   [junit4]   2> 238865 INFO  (TEST-TestDynamicLoading.testDynamicLoading-seed#[74B623A3C362FE88]) [    ] o.a.s.c.ZkTestServer STARTING ZK TEST SERVER
   [junit4]   2> 238866 INFO  (Thread-612) [    ] o.a.s.c.ZkTestServer client port:0.0.0.0/0.0.0.0:0
   [junit4]   2> 238866 INFO  (Thread-612) [    ] o.a.s.c.ZkTestServer Starting server
   [junit4]   2> 238966 INFO  (TEST-TestDynamicLoading.testDynamicLoading-seed#[74B623A3C362FE88]) [    ] o.a.s.c.ZkTestServer start zk server on port:48531
   [junit4]   2> 238966 INFO  (TEST-TestDynamicLoading.testDynamicLoading-seed#[74B623A3C362FE88]) [    ] o.a.s.c.c.SolrZkClient Using default ZkCredentialsProvider
   [junit4]   2> 238966 INFO  (TEST-TestDynamicLoading.testDynamicLoading-seed#[74B623A3C362FE88]) [    ] o.a.s.c.c.ConnectionManager Waiting for client to connect to ZooKeeper
   [junit4]   2> 238969 INFO  (zkCallback-236-thread-1) [    ] o.a.s.c.c.ConnectionManager Watcher org.apache.solr.common.cloud.ConnectionManager@11c5315 name:ZooKeeperConnection Watcher:127.0.0.1:48531 got event WatchedEvent state:SyncConnected type:None path:null path:null type:None
   [junit4]   2> 238970 INFO  (TEST-TestDynamicLoading.testDynamicLoading-seed#[74B623A3C362FE88]) [    ] o.a.s.c.c.ConnectionManager Client is connected to ZooKeeper
   [junit4]   2> 238977 INFO  (TEST-TestDynamicLoading.testDynamicLoading-seed#[74B623A3C362FE88]) [    ] o.a.s.c.c.SolrZkClient Using default ZkACLProvider
   [junit4]   2> 238977 INFO  (TEST-TestDynamicLoading.testDynamicLoading-seed#[74B623A3C362FE88]) [    ] o.a.s.c.c.SolrZkClient makePath: /solr
   [junit4]   2> 238980 INFO  (TEST-TestDynamicLoading.testDynamicLoading-seed#[74B623A3C362FE88]) [    ] o.a.s.c.c.SolrZkClient Using default ZkCredentialsProvider
   [junit4]   2> 238980 INFO  (TEST-TestDynamicLoading.testDynamicLoading-seed#[74B623A3C362FE88]) [    ] o.a.s.c.c.ConnectionManager Waiting for client to connect to ZooKeeper
   [junit4]   2> 238981 INFO  (zkCallback-237-thread-1) [    ] o.a.s.c.c.ConnectionManager Watcher org.apache.solr.common.cloud.ConnectionManager@9b08c4 name:ZooKeeperConnection Watcher:127.0.0.1:48531/solr got event WatchedEvent state:SyncConnected type:None path:null path:null type:None
   [junit4]   2> 238982 INFO  (TEST-TestDynamicLoading.testDynamicLoading-seed#[74B623A3C362FE88]) [    ] o.a.s.c.c.ConnectionManager Client is connected to ZooKeeper
   [junit4]   2> 238982 INFO  (TEST-TestDynamicLoading.testDynamicLoading-seed#[74B623A3C362FE88]) [    ] o.a.s.c.c.SolrZkClient Using default ZkACLProvider
   [junit4]   2> 238982 INFO  (TEST-TestDynamicLoading.testDynamicLoading-seed#[74B623A3C362FE88]) [    ] o.a.s.c.c.SolrZkClient makePath: /collections/collection1
   [junit4]   2> 238983 INFO  (TEST-TestDynamicLoading.testDynamicLoading-seed#[74B623A3C362FE88]) [    ] o.a.s.c.c.SolrZkClient makePath: /collections/collection1/shards
   [junit4]   2> 238984 INFO  (TEST-TestDynamicLoading.testDynamicLoading-seed#[74B623A3C362FE88]) [    ] o.a.s.c.c.SolrZkClient makePath: /collections/control_collection
   [junit4]   2> 238985 INFO  (TEST-TestDynamicLoading.testDynamicLoading-seed#[74B623A3C362FE88]) [    ] o.a.s.c.c.SolrZkClient makePath: /collections/control_collection/shards
   [junit4]   2> 238986 INFO  (TEST-TestDynamicLoading.testDynamicLoading-seed#[74B623A3C362FE88]) [    ] o.a.s.c.AbstractZkTestCase put /home/jenkins/workspace/Lucene-Solr-trunk-Linux/solr/core/src/test-files/solr/collection1/conf/solrconfig-tlog.xml to /configs/conf1/solrconfig.xml
   [junit4]   2> 238987 INFO  (TEST-TestDynamicLoading.testDynamicLoading-seed#[74B623A3C362FE88]) [    ] o.a.s.c.c.SolrZkClient makePath: /configs/conf1/solrconfig.xml
   [junit4]   2> 238989 INFO  (TEST-TestDynamicLoading.testDynamicLoading-seed#[74B623A3C362FE88]) [    ] o.a.s.c.AbstractZkTestCase put /home/jenkins/workspace/Lucene-Solr-trunk-Linux/solr/core/src/test-files/solr/collection1/conf/schema.xml to /configs/conf1/schema.xml
   [junit4]   2> 238989 INFO  (TEST-TestDynamicLoading.testDynamicLoading-seed#[74B623A3C362FE88]) [    ] o.a.s.c.c.SolrZkClient makePath: /configs/conf1/schema.xml
   [junit4]   2> 239006 INFO  (TEST-TestDynamicLoading.testDynamicLoading-seed#[74B623A3C362FE88]) [    ] o.a.s.c.AbstractZkTestCase put /home/jenkins/workspace/Lucene-Solr-trunk-Linux/solr/core/src/test-files/solr/collection1/conf/solrconfig.snippet.randomindexconfig.xml to /configs/conf1/solrconfig.snippet.randomindexconfig.xml
   [junit4]   2> 239007 INFO  (TEST-TestDynamicLoading.testDynamicLoading-seed#[74B623A3C362FE88]) [    ] o.a.s.c.c.SolrZkClient makePath: /configs/conf1/solrconfig.snippet.randomindexconfig.xml
   [junit4]   2> 239008 INFO  (TEST-TestDynamicLoading.testDynamicLoading-seed#[74B623A3C362FE88]) [    ] o.a.s.c.AbstractZkTestCase put /home/jenkins/workspace/Lucene-Solr-trunk-Linux/solr/core/src/test-files/solr/collection1/conf/stopwords.txt to /configs/conf1/stopwords.txt
   [junit4]   2> 239008 INFO  (TEST-TestDynamicLoading.testDynamicLoading-seed#[74B623A3C362FE88]) [    ] o.a.s.c.c.SolrZkClient makePath: /configs/conf1/stopwords.txt
   [junit4]   2> 239010 INFO  (TEST-TestDynamicLoading.testDynamicLoading-seed#[74B623A3C362FE88]) [    ] o.a.s.c.AbstractZkTestCase put /home/jenkins/workspace/Lucene-Solr-trunk-Linux/solr/core/src/test-files/solr/collection1/conf/protwords.txt to /configs/conf1/protwords.txt
   [junit4]   2> 239010 INFO  (TEST-TestDynamicLoading.testDynamicLoading-seed#[74B623A3C362FE88]) [    ] o.a.s.c.c.SolrZkClient makePath: /configs/conf1/protwords.txt
   [junit4]   2> 239011 INFO  (TEST-TestDynamicLoading.testDynamicLoading-seed#[74B623A3C362FE88]) [    ] o.a.s.c.AbstractZkTestCase put /home/jenkins/workspace/Lucene-Solr-trunk-Linux/solr/core/src/test-files/solr/collection1/conf/currency.xml to /configs/conf1/currency.xml
   [junit4]   2> 239011 INFO  (TEST-TestDynamicLoading.testDynamicLoading-seed#[74B623A3C362FE88]) [    ] o.a.s.c.c.SolrZkClient makePath: /configs/conf1/currency.xml
   [junit4]   2> 239014 INFO  (TEST-TestDynamicLoading.testDynamicLoading-seed#[74B623A3C362FE88]) [    ] o.a.s.c.AbstractZkTestCase put /home/jenkins/workspace/Lucene-Solr-trunk-Linux/solr/core/src/test-files/solr/collection1/conf/enumsConfig.xml to /configs/conf1/enumsConfig.xml
   [junit4]   2> 239014 INFO  (TEST-TestDynamicLoading.testDynamicLoading-seed#[74B623A3C362FE88]) [    ] o.a.s.c.c.SolrZkClient makePath: /configs/conf1/enumsConfig.xml
   [junit4]   2> 239016 INFO  (TEST-TestDynamicLoading.testDynamicLoading-seed#[74B623A3C362FE88]) [    ] o.a.s.c.AbstractZkTestCase put /home/jenkins/workspace/Lucene-Solr-trunk-Linux/solr/core/src/test-files/solr/collection1/conf/open-exchange-rates.json to /configs/conf1/open-exchange-rates.json
   [junit4]   2> 239016 INFO  (TEST-TestDynamicLoading.testDynamicLoading-seed#[74B623A3C362FE88]) [    ] o.a.s.c.c.SolrZkClient makePath: /configs/conf1/open-exchange-rates.json
   [junit4]   2> 239023 INFO  (TEST-TestDynamicLoading.testDynamicLoading-seed#[74B623A3C362FE88]) [    ] o.a.s.c.AbstractZkTestCase put /home/jenkins/workspace/Lucene-Solr-trunk-Linux/solr/core/src/test-files/solr/collection1/conf/mapping-ISOLatin1Accent.txt to /configs/conf1/mapping-ISOLatin1Accent.txt
   [junit4]   2> 239023 INFO  (TEST-TestDynamicLoading.testDynamicLoading-seed#[74B623A3C362FE88]) [    ] o.a.s.c.c.SolrZkClient makePath: /configs/conf1/mapping-ISOLatin1Accent.txt
   [junit4]   2> 239024 INFO  (TEST-TestDynamicLoading.testDynamicLoading-seed#[74B623A3C362FE88]) [    ] o.a.s.c.AbstractZkTestCase put /home/jenkins/workspace/Lucene-Solr-trunk-Linux/solr/core/src/test-files/solr/collection1/conf/old_synonyms.txt to /configs/conf1/old_synonyms.txt
   [junit4]   2> 239024 INFO  (TEST-TestDynamicLoading.testDynamicLoading-seed#[74B623A3C362FE88]) [    ] o.a.s.c.c.SolrZkClient makePath: /configs/conf1/old_synonyms.txt
   [junit4]   2> 239025 INFO  (TEST-TestDynamicLoading.testDynamicLoading-seed#[74B623A3C362FE88]) [    ] o.a.s.c.AbstractZkTestCase put /home/jenkins/workspace/Lucene-Solr-trunk-Linux/solr/core/src/test-files/solr/collection1/conf/synonyms.txt to /configs/conf1/synonyms.txt
   [junit4]   2> 239025 INFO  (TEST-TestDynamicLoading.testDynamicLoading-seed#[74B623A3C362FE88]) [    ] o.a.s.c.c.SolrZkClient makePath: /configs/conf1/synonyms.txt
   [junit4]   2> 239027 INFO  (TEST-TestDynamicLoading.testDynamicLoading-seed#[74B623A3C362FE88]) [    ] o.a.s.c.c.SolrZkClient Using default ZkCredentialsProvider
   [junit4]   2> 239027 INFO  (TEST-TestDynamicLoading.testDynamicLoading-seed#[74B623A3C362FE88]) [    ] o.a.s.c.c.ConnectionManager Waiting for client to connect to ZooKeeper
   [junit4]   2> 239028 INFO  (zkCallback-238-thread-1) [    ] o.a.s.c.c.ConnectionManager Watcher org.apache.solr.common.cloud.ConnectionManager@1539c79 name:ZooKeeperConnection Watcher:127.0.0.1:48531/solr got event WatchedEvent state:SyncConnected type:None path:null path:null type:None
   [junit4]   2> 239028 INFO  (TEST-TestDynamicLoading.testDynamicLoading-seed#[74B623A3C362FE88]) [    ] o.a.s.c.c.ConnectionManager Client is connected to ZooKeeper
   [junit4]   2> 239029 INFO  (TEST-TestDynamicLoading.testDynamicLoading-seed#[74B623A3C362FE88]) [    ] o.a.s.c.c.SolrZkClient Using default ZkACLProvider
   [junit4]   2> 239153 INFO  (TEST-TestDynamicLoading.testDynamicLoading-seed#[74B623A3C362FE88]) [    ] o.a.s.SolrTestCaseJ4 Writing core.properties file to /home/jenkins/workspace/Lucene-Solr-trunk-Linux/solr/build/solr-core/test/J1/temp/solr.core.TestDynamicLoading_74B623A3C362FE88-001/control-001/cores/collection1
   [junit4]   2> 239171 INFO  (TEST-TestDynamicLoading.testDynamicLoading-seed#[74B623A3C362FE88]) [    ] o.e.j.s.Server jetty-9.3.6.v20151106
   [junit4]   2> 239174 INFO  (TEST-TestDynamicLoading.testDynamicLoading-seed#[74B623A3C362FE88]) [    ] o.e.j.s.h.ContextHandler Started o.e.j.s.ServletContextHandler@19ee034{/,null,AVAILABLE}
   [junit4]   2> 239184 INFO  (TEST-TestDynamicLoading.testDynamicLoading-seed#[74B623A3C362FE88]) [    ] o.e.j.u.s.SslContextFactory x509=X509@ceb5b3(solrtest,h=[],w=[]) for SslContextFactory@3dc284(file:///home/jenkins/workspace/Lucene-Solr-trunk-Linux/solr/server/etc/test/solrtest.keystore,file:///home/jenkins/workspace/Lucene-Solr-trunk-Linux/solr/server/etc/test/solrtest.keystore)
   [junit4]   2> 239209 INFO  (TEST-TestDynamicLoading.testDynamicLoading-seed#[74B623A3C362FE88]) [    ] o.e.j.s.ServerConnector Started ServerConnector@10e68cd{SSL,[ssl, http/1.1]}{127.0.0.1:51620}
   [junit4]   2> 239210 INFO  (TEST-TestDynamicLoading.testDynamicLoading-seed#[74B623A3C362FE88]) [    ] o.e.j.s.Server Started @240481ms
   [junit4]   2> 239210 INFO  (TEST-TestDynamicLoading.testDynamicLoading-seed#[74B623A3C362FE88]) [    ] o.a.s.c.s.e.JettySolrRunner Jetty properties: {solr.data.dir=/home/jenkins/workspace/Lucene-Solr-trunk-Linux/solr/build/solr-core/test/J1/temp/solr.core.TestDynamicLoading_74B623A3C362FE88-001/tempDir-001/control/data, hostContext=/, hostPort=51620, coreRootDirectory=/home/jenkins/workspace/Lucene-Solr-trunk-Linux/solr/build/solr-core/test/J1/temp/solr.core.TestDynamicLoading_74B623A3C362FE88-001/control-001/cores}
   [junit4]   2> 239210 INFO  (TEST-TestDynamicLoading.testDynamicLoading-seed#[74B623A3C362FE88]) [    ] o.a.s.s.SolrDispatchFilter SolrDispatchFilter.init(): sun.misc.Launcher$AppClassLoader@163006a
   [junit4]   2> 239210 INFO  (TEST-TestDynamicLoading.testDynamicLoading-seed#[74B623A3C362FE88]) [    ] o.a.s.c.SolrResourceLoader new SolrResourceLoader for directory: '/home/jenkins/workspace/Lucene-Solr-trunk-Linux/solr/build/solr-core/test/J1/temp/solr.core.TestDynamicLoading_74B623A3C362FE88-001/control-001'
   [junit4]   2> 239210 INFO  (TEST-TestDynamicLoading.testDynamicLoading-seed#[74B623A3C362FE88]) [    ] o.a.s.c.SolrResourceLoader JNDI not configured for solr (NoInitialContextEx)
   [junit4]   2> 239210 INFO  (TEST-TestDynamicLoading.testDynamicLoading-seed#[74B623A3C362FE88]) [    ] o.a.s.c.SolrResourceLoader solr home defaulted to 'solr/' (could not find system property or JNDI)
   [junit4]   2> 239211 INFO  (TEST-TestDynamicLoading.testDynamicLoading-seed#[74B623A3C362FE88]) [    ] o.a.s.c.c.SolrZkClient Using default ZkCredentialsProvider
   [junit4]   2> 239211 INFO  (TEST-TestDynamicLoading.testDynamicLoading-seed#[74B623A3C362FE88]) [    ] o.a.s.c.c.ConnectionManager Waiting for client to connect to ZooKeeper
   [junit4]   2> 239212 INFO  (zkCallback-239-thread-1) [    ] o.a.s.c.c.ConnectionManager Watcher org.apache.solr.common.cloud.ConnectionManager@53473f name:ZooKeeperConnection Watcher:127.0.0.1:48531/solr got event WatchedEvent state:SyncConnected type:None path:null path:null type:None
   [junit4]   2> 239212 INFO  (TEST-TestDynamicLoading.testDynamicLoading-seed#[74B623A3C362FE88]) [    ] o.a.s.c.c.ConnectionManager Client is connected to ZooKeeper
   [junit4]   2> 239213 INFO  (TEST-TestDynamicLoading.testDynamicLoading-seed#[74B623A3C362FE88]) [    ] o.a.s.c.c.SolrZkClient Using default ZkACLProvider
   [junit4]   2> 239214 INFO  (TEST-TestDynamicLoading.testDynamicLoading-seed#[74B623A3C362FE88]) [    ] o.a.s.s.SolrDispatchFilter Loading solr.xml from SolrHome (not found in ZooKeeper)
   [junit4]   2> 239214 INFO  (TEST-TestDynamicLoading.testDynamicLoading-seed#[74B623A3C362FE88]) [    ] o.a.s.c.SolrXmlConfig Loading container configuration from /home/jenkins/workspace/Lucene-Solr-trunk-Linux/solr/build/solr-core/test/J1/temp/solr.core.TestDynamicLoading_74B623A3C362FE88-001/control-001/solr.xml
   [junit4]   2> 239231 INFO  (TEST-TestDynamicLoading.testDynamicLoading-seed#[74B623A3C362FE88]) [    ] o.a.s.c.CorePropertiesLocator Config-defined core root directory: /home/jenkins/workspace/Lucene-Solr-trunk-Linux/solr/build/solr-core/test/J1/temp/solr.core.TestDynamicLoading_74B623A3C362FE88-001/control-001/cores
   [junit4]   2> 239231 INFO  (TEST-TestDynamicLoading.testDynamicLoading-seed#[74B623A3C362FE88]) [    ] o.a.s.c.CoreContainer New CoreContainer 14646459
   [junit4]   2> 239231 INFO  (TEST-TestDynamicLoading.testDynamicLoading-seed#[74B623A3C362FE88]) [    ] o.a.s.c.CoreContainer Loading cores into CoreContainer [instanceDir=/home/jenkins/workspace/Lucene-Solr-trunk-Linux/solr/build/solr-core/test/J1/temp/solr.core.TestDynamicLoading_74B623A3C362FE88-001/control-001]
   [junit4]   2> 239231 WARN  (TEST-TestDynamicLoading.testDynamicLoading-seed#[74B623A3C362FE88]) [    ] o.a.s.c.CoreContainer Couldn't add files from /home/jenkins/workspace/Lucene-Solr-trunk-Linux/solr/build/solr-core/test/J1/temp/solr.core.TestDynamicLoading_74B623A3C362FE88-001/control-001/lib to classpath: /home/jenkins/workspace/Lucene-Solr-trunk-Linux/solr/build/solr-core/test/J1/temp/solr.core.TestDynamicLoading_74B623A3C362FE88-001/control-001/lib
   [junit4]   2> 239231 INFO  (TEST-TestDynamicLoading.testDynamicLoading-seed#[74B623A3C362FE88]) [    ] o.a.s.h.c.HttpShardHandlerFactory created with socketTimeout : 90000,urlScheme : ,connTimeout : 15000,maxConnectionsPerHost : 20,maxConnections : 10000,corePoolSize : 0,maximumPoolSize : 2147483647,maxThreadIdleTime : 5,sizeOfQueue : -1,fairnessPolicy : false,useRetries : false,
   [junit4]   2> 239235 INFO  (TEST-TestDynamicLoading.testDynamicLoading-seed#[74B623A3C362FE88]) [    ] o.a.s.u.UpdateShardHandler Creating UpdateShardHandler HTTP client with params: socketTimeout=340000&connTimeout=45000&retry=true
   [junit4]   2> 239237 INFO  (TEST-TestDynamicLoading.testDynamicLoading-seed#[74B623A3C362FE88]) [    ] o.a.s.l.LogWatcher SLF4J impl is org.slf4j.impl.Log4jLoggerFactory
   [junit4]   2> 239237 INFO  (TEST-TestDynamicLoading.testDynamicLoading-seed#[74B623A3C362FE88]) [    ] o.a.s.l.LogWatcher Registering Log Listener [Log4j (org.slf4j.impl.Log4jLoggerFactory)]
   [junit4]   2> 239237 INFO  (TEST-TestDynamicLoading.testDynamicLoading-seed#[74B623A3C362FE88]) [    ] o.a.s.c.ZkContainer Zookeeper client=127.0.0.1:48531/solr
   [junit4]   2> 239237 INFO  (TEST-TestDynamicLoading.testDynamicLoading-seed#[74B623A3C362FE88]) [    ] o.a.s.c.ZkController zkHost includes chroot
   [junit4]   2> 239237 INFO  (TEST-TestDynamicLoading.testDynamicLoading-seed#[74B623A3C362FE88]) [    ] o.a.s.c.c.SolrZkClient Using default ZkCredentialsProvider
   [junit4]   2> 239238 INFO  (TEST-TestDynamicLoading.testDynamicLoading-seed#[74B623A3C362FE88]) [    ] o.a.s.c.c.ConnectionManager Waiting for client to connect to ZooKeeper
   [junit4]   2> 239241 INFO  (zkCallback-242-thread-1) [    ] o.a.s.c.c.ConnectionManager Watcher org.apache.solr.common.cloud.ConnectionManager@1a6545 name:ZooKeeperConnection Watcher:127.0.0.1:48531 got event WatchedEvent state:SyncConnected type:None path:null path:null type:None
   [junit4]   2> 239241 INFO  (TEST-TestDynamicLoading.testDynamicLoading-seed#[74B623A3C362FE88]) [    ] o.a.s.c.c.ConnectionManager Client is connected to ZooKeeper
   [junit4]   2> 239242 INFO  (TEST-TestDynamicLoading.testDynamicLoading-seed#[74B623A3C362FE88]) [    ] o.a.s.c.c.SolrZkClient Using default ZkACLProvider
   [junit4]   2> 239243 INFO  (TEST-TestDynamicLoading.testDynamicLoading-seed#[74B623A3C362FE88]) [    ] o.a.s.c.c.ConnectionManager Waiting for client to connect to ZooKeeper
   [junit4]   2> 239243 INFO  (zkCallback-243-thread-1) [    ] o.a.s.c.c.ConnectionManager Watcher org.apache.solr.common.cloud.ConnectionManager@167d5be name:ZooKeeperConnection Watcher:127.0.0.1:48531/solr got event WatchedEvent state:SyncConnected type:None path:null path:null type:None
   [junit4]   2> 239244 INFO  (TEST-TestDynamicLoading.testDynamicLoading-seed#[74B623A3C362FE88]) [    ] o.a.s.c.c.ConnectionManager Client is connected to ZooKeeper
   [junit4]   2> 239245 INFO  (TEST-TestDynamicLoading.testDynamicLoading-seed#[74B623A3C362FE88]) [    ] o.a.s.c.c.SolrZkClient makePath: /overseer/queue
   [junit4]   2> 239246 INFO  (TEST-TestDynamicLoading.testDynamicLoading-seed#[74B623A3C362FE88]) [    ] o.a.s.c.c.SolrZkClient makePath: /overseer/collection-queue-work
   [junit4]   2> 239248 INFO  (TEST-TestDynamicLoading.testDynamicLoading-seed#[74B623A3C362FE88]) [    ] o.a.s.c.c.SolrZkClient makePath: /overseer/collection-map-running
   [junit4]   2> 239250 INFO  (TEST-TestDynamicLoading.testDynamicLoading-seed#[74B623A3C362FE88]) [    ] o.a.s.c.c.SolrZkClient makePath: /overseer/collection-map-completed
   [junit4]   2> 239252 INFO  (TEST-TestDynamicLoading.testDynamicLoading-seed#[74B623A3C362FE88]) [    ] o.a.s.c.c.SolrZkClient makePath: /overseer/collection-map-failure
   [junit4]   2> 239253 INFO  (TEST-TestDynamicLoading.testDynamicLoading-seed#[74B623A3C362FE88]) [    ] o.a.s.c.c.SolrZkClient makePath: /live_nodes
   [junit4]   2> 239254 INFO  (TEST-TestDynamicLoading.testDynamicLoading-seed#[74B623A3C362FE88]) [    ] o.a.s.c.c.SolrZkClient makePath: /aliases.json
   [junit4]   2> 239255 INFO  (TEST-TestDynamicLoading.testDynamicLoading-seed#[74B623A3C362FE88]) [    ] o.a.s.c.c.SolrZkClient makePath: /clusterstate.json
   [junit4]   2> 239256 INFO  (TEST-TestDynamicLoading.testDynamicLoading-seed#[74B623A3C362FE88]) [    ] o.a.s.c.c.SolrZkClient makePath: /security.json
   [junit4]   2> 239256 INFO  (TEST-TestDynamicLoading.testDynamicLoading-seed#[74B623A3C362FE88]) [    ] o.a.s.c.c.ZkStateReader Updating cluster state from ZooKeeper... 
   [junit4]   2> 239257 INFO  (TEST-TestDynamicLoading.testDynamicLoading-seed#[74B623A3C362FE88]) [    ] o.a.s.c.c.ZkStateReader Updated live nodes from ZooKeeper... (0) -> (0)
   [junit4]   2> 239258 INFO  (TEST-TestDynamicLoading.testDynamicLoading-seed#[74B623A3C362FE88]) [    ] o.a.s.c.c.SolrZkClient makePath: /overseer_elect
   [junit4]   2> 239263 INFO  (TEST-TestDynamicLoading.testDynamicLoading-seed#[74B623A3C362FE88]) [    ] o.a.s.c.c.SolrZkClient makePath: /overseer_elect/election
   [junit4]   2> 239263 INFO  (TEST-TestDynamicLoading.testDynamicLoading-seed#[74B623A3C362FE88]) [    ] o.a.s.c.Overseer Overseer (id=null) closing
   [junit4]   2> 239264 INFO  (TEST-TestDynamicLoading.testDynamicLoading-seed#[74B623A3C362FE88]) [    ] o.a.s.c.LeaderElector Joined leadership election with path: /overseer_elect/election/95472253238247429-127.0.0.1:51620_-n_0000000000
   [junit4]   2> 239264 INFO  (TEST-TestDynamicLoading.testDynamicLoading-seed#[74B623A3C362FE88]) [    ] o.a.s.c.OverseerElectionContext I am going to be the leader 127.0.0.1:51620_
   [junit4]   2> 239264 INFO  (TEST-TestDynamicLoading.testDynamicLoading-seed#[74B623A3C362FE88]) [    ] o.a.s.c.c.SolrZkClient makePath: /overseer_elect/leader
   [junit4]   2> 239265 INFO  (TEST-TestDynamicLoading.testDynamicLoading-seed#[74B623A3C362FE88]) [    ] o.a.s.c.Overseer Overseer (id=95472253238247429-127.0.0.1:51620_-n_0000000000) starting
   [junit4]   2> 239266 INFO  (TEST-TestDynamicLoading.testDynamicLoading-seed#[74B623A3C362FE88]) [    ] o.a.s.c.c.SolrZkClient makePath: /overseer/queue-work
   [junit4]   2> 239272 INFO  (TEST-TestDynamicLoading.testDynamicLoading-seed#[74B623A3C362FE88]) [    ] o.a.s.c.OverseerAutoReplicaFailoverThread Starting OverseerAutoReplicaFailoverThread autoReplicaFailoverWorkLoopDelay=10000 autoReplicaFailoverWaitAfterExpiration=30000 autoReplicaFailoverBadNodeExpiration=60000
   [junit4]   2> 239273 INFO  (OverseerCollectionConfigSetProcessor-95472253238247429-127.0.0.1:51620_-n_0000000000) [    ] o.a.s.c.OverseerTaskProcessor Process current queue of overseer operations
   [junit4]   2> 239273 INFO  (OverseerStateUpdate-95472253238247429-127.0.0.1:51620_-n_0000000000) [    ] o.a.s.c.Overseer Starting to work on the main queue
   [junit4]   2> 239277 INFO  (TEST-TestDynamicLoading.testDynamicLoading-seed#[74B623A3C362FE88]) [    ] o.a.s.c.ZkController Register node as live in ZooKeeper:/live_nodes/127.0.0.1:51620_
   [junit4]   2> 239277 INFO  (TEST-TestDynamicLoading.testDynamicLoading-seed#[74B623A3C362FE88]) [    ] o.a.s.c.c.SolrZkClient makePath: /live_nodes/127.0.0.1:51620_
   [junit4]   2> 239277 INFO  (OverseerStateUpdate-95472253238247429-127.0.0.1:51620_-n_0000000000) [    ] o.a.s.c.c.ZkStateReader Updated live nodes from ZooKeeper... (0) -> (0)
   [junit4]   2> 239278 INFO  (zkCallback-243-thread-1) [    ] o.a.s.c.c.ZkStateReader A live node change: [WatchedEvent state:SyncConnected type:NodeChildrenChanged path:/live_nodes], has occurred - updating... (live nodes size: [0])
   [junit4]   2> 239278 INFO  (zkCallback-243-thread-1) [    ] o.a.s.c.c.ZkStateReader Updated live nodes from ZooKeeper... (0) -> (1)
   [junit4]   2> 239323 INFO  (TEST-TestDynamicLoading.testDynamicLoading-seed#[74B623A3C362FE88]) [    ] o.a.s.c.CoreContainer Security conf doesn't exist. Skipping setup for authorization module.
   [junit4]   2> 239323 INFO  (TEST-TestDynamicLoading.testDynamicLoading-seed#[74B623A3C362FE88]) [    ] o.a.s.c.CoreContainer No authentication plugin used.
   [junit4]   2> 239323 INFO  (TEST-TestDynamicLoading.testDynamicLoading-seed#[74B623A3C362FE88]) [    ] o.a.s.c.CorePropertiesLocator Looking for core definitions underneath /home/jenkins/workspace/Lucene-Solr-trunk-Linux/solr/build/solr-core/test/J1/temp/solr.core.TestDynamicLoading_74B623A3C362FE88-001/control-001/cores
   [junit4]   2> 239324 INFO  (TEST-TestDynamicLoading.testDynamicLoading-seed#[74B623A3C362FE88]) [    ] o.a.s.c.CoreDescriptor Created CoreDescriptor: {name=collection1, config=solrconfig.xml, transient=false, schema=schema.xml, loadOnStartup=true, configSetProperties=configsetprops.json, collection=control_collection, coreNodeName=, dataDir=data/, shard=}
   [junit4]   2> 239324 INFO  (TEST-TestDynamicLoading.testDynamicLoading-seed#[74B623A3C362FE88]) [    ] o.a.s.c.CorePropertiesLocator Found core collection1 in /home/jenkins/workspace/Lucene-Solr-trunk-Linux/solr/build/solr-core/test/J1/temp/solr.core.TestDynamicLoading_74B623A3C362FE88-001/control-001/cores/collection1
   [junit4]   2> 239324 INFO  (TEST-TestDynamicLoading.testDynamicLoading-seed#[74B623A3C362FE88]) [    ] o.a.s.c.CorePropertiesLocator Found 1 core definitions
   [junit4]   2> 239325 INFO  (TEST-TestDynamicLoading.testDynamicLoading-seed#[74B623A3C362FE88]) [    ] o.a.s.s.SolrDispatchFilter user.dir=/home/jenkins/workspace/Lucene-Solr-trunk-Linux/solr/build/solr-core/test/J1
   [junit4]   2> 239325 INFO  (TEST-TestDynamicLoading.testDynamicLoading-seed#[74B623A3C362FE88]) [    ] o.a.s.s.SolrDispatchFilter SolrDispatchFilter.init() done
   [junit4]   2> 239325 INFO  (coreLoadExecutor-662-thread-1) [    ] o.a.s.c.ZkController publishing state=down
   [junit4]   2> 239325 INFO  (coreLoadExecutor-662-thread-1) [    ] o.a.s.c.ZkController numShards not found on descriptor - reading it from system property
   [junit4]   2> 239327 INFO  (OverseerStateUpdate-95472253238247429-127.0.0.1:51620_-n_0000000000) [    ] o.a.s.c.Overseer processMessage: queueSize: 1, message = {
   [junit4]   2>   "core":"collection1",
   [junit4]   2>   "roles":null,
   [junit4]   2>   "base_url":"https://127.0.0.1:51620",
   [junit4]   2>   "node_name":"127.0.0.1:51620_",
   [junit4]   2>   "numShards":"1",
   [junit4]   2>   "state":"down",
   [junit4]   2>   "shard":null,
   [junit4]   2>   "collection":"control_collection",
   [junit4]   2>   "operation":"state"} current state version: 0
   [junit4]   2> 239327 INFO  (coreLoadExecutor-662-thread-1) [    ] o.a.s.c.ZkController look for our core node name
   [junit4]   2> 239327 INFO  (OverseerStateUpdate-95472253238247429-127.0.0.1:51620_-n_0000000000) [    ] o.a.s.c.o.ReplicaMutator Update state numShards=1 message={
   [junit4]   2>   "core":"collection1",
   [junit4]   2>   "roles":null,
   [junit4]   2>   "base_url":"https://127.0.0.1:51620",
   [junit4]   2>   "node_name":"127.0.0.1:51620_",
   [junit4]   2>   "numShards":"1",
   [junit4]   2>   "state":"down",
   [junit4]   2>   "shard":null,
   [junit4]   2>   "collection":"control_collection",
   [junit4]   2>   "operation":"state"}
   [junit4]   2> 239327 INFO  (OverseerStateUpdate-95472253238247429-127.0.0.1:51620_-n_0000000000) [    ] o.a.s.c.o.ClusterStateMutator building a new cName: control_collection
   [junit4]   2> 239328 INFO  (OverseerStateUpdate-95472253238247429-127.0.0.1:51620_-n_0000000000) [    ] o.a.s.c.o.ReplicaMutator Assigning new node to shard shard=shard1
   [junit4]   2> 239329 INFO  (zkCallback-243-thread-1) [    ] o.a.s.c.c.ZkStateReader A cluster state change: [WatchedEvent state:SyncConnected type:NodeDataChanged path:/clusterstate.json], has occurred - updating... (live nodes size: [1])
   [junit4]   2> 240327 INFO  (coreLoadExecutor-662-thread-1) [    ] o.a.s.c.ZkController waiting to find shard id in clusterstate for collection1
   [junit4]   2> 240327 INFO  (coreLoadExecutor-662-thread-1) [    ] o.a.s.c.ZkController Check for collection zkNode:control_collection
   [junit4]   2> 240328 INFO  (coreLoadExecutor-662-thread-1) [    ] o.a.s.c.ZkController Collection zkNode exists
   [junit4]   2> 240328 INFO  (coreLoadExecutor-662-thread-1) [    ] o.a.s.c.c.ZkStateReader Load collection config from: [/collections/control_collection]
   [junit4]   2> 240328 INFO  (coreLoadExecutor-662-thread-1) [    ] o.a.s.c.c.ZkStateReader path=[/collections/control_collection] [configName]=[conf1] specified config exists in ZooKeeper
   [junit4]   2> 240328 INFO  (coreLoadExecutor-662-thread-1) [    ] o.a.s.c.SolrResourceLoader new SolrResourceLoader for directory: '/home/jenkins/workspace/Lucene-Solr-trunk-Linux/solr/build/solr-core/test/J1/temp/solr.core.TestDynamicLoading_74B623A3C362FE88-001/control-001/cores/collection1'
   [junit4]   2> 240328 INFO  (coreLoadExecutor-662-thread-1) [    ] o.a.s.c.SolrResourceLoader JNDI not configured for solr (NoInitialContextEx)
   [junit4]   2> 240329 INFO  (coreLoadExecutor-662-thread-1) [    ] o.a.s.c.SolrResourceLoader solr home defaulted to 'solr/' (could not find system property or JNDI)
   [junit4]   2> 240330 INFO  (coreLoadExecutor-662-thread-1) [    ] o.a.s.c.Config loaded config solrconfig.xml with version 0 
   [junit4]   2> 240337 INFO  (coreLoadExecutor-662-thread-1) [    ] o.a.s.c.SolrConfig current version of requestparams : -1
   [junit4]   2> 240344 INFO  (coreLoadExecutor-662-thread-1) [    ] o.a.s.c.SolrConfig Using Lucene MatchVersion: 6.0.0
   [junit4]   2> 240355 INFO  (coreLoadExecutor-662-thread-1) [    ] o.a.s.c.SolrConfig Loaded SolrConfig: solrconfig.xml
   [junit4]   2> 240366 INFO  (coreLoadExecutor-662-thread-1) [    ] o.a.s.s.IndexSchema [collection1] Schema name=test
   [junit4]   2> 240491 INFO  (coreLoadExecutor-662-thread-1) [    ] o.a.s.s.OpenExchangeRatesOrgProvider Initialized with rates=open-exchange-rates.json, refreshInterval=1440.
   [junit4]   2> 240499 INFO  (coreLoadExecutor-662-thread-1) [    ] o.a.s.s.IndexSchema default search field in schema is text
   [junit4]   2> 240500 INFO  (coreLoadExecutor-662-thread-1) [    ] o.a.s.s.IndexSchema unique key field: id
   [junit4]   2> 240508 INFO  (coreLoadExecutor-662-thread-1) [    ] o.a.s.s.FileExchangeRateProvider Reloading exchange rates from file currency.xml
   [junit4]   2> 240511 INFO  (coreLoadExecutor-662-thread-1) [    ] o.a.s.s.FileExchangeRateProvider Reloading exchange rates from file currency.xml
   [junit4]   2> 240513 INFO  (coreLoadExecutor-662-thread-1) [    ] o.a.s.s.OpenExchangeRatesOrgProvider Reloading exchange rates from open-exchange-rates.json
   [junit4]   2> 240514 INFO  (coreLoadExecutor-662-thread-1) [    ] o.a.s.s.OpenExchangeRatesOrgProvider Reloading exchange rates from open-exchange-rates.json
   [junit4]   2> 240515 INFO  (coreLoadExecutor-662-thread-1) [    ] o.a.s.c.ConfigSetProperties Did not find ConfigSet properties, assuming default properties: Can't find resource 'configsetprops.json' in classpath or '/configs/conf1', cwd=/home/jenkins/workspace/Lucene-Solr-trunk-Linux/solr/build/solr-core/test/J1
   [junit4]   2> 240515 INFO  (coreLoadExecutor-662-thread-1) [    ] o.a.s.c.CoreContainer Creating SolrCore 'collection1' using configuration from collection control_collection
   [junit4]   2> 240515 INFO  (coreLoadExecutor-662-thread-1) [    ] o.a.s.c.SolrCore org.apache.solr.core.MockDirectoryFactory
   [junit4]   2> 240516 INFO  (coreLoadExecutor-662-thread-1) [    ] o.a.s.c.SolrCore [[collection1] ] Opening new SolrCore at [/home/jenkins/workspace/Lucene-Solr-trunk-Linux/solr/build/solr-core/test/J1/temp/solr.core.TestDynamicLoading_74B623A3C362FE88-001/control-001/cores/collection1], dataDir=[/home/jenkins/workspace/Lucene-Solr-trunk-Linux/solr/build/solr-core/test/J1/temp/solr.core.TestDynamicLoading_74B623A3C362FE88-001/control-001/cores/collection1/data/]
   [junit4]   2> 240516 INFO  (coreLoadExecutor-662-thread-1) [    ] o.a.s.c.JmxMonitoredMap JMX monitoring is enabled. Adding Solr mbeans to JMX Server: com.sun.jmx.mbeanserver.JmxMBeanServer@9803bc
   [junit4]   2> 240516 INFO  (coreLoadExecutor-662-thread-1) [    ] o.a.s.c.CachingDirectoryFactory return new directory for /home/jenkins/workspace/Lucene-Solr-trunk-Linux/solr/build/solr-core/test/J1/temp/solr.core.TestDynamicLoading_74B623A3C362FE88-001/control-001/cores/collection1/data
   [junit4]   2> 240517 INFO  (coreLoadExecutor-662-thread-1) [    ] o.a.s.c.SolrCore New index directory detected: old=null new=/home/jenkins/workspace/Lucene-Solr-trunk-Linux/solr/build/solr-core/test/J1/temp/solr.core.TestDynamicLoading_74B623A3C362FE88-001/control-001/cores/collection1/data/index/
   [junit4]   2> 240517 WARN  (coreLoadExecutor-662-thread-1) [    ] o.a.s.c.SolrCore [collection1] Solr index directory '/home/jenkins/workspace/Lucene-Solr-trunk-Linux/solr/build/solr-core/test/J1/temp/solr.core.TestDynamicLoading_74B623A3C362FE88-001/control-001/cores/collection1/data/index' doesn't exist. Creating new index...
   [junit4]   2> 240517 INFO  (coreLoadExecutor-662-thread-1) [    ] o.a.s.c.CachingDirectoryFactory return new directory for /home/jenkins/workspace/Lucene-Solr-trunk-Linux/solr/build/solr-core/test/J1/temp/solr.core.TestDynamicLoading_74B623A3C362FE88-001/control-001/cores/collection1/data/index
   [junit4]   2> 240518 INFO  (coreLoadExecutor-662-thread-1) [    ] o.a.s.u.RandomMergePolicy RandomMergePolicy wrapping class org.apache.lucene.index.TieredMergePolicy: [TieredMergePolicy: maxMergeAtOnce=23, maxMergeAtOnceExplicit=37, maxMergedSegmentMB=88.912109375, floorSegmentMB=1.3359375, forceMergeDeletesPctAllowed=4.614789450692209, segmentsPerTier=14.0, maxCFSSegmentSizeMB=1.8701171875, noCFSRatio=0.7213100856309607
   [junit4]   2> 240518 INFO  (coreLoadExecutor-662-thread-1) [    ] o.a.s.c.SolrDeletionPolicy SolrDeletionPolicy.onCommit: commits: num=1
   [junit4]   2> 	commit{dir=MockDirectoryWrapper(RAMDirectory@9d6f89 lockFactory=org.apache.lucene.store.SingleInstanceLockFactory@14a280a),segFN=segments_1,generation=1}
   [junit4]   2> 240518 INFO  (coreLoadExecutor-662-thread-1) [    ] o.a.s.c.SolrDeletionPolicy newest commit generation = 1
   [junit4]   2> 240518 INFO  (OldIndexDirectoryCleanupThreadForCore-collection1) [    ] o.a.s.c.SolrCore Looking for old index directories to cleanup for core collection1 in /home/jenkins/workspace/Lucene-Solr-trunk-Linux/solr/build/solr-core/test/J1/temp/solr.core.TestDynamicLoading_74B623A3C362FE88-001/control-001/cores/collection1/data/
   [junit4]   2> 240519 WARN  (OldIndexDirectoryCleanupThreadForCore-collection1) [    ] o.a.s.c.DirectoryFactory /home/jenkins/workspace/Lucene-Solr-trunk-Linux/solr/build/solr-core/test/J1/temp/solr.core.TestDynamicLoading_74B623A3C362FE88-001/control-001/cores/collection1/data/ does not point to a valid data directory; skipping clean-up of old index directories.
   [junit4]   2> 240522 INFO  (coreLoadExecutor-662-thread-1) [    ] o.a.s.u.p.UpdateRequestProcessorChain creating updateRequestProcessorChain "nodistrib"
   [junit4]   2> 240522 INFO  (coreLoadExecutor-662-thread-1) [    ] o.a.s.u.p.UpdateRequestProcessorChain creating updateRequestProcessorChain "dedupe"
   [junit4]   2> 240522 INFO  (coreLoadExecutor-662-thread-1) [    ] o.a.s.u.p.UpdateRequestProcessorChain inserting DistributedUpdateProcessorFactory into updateRequestProcessorChain "dedupe"
   [junit4]   2> 240522 INFO  (coreLoadExecutor-662-thread-1) [    ] o.a.s.u.p.UpdateRequestProcessorChain creating updateRequestProcessorChain "stored_sig"
   [junit4]   2> 240522 INFO  (coreLoadExecutor-662-thread-1) [    ] o.a.s.u.p.UpdateRequestProcessorChain inserting DistributedUpdateProcessorFactory into updateRequestProcessorChain "stored_sig"
   [junit4]   2> 240522 INFO  (coreLoadExecutor-662-thread-1) [    ] o.a.s.u.p.UpdateRequestProcessorChain creating updateRequestProcessorChain "distrib-dup-test-chain-explicit"
   [junit4]   2> 240522 INFO  (coreLoadExecutor-662-thread-1) [    ] o.a.s.u.p.UpdateRequestProcessorChain creating updateRequestProcessorChain "distrib-dup-test-chain-implicit"
   [junit4]   2> 240522 INFO  (coreLoadExecutor-662-thread-1) [    ] o.a.s.u.p.UpdateRequestProcessorChain inserting DistributedUpdateProcessorFactory into updateRequestProcessorChain "distrib-dup-test-chain-implicit"
   [junit4]   2> 240522 INFO  (coreLoadExecutor-662-thread-1) [    ] o.a.s.c.SolrCore no updateRequestProcessorChain defined as default, creating implicit default
   [junit4]   2> 240522 WARN  (coreLoadExecutor-662-thread-1) [    ] o.a.s.c.RequestHandlers INVALID paramSet a in requestHandler {type = requestHandler,name = /dump,class = DumpRequestHandler,args = {defaults={a=A,b=B}}}
   [junit4]   2> 240524 INFO  (coreLoadExecutor-662-thread-1) [    ] o.a.s.h.l.XMLLoader xsltCacheLifetimeSeconds=60
   [junit4]   2> 240525 INFO  (coreLoadExecutor-662-thread-1) [    ] o.a.s.h.l.XMLLoader xsltCacheLifetimeSeconds=60
   [junit4]   2> 240526 INFO  (coreLoadExecutor-662-thread-1) [    ] o.a.s.h.l.XMLLoader xsltCacheLifetimeSeconds=60
   [junit4]   2> 240526 INFO  (coreLoadExecutor-662-thread-1) [    ] o.a.s.h.l.XMLLoader xsltCacheLifetimeSeconds=60
   [junit4]   2> 240531 INFO  (coreLoadExecutor-662-thread-1) [    ] o.a.s.c.RequestHandlers Registered paths: /admin/mbeans,standard,/dump,/update/csv,/sql,/update/json/docs,/admin/luke,/export,/admin/segments,/get,/admin/system,/replication,/admin/properties,/config,/stream,/schema,/admin/plugins,/admin/logging,/update/json,/admin/ping,/admin/threads,/update,/admin/file
   [junit4]   2> 240531 INFO  (coreLoadExecutor-662-thread-1) [    ] o.a.s.c.SolrCore Using default statsCache cache: org.apache.solr.search.stats.LocalStatsCache
   [junit4]   2> 240531 INFO  (coreLoadExecutor-662-thread-1) [    ] o.a.s.u.UpdateHandler Using UpdateLog implementation: org.apache.solr.update.UpdateLog
   [junit4]   2> 240532 INFO  (coreLoadExecutor-662-thread-1) [    ] o.a.s.u.UpdateLog Initializing UpdateLog: dataDir= defaultSyncLevel=FLUSH numRecordsToKeep=100 maxNumLogsToKeep=10 numVersionBuckets=65536
   [junit4]   2> 240533 INFO  (coreLoadExecutor-662-thread-1) [    ] o.a.s.u.CommitTracker Hard AutoCommit: disabled
   [junit4]   2> 240533 INFO  (coreLoadExecutor-662-thread-1) [    ] o.a.s.u.CommitTracker Soft AutoCommit: disabled
   [junit4]   2> 240534 INFO  (coreLoadExecutor-662-thread-1) [    ] o.a.s.u.RandomMergePolicy RandomMergePolicy wrapping class org.apache.lucene.index.LogByteSizeMergePolicy: [LogByteSizeMergePolicy: minMergeSize=1677721, mergeFactor=30, maxMergeSize=2147483648, maxMergeSizeForForcedMerge=9223372036854775807, calibrateSizeByDeletes=true, maxMergeDocs=2147483647, maxCFSSegmentSizeMB=8.796093022207999E12, noCFSRatio=1.0]
   [junit4]   2> 240534 INFO  (coreLoadExecutor-662-thread-1) [    ] o.a.s.c.SolrDeletionPolicy SolrDeletionPolicy.onInit: commits: num=1
   [junit4]   2> 	commit{dir=MockDirectoryWrapper(RAMDirectory@9d6f89 lockFactory=org.apache.lucene.store.SingleInstanceLockFactory@14a280a),segFN=segments_1,generation=1}
   [junit4]   2> 240534 INFO  (coreLoadExecutor-662-thread-1) [    ] o.a.s.c.SolrDeletionPolicy newest commit generation = 1
   [junit4]   2> 240535 INFO  (coreLoadExecutor-662-thread-1) [    ] o.a.s.s.SolrIndexSearcher Opening [Searcher@a2692a[collection1] main]
   [junit4]   2> 240535 INFO  (coreLoadExecutor-662-thread-1) [    ] o.a.s.c.c.ZkStateReader Load collection config from: [/collections/control_collection]
   [junit4]   2> 240536 INFO  (coreLoadExecutor-662-thread-1) [    ] o.a.s.c.c.ZkStateReader path=[/collections/control_collection] [configName]=[conf1] specified config exists in ZooKeeper
   [junit4]   2> 240536 INFO  (coreLoadExecutor-662-thread-1) [    ] o.a.s.r.ManagedResourceStorage Setting up ZooKeeper-based storage for the RestManager with znodeBase: /configs/conf1
   [junit4]   2> 240537 INFO  (coreLoadExecutor-662-thread-1) [    ] o.a.s.r.ManagedResourceStorage Configured ZooKeeperStorageIO with znodeBase: /configs/conf1
   [junit4]   2> 240537 INFO  (coreLoadExecutor-662-thread-1) [    ] o.a.s.r.RestManager Initializing RestManager with initArgs: {}
   [junit4]   2> 240537 INFO  (coreLoadExecutor-662-thread-1) [    ] o.a.s.r.ManagedResourceStorage Reading _rest_managed.json using ZooKeeperStorageIO:path=/configs/conf1
   [junit4]   2> 240537 INFO  (coreLoadExecutor-662-thread-1) [    ] o.a.s.r.ManagedResourceStorage No data found for znode /configs/conf1/_rest_managed.json
   [junit4]   2> 240537 INFO  (coreLoadExecutor-662-thread-1) [    ] o.a.s.r.ManagedResourceStorage Loaded null at path _rest_managed.json using ZooKeeperStorageIO:path=/configs/conf1
   [junit4]   2> 240537 INFO  (coreLoadExecutor-662-thread-1) [    ] o.a.s.r.RestManager Initializing 0 registered ManagedResources
   [junit4]   2> 240538 INFO  (coreLoadExecutor-662-thread-1) [    ] o.a.s.h.ReplicationHandler Commits will be reserved for  10000
   [junit4]   2> 240538 INFO  (coreLoadExecutor-662-thread-1) [    ] o.a.s.u.UpdateLog Looking up max value of version field to seed version buckets
   [junit4]   2> 240538 INFO  (coreLoadExecutor-662-thread-1) [    ] o.a.s.u.VersionInfo Refreshing highest value of _version_ for 65536 version buckets from index
   [junit4]   2> 240538 INFO  (coreLoadExecutor-662-thread-1) [    ] o.a.s.u.VersionInfo No terms found for _version_, cannot seed version bucket highest value from index
   [junit4]   2> 240538 INFO  (coreLoadExecutor-662-thread-1) [    ] o.a.s.u.UpdateLog Could not find max version in index or recent updates, using new clock 1527556053564129280
   [junit4]   2> 240540 INFO  (coreLoadExecutor-662-thread-1) [    ] o.a.s.u.UpdateLog Took 1.0ms to seed version buckets with highest version 1527556053564129280
   [junit4]   2> 240540 INFO  (coreLoadExecutor-662-thread-1) [    ] o.a.s.c.ZkController watch zkdir /configs/conf1
   [junit4]   2> 240540 INFO  (coreLoadExecutor-662-thread-1) [    ] o.a.s.c.CoreContainer registering core: collection1
   [junit4]   2> 240540 INFO  (coreZkRegister-656-thread-1) [    ] o.a.s.c.ZkController Register replica - core:collection1 address:https://127.0.0.1:51620 collection:control_collection shard:shard1
   [junit4]   2> 240541 INFO  (coreZkRegister-656-thread-1) [    ] o.a.s.c.c.SolrZkClient makePath: /collections/control_collection/leader_elect/shard1/election
   [junit4]   2> 240544 INFO  (searcherExecutor-663-thread-1) [    ] o.a.s.c.SolrCore [collection1] Registered new searcher Searcher@a2692a[collection1] main{ExitableDirectoryReader(UninvertingDirectoryReader())}
   [junit4]   2> 240544 INFO  (coreZkRegister-656-thread-1) [    ] o.a.s.c.LeaderElector Joined leadership election with path: /collections/control_collection/leader_elect/shard1/election/95472253238247429-core_node1-n_0000000000
   [junit4]   2> 240545 INFO  (coreZkRegister-656-thread-1) [    ] o.a.s.c.ShardLeaderElectionContext Running the leader process for shard=shard1 and weAreReplacement=false and leaderVoteWait=10000
   [junit4]   2> 240546 INFO  (coreZkRegister-656-thread-1) [    ] o.a.s.c.ShardLeaderElectionContext Enough replicas found to continue.
   [junit4]   2> 240546 INFO  (coreZkRegister-656-thread-1) [    ] o.a.s.c.ShardLeaderElectionContext I may be the new leader - try and sync
   [junit4]   2> 240546 INFO  (coreZkRegister-656-thread-1) [    ] o.a.s.c.SyncStrategy Sync replicas to https://127.0.0.1:51620/collection1/
   [junit4]   2> 240546 INFO  (coreZkRegister-656-thread-1) [    ] o.a.s.c.SyncStrategy Sync Success - now sync replicas to me
   [junit4]   2> 240546 INFO  (coreZkRegister-656-thread-1) [    ] o.a.s.c.SyncStrategy https://127.0.0.1:51620/collection1/ has no replicas
   [junit4]   2> 240546 INFO  (OverseerStateUpdate-95472253238247429-127.0.0.1:51620_-n_0000000000) [    ] o.a.s.c.Overseer processMessage: queueSize: 1, message = {
   [junit4]   2>   "operation":"leader",
   [junit4]   2>   "shard":"shard1",
   [junit4]   2>   "collection":"control_collection"} current state version: 1
   [junit4]   2> 240547 INFO  (coreZkRegister-656-thread-1) [    ] o.a.s.c.c.SolrZkClient makePath: /collections/control_collection/leaders/shard1
   [junit4]   2> 240548 INFO  (coreZkRegister-656-thread-1) [    ] o.a.s.c.ShardLeaderElectionContextBase Creating leader registration node /collections/control_collection/leaders/shard1/leader after winning as /collections/control_collection/leader_elect/shard1/election/95472253238247429-core_node1-n_0000000000
   [junit4]   2> 240549 INFO  (coreZkRegister-656-thread-1) [    ] o.a.s.c.ShardLeaderElectionContext I am the new leader: https://127.0.0.1:51620/collection1/ shard1
   [junit4]   2> 240550 INFO  (OverseerStateUpdate-95472253238247429-127.0.0.1:51620_-n_0000000000) [    ] o.a.s.c.Overseer processMessage: queueSize: 1, message = {
   [junit4]   2>   "operation":"leader",
   [junit4]   2>   "shard":"shard1",
   [junit4]   2>   "collection":"control_collection",
   [junit4]   2>   "base_url":"https://127.0.0.1:51620",
   [junit4]   2>   "core":"collection1",
   [junit4]   2>   "state":"active"} current state version: 1
   [junit4]   2> 240651 INFO  (zkCallback-243-thread-1) [    ] o.a.s.c.c.ZkStateReader A cluster state change: [WatchedEvent state:SyncConnected type:NodeDataChanged path:/clusterstate.json], has occurred - updating... (live nodes size: [1])
   [junit4]   2> 240700 INFO  (coreZkRegister-656-thread-1) [    ] o.a.s.c.ZkController We are https://127.0.0.1:51620/collection1/ and leader is https://127.0.0.1:51620/collection1/
   [junit4]   2> 240700 INFO  (coreZkRegister-656-thread-1) [    ] o.a.s.c.ZkController No LogReplay needed for core=collection1 baseURL=https://127.0.0.1:51620
   [junit4]   2> 240700 INFO  (coreZkRegister-656-thread-1) [    ] o.a.s.c.ZkController I am the leader, no recovery necessary
   [junit4]   2> 240700 INFO  (coreZkRegister-656-thread-1) [    ] o.a.s.c.ZkController publishing state=active
   [junit4]   2> 240700 INFO  (coreZkRegister-656-thread-1) [    ] o.a.s.c.ZkController numShards not found on descriptor - reading it from system property
   [junit4]   2> 240702 INFO  (OverseerStateUpdate-95472253238247429-127.0.0.1:51620_-n_0000000000) [    ] o.a.s.c.Overseer processMessage: queueSize: 1, message = {
   [junit4]   2>   "core":"collection1",
   [junit4]   2>   "core_node_name":"core_node1",
   [junit4]   2>   "roles":null,
   [junit4]   2>   "base_url":"https://127.0.0.1:51620",
   [junit4]   2>   "node_name":"127.0.0.1:51620_",
   [junit4]   2>   "numShards":"1",
   [junit4]   2>   "state":"active",
   [junit4]   2>   "shard":"shard1",
   [junit4]   2>   "collection":"control_collection",
   [junit4]   2>   "operation":"state"} current state version: 2
   [junit4]   2> 240702 INFO  (coreZkRegister-656-thread-1) [    ] o.a.s.c.c.ZkStateReader Updated live nodes from ZooKeeper... (1) -> (1)
   [junit4]   2> 240702 INFO  (OverseerStateUpdate-95472253238247429-127.0.0.1:51620_-n_0000000000) [    ] o.a.s.c.o.ReplicaMutator Update state numShards=1 message={
   [junit4]   2>   "core":"collection1",
   [junit4]   2>   "core_node_name":"core_node1",
   [junit4]   2>   "roles":null,
   [junit4]   2>   "base_url":"https://127.0.0.1:51620",
   [junit4]   2>   "node_name":"127.0.0.1:51620_",
   [junit4]   2>   "numShards":"1",
   [junit4]   2>   "state":"active",
   [junit4]   2>   "shard":"shard1",
   [junit4]   2>   "collection":"control_collection",
   [junit4]   2>   "operation":"state"}
   [junit4]   2> 240804 INFO  (zkCallback-243-thread-1) [    ] o.a.s.c.c.ZkStateReader A cluster state change: [WatchedEvent state:SyncConnected type:NodeDataChanged path:/clusterstate.json], has occurred - updating... (live nodes size: [1])
   [junit4]   2> 240831 INFO  (TEST-TestDynamicLoading.testDynamicLoading-seed#[74B623A3C362FE88]) [    ] o.a.s.c.c.SolrZkClient Using default ZkCredentialsProvider
   [junit4]   2> 240831 INFO  (TEST-TestDynamicLoading.testDynamicLoading-seed#[74B623A3C362FE88]) [    ] o.a.s.c.c.ConnectionManager Waiting for client to connect to ZooKeeper
   [junit4]   2> 240832 INFO  (zkCallback-245-thread-1) [    ] o.a.s.c.c.ConnectionManager Watcher org.apache.solr.common.cloud.ConnectionManager@16fdb64 name:ZooKeeperConnection Watcher:127.0.0.1:48531/solr got event WatchedEvent state:SyncConnected type:None path:null path:null type:None
   [junit4]   2> 240832 INFO  (TEST-TestDynamicLoading.testDynamicLoading-seed#[74B623A3C362FE88]) [    ] o.a.s.c.c.ConnectionManager Client is connected to ZooKeeper
   [junit4]   2> 240832 INFO  (TEST-TestDynamicLoading.testDynamicLoading-seed#[74B623A3C362FE88]) [    ] o.a.s.c.c.SolrZkClient Using default ZkACLProvider
   [junit4]   2> 240832 INFO  (TEST-TestDynamicLoading.testDynamicLoading-seed#[74B623A3C362FE88]) [    ] o.a.s.c.c.ZkStateReader Updating cluster state from ZooKeeper... 
   [junit4]   2> 240833 INFO  (TEST-TestDynamicLoading.testDynamicLoading-seed#[74B623A3C362FE88]) [    ] o.a.s.c.c.ZkStateReader Updated live nodes from ZooKeeper... (0) -> (1)
   [junit4]   2> 240834 INFO  (TEST-TestDynamicLoading.testDynamicLoading-seed#[74B623A3C362FE88]) [    ] o.a.s.c.ChaosMonkey monkey: init - expire sessions:false cause connection loss:false
   [junit4]   2> 240916 INFO  (TEST-TestDynamicLoading.testDynamicLoading-seed#[74B623A3C362FE88]) [    ] o.a.s.SolrTestCaseJ4 Writing core.properties file to /home/jenkins/workspace/Lucene-Solr-trunk-Linux/solr/build/solr-core/test/J1/temp/solr.core.TestDynamicLoading_74B623A3C362FE88-001/shard-1-001/cores/collection1
   [junit4]   2> 240917 INFO  (TEST-TestDynamicLoading.testDynamicLoading-seed#[74B623A3C362FE88]) [    ] o.a.s.c.AbstractFullDistribZkTestBase create jetty 1 in directory /home/jenkins/workspace/Lucene-Solr-trunk-Linux/solr/build/solr-core/test/J1/temp/solr.core.TestDynamicLoading_74B623A3C362FE88-001/shard-1-001
   [junit4]   2> 240918 INFO  (TEST-TestDynamicLoading.testDynamicLoading-seed#[74B623A3C362FE88]) [    ] o.e.j.s.Server jetty-9.3.6.v20151106
   [junit4]   2> 240919 INFO  (TEST-TestDynamicLoading.testDynamicLoading-seed#[74B623A3C362FE88]) [    ] o.e.j.s.h.ContextHandler Started o.e.j.s.ServletContextHandler@a4bf44{/,null,AVAILABLE}
   [junit4]   2> 240920 INFO  (TEST-TestDynamicLoading.testDynamicLoading-seed#[74B623A3C362FE88]) [    ] o.e.j.u.s.SslContextFactory x509=X509@f0620(solrtest,h=[],w=[]) for SslContextFactory@7252a1(file:///home/jenkins/workspace/Lucene-Solr-trunk-Linux/solr/server/etc/test/solrtest.keystore,file:///home/jenkins/workspace/Lucene-Solr-trunk-Linux/solr/server/etc/test/solrtest.keystore)
   [junit4]   2> 240921 INFO  (TEST-TestDynamicLoading.testDynamicLoading-seed#[74B623A3C362FE88]) [    ] o.e.j.s.ServerConnector Started ServerConnector@e5720c{SSL,[ssl, http/1.1]}{127.0.0.1:46135}
   [junit4]   2> 240921 INFO  (TEST-TestDynamicLoading.testDynamicLoading-seed#[74B623A3C362FE88]) [    ] o.e.j.s.Server Started @242193ms
   [junit4]   2> 240921 INFO  (TEST-TestDynamicLoading.testDynamicLoading-seed#[74B623A3C362FE88]) [    ] o.a.s.c.s.e.JettySolrRunner Jetty properties: {solr.data.dir=/home/jenkins/workspace/Lucene-Solr-trunk-Linux/solr/build/solr-core/test/J1/temp/solr.core.TestDynamicLoading_74B623A3C362FE88-001/tempDir-001/jetty1, solrconfig=solrconfig.xml, hostContext=/, hostPort=46135, coreRootDirectory=/home/jenkins/workspace/Lucene-Solr-trunk-Linux/solr/build/solr-core/test/J1/../../../../../../../../../home/jenkins/workspace/Lucene-Solr-trunk-Linux/solr/build/solr-core/test/J1/temp/solr.core.TestDynamicLoading_74B623A3C362FE88-001/shard-1-001/cores}
   [junit4]   2> 240922 INFO  (TEST-TestDynamicLoading.testDynamicLoading-seed#[74B623A3C362FE88]) [    ] o.a.s.s.SolrDispatchFilter SolrDispatchFilter.init(): sun.misc.Launcher$AppClassLoader@163006a
   [junit4]   2> 240922 INFO  (TEST-TestDynamicLoading.testDynamicLoading-seed#[74B623A3C362FE88]) [    ] o.a.s.c.SolrResourceLoader new SolrResourceLoader for directory: '/home/jenkins/workspace/Lucene-Solr-trunk-Linux/solr/build/solr-core/test/J1/temp/solr.core.TestDynamicLoading_74B623A3C362FE88-001/shard-1-001'
   [junit4]   2> 240922 INFO  (TEST-TestDynamicLoading.testDynamicLoading-seed#[74B623A3C362FE88]) [    ] o.a.s.c.SolrResourceLoader JNDI not configured for solr (NoInitialContextEx)
   [junit4]   2> 240922 INFO  (TEST-TestDynamicLoading.testDynamicLoading-seed#[74B623A3C362FE88]) [    ] o.a.s.c.SolrResourceLoader solr home defaulted to 'solr/' (could not find system property or JNDI)
   [junit4]   2> 240922 INFO  (TEST-TestDynamicLoading.testDynamicLoading-seed#[74B623A3C362FE88]) [    ] o.a.s.c.c.SolrZkClient Using default ZkCredentialsProvider
   [junit4]   2> 240922 INFO  (TEST-TestDynamicLoading.testDynamicLoading-seed#[74B623A3C362FE88]) [    ] o.a.s.c.c.ConnectionManager Waiting for client to connect to ZooKeeper
   [junit4]   2> 240923 INFO  (zkCallback-246-thread-1) [    ] o.a.s.c.c.ConnectionManager Watcher org.apache.solr.common.cloud.ConnectionManager@e18738 name:ZooKeeperConnection Watcher:127.0.0.1:48531/solr got event WatchedEvent state:SyncConnected type:None path:null path:null type:None
   [junit4]   2> 240923 INFO  (TEST-TestDynamicLoading.testDynamicLoading-seed#[74B623A3C362FE88]) [    ] o.a.s.c.c.ConnectionManager Client is connected to ZooKeeper
   [junit4]   2> 240924 INFO  (TEST-TestDynamicLoading.testDynamicLoading-seed#[74B623A3C362FE88]) [    ] o.a.s.c.c.SolrZkClient Using default ZkACLProvider
   [junit4]   2> 240925 INFO  (TEST-TestDynamicLoading.testDynamicLoading-seed#[74B623A3C362FE88]) [    ] o.a.s.s.SolrDispatchFilter Loading solr.xml from SolrHome (not found in ZooKeeper)
   [junit4]   2> 240925 INFO  (TEST-TestDynamicLoading.testDynamicLoading-seed#[74B623A3C362FE88]) [    ] o.a.s.c.SolrXmlConfig Loading container configuration from /home/jenkins/workspace/Lucene-Solr-trunk-Linux/solr/build/solr-core/test/J1/temp/solr.core.TestDynamicLoading_74B623A3C362FE88-001/shard-1-001/solr.xml
   [junit4]   2> 240931 INFO  (TEST-TestDynamicLoading.testDynamicLoading-seed#[74B623A3C362FE88]) [    ] o.a.s.c.CorePropertiesLocator Config-defined core root directory: /home/jenkins/workspace/Lucene-Solr-trunk-Linux/solr/build/solr-core/test/J1/../../../../../../../../../home/jenkins/workspace/Lucene-Solr-trunk-Linux/solr/build/solr-core/test/J1/temp/solr.core.TestDynamicLoading_74B623A3C362FE88-001/shard-1-001/cores
   [junit4]   2> 240931 INFO  (TEST-TestDynamicLoading.testDynamicLoading-seed#[74B623A3C362FE88]) [    ] o.a.s.c.CoreContainer New CoreContainer 8838553
   [junit4]   2> 240931 INFO  (TEST-TestDynamicLoading.testDynamicLoading-seed#[74B623A3C362FE88]) [    ] o.a.s.c.CoreContainer Loading cores into CoreContainer [instanceDir=/home/jenkins/workspace/Lucene-Solr-trunk-Linux/solr/build/solr-core/test/J1/temp/solr.core.TestDynamicLoading_74B623A3C362FE88-001/shard-1-001]
   [junit4]   2> 240932 WARN  (TEST-TestDynamicLoading.testDynamicLoading-seed#[74B623A3C362FE88]) [    ] o.a.s.c.CoreContainer Couldn't add files from /home/jenkins/workspace/Lucene-Solr-trunk-Linux/solr/build/solr-core/test/J1/temp/solr.core.TestDynamicLoading_74B623A3C362FE88-001/shard-1-001/lib to classpath: /home/jenkins/workspace/Lucene-Solr-trunk-Linux/solr/build/solr-core/test/J1/temp/solr.core.TestDynamicLoading_74B623A3C362FE88-001/shard-1-001/lib
   [junit4]   2> 240932 INFO  (TEST-TestDynamicLoading.testDynamicLoading-seed#[74B623A3C362FE88]) [    ] o.a.s.h.c.HttpShardHandlerFactory created with socketTimeout : 90000,urlScheme : ,connTimeout : 15000,maxConnectionsPerHost : 20,maxConnections : 10000,corePoolSize : 0,maximumPoolSize : 2147483647,maxThreadIdleTime : 5,sizeOfQueue : -1,fairnessPolicy : false,useRetries : false,
   [junit4]   2> 240935 INFO  (TEST-TestDynamicLoading.testDynamicLoading-seed#[74B623A3C362FE88]) [    ] o.a.s.u.UpdateShardHandler Creating UpdateShardHandler HTTP client with params: socketTimeout=340000&connTimeout=45000&retry=true
   [junit4]   2> 240938 INFO  (TEST-TestDynamicLoading.testDynamicLoading-seed#[74B623A3C362FE88]) [    ] o.a.s.l.LogWatcher SLF4J impl is org.slf4j.impl.Log4jLoggerFactory
   [junit4]   2> 240938 INFO  (TEST-TestDynamicLoading.testDynamicLoading-seed#[74B623A3C362FE88]) [    ] o.a.s.l.LogWatcher Registering Log Listener [Log4j (org.slf4j.impl.Log4jLoggerFactory)]
   [junit4]   2> 240938 INFO  (TEST-TestDynamicLoading.testDynamicLoading-seed#[74B623A3C362FE88]) [    ] o.a.s.c.ZkContainer Zookeeper client=127.0.0.1:48531/solr
   [junit4]   2> 240938 INFO  (TEST-TestDynamicLoading.testDynamicLoading-seed#[74B623A3C362FE88]) [    ] o.a.s.c.ZkController zkHost includes chroot
   [junit4]   2> 240938 INFO  (TEST-TestDynamicLoading.testDynamicLoading-seed#[74B623A3C362FE88]) [    ] o.a.s.c.c.SolrZkClient Using default ZkCredentialsProvider
   [junit4]   2> 240939 INFO  (TEST-TestDynamicLoading.testDynamicLoading-seed#[74B623A3C362FE88]) [    ] o.a.s.c.c.ConnectionManager Waiting for client to connect to ZooKeeper
   [junit4]   2> 240940 INFO  (zkCallback-249-thread-1) [    ] o.a.s.c.c.ConnectionManager Watcher org.apache.solr.common.cloud.ConnectionManager@1f54aa0 name:ZooKeeperConnection Watcher:127.0.0.1:48531 got event WatchedEvent state:SyncConnected type:None path:null path:null type:None
   [junit4]   2> 240940 INFO  (TEST-TestDynamicLoading.testDynamicLoading-seed#[74B623A3C362FE88]) [    ] o.a.s.c.c.ConnectionManager Client is connected to ZooKeeper
   [junit4]   2> 240941 INFO  (TEST-TestDynamicLoading.testDynamicLoading-seed#[74B623A3C362FE88]) [    ] o.a.s.c.c.SolrZkClient Using default ZkACLProvider
   [junit4]   2> 240944 INFO  (TEST-TestDynamicLoading.testDynamicLoading-seed#[74B623A3C362FE88]) [    ] o.a.s.c.c.ConnectionManager Waiting for client to connect to ZooKeeper
   [junit4]   2> 240945 INFO  (zkCallback-250-thread-1) [    ] o.a.s.c.c.ConnectionManager Watcher org.apache.solr.common.cloud.ConnectionManager@103ee18 name:ZooKeeperConnection Watcher:127.0.0.1:48531/solr got event WatchedEvent state:SyncConnected type:None path:null path:null type:None
   [junit4]   2> 240945 INFO  (TEST-TestDynamicLoading.testDynamicLoading-seed#[74B623A3C362FE88]) [    ] o.a.s.c.c.ConnectionManager Client is connected to ZooKeeper
   [junit4]   2> 240950 INFO  (TEST-TestDynamicLoading.testDynamicLoading-seed#[74B623A3C362FE88]) [    ] o.a.s.c.c.ZkStateReader Updating cluster state from ZooKeeper... 
   [junit4]   2> 240951 INFO  (TEST-TestDynamicLoading.testDynamicLoading-seed#[74B623A3C362FE88]) [    ] o.a.s.c.c.ZkStateReader Updated live nodes from ZooKeeper... (0) -> (1)
   [junit4]   2> 240954 INFO  (TEST-TestDynamicLoading.testDynamicLoading-seed#[74B623A3C362FE88]) [    ] o.a.s.c.Overseer Overseer (id=null) closing
   [junit4]   2> 240955 INFO  (TEST-TestDynamicLoading.testDynamicLoading-seed#[74B623A3C362FE88]) [    ] o.a.s.c.LeaderElector Joined leadership election with path: /overseer_elect/election/95472253238247433-127.0.0.1:46135_-n_0000000001
   [junit4]   2> 240955 INFO  (TEST-TestDynamicLoading.testDynamicLoading-seed#[74B623A3C362FE88]) [    ] o.a.s.c.LeaderElector Watching path /overseer_elect/election/95472253238247429-127.0.0.1:51620_-n_0000000000 to know if I could be the leader
   [junit4]   2> 240955 INFO  (TEST-TestDynamicLoading.testDynamicLoading-seed#[74B623A3C362FE88]) [    ] o.a.s.c.ZkController Publish node=127.0.0.1:46135_ as DOWN
   [junit4]   2> 240957 INFO  (OverseerStateUpdate-95472253238247429-127.0.0.1:51620_-n_0000000000) [    ] o.a.s.c.Overseer processMessage: queueSize: 1, message = {
   [junit4]   2>   "operation":"downnode",
   [junit4]   2>   "node_name":"127.0.0.1:46135_"} current state version: 3
   [junit4]   2> 240957 INFO  (OverseerStateUpdate-95472253238247429-127.0.0.1:51620_-n_0000000000) [    ] o.a.s.c.o.NodeMutator DownNode state invoked for node: 127.0.0.1:46135_
   [junit4]   2> 241059 INFO  (zkCallback-245-thread-1) [    ] o.a.s.c.c.ZkStateReader A cluster state change: [WatchedEvent state:SyncConnected type:NodeDataChanged path:/clusterstate.json], has occurred - updating... (live nodes size: [1])
   [junit4]   2> 241059 INFO  (zkCallback-243-thread-1) [    ] o.a.s.c.c.ZkStateReader A cluster state change: [WatchedEvent state:SyncConnected type:NodeDataChanged path:/clusterstate.json], has occurred - updating... (live nodes size: [1])
   [junit4]   2> 241059 INFO  (zkCallback-250-thread-1) [    ] o.a.s.c.c.ZkStateReader A cluster state change: [WatchedEvent state:SyncConnected type:NodeDataChanged path:/clusterstate.json], has occurred - updating... (live nodes size: [1])
   [junit4]   2> 241957 INFO  (TEST-TestDynamicLoading.testDynamicLoading-seed#[74B623A3C362FE88]) [    ] o.a.s.c.ZkController Register node as live in ZooKeeper:/live_nodes/127.0.0.1:46135_
   [junit4]   2> 241958 INFO  (TEST-TestDynamicLoading.testDynamicLoading-seed#[74B623A3C362FE88]) [    ] o.a.s.c.c.SolrZkClient makePath: /live_nodes/127.0.0.1:46135_
   [junit4]   2> 241959 INFO  (zkCallback-245-thread-1) [    ] o.a.s.c.c.ZkStateReader A live node change: [WatchedEvent state:SyncConnected type:NodeChildrenChanged path:/live_nodes], has occurred - updating... (live nodes size: [1])
   [junit4]   2> 241959 INFO  (zkCallback-243-thread-1) [    ] o.a.s.c.c.ZkStateReader A live node change: [WatchedEvent state:SyncConnected type:NodeChildrenChanged path:/live_nodes], has occurred - updating... (live nodes size: [1])
   [junit4]   2> 241959 INFO  (zkCallback-250-thread-1) [    ] o.a.s.c.c.ZkStateReader A live node change: [WatchedEvent state:SyncConnected type:NodeChildrenChanged path:/live_nodes], has occurred - updating... (live nodes size: [1])
   [junit4]   2> 241959 INFO  (zkCallback-245-thread-1) [    ] o.a.s.c.c.ZkStateReader Updated live nodes from ZooKeeper... (1) -> (2)
   [junit4]   2> 241959 INFO  (zkCallback-250-thread-1) [    ] o.a.s.c.c.ZkStateReader Updated live nodes from ZooKeeper... (1) -> (2)
   [junit4]   2> 241962 INFO  (zkCallback-243-thread-1) [    ] o.a.s.c.c.ZkStateReader Updated live nodes from ZooKeeper... (1) -> (2)
   [junit4]   2> 242031 INFO  (TEST-TestDynamicLoading.testDynamicLoading-seed#[74B623A3C362FE88]) [    ] o.a.s.c.CoreContainer Security conf doesn't exist. Skipping setup for authorization module.
   [junit4]   2> 242032 INFO  (TEST-TestDynamicLoading.testDynamicLoading-seed#[74B623A3C362FE88]) [    ] o.a.s.c.CoreContainer No authentication plugin used.
   [junit4]   2> 242032 INFO  (TEST-TestDynamicLoading.testDynamicLoading-seed#[74B623A3C362FE88]) [    ] o.a.s.c.CorePropertiesLocator Looking for core definitions underneath /home/jenkins/workspace/Lucene-Solr-trunk-Linux/solr/build/solr-core/test/J1/../../../../../../../../../home/jenkins/workspace/Lucene-Solr-trunk-Linux/solr/build/solr-core/test/J1/temp/solr.core.TestDynamicLoading_74B623A3C362FE88-001/shard-1-001/cores
   [junit4]   2> 242034 INFO  (TEST-TestDynamicLoading.testDynamicLoading-seed#[74B623A3C362FE88]) [    ] o.a.s.c.CoreDescriptor Created CoreDescriptor: {name=collection1, config=solrconfig.xml, transient=false, schema=schema.xml, loadOnStartup=true, configSetProperties=configsetprops.json, collection=collection1, coreNodeName=, dataDir=data/, shard=}
   [junit4]   2> 242034 INFO  (TEST-TestDynamicLoading.testDynamicLoading-seed#[74B623A3C362FE88]) [    ] o.a.s.c.CorePropertiesLocator Found core collection1 in /home/jenkins/workspace/Lucene-Solr-trunk-Linux/solr/build/solr-core/test/J1/../../../../../../../../../home/jenkins/workspace/Lucene-Solr-trunk-Linux/solr/build/solr-core/test/J1/temp/solr.core.TestDynamicLoading_74B623A3C362FE88-001/shard-1-001/cores/collection1
   [junit4]   2> 242034 INFO  (TEST-TestDynamicLoading.testDynamicLoading-seed#[74B623A3C362FE88]) [    ] o.a.s.c.CorePropertiesLocator Found 1 core definitions
   [junit4]   2> 242035 INFO  (TEST-TestDynamicLoading.testDynamicLoading-seed#[74B623A3C362FE88]) [    ] o.a.s.s.SolrDispatchFilter user.dir=/home/jenkins/workspace/Lucene-Solr-trunk-Linux/solr/build/solr-core/test/J1
   [junit4]   2> 242035 INFO  (TEST-TestDynamicLoading.testDynamicLoading-seed#[74B623A3C362FE88]) [    ] o.a.s.s.SolrDispatchFilter SolrDispatchFilter.init() done
   [junit4]   2> 242035 INFO  (coreLoadExecutor-673-thread-1) [    ] o.a.s.c.ZkController publishing state=down
   [junit4]   2> 242035 INFO  (coreLoadExecutor-673-thread-1) [    ] o.a.s.c.ZkController numShards not found on descriptor - reading it from system property
   [junit4]   2> 242036 INFO  (coreLoadExecutor-673-thread-1) [    ] o.a.s.c.ZkController look for our core node name
   [junit4]   2> 242036 INFO  (OverseerStateUpdate-95472253238247429-127.0.0.1:51620_-n_0000000000) [    ] o.a.s.c.Overseer processMessage: queueSize: 1, message = {
   [junit4]   2>   "core":"collection1",
   [junit4]   2>   "roles":null,
   [junit4]   2>   "base_url":"https://127.0.0.1:46135",
   [junit4]   2>   "node_name":"127.0.0.1:46135_",
   [junit4]   2>   "numShards":"2",
   [junit4]   2>   "state":"down",
   [junit4]   2>   "shard":null,
   [junit4]   2>   "collection":"collection1",
   [junit4]   2>   "operation":"state"} current state version: 4
   [junit4]   2> 242037 INFO  (OverseerStateUpdate-95472253238247429-127.0.0.1:51620_-n_0000000000) [    ] o.a.s.c.o.ReplicaMutator Update state numShards=2 message={
   [junit4]   2>   "core":"collection1",
   [junit4]   2>   "roles":null,
   [junit4]   2>   "base_url":"https://127.0.0.1:46135",
   [junit4]   2>   "node_name":"127.0.0.1:46135_",
   [junit4]   2>   "numShards":"2",
   [junit4]   2>   "state":"down",
   [junit4]   2>   "shard":null,
   [junit4]   2>   "collection":"collection1",
   [junit4]   2>   "operation":"state"}
   [junit4]   2> 242037 INFO  (OverseerStateUpdate-95472253238247429-127.0.0.1:51620_-n_0000000000) [    ] o.a.s.c.o.ClusterStateMutator building a new cName: collection1
   [junit4]   2> 242037 INFO  (OverseerStateUpdate-95472253238247429-127.0.0.1:51620_-n_0000000000) [    ] o.a.s.c.o.ReplicaMutator Assigning new node to shard shard=shard2
   [junit4]   2> 242139 INFO  (zkCallback-245-thread-1) [    ] o.a.s.c.c.ZkStateReader A cluster state change: [WatchedEvent state:SyncConnected type:NodeDataChanged path:/clusterstate.json], has occurred - updating... (live nodes size: [2])
   [junit4]   2> 242139 INFO  (zkCallback-250-thread-1) [    ] o.a.s.c.c.ZkStateReader A cluster state change: [WatchedEvent state:SyncConnected type:NodeDataChanged path:/clusterstate.json], has occurred - updating... (live nodes size: [2])
   [junit4]   2> 242139 INFO  (zkCallback-243-thread-1) [    ] o.a.s.c.c.ZkStateReader A cluster state change: [WatchedEvent state:SyncConnected type:NodeDataChanged path:/clusterstate.json], has occurred - updating... (live nodes size: [2])
   [junit4]   2> 243037 INFO  (coreLoadExecutor-673-thread-1) [    ] o.a.s.c.ZkController waiting to find shard id in clusterstate for collection1
   [junit4]   2> 243037 INFO  (coreLoadExecutor-673-thread-1) [    ] o.a.s.c.ZkController Check for collection zkNode:collection1
   [junit4]   2> 243037 INFO  (coreLoadExecutor-673-thread-1) [    ] o.a.s.c.ZkController Collection zkNode exists
   [junit4]   2> 243037 INFO  (coreLoadExecutor-673-thread-1) [    ] o.a.s.c.c.ZkStateReader Load collection config from: [/collections/collection1]
   [junit4]   2> 243038 INFO  (coreLoadExecutor-673-thread-1) [    ] o.a.s.c.c.ZkStateReader path=[/collections/collection1] [configName]=[conf1] specified config exists in ZooKeeper
   [junit4]   2> 243038 INFO  (coreLoadExecutor-673-thread-1) [    ] o.a.s.c.SolrResourceLoader new SolrResourceLoader for directory: '/home/jenkins/workspace/Lucene-Solr-trunk-Linux/solr/build/solr-core/test/J1/temp/solr.core.TestDynamicLoading_74B623A3C362FE88-001/shard-1-001/cores/collection1'
   [junit4]   2> 243038 INFO  (coreLoadExecutor-673-thread-1) [    ] o.a.s.c.SolrResourceLoader JNDI not configured for solr (NoInitialContextEx)
   [junit4]   2> 243038 INFO  (coreLoadExecutor-673-thread-1) [    ] o.a.s.c.SolrResourceLoader solr home defaulted to 'solr/' (could not find system property or JNDI)
   [junit4]   2> 243039 INFO  (coreLoadExecutor-673-thread-1) [    ] o.a.s.c.Config loaded config solrconfig.xml with version 0 
   [junit4]   2> 243044 INFO  (coreLoadExecutor-673-thread-1) [    ] o.a.s.c.SolrConfig current version of requestparams : -1
   [junit4]   2> 243048 INFO  (coreLoadExecutor-673-thread-1) [    ] o.a.s.c.SolrConfig Using Lucene MatchVersion: 6.0.0
   [junit4]   2> 243058 INFO  (coreLoadExecutor-673-thread-1) [    ] o.a.s.c.SolrConfig Loaded SolrConfig: solrconfig.xml
   [junit4]   2> 243066 INFO  (coreLoadExecutor-673-thread-1) [    ] o.a.s.s.IndexSchema [collection1] Schema name=test
   [junit4]   2> 243173 INFO  (coreLoadExecutor-673-thread-1) [    ] o.a.s.s.OpenExchangeRatesOrgProvider Initialized with rates=open-exchange-rates.json, refreshInterval=1440.
   [junit4]   2> 243178 INFO  (coreLoadExecutor-673-thread-1) [    ] o.a.s.s.IndexSchema default search field in schema is text
   [junit4]   2> 243181 INFO  (coreLoadExecutor-673-thread-1) [    ] o.a.s.s.IndexSchema unique key field: id
   [junit4]   2> 243189 INFO  (coreLoadExecutor-673-thread-1) [    ] o.a.s.s.FileExchangeRateProvider Reloading exchange rates from file currency.xml
   [junit4]   2> 243191 INFO  (coreLoadExecutor-673-thread-1) [    ] o.a.s.s.FileExchangeRateProvider Reloading exchange rates from file currency.xml
   [junit4]   2> 243192 INFO  (coreLoadExecutor-673-thread-1) [    ] o.a.s.s.OpenExchangeRatesOrgProvider Reloading exchange rates from open-exchange-rates.json
   [junit4]   2> 243193 INFO  (coreLoadExecutor-673-thread-1) [    ] o.a.s.s.OpenExchangeRatesOrgProvider Reloading exchange rates from open-exchange-rates.json
   [junit4]   2> 243194 INFO  (coreLoadExecutor-673-thread-1) [    ] o.a.s.c.ConfigSetProperties Did not find ConfigSet properties, assuming default properties: Can't find resource 'configsetprops.json' in classpath or '/configs/conf1', cwd=/home/jenkins/workspace/Lucene-Solr-trunk-Linux/solr/build/solr-core/test/J1
   [junit4]   2> 243194 INFO  (coreLoadExecutor-673-thread-1) [    ] o.a.s.c.CoreContainer Creating SolrCore 'collection1' using configuration from collection collection1
   [junit4]   2> 243194 INFO  (coreLoadExecutor-673-thread-1) [    ] o.a.s.c.SolrCore org.apache.solr.core.MockDirectoryFactory
   [junit4]   2> 243195 INFO  (coreLoadExecutor-673-thread-1) [    ] o.a.s.c.SolrCore [[collection1] ] Opening new SolrCore at [/home/jenkins/workspace/Lucene-Solr-trunk-Linux/solr/build/solr-core/test/J1/temp/solr.core.TestDynamicLoading_74B623A3C362FE88-001/shard-1-001/cores/collection1], dataDir=[/home/jenkins/workspace/Lucene-Solr-trunk-Linux/solr/build/solr-core/test/J1/../../../../../../../../../home/jenkins/workspace/Lucene-Solr-trunk-Linux/solr/build/solr-core/test/J1/temp/solr.core.TestDynamicLoading_74B623A3C362FE88-001/shard-1-001/cores/collection1/data/]
   [junit4]   2> 243195 INFO  (coreLoadExecutor-673-thread-1) [    ] o.a.s.c.JmxMonitoredMap JMX monitoring is enabled. Adding Solr mbeans to JMX Server: com.sun.jmx.mbeanserver.JmxMBeanServer@9803bc
   [junit4]   2> 243195 INFO  (coreLoadExecutor-673-thread-1) [    ] o.a.s.c.CachingDirectoryFactory return new directory for /home/jenkins/workspace/Lucene-Solr-trunk-Linux/solr/build/solr-core/test/J1/../../../../../../../../../home/jenkins/workspace/Lucene-Solr-trunk-Linux/solr/build/solr-core/test/J1/temp/solr.core.TestDynamicLoading_74B623A3C362FE88-001/shard-1-001/cores/collection1/data
   [junit4]   2> 243195 INFO  (coreLoadExecutor-673-thread-1) [    ] o.a.s.c.SolrCore New index directory detected: old=null new=/home/jenkins/workspace/Lucene-Solr-trunk-Linux/solr/build/solr-core/test/J1/../../../../../../../../../home/jenkins/workspace/Lucene-Solr-trunk-Linux/solr/build/solr-core/test/J1/temp/solr.core.TestDynamicLoading_74B623A3C362FE88-001/shard-1-001/cores/collection1/data/index/
   [junit4]   2> 243195 WARN  (coreLoadExecutor-673-thread-1) [    ] o.a.s.c.SolrCore [collection1] Solr index directory '/home/jenkins/workspace/Lucene-Solr-trunk-Linux/solr/build/solr-core/test/J1/../../../../../../../../../home/jenkins/workspace/Lucene-Solr-trunk-Linux/solr/build/solr-core/test/J1/temp/solr.core.TestDynamicLoading_74B623A3C362FE88-001/shard-1-001/cores/collection1/data/index' doesn't exist. Creating new index...
   [junit4]   2> 243196 INFO  (coreLoadExecutor-673-thread-1) [    ] o.a.s.c.CachingDirectoryFactory return new directory for /home/jenkins/workspace/Lucene-Solr-trunk-Linux/solr/build/solr-core/test/J1/../../../../../../../../../home/jenkins/workspace/Lucene-Solr-trunk-Linux/solr/build/solr-core/test/J1/temp/solr.core.TestDynamicLoading_74B623A3C362FE88-001/shard-1-001/cores/collection1/data/index
   [junit4]   2> 243196 INFO  (coreLoadExecutor-673-thread-1) [    ] o.a.s.u.RandomMergePolicy RandomMergePolicy wrapping class org.apache.lucene.index.TieredMergePolicy: [TieredMergePolicy: maxMergeAtOnce=23, maxMergeAtOnceExplicit=37, maxMergedSegmentMB=88.912109375, floorSegmentMB=1.3359375, forceMergeDeletesPctAllowed=4.614789450692209, segmentsPerTier=14.0, maxCFSSegmentSizeMB=1.8701171875, noCFSRatio=0.7213100856309607
   [junit4]   2> 243196 INFO  (coreLoadExecutor-673-thread-1) [    ] o.a.s.c.SolrDeletionPolicy SolrDeletionPolicy.onCommit: commits: num=1
   [junit4]   2> 	commit{dir=MockDirectoryWrapper(RAMDirectory@1760735 lockFactory=org.apache.lucene.store.SingleInstanceLockFactory@1d7a1d1),segFN=segments_1,generation=1}
   [junit4]   2> 243196 INFO  (coreLoadExecutor-673-thread-1) [    ] o.a.s.c.SolrDeletionPolicy newest commit generation = 1
   [junit4]   2> 243196 INFO  (OldIndexDirectoryCleanupThreadForCore-collection1) [    ] o.a.s.c.SolrCore Looking for old index directories to cleanup for core collection1 in /home/jenkins/workspace/Lucene-Solr-trunk-Linux/solr/build/solr-core/test/J1/../../../../../../../../../home/jenkins/workspace/Lucene-Solr-trunk-Linux/solr/build/solr-core/test/J1/temp/solr.core.TestDynamicLoading_74B623A3C362FE88-001/shard-1-001/cores/collection1/data/
   [junit4]   2> 243197 WARN  (OldIndexDirectoryCleanupThreadForCore-collection1) [    ] o.a.s.c.DirectoryFactory /home/jenkins/workspace/Lucene-Solr-trunk-Linux/solr/build/solr-core/test/J1/../../../../../../../../../home/jenkins/workspace/Lucene-Solr-trunk-Linux/solr/build/solr-core/test/J1/temp/solr.core.TestDynamicLoading_74B623A3C362FE88-001/shard-1-001/cores/collection1/data/ does not point to a valid data directory; skipping clean-up of old index directories.
   [junit4]   2> 243200 INFO  (coreLoadExecutor-673-thread-1) [    ] o.a.s.u.p.UpdateRequestProcessorChain creating updateRequestProcessorChain "nodistrib"
   [junit4]   2> 243200 INFO  (coreLoadExecutor-673-thread-1) [    ] o.a.s.u.p.UpdateRequestProcessorChain creating updateRequestProcessorChain "dedupe"
   [junit4]   2> 243200 INFO  (coreLoadExecutor-673-thread-1) [    ] o.a.s.u.p.UpdateRequestProcessorChain inserting DistributedUpdateProcessorFactory into updateRequestProcessorChain "dedupe"
   [junit4]   2> 243200 INFO  (coreLoadExecutor-673-thread-1) [    ] o.a.s.u.p.UpdateRequestProcessorChain creating updateRequestProcessorChain "stored_sig"
   [junit4]   2> 243200 INFO  (coreLoadExecutor-673-thread-1) [    ] o.a.s.u.p.UpdateRequestProcessorChain inserting DistributedUpdateProcessorFactory into updateRequestProcessorChain "stored_sig"
   [junit4]   2> 243200 INFO  (coreLoadExecutor-673-thread-1) [    ] o.a.s.u.p.UpdateRequestProcessorChain creating updateRequestProcessorChain "distrib-dup-test-chain-explicit"
   [junit4]   2> 243201 INFO  (coreLoadExecutor-673-thread-1) [    ] o.a.s.u.p.UpdateRequestProcessorChain creating updateRequestProcessorChain "distrib-dup-test-chain-implicit"
   [junit4]   2> 243201 INFO  (coreLoadExecutor-673-thread-1) [    ] o.a.s.u.p.UpdateRequestProcessorChain inserting DistributedUpdateProcessorFactory into updateRequestProcessorChain "distrib-dup-test-chain-implicit"
   [junit4]   2> 243201 INFO  (coreLoadExecutor-673-thread-1) [    ] o.a.s.c.SolrCore no updateRequestProcessorChain defined as default, creating implicit default
   [junit4]   2> 243201 WARN  (coreLoadExecutor-673-thread-1) [    ] o.a.s.c.RequestHandlers INVALID paramSet a in requestHandler {type = requestHandler,name = /dump,class = DumpRequestHandler,args = {defaults={a=A,b=B}}}
   [junit4]   2> 243202 INFO  (coreLoadExecutor-673-thread-1) [    ] o.a.s.h.l.XMLLoader xsltCacheLifetimeSeconds=60
   [junit4]   2> 243203 INFO  (coreLoadExecutor-673-thread-1) [    ] o.a.s.h.l.XMLLoader xsltCacheLifetimeSeconds=60
   [junit4]   2> 243205 INFO  (coreLoadExecutor-673-thread-1) [    ] o.a.s.h.l.XMLLoader xsltCacheLifetimeSeconds=60
   [junit4]   2> 243206 INFO  (coreLoadExecutor-673-thread-1) [    ] o.a.s.h.l.XMLLoader xsltCacheLifetimeSeconds=60
   [junit4]   2> 243213 INFO  (coreLoadExecutor-673-thread-1) [    ] o.a.s.c.RequestHandlers Registered paths: /admin/mbeans,standard,/dump,/update/csv,/sql,/update/json/docs,/admin/luke,/export,/admin/segments,/get,/admin/system,/replication,/admin/properties,/config,/stream,/schema,/admin/plugins,/admin/logging,/update/json,/admin/ping,/admin/threads,/update,/admin/file
   [junit4]   2> 243213 INFO  (coreLoadExecutor-673-thread-1) [    ] o.a.s.c.SolrCore Using default statsCache cache: org.apache.solr.search.stats.LocalStatsCache
   [junit4]   2> 243214 INFO  (coreLoadExecutor-673-thread-1) [    ] o.a.s.u.UpdateHandler Using UpdateLog implementation: org.apache.solr.update.UpdateLog
   [junit4]   2> 243214 INFO  (coreLoadExecutor-673-thread-1) [    ] o.a.s.u.UpdateLog Initializing UpdateLog: dataDir= defaultSyncLevel=FLUSH numRecordsToKeep=100 maxNumLogsToKeep=10 numVersionBuckets=65536
   [junit4]   2> 243215 INFO  (coreLoadExecutor-673-thread-1) [    ] o.a.s.u.CommitTracker Hard AutoCommit: disabled
   [junit4]   2> 243215 INFO  (coreLoadExecutor-673-thread-1) [    ] o.a.s.u.CommitTracker Soft AutoCommit: disabled
   [junit4]   2> 243218 INFO  (coreLoadExecutor-673-thread-1) [    ] o.a.s.u.RandomMergePolicy RandomMergePolicy wrapping class org.apache.lucene.index.LogByteSizeMergePolicy: [LogByteSizeMergePolicy: minMergeSize=1677721, mergeFactor=30, maxMergeSize=2147483648, maxMergeSizeForForcedMerge=9223372036854775807, calibrateSizeByDeletes=true, maxMergeDocs=2147483647, maxCFSSegmentSizeMB=8.796093022207999E12, noCFSRatio=1.0]
   [junit4]   2> 243219 INFO  (coreLoadExecutor-673-thread-1) [    ] o.a.s.c.SolrDeletionPolicy SolrDeletionPolicy.onInit: commits: num=1
   [junit4]   2> 	commit{dir=MockDirectoryWrapper(RAMDirectory@1760735 lockFactory=org.apache.lucene.store.SingleInstanceLockFactory@1d7a1d1),segFN=segments_1,generation=1}
   [junit4]   2> 243219 INFO  (coreLoadExecutor-673-thread-1) [    ] o.a.s.c.SolrDeletionPolicy newest commit generation = 1
   [junit4]   2> 243219 INFO  (coreLoadExecutor-673-thread-1) [    ] o.a.s.s.SolrIndexSearcher Opening [Searcher@1f15c58[collection1] main]
   [junit4]   2> 243219 INFO  (coreLoadExecutor-673-thread-1) [    ] o.a.s.c.c.ZkStateReader Load collection config from: [/collections/collection1]
   [junit4]   2> 243220 INFO  (coreLoadExecutor-673-thread-1) [    ] o.a.s.c.c.ZkStateReader path=[/collections/collection1] [configName]=[conf1] specified config exists in ZooKeeper
   [junit4]   2> 243220 INFO  (coreLoadExecutor-673-thread-1) [    ] o.a.s.r.ManagedResourceStorage Setting up ZooKeeper-based storage for the RestManager with znodeBase: /configs/conf1
   [junit4]   2> 243220 INFO  (coreLoadExecutor-673-thread-1) [    ] o.a.s.r.ManagedResourceStorage Configured ZooKeeperStorageIO with znodeBase: /configs/conf1
   [junit4]   2> 243220 INFO  (coreLoadExecutor-673-thread-1) [    ] o.a.s.r.RestManager Initializing RestManager with initArgs: {}
   [junit4]   2> 243220 INFO  (coreLoadExecutor-673-thread-1) [    ] o.a.s.r.ManagedResourceStorage Reading _rest_managed.json using ZooKeeperStorageIO:path=/configs/conf1
   [junit4]   2> 243220 INFO  (coreLoadExecutor-673-thread-1) [    ] o.a.s.r.ManagedResourceStorage No data found for znode /configs/conf1/_rest_managed.json
   [junit4]   2> 243221 INFO  (coreLoadExecutor-673-thread-1) [    ] o.a.s.r.ManagedResourceStorage Loaded null at path _rest_managed.json using ZooKeeperStorageIO:path=/configs/conf1
   [junit4]   2> 243221 INFO  (coreLoadExecutor-673-thread-1) [    ] o.a.s.r.RestManager Initializing 0 registered ManagedResources
   [junit4]   2> 243221 INFO  (coreLoadExecutor-673-thread-1) [    ] o.a.s.h.ReplicationHandler Commits will be reserved for  10000
   [junit4]   2> 243223 INFO  (searcherExecutor-674-thread-1) [    ] o.a.s.c.SolrCore [collection1] Registered new searcher Searcher@1f15c58[collection1] main{ExitableDirectoryReader(UninvertingDirectoryReader())}
   [junit4]   2> 243223 INFO  (coreLoadExecutor-673-thread-1) [    ] o.a.s.u.UpdateLog Looking up max value of version field to seed version buckets
   [junit4]   2> 243223 INFO  (coreLoadExecutor-673-thread-1) [    ] o.a.s.u.VersionInfo Refreshing highest value of _version_ for 65536 version buckets from index
   [junit4]   2> 243223 INFO  (coreLoadExecutor-673-thread-1) [    ] o.a.s.u.VersionInfo No terms found for _version_, cannot seed version bucket highest value from index
   [junit4]   2> 243223 INFO  (coreLoadExecutor-673-thread-1) [    ] o.a.s.u.UpdateLog Could not find max version in index or recent updates, using new clock 1527556056379555840
   [junit4]   2> 243225 INFO  (coreLoadExecutor-673-thread-1) [    ] o.a.s.u.UpdateLog Took 1.0ms to seed version buckets with highest version 1527556056379555840
   [junit4]   2> 243225 INFO  (coreLoadExecutor-673-thread-1) [    ] o.a.s.c.ZkController watch zkdir /configs/conf1
   [junit4]   2> 243226 INFO  (coreLoadExecutor-673-thread-1) [    ] o.a.s.c.CoreContainer registering core: collection1
   [junit4]   2> 243226 INFO  (coreZkRegister-668-thread-1) [    ] o.a.s.c.ZkController Register replica - core:collection1 address:https://127.0.0.1:46135 collection:collection1 shard:shard2
   [junit4]   2> 243227 INFO  (coreZkRegister-668-thread-1) [    ] o.a.s.c.c.SolrZkClient makePath: /collections/collection1/leader_elect/shard2/election
   [junit4]   2> 243230 INFO  (coreZkRegister-668-thread-1) [    ] o.a.s.c.LeaderElector Joined leadership election with path: /collections/collection1/leader_elect/shard2/election/95472253238247433-core_node1-n_0000000000
   [junit4]   2> 243230 INFO  (coreZkRegister-668-thread-1) [    ] o.a.s.c.ShardLeaderElectionContext Running the leader process for shard=shard2 and weAreReplacement=false and leaderVoteWait=10000
   [junit4]   2> 243231 INFO  (coreZkRegister-668-thread-1) [    ] o.a.s.c.ShardLeaderElectionContext Enough replicas found to continue.
   [junit4]   2> 243232 INFO  (coreZkRegister-668-thread-1) [    ] o.a.s.c.ShardLeaderElectionContext I may be the new leader - try and sync
   [junit4]   2> 243232 INFO  (coreZkRegister-668-thread-1) [    ] o.a.s.c.SyncStrategy Sync replicas to https://127.0.0.1:46135/collection1/
   [junit4]   2> 243232 INFO  (coreZkRegister-668-thread-1) [    ] o.a.s.c.SyncStrategy Sync Success - now sync replicas to me
   [junit4]   2> 243232 INFO  (coreZkRegister-668-thread-1) [    ] o.a.s.c.SyncStrategy https://127.0.0.1:46135/collection1/ has no replicas
   [junit4]   2> 243232 INFO  (OverseerStateUpdate-95472253238247429-127.0.0.1:51620_-n_0000000000) [    ] o.a.s.c.Overseer processMessage: queueSize: 1, message = {
   [junit4]   2>   "operation":"leader",
   [junit4]   2>   "shard":"shard2",
   [junit4]   2>   "collection":"collection1"} current state version: 5
   [junit4]   2> 243232 INFO  (coreZkRegister-668-thread-1) [    ] o.a.s.c.c.SolrZkClient makePath: /collections/collection1/leaders/shard2
   [junit4]   2> 243234 INFO  (coreZkRegister-668-thread-1) [    ] o.a.s.c.ShardLeaderElectionContextBase Creating leader registration node /collections/collection1/leaders/shard2/leader after winning as /collections/collection1/leader_elect/shard2/election/95472253238247433-core_node1-n_0000000000
   [junit4]   2> 243235 INFO  (coreZkRegister-668-thread-1) [    ] o.a.s.c.ShardLeaderElectionContext I am the new leader: https://127.0.0.1:46135/collection1/ shard2
   [junit4]   2> 243236 INFO  (OverseerStateUpdate-95472253238247429-127.0.0.1:51620_-n_0000000000) [    ] o.a.s.c.Overseer processMessage: queueSize: 1, message = {
   [junit4]   2>   "operation":"leader",
   [junit4]   2>   "shard":"shard2",
   [junit4]   2>   "collection":"collection1",
   [junit4]   2>   "base_url":"https://127.0.0.1:46135",
   [junit4]   2>   "core":"collection1",
   [junit4]   2>   "state":"active"} current state version: 5
   [junit4]   2> 243338 INFO  (zkCallback-250-thread-1) [    ] o.a.s.c.c.ZkStateReader A cluster state change: [WatchedEvent state:SyncConnected type:NodeDataChanged path:/clusterstate.json], has occurred - updating... (live nodes size: [2])
   [junit4]   2> 243338 INFO  (zkCallback-245-thread-1) [    ] o.a.s.c.c.ZkStateReader A cluster state change: [WatchedEvent state:SyncConnected type:NodeDataChanged path:/clusterstate.json], has occurred - updating... (live nodes size: [2])
   [junit4]   2> 243338 INFO  (zkCallback-243-thread-1) [    ] o.a.s.c.c.ZkStateReader A cluster state change: [WatchedEvent state:SyncConnected type:NodeDataChanged path:/clusterstate.json], has occurred - updating... (live nodes size: [2])
   [junit4]   2> 243386 INFO  (coreZkRegister-668-thread-1) [    ] o.a.s.c.ZkController We are https://127.0.0.1:46135/coll

[...truncated too long message...]

 org.apache.solr.core.SolrCore@b652aa
   [junit4]   2> 294066 INFO  (zkCallback-266-thread-4) [    ] o.a.s.c.ZkController removed listener for config directory [/configs/.system]
   [junit4]   2> 294066 INFO  (zkCallback-266-thread-4) [    ] o.a.s.c.ZkController No more listeners for config directory [/configs/.system]
   [junit4]   2> 294067 INFO  (zkCallback-266-thread-4) [    ] o.a.s.u.DirectUpdateHandler2 closing DirectUpdateHandler2{commits=3,autocommit maxDocs=1,autocommits=1,soft autocommits=0,optimizes=0,rollbacks=0,expungeDeletes=0,docsPending=0,adds=0,deletesById=0,deletesByQuery=0,errors=0,cumulative_adds=2,cumulative_deletesById=0,cumulative_deletesByQuery=0,cumulative_errors=0,transaction_logs_total_size=13864,transaction_logs_total_number=2}
   [junit4]   2> 294067 INFO  (zkCallback-266-thread-4) [    ] o.a.s.u.SolrCoreState Closing SolrCoreState
   [junit4]   2> 294067 WARN  (zkCallback-266-thread-4) [    ] o.a.s.c.RecoveryStrategy Stopping recovery for core=[.system_shard1_replica1] coreNodeName=[core_node2]
   [junit4]   2> 294067 INFO  (zkCallback-266-thread-4) [    ] o.a.s.u.DefaultSolrCoreState SolrCoreState ref count has reached 0 - closing IndexWriter
   [junit4]   2> 294067 INFO  (zkCallback-266-thread-4) [    ] o.a.s.u.DefaultSolrCoreState closing IndexWriter with IndexWriterCloser
   [junit4]   2> 294067 INFO  (zkCallback-266-thread-4) [    ] o.a.s.c.SolrCore [.system_shard1_replica1] Closing main searcher on request.
   [junit4]   2> 294068 INFO  (zkCallback-266-thread-4) [    ] o.a.s.c.CachingDirectoryFactory Closing MockDirectoryFactory - 2 directories currently being tracked
   [junit4]   2> 294068 INFO  (zkCallback-266-thread-4) [    ] o.a.s.c.CachingDirectoryFactory looking to close /home/jenkins/workspace/Lucene-Solr-trunk-Linux/solr/build/solr-core/test/J1/../../../../../../../../../home/jenkins/workspace/Lucene-Solr-trunk-Linux/solr/build/solr-core/test/J1/temp/solr.core.TestDynamicLoading_74B623A3C362FE88-001/shard-4-001/cores/.system_shard1_replica1/data/index [CachedDir<<refCount=0;path=/home/jenkins/workspace/Lucene-Solr-trunk-Linux/solr/build/solr-core/test/J1/../../../../../../../../../home/jenkins/workspace/Lucene-Solr-trunk-Linux/solr/build/solr-core/test/J1/temp/solr.core.TestDynamicLoading_74B623A3C362FE88-001/shard-4-001/cores/.system_shard1_replica1/data/index;done=false>>]
   [junit4]   2> 294068 INFO  (zkCallback-266-thread-4) [    ] o.a.s.c.CachingDirectoryFactory Closing directory: /home/jenkins/workspace/Lucene-Solr-trunk-Linux/solr/build/solr-core/test/J1/../../../../../../../../../home/jenkins/workspace/Lucene-Solr-trunk-Linux/solr/build/solr-core/test/J1/temp/solr.core.TestDynamicLoading_74B623A3C362FE88-001/shard-4-001/cores/.system_shard1_replica1/data/index
   [junit4]   2> 294068 INFO  (zkCallback-266-thread-4) [    ] o.a.s.c.CachingDirectoryFactory looking to close /home/jenkins/workspace/Lucene-Solr-trunk-Linux/solr/build/solr-core/test/J1/../../../../../../../../../home/jenkins/workspace/Lucene-Solr-trunk-Linux/solr/build/solr-core/test/J1/temp/solr.core.TestDynamicLoading_74B623A3C362FE88-001/shard-4-001/cores/.system_shard1_replica1/data [CachedDir<<refCount=0;path=/home/jenkins/workspace/Lucene-Solr-trunk-Linux/solr/build/solr-core/test/J1/../../../../../../../../../home/jenkins/workspace/Lucene-Solr-trunk-Linux/solr/build/solr-core/test/J1/temp/solr.core.TestDynamicLoading_74B623A3C362FE88-001/shard-4-001/cores/.system_shard1_replica1/data;done=false>>]
   [junit4]   2> 294068 INFO  (zkCallback-266-thread-4) [    ] o.a.s.c.CachingDirectoryFactory Closing directory: /home/jenkins/workspace/Lucene-Solr-trunk-Linux/solr/build/solr-core/test/J1/../../../../../../../../../home/jenkins/workspace/Lucene-Solr-trunk-Linux/solr/build/solr-core/test/J1/temp/solr.core.TestDynamicLoading_74B623A3C362FE88-001/shard-4-001/cores/.system_shard1_replica1/data
   [junit4]   2> 294069 INFO  (TEST-TestDynamicLoading.testDynamicLoading-seed#[74B623A3C362FE88]) [    ] o.e.j.s.ServerConnector Stopped ServerConnector@d5b9f{SSL,[ssl, http/1.1]}{127.0.0.1:0}
   [junit4]   2> 294069 INFO  (TEST-TestDynamicLoading.testDynamicLoading-seed#[74B623A3C362FE88]) [    ] o.e.j.s.h.ContextHandler Stopped o.e.j.s.ServletContextHandler@af825e{/,null,UNAVAILABLE}
   [junit4]   2> 294070 INFO  (TEST-TestDynamicLoading.testDynamicLoading-seed#[74B623A3C362FE88]) [    ] o.a.s.c.ZkTestServer connecting to 127.0.0.1:48531 48531
   [junit4]   2> 294096 INFO  (Thread-612) [    ] o.a.s.c.ZkTestServer connecting to 127.0.0.1:48531 48531
   [junit4]   2> 294097 WARN  (Thread-612) [    ] o.a.s.c.ZkTestServer Watch limit violations: 
   [junit4]   2> Maximum concurrent create/delete watches above limit:
   [junit4]   2> 
   [junit4]   2> 	40	/solr/configs/conf1
   [junit4]   2> 	6	/solr/aliases.json
   [junit4]   2> 	5	/solr/security.json
   [junit4]   2> 	2	/solr/configs/.system
   [junit4]   2> 	2	/solr/configs/.system/managed-schema
   [junit4]   2> 
   [junit4]   2> Maximum concurrent data watches above limit:
   [junit4]   2> 
   [junit4]   2> 	6	/solr/clusterstate.json
   [junit4]   2> 	2	/solr/collections/.system/state.json
   [junit4]   2> 
   [junit4]   2> Maximum concurrent children watches above limit:
   [junit4]   2> 
   [junit4]   2> 	6	/solr/live_nodes
   [junit4]   2> 	6	/solr/collections
   [junit4]   2> 	4	/solr/overseer/queue
   [junit4]   2> 	4	/solr/overseer/collection-queue-work
   [junit4]   2> 
   [junit4]   2> NOTE: reproduce with: ant test  -Dtestcase=TestDynamicLoading -Dtests.method=testDynamicLoading -Dtests.seed=74B623A3C362FE88 -Dtests.multiplier=3 -Dtests.slow=true -Dtests.locale=sq -Dtests.timezone=Africa/Freetown -Dtests.asserts=true -Dtests.file.encoding=US-ASCII
   [junit4] FAILURE 55.2s J1 | TestDynamicLoading.testDynamicLoading <<<
   [junit4]    > Throwable #1: java.lang.AssertionError: Could not get expected value  'X val changed' for path 'x' full output: {
   [junit4]    >   "responseHeader":{
   [junit4]    >     "status":0,
   [junit4]    >     "QTime":0},
   [junit4]    >   "params":{"wt":"json"},
   [junit4]    >   "context":{
   [junit4]    >     "webapp":"",
   [junit4]    >     "path":"/test1",
   [junit4]    >     "httpMethod":"GET"},
   [junit4]    >   "class":"org.apache.solr.core.BlobStoreTestRequestHandler",
   [junit4]    >   "x":"X val"}
   [junit4]    > 	at __randomizedtesting.SeedInfo.seed([74B623A3C362FE88:ACFB0EF434BF5B28]:0)
   [junit4]    > 	at org.apache.solr.core.TestSolrConfigHandler.testForResponseElement(TestSolrConfigHandler.java:458)
   [junit4]    > 	at org.apache.solr.core.TestDynamicLoading.testDynamicLoading(TestDynamicLoading.java:255)
   [junit4]    > 	at org.apache.solr.BaseDistributedSearchTestCase$ShardsRepeatRule$ShardsFixedStatement.callStatement(BaseDistributedSearchTestCase.java:996)
   [junit4]    > 	at org.apache.solr.BaseDistributedSearchTestCase$ShardsRepeatRule$ShardsStatement.evaluate(BaseDistributedSearchTestCase.java:971)
   [junit4]    > 	at java.lang.Thread.run(Thread.java:804)
   [junit4]   2> 294101 INFO  (SUITE-TestDynamicLoading-seed#[74B623A3C362FE88]-worker) [    ] o.a.s.SolrTestCaseJ4 ###deleteCore
   [junit4]   2> NOTE: leaving temporary files on disk at: /home/jenkins/workspace/Lucene-Solr-trunk-Linux/solr/build/solr-core/test/J1/temp/solr.core.TestDynamicLoading_74B623A3C362FE88-001
   [junit4]   2> Mar 01, 2016 12:10:28 AM com.carrotsearch.randomizedtesting.ThreadLeakControl checkThreadLeaks
   [junit4]   2> WARNING: Will linger awaiting termination of 1 leaked thread(s).
   [junit4]   2> NOTE: test params are: codec=DummyCompressingStoredFields(storedFieldsFormat=CompressingStoredFieldsFormat(compressionMode=DUMMY, chunkSize=2, maxDocsPerChunk=821, blockSize=5), termVectorsFormat=CompressingTermVectorsFormat(compressionMode=DUMMY, chunkSize=2, blockSize=5)), sim=ClassicSimilarity, locale=sq, timezone=Africa/Freetown
   [junit4]   2> NOTE: Linux 3.19.0-51-generic i386/Oracle Corporation 9-ea (32-bit)/cpus=12,threads=1,free=108096032,total=278921216
   [junit4]   2> NOTE: All tests run in this JVM: [TestCodecSupport, LeaderInitiatedRecoveryOnCommitTest, TestAddFieldRealTimeGet, HdfsChaosMonkeySafeLeaderTest, ZkCLITest, TestJsonFacets, ChaosMonkeySafeLeaderTest, DirectSolrSpellCheckerTest, PreAnalyzedUpdateProcessorTest, TestSolrDeletionPolicy2, TestDocumentBuilder, TestQueryUtils, DistributedQueryComponentOptimizationTest, CdcrReplicationHandlerTest, TestLRUStatsCache, SpellCheckComponentTest, SolrInfoMBeanTest, SolrIndexConfigTest, HdfsBasicDistributedZk2Test, TestRawTransformer, TestExclusionRuleCollectionAccess, TestConfigSetImmutable, HdfsSyncSliceTest, TestDynamicLoading]
   [junit4] Completed [87/581 (1!)] on J1 in 55.78s, 1 test, 1 failure <<< FAILURES!

[...truncated 1606 lines...]
BUILD FAILED
/home/jenkins/workspace/Lucene-Solr-trunk-Linux/build.xml:740: The following error occurred while executing this line:
/home/jenkins/workspace/Lucene-Solr-trunk-Linux/build.xml:684: The following error occurred while executing this line:
/home/jenkins/workspace/Lucene-Solr-trunk-Linux/build.xml:59: The following error occurred while executing this line:
/home/jenkins/workspace/Lucene-Solr-trunk-Linux/solr/build.xml:233: The following error occurred while executing this line:
/home/jenkins/workspace/Lucene-Solr-trunk-Linux/solr/common-build.xml:524: The following error occurred while executing this line:
/home/jenkins/workspace/Lucene-Solr-trunk-Linux/lucene/common-build.xml:1457: The following error occurred while executing this line:
/home/jenkins/workspace/Lucene-Solr-trunk-Linux/lucene/common-build.xml:1014: There were test failures: 581 suites (8 ignored), 2349 tests, 1 failure, 117 ignored (71 assumptions) [seed: 74B623A3C362FE88]

Total time: 62 minutes 39 seconds
Build step 'Invoke Ant' marked build as failure
Archiving artifacts
[WARNINGS] Skipping publisher since build result is FAILURE
Recording test results
Email was triggered for: Failure - Any
Sending email for trigger: Failure - Any



Mime
View raw message