lucene-dev mailing list archives

Site index · List index
Message view « Date » · « Thread »
Top « Date » · « Thread »
From Apache Jenkins Server <jenk...@builds.apache.org>
Subject [JENKINS] Lucene-Solr-Tests-master - Build # 1049 - Failure
Date Tue, 29 Mar 2016 03:28:47 GMT
Build: https://builds.apache.org/job/Lucene-Solr-Tests-master/1049/

2 tests failed.
FAILED:  org.apache.solr.cloud.LeaderFailoverAfterPartitionTest.test

Error Message:
Expected 2 of 3 replicas to be active but only found 1; [core_node3:{"core":"c8n_1x3_lf_shard1_replica2","base_url":"http://127.0.0.1:49012","node_name":"127.0.0.1:49012_","state":"active","leader":"true"}]; clusterState: DocCollection(c8n_1x3_lf)={   "replicationFactor":"3",   "shards":{"shard1":{       "range":"80000000-7fffffff",       "state":"active",       "replicas":{         "core_node1":{           "state":"down",           "base_url":"http://127.0.0.1:51900",           "core":"c8n_1x3_lf_shard1_replica3",           "node_name":"127.0.0.1:51900_"},         "core_node2":{           "core":"c8n_1x3_lf_shard1_replica1",           "base_url":"http://127.0.0.1:48282",           "node_name":"127.0.0.1:48282_",           "state":"down"},         "core_node3":{           "core":"c8n_1x3_lf_shard1_replica2",           "base_url":"http://127.0.0.1:49012",           "node_name":"127.0.0.1:49012_",           "state":"active",           "leader":"true"}}}},   "router":{"name":"compositeId"},   "maxShardsPerNode":"1",   "autoAddReplicas":"false"}

Stack Trace:
java.lang.AssertionError: Expected 2 of 3 replicas to be active but only found 1; [core_node3:{"core":"c8n_1x3_lf_shard1_replica2","base_url":"http://127.0.0.1:49012","node_name":"127.0.0.1:49012_","state":"active","leader":"true"}]; clusterState: DocCollection(c8n_1x3_lf)={
  "replicationFactor":"3",
  "shards":{"shard1":{
      "range":"80000000-7fffffff",
      "state":"active",
      "replicas":{
        "core_node1":{
          "state":"down",
          "base_url":"http://127.0.0.1:51900",
          "core":"c8n_1x3_lf_shard1_replica3",
          "node_name":"127.0.0.1:51900_"},
        "core_node2":{
          "core":"c8n_1x3_lf_shard1_replica1",
          "base_url":"http://127.0.0.1:48282",
          "node_name":"127.0.0.1:48282_",
          "state":"down"},
        "core_node3":{
          "core":"c8n_1x3_lf_shard1_replica2",
          "base_url":"http://127.0.0.1:49012",
          "node_name":"127.0.0.1:49012_",
          "state":"active",
          "leader":"true"}}}},
  "router":{"name":"compositeId"},
  "maxShardsPerNode":"1",
  "autoAddReplicas":"false"}
	at __randomizedtesting.SeedInfo.seed([FF75ABE235BDDBAE:772194389B41B656]:0)
	at org.junit.Assert.fail(Assert.java:93)
	at org.junit.Assert.assertTrue(Assert.java:43)
	at org.apache.solr.cloud.LeaderFailoverAfterPartitionTest.testRf3WithLeaderFailover(LeaderFailoverAfterPartitionTest.java:168)
	at org.apache.solr.cloud.LeaderFailoverAfterPartitionTest.test(LeaderFailoverAfterPartitionTest.java:55)
	at sun.reflect.NativeMethodAccessorImpl.invoke0(Native Method)
	at sun.reflect.NativeMethodAccessorImpl.invoke(NativeMethodAccessorImpl.java:62)
	at sun.reflect.DelegatingMethodAccessorImpl.invoke(DelegatingMethodAccessorImpl.java:43)
	at java.lang.reflect.Method.invoke(Method.java:498)
	at com.carrotsearch.randomizedtesting.RandomizedRunner.invoke(RandomizedRunner.java:1764)
	at com.carrotsearch.randomizedtesting.RandomizedRunner$8.evaluate(RandomizedRunner.java:871)
	at com.carrotsearch.randomizedtesting.RandomizedRunner$9.evaluate(RandomizedRunner.java:907)
	at com.carrotsearch.randomizedtesting.RandomizedRunner$10.evaluate(RandomizedRunner.java:921)
	at org.apache.solr.BaseDistributedSearchTestCase$ShardsRepeatRule$ShardsFixedStatement.callStatement(BaseDistributedSearchTestCase.java:996)
	at org.apache.solr.BaseDistributedSearchTestCase$ShardsRepeatRule$ShardsStatement.evaluate(BaseDistributedSearchTestCase.java:971)
	at com.carrotsearch.randomizedtesting.rules.SystemPropertiesRestoreRule$1.evaluate(SystemPropertiesRestoreRule.java:57)
	at org.apache.lucene.util.TestRuleSetupTeardownChained$1.evaluate(TestRuleSetupTeardownChained.java:49)
	at org.apache.lucene.util.AbstractBeforeAfterRule$1.evaluate(AbstractBeforeAfterRule.java:45)
	at org.apache.lucene.util.TestRuleThreadAndTestName$1.evaluate(TestRuleThreadAndTestName.java:48)
	at org.apache.lucene.util.TestRuleIgnoreAfterMaxFailures$1.evaluate(TestRuleIgnoreAfterMaxFailures.java:64)
	at org.apache.lucene.util.TestRuleMarkFailure$1.evaluate(TestRuleMarkFailure.java:47)
	at com.carrotsearch.randomizedtesting.rules.StatementAdapter.evaluate(StatementAdapter.java:36)
	at com.carrotsearch.randomizedtesting.ThreadLeakControl$StatementRunner.run(ThreadLeakControl.java:367)
	at com.carrotsearch.randomizedtesting.ThreadLeakControl.forkTimeoutingTask(ThreadLeakControl.java:809)
	at com.carrotsearch.randomizedtesting.ThreadLeakControl$3.evaluate(ThreadLeakControl.java:460)
	at com.carrotsearch.randomizedtesting.RandomizedRunner.runSingleTest(RandomizedRunner.java:880)
	at com.carrotsearch.randomizedtesting.RandomizedRunner$5.evaluate(RandomizedRunner.java:781)
	at com.carrotsearch.randomizedtesting.RandomizedRunner$6.evaluate(RandomizedRunner.java:816)
	at com.carrotsearch.randomizedtesting.RandomizedRunner$7.evaluate(RandomizedRunner.java:827)
	at com.carrotsearch.randomizedtesting.rules.StatementAdapter.evaluate(StatementAdapter.java:36)
	at com.carrotsearch.randomizedtesting.rules.SystemPropertiesRestoreRule$1.evaluate(SystemPropertiesRestoreRule.java:57)
	at org.apache.lucene.util.AbstractBeforeAfterRule$1.evaluate(AbstractBeforeAfterRule.java:45)
	at com.carrotsearch.randomizedtesting.rules.StatementAdapter.evaluate(StatementAdapter.java:36)
	at org.apache.lucene.util.TestRuleStoreClassName$1.evaluate(TestRuleStoreClassName.java:41)
	at com.carrotsearch.randomizedtesting.rules.NoShadowingOrOverridesOnMethodsRule$1.evaluate(NoShadowingOrOverridesOnMethodsRule.java:40)
	at com.carrotsearch.randomizedtesting.rules.NoShadowingOrOverridesOnMethodsRule$1.evaluate(NoShadowingOrOverridesOnMethodsRule.java:40)
	at com.carrotsearch.randomizedtesting.rules.StatementAdapter.evaluate(StatementAdapter.java:36)
	at com.carrotsearch.randomizedtesting.rules.StatementAdapter.evaluate(StatementAdapter.java:36)
	at com.carrotsearch.randomizedtesting.rules.StatementAdapter.evaluate(StatementAdapter.java:36)
	at org.apache.lucene.util.TestRuleAssertionsRequired$1.evaluate(TestRuleAssertionsRequired.java:53)
	at org.apache.lucene.util.TestRuleMarkFailure$1.evaluate(TestRuleMarkFailure.java:47)
	at org.apache.lucene.util.TestRuleIgnoreAfterMaxFailures$1.evaluate(TestRuleIgnoreAfterMaxFailures.java:64)
	at org.apache.lucene.util.TestRuleIgnoreTestSuites$1.evaluate(TestRuleIgnoreTestSuites.java:54)
	at com.carrotsearch.randomizedtesting.rules.StatementAdapter.evaluate(StatementAdapter.java:36)
	at com.carrotsearch.randomizedtesting.ThreadLeakControl$StatementRunner.run(ThreadLeakControl.java:367)
	at java.lang.Thread.run(Thread.java:745)


FAILED:  org.apache.solr.cloud.overseer.ZkStateReaderTest.testStateFormatUpdateWithExplicitRefreshLazy

Error Message:
Could not find collection : c1

Stack Trace:
org.apache.solr.common.SolrException: Could not find collection : c1
	at __randomizedtesting.SeedInfo.seed([FF75ABE235BDDBAE:943A0B9F4CB20694]:0)
	at org.apache.solr.common.cloud.ClusterState.getCollection(ClusterState.java:170)
	at org.apache.solr.cloud.overseer.ZkStateReaderTest.testStateFormatUpdate(ZkStateReaderTest.java:135)
	at org.apache.solr.cloud.overseer.ZkStateReaderTest.testStateFormatUpdateWithExplicitRefreshLazy(ZkStateReaderTest.java:46)
	at sun.reflect.NativeMethodAccessorImpl.invoke0(Native Method)
	at sun.reflect.NativeMethodAccessorImpl.invoke(NativeMethodAccessorImpl.java:62)
	at sun.reflect.DelegatingMethodAccessorImpl.invoke(DelegatingMethodAccessorImpl.java:43)
	at java.lang.reflect.Method.invoke(Method.java:498)
	at com.carrotsearch.randomizedtesting.RandomizedRunner.invoke(RandomizedRunner.java:1764)
	at com.carrotsearch.randomizedtesting.RandomizedRunner$8.evaluate(RandomizedRunner.java:871)
	at com.carrotsearch.randomizedtesting.RandomizedRunner$9.evaluate(RandomizedRunner.java:907)
	at com.carrotsearch.randomizedtesting.RandomizedRunner$10.evaluate(RandomizedRunner.java:921)
	at com.carrotsearch.randomizedtesting.rules.SystemPropertiesRestoreRule$1.evaluate(SystemPropertiesRestoreRule.java:57)
	at org.apache.lucene.util.TestRuleSetupTeardownChained$1.evaluate(TestRuleSetupTeardownChained.java:49)
	at org.apache.lucene.util.AbstractBeforeAfterRule$1.evaluate(AbstractBeforeAfterRule.java:45)
	at org.apache.lucene.util.TestRuleThreadAndTestName$1.evaluate(TestRuleThreadAndTestName.java:48)
	at org.apache.lucene.util.TestRuleIgnoreAfterMaxFailures$1.evaluate(TestRuleIgnoreAfterMaxFailures.java:64)
	at org.apache.lucene.util.TestRuleMarkFailure$1.evaluate(TestRuleMarkFailure.java:47)
	at com.carrotsearch.randomizedtesting.rules.StatementAdapter.evaluate(StatementAdapter.java:36)
	at com.carrotsearch.randomizedtesting.ThreadLeakControl$StatementRunner.run(ThreadLeakControl.java:367)
	at com.carrotsearch.randomizedtesting.ThreadLeakControl.forkTimeoutingTask(ThreadLeakControl.java:809)
	at com.carrotsearch.randomizedtesting.ThreadLeakControl$3.evaluate(ThreadLeakControl.java:460)
	at com.carrotsearch.randomizedtesting.RandomizedRunner.runSingleTest(RandomizedRunner.java:880)
	at com.carrotsearch.randomizedtesting.RandomizedRunner$5.evaluate(RandomizedRunner.java:781)
	at com.carrotsearch.randomizedtesting.RandomizedRunner$6.evaluate(RandomizedRunner.java:816)
	at com.carrotsearch.randomizedtesting.RandomizedRunner$7.evaluate(RandomizedRunner.java:827)
	at com.carrotsearch.randomizedtesting.rules.StatementAdapter.evaluate(StatementAdapter.java:36)
	at com.carrotsearch.randomizedtesting.rules.SystemPropertiesRestoreRule$1.evaluate(SystemPropertiesRestoreRule.java:57)
	at org.apache.lucene.util.AbstractBeforeAfterRule$1.evaluate(AbstractBeforeAfterRule.java:45)
	at com.carrotsearch.randomizedtesting.rules.StatementAdapter.evaluate(StatementAdapter.java:36)
	at org.apache.lucene.util.TestRuleStoreClassName$1.evaluate(TestRuleStoreClassName.java:41)
	at com.carrotsearch.randomizedtesting.rules.NoShadowingOrOverridesOnMethodsRule$1.evaluate(NoShadowingOrOverridesOnMethodsRule.java:40)
	at com.carrotsearch.randomizedtesting.rules.NoShadowingOrOverridesOnMethodsRule$1.evaluate(NoShadowingOrOverridesOnMethodsRule.java:40)
	at com.carrotsearch.randomizedtesting.rules.StatementAdapter.evaluate(StatementAdapter.java:36)
	at com.carrotsearch.randomizedtesting.rules.StatementAdapter.evaluate(StatementAdapter.java:36)
	at com.carrotsearch.randomizedtesting.rules.StatementAdapter.evaluate(StatementAdapter.java:36)
	at org.apache.lucene.util.TestRuleAssertionsRequired$1.evaluate(TestRuleAssertionsRequired.java:53)
	at org.apache.lucene.util.TestRuleMarkFailure$1.evaluate(TestRuleMarkFailure.java:47)
	at org.apache.lucene.util.TestRuleIgnoreAfterMaxFailures$1.evaluate(TestRuleIgnoreAfterMaxFailures.java:64)
	at org.apache.lucene.util.TestRuleIgnoreTestSuites$1.evaluate(TestRuleIgnoreTestSuites.java:54)
	at com.carrotsearch.randomizedtesting.rules.StatementAdapter.evaluate(StatementAdapter.java:36)
	at com.carrotsearch.randomizedtesting.ThreadLeakControl$StatementRunner.run(ThreadLeakControl.java:367)
	at java.lang.Thread.run(Thread.java:745)




Build Log:
[...truncated 12079 lines...]
   [junit4] Suite: org.apache.solr.cloud.LeaderFailoverAfterPartitionTest
   [junit4]   2> Creating dataDir: /x1/jenkins/jenkins-slave/workspace/Lucene-Solr-Tests-master/solr/build/solr-core/test/J1/temp/solr.cloud.LeaderFailoverAfterPartitionTest_FF75ABE235BDDBAE-001/init-core-data-001
   [junit4]   2> 1902646 INFO  (SUITE-LeaderFailoverAfterPartitionTest-seed#[FF75ABE235BDDBAE]-worker) [    ] o.a.s.BaseDistributedSearchTestCase Setting hostContext system property: /
   [junit4]   2> 1902647 INFO  (TEST-LeaderFailoverAfterPartitionTest.test-seed#[FF75ABE235BDDBAE]) [    ] o.a.s.c.ZkTestServer STARTING ZK TEST SERVER
   [junit4]   2> 1902658 INFO  (Thread-6892) [    ] o.a.s.c.ZkTestServer client port:0.0.0.0/0.0.0.0:0
   [junit4]   2> 1902658 INFO  (Thread-6892) [    ] o.a.s.c.ZkTestServer Starting server
   [junit4]   2> 1902758 INFO  (TEST-LeaderFailoverAfterPartitionTest.test-seed#[FF75ABE235BDDBAE]) [    ] o.a.s.c.ZkTestServer start zk server on port:44966
   [junit4]   2> 1902758 INFO  (TEST-LeaderFailoverAfterPartitionTest.test-seed#[FF75ABE235BDDBAE]) [    ] o.a.s.c.c.SolrZkClient Using default ZkCredentialsProvider
   [junit4]   2> 1902770 INFO  (TEST-LeaderFailoverAfterPartitionTest.test-seed#[FF75ABE235BDDBAE]) [    ] o.a.s.c.c.ConnectionManager Waiting for client to connect to ZooKeeper
   [junit4]   2> 1902790 INFO  (zkCallback-1620-thread-1) [    ] o.a.s.c.c.ConnectionManager Watcher org.apache.solr.common.cloud.ConnectionManager@22f66720 name:ZooKeeperConnection Watcher:127.0.0.1:44966 got event WatchedEvent state:SyncConnected type:None path:null path:null type:None
   [junit4]   2> 1902794 INFO  (TEST-LeaderFailoverAfterPartitionTest.test-seed#[FF75ABE235BDDBAE]) [    ] o.a.s.c.c.ConnectionManager Client is connected to ZooKeeper
   [junit4]   2> 1902794 INFO  (TEST-LeaderFailoverAfterPartitionTest.test-seed#[FF75ABE235BDDBAE]) [    ] o.a.s.c.c.SolrZkClient Using default ZkACLProvider
   [junit4]   2> 1902794 INFO  (TEST-LeaderFailoverAfterPartitionTest.test-seed#[FF75ABE235BDDBAE]) [    ] o.a.s.c.c.SolrZkClient makePath: /solr
   [junit4]   2> 1902801 WARN  (NIOServerCxn.Factory:0.0.0.0/0.0.0.0:0) [    ] o.a.z.s.NIOServerCnxn caught end of stream exception
   [junit4]   2> EndOfStreamException: Unable to read additional data from client sessionid 0x153c05abcc50000, likely client has closed socket
   [junit4]   2> 	at org.apache.zookeeper.server.NIOServerCnxn.doIO(NIOServerCnxn.java:228)
   [junit4]   2> 	at org.apache.zookeeper.server.NIOServerCnxnFactory.run(NIOServerCnxnFactory.java:208)
   [junit4]   2> 	at java.lang.Thread.run(Thread.java:745)
   [junit4]   2> 1902807 INFO  (TEST-LeaderFailoverAfterPartitionTest.test-seed#[FF75ABE235BDDBAE]) [    ] o.a.s.c.c.SolrZkClient Using default ZkCredentialsProvider
   [junit4]   2> 1902808 INFO  (TEST-LeaderFailoverAfterPartitionTest.test-seed#[FF75ABE235BDDBAE]) [    ] o.a.s.c.c.ConnectionManager Waiting for client to connect to ZooKeeper
   [junit4]   2> 1902809 INFO  (zkCallback-1621-thread-1) [    ] o.a.s.c.c.ConnectionManager Watcher org.apache.solr.common.cloud.ConnectionManager@438074dd name:ZooKeeperConnection Watcher:127.0.0.1:44966/solr got event WatchedEvent state:SyncConnected type:None path:null path:null type:None
   [junit4]   2> 1902809 INFO  (TEST-LeaderFailoverAfterPartitionTest.test-seed#[FF75ABE235BDDBAE]) [    ] o.a.s.c.c.ConnectionManager Client is connected to ZooKeeper
   [junit4]   2> 1902809 INFO  (TEST-LeaderFailoverAfterPartitionTest.test-seed#[FF75ABE235BDDBAE]) [    ] o.a.s.c.c.SolrZkClient Using default ZkACLProvider
   [junit4]   2> 1902809 INFO  (TEST-LeaderFailoverAfterPartitionTest.test-seed#[FF75ABE235BDDBAE]) [    ] o.a.s.c.c.SolrZkClient makePath: /collections/collection1
   [junit4]   2> 1902816 INFO  (TEST-LeaderFailoverAfterPartitionTest.test-seed#[FF75ABE235BDDBAE]) [    ] o.a.s.c.c.SolrZkClient makePath: /collections/collection1/shards
   [junit4]   2> 1902817 INFO  (TEST-LeaderFailoverAfterPartitionTest.test-seed#[FF75ABE235BDDBAE]) [    ] o.a.s.c.c.SolrZkClient makePath: /collections/control_collection
   [junit4]   2> 1902817 INFO  (TEST-LeaderFailoverAfterPartitionTest.test-seed#[FF75ABE235BDDBAE]) [    ] o.a.s.c.c.SolrZkClient makePath: /collections/control_collection/shards
   [junit4]   2> 1902818 INFO  (TEST-LeaderFailoverAfterPartitionTest.test-seed#[FF75ABE235BDDBAE]) [    ] o.a.s.c.AbstractZkTestCase put /x1/jenkins/jenkins-slave/workspace/Lucene-Solr-Tests-master/solr/core/src/test-files/solr/collection1/conf/solrconfig-tlog.xml to /configs/conf1/solrconfig.xml
   [junit4]   2> 1902818 INFO  (TEST-LeaderFailoverAfterPartitionTest.test-seed#[FF75ABE235BDDBAE]) [    ] o.a.s.c.c.SolrZkClient makePath: /configs/conf1/solrconfig.xml
   [junit4]   2> 1902819 INFO  (TEST-LeaderFailoverAfterPartitionTest.test-seed#[FF75ABE235BDDBAE]) [    ] o.a.s.c.AbstractZkTestCase put /x1/jenkins/jenkins-slave/workspace/Lucene-Solr-Tests-master/solr/core/src/test-files/solr/collection1/conf/schema.xml to /configs/conf1/schema.xml
   [junit4]   2> 1902819 INFO  (TEST-LeaderFailoverAfterPartitionTest.test-seed#[FF75ABE235BDDBAE]) [    ] o.a.s.c.c.SolrZkClient makePath: /configs/conf1/schema.xml
   [junit4]   2> 1902820 INFO  (TEST-LeaderFailoverAfterPartitionTest.test-seed#[FF75ABE235BDDBAE]) [    ] o.a.s.c.AbstractZkTestCase put /x1/jenkins/jenkins-slave/workspace/Lucene-Solr-Tests-master/solr/core/src/test-files/solr/collection1/conf/solrconfig.snippet.randomindexconfig.xml to /configs/conf1/solrconfig.snippet.randomindexconfig.xml
   [junit4]   2> 1902820 INFO  (TEST-LeaderFailoverAfterPartitionTest.test-seed#[FF75ABE235BDDBAE]) [    ] o.a.s.c.c.SolrZkClient makePath: /configs/conf1/solrconfig.snippet.randomindexconfig.xml
   [junit4]   2> 1902821 INFO  (TEST-LeaderFailoverAfterPartitionTest.test-seed#[FF75ABE235BDDBAE]) [    ] o.a.s.c.AbstractZkTestCase put /x1/jenkins/jenkins-slave/workspace/Lucene-Solr-Tests-master/solr/core/src/test-files/solr/collection1/conf/stopwords.txt to /configs/conf1/stopwords.txt
   [junit4]   2> 1902821 INFO  (TEST-LeaderFailoverAfterPartitionTest.test-seed#[FF75ABE235BDDBAE]) [    ] o.a.s.c.c.SolrZkClient makePath: /configs/conf1/stopwords.txt
   [junit4]   2> 1902821 INFO  (TEST-LeaderFailoverAfterPartitionTest.test-seed#[FF75ABE235BDDBAE]) [    ] o.a.s.c.AbstractZkTestCase put /x1/jenkins/jenkins-slave/workspace/Lucene-Solr-Tests-master/solr/core/src/test-files/solr/collection1/conf/protwords.txt to /configs/conf1/protwords.txt
   [junit4]   2> 1902821 INFO  (TEST-LeaderFailoverAfterPartitionTest.test-seed#[FF75ABE235BDDBAE]) [    ] o.a.s.c.c.SolrZkClient makePath: /configs/conf1/protwords.txt
   [junit4]   2> 1902822 INFO  (TEST-LeaderFailoverAfterPartitionTest.test-seed#[FF75ABE235BDDBAE]) [    ] o.a.s.c.AbstractZkTestCase put /x1/jenkins/jenkins-slave/workspace/Lucene-Solr-Tests-master/solr/core/src/test-files/solr/collection1/conf/currency.xml to /configs/conf1/currency.xml
   [junit4]   2> 1902822 INFO  (TEST-LeaderFailoverAfterPartitionTest.test-seed#[FF75ABE235BDDBAE]) [    ] o.a.s.c.c.SolrZkClient makePath: /configs/conf1/currency.xml
   [junit4]   2> 1902823 INFO  (TEST-LeaderFailoverAfterPartitionTest.test-seed#[FF75ABE235BDDBAE]) [    ] o.a.s.c.AbstractZkTestCase put /x1/jenkins/jenkins-slave/workspace/Lucene-Solr-Tests-master/solr/core/src/test-files/solr/collection1/conf/enumsConfig.xml to /configs/conf1/enumsConfig.xml
   [junit4]   2> 1902823 INFO  (TEST-LeaderFailoverAfterPartitionTest.test-seed#[FF75ABE235BDDBAE]) [    ] o.a.s.c.c.SolrZkClient makePath: /configs/conf1/enumsConfig.xml
   [junit4]   2> 1902823 INFO  (TEST-LeaderFailoverAfterPartitionTest.test-seed#[FF75ABE235BDDBAE]) [    ] o.a.s.c.AbstractZkTestCase put /x1/jenkins/jenkins-slave/workspace/Lucene-Solr-Tests-master/solr/core/src/test-files/solr/collection1/conf/open-exchange-rates.json to /configs/conf1/open-exchange-rates.json
   [junit4]   2> 1902824 INFO  (TEST-LeaderFailoverAfterPartitionTest.test-seed#[FF75ABE235BDDBAE]) [    ] o.a.s.c.c.SolrZkClient makePath: /configs/conf1/open-exchange-rates.json
   [junit4]   2> 1902824 INFO  (TEST-LeaderFailoverAfterPartitionTest.test-seed#[FF75ABE235BDDBAE]) [    ] o.a.s.c.AbstractZkTestCase put /x1/jenkins/jenkins-slave/workspace/Lucene-Solr-Tests-master/solr/core/src/test-files/solr/collection1/conf/mapping-ISOLatin1Accent.txt to /configs/conf1/mapping-ISOLatin1Accent.txt
   [junit4]   2> 1902824 INFO  (TEST-LeaderFailoverAfterPartitionTest.test-seed#[FF75ABE235BDDBAE]) [    ] o.a.s.c.c.SolrZkClient makePath: /configs/conf1/mapping-ISOLatin1Accent.txt
   [junit4]   2> 1902825 INFO  (TEST-LeaderFailoverAfterPartitionTest.test-seed#[FF75ABE235BDDBAE]) [    ] o.a.s.c.AbstractZkTestCase put /x1/jenkins/jenkins-slave/workspace/Lucene-Solr-Tests-master/solr/core/src/test-files/solr/collection1/conf/old_synonyms.txt to /configs/conf1/old_synonyms.txt
   [junit4]   2> 1902825 INFO  (TEST-LeaderFailoverAfterPartitionTest.test-seed#[FF75ABE235BDDBAE]) [    ] o.a.s.c.c.SolrZkClient makePath: /configs/conf1/old_synonyms.txt
   [junit4]   2> 1902826 INFO  (TEST-LeaderFailoverAfterPartitionTest.test-seed#[FF75ABE235BDDBAE]) [    ] o.a.s.c.AbstractZkTestCase put /x1/jenkins/jenkins-slave/workspace/Lucene-Solr-Tests-master/solr/core/src/test-files/solr/collection1/conf/synonyms.txt to /configs/conf1/synonyms.txt
   [junit4]   2> 1902826 INFO  (TEST-LeaderFailoverAfterPartitionTest.test-seed#[FF75ABE235BDDBAE]) [    ] o.a.s.c.c.SolrZkClient makePath: /configs/conf1/synonyms.txt
   [junit4]   2> 1902888 INFO  (TEST-LeaderFailoverAfterPartitionTest.test-seed#[FF75ABE235BDDBAE]) [    ] o.a.s.SolrTestCaseJ4 Writing core.properties file to /x1/jenkins/jenkins-slave/workspace/Lucene-Solr-Tests-master/solr/build/solr-core/test/J1/temp/solr.cloud.LeaderFailoverAfterPartitionTest_FF75ABE235BDDBAE-001/control-001/cores/collection1
   [junit4]   2> 1902890 INFO  (TEST-LeaderFailoverAfterPartitionTest.test-seed#[FF75ABE235BDDBAE]) [    ] o.e.j.s.Server jetty-9.3.8.v20160314
   [junit4]   2> 1902895 INFO  (TEST-LeaderFailoverAfterPartitionTest.test-seed#[FF75ABE235BDDBAE]) [    ] o.e.j.s.h.ContextHandler Started o.e.j.s.ServletContextHandler@142a20ff{/,null,AVAILABLE}
   [junit4]   2> 1902895 INFO  (TEST-LeaderFailoverAfterPartitionTest.test-seed#[FF75ABE235BDDBAE]) [    ] o.e.j.s.ServerConnector Started ServerConnector@557e2da9{HTTP/1.1,[http/1.1]}{127.0.0.1:39783}
   [junit4]   2> 1902895 INFO  (TEST-LeaderFailoverAfterPartitionTest.test-seed#[FF75ABE235BDDBAE]) [    ] o.e.j.s.Server Started @1909159ms
   [junit4]   2> 1902895 INFO  (TEST-LeaderFailoverAfterPartitionTest.test-seed#[FF75ABE235BDDBAE]) [    ] o.a.s.c.s.e.JettySolrRunner Jetty properties: {solr.data.dir=/x1/jenkins/jenkins-slave/workspace/Lucene-Solr-Tests-master/solr/build/solr-core/test/J1/temp/solr.cloud.LeaderFailoverAfterPartitionTest_FF75ABE235BDDBAE-001/tempDir-001/control/data, hostContext=/, hostPort=49012, coreRootDirectory=/x1/jenkins/jenkins-slave/workspace/Lucene-Solr-Tests-master/solr/build/solr-core/test/J1/temp/solr.cloud.LeaderFailoverAfterPartitionTest_FF75ABE235BDDBAE-001/control-001/cores}
   [junit4]   2> 1902895 INFO  (TEST-LeaderFailoverAfterPartitionTest.test-seed#[FF75ABE235BDDBAE]) [    ] o.a.s.s.SolrDispatchFilter SolrDispatchFilter.init(): sun.misc.Launcher$AppClassLoader@73d16e93
   [junit4]   2> 1902896 INFO  (TEST-LeaderFailoverAfterPartitionTest.test-seed#[FF75ABE235BDDBAE]) [    ] o.a.s.c.SolrResourceLoader new SolrResourceLoader for directory: '/x1/jenkins/jenkins-slave/workspace/Lucene-Solr-Tests-master/solr/build/solr-core/test/J1/temp/solr.cloud.LeaderFailoverAfterPartitionTest_FF75ABE235BDDBAE-001/control-001'
   [junit4]   2> 1902896 INFO  (TEST-LeaderFailoverAfterPartitionTest.test-seed#[FF75ABE235BDDBAE]) [    ] o.a.s.c.SolrResourceLoader JNDI not configured for solr (NoInitialContextEx)
   [junit4]   2> 1902896 INFO  (TEST-LeaderFailoverAfterPartitionTest.test-seed#[FF75ABE235BDDBAE]) [    ] o.a.s.c.SolrResourceLoader solr home defaulted to 'solr/' (could not find system property or JNDI)
   [junit4]   2> 1902896 INFO  (TEST-LeaderFailoverAfterPartitionTest.test-seed#[FF75ABE235BDDBAE]) [    ] o.a.s.c.c.SolrZkClient Using default ZkCredentialsProvider
   [junit4]   2> 1902896 INFO  (TEST-LeaderFailoverAfterPartitionTest.test-seed#[FF75ABE235BDDBAE]) [    ] o.a.s.c.c.ConnectionManager Waiting for client to connect to ZooKeeper
   [junit4]   2> 1902898 INFO  (zkCallback-1622-thread-1) [    ] o.a.s.c.c.ConnectionManager Watcher org.apache.solr.common.cloud.ConnectionManager@7315691f name:ZooKeeperConnection Watcher:127.0.0.1:44966/solr got event WatchedEvent state:SyncConnected type:None path:null path:null type:None
   [junit4]   2> 1902898 INFO  (TEST-LeaderFailoverAfterPartitionTest.test-seed#[FF75ABE235BDDBAE]) [    ] o.a.s.c.c.ConnectionManager Client is connected to ZooKeeper
   [junit4]   2> 1902898 INFO  (TEST-LeaderFailoverAfterPartitionTest.test-seed#[FF75ABE235BDDBAE]) [    ] o.a.s.c.c.SolrZkClient Using default ZkACLProvider
   [junit4]   2> 1902899 INFO  (TEST-LeaderFailoverAfterPartitionTest.test-seed#[FF75ABE235BDDBAE]) [    ] o.a.s.s.SolrDispatchFilter Loading solr.xml from SolrHome (not found in ZooKeeper)
   [junit4]   2> 1902899 INFO  (TEST-LeaderFailoverAfterPartitionTest.test-seed#[FF75ABE235BDDBAE]) [    ] o.a.s.c.SolrXmlConfig Loading container configuration from /x1/jenkins/jenkins-slave/workspace/Lucene-Solr-Tests-master/solr/build/solr-core/test/J1/temp/solr.cloud.LeaderFailoverAfterPartitionTest_FF75ABE235BDDBAE-001/control-001/solr.xml
   [junit4]   2> 1902903 INFO  (TEST-LeaderFailoverAfterPartitionTest.test-seed#[FF75ABE235BDDBAE]) [    ] o.a.s.c.CorePropertiesLocator Config-defined core root directory: /x1/jenkins/jenkins-slave/workspace/Lucene-Solr-Tests-master/solr/build/solr-core/test/J1/temp/solr.cloud.LeaderFailoverAfterPartitionTest_FF75ABE235BDDBAE-001/control-001/cores
   [junit4]   2> 1902904 INFO  (TEST-LeaderFailoverAfterPartitionTest.test-seed#[FF75ABE235BDDBAE]) [    ] o.a.s.c.CoreContainer New CoreContainer 1378176145
   [junit4]   2> 1902904 INFO  (TEST-LeaderFailoverAfterPartitionTest.test-seed#[FF75ABE235BDDBAE]) [    ] o.a.s.c.CoreContainer Loading cores into CoreContainer [instanceDir=/x1/jenkins/jenkins-slave/workspace/Lucene-Solr-Tests-master/solr/build/solr-core/test/J1/temp/solr.cloud.LeaderFailoverAfterPartitionTest_FF75ABE235BDDBAE-001/control-001]
   [junit4]   2> 1902904 WARN  (TEST-LeaderFailoverAfterPartitionTest.test-seed#[FF75ABE235BDDBAE]) [    ] o.a.s.c.CoreContainer Couldn't add files from /x1/jenkins/jenkins-slave/workspace/Lucene-Solr-Tests-master/solr/build/solr-core/test/J1/temp/solr.cloud.LeaderFailoverAfterPartitionTest_FF75ABE235BDDBAE-001/control-001/lib to classpath: /x1/jenkins/jenkins-slave/workspace/Lucene-Solr-Tests-master/solr/build/solr-core/test/J1/temp/solr.cloud.LeaderFailoverAfterPartitionTest_FF75ABE235BDDBAE-001/control-001/lib
   [junit4]   2> 1902904 INFO  (TEST-LeaderFailoverAfterPartitionTest.test-seed#[FF75ABE235BDDBAE]) [    ] o.a.s.h.c.HttpShardHandlerFactory created with socketTimeout : 90000,urlScheme : ,connTimeout : 15000,maxConnectionsPerHost : 20,maxConnections : 10000,corePoolSize : 0,maximumPoolSize : 2147483647,maxThreadIdleTime : 5,sizeOfQueue : -1,fairnessPolicy : false,useRetries : false,
   [junit4]   2> 1902905 INFO  (TEST-LeaderFailoverAfterPartitionTest.test-seed#[FF75ABE235BDDBAE]) [    ] o.a.s.u.UpdateShardHandler Creating UpdateShardHandler HTTP client with params: socketTimeout=340000&connTimeout=45000&retry=true
   [junit4]   2> 1902905 INFO  (TEST-LeaderFailoverAfterPartitionTest.test-seed#[FF75ABE235BDDBAE]) [    ] o.a.s.l.LogWatcher SLF4J impl is org.slf4j.impl.Log4jLoggerFactory
   [junit4]   2> 1902905 INFO  (TEST-LeaderFailoverAfterPartitionTest.test-seed#[FF75ABE235BDDBAE]) [    ] o.a.s.l.LogWatcher Registering Log Listener [Log4j (org.slf4j.impl.Log4jLoggerFactory)]
   [junit4]   2> 1902905 INFO  (TEST-LeaderFailoverAfterPartitionTest.test-seed#[FF75ABE235BDDBAE]) [    ] o.a.s.c.ZkContainer Zookeeper client=127.0.0.1:44966/solr
   [junit4]   2> 1902905 INFO  (TEST-LeaderFailoverAfterPartitionTest.test-seed#[FF75ABE235BDDBAE]) [    ] o.a.s.c.ZkController zkHost includes chroot
   [junit4]   2> 1902905 INFO  (TEST-LeaderFailoverAfterPartitionTest.test-seed#[FF75ABE235BDDBAE]) [    ] o.a.s.c.c.SolrZkClient Using default ZkCredentialsProvider
   [junit4]   2> 1902906 INFO  (TEST-LeaderFailoverAfterPartitionTest.test-seed#[FF75ABE235BDDBAE]) [    ] o.a.s.c.c.ConnectionManager Waiting for client to connect to ZooKeeper
   [junit4]   2> 1902907 INFO  (zkCallback-1625-thread-1) [    ] o.a.s.c.c.ConnectionManager Watcher org.apache.solr.common.cloud.ConnectionManager@4bc5247c name:ZooKeeperConnection Watcher:127.0.0.1:44966 got event WatchedEvent state:SyncConnected type:None path:null path:null type:None
   [junit4]   2> 1902908 INFO  (TEST-LeaderFailoverAfterPartitionTest.test-seed#[FF75ABE235BDDBAE]) [    ] o.a.s.c.c.ConnectionManager Client is connected to ZooKeeper
   [junit4]   2> 1902908 INFO  (TEST-LeaderFailoverAfterPartitionTest.test-seed#[FF75ABE235BDDBAE]) [    ] o.a.s.c.c.SolrZkClient Using default ZkACLProvider
   [junit4]   2> 1902909 INFO  (TEST-LeaderFailoverAfterPartitionTest.test-seed#[FF75ABE235BDDBAE]) [n:127.0.0.1:49012_    ] o.a.s.c.c.ConnectionManager Waiting for client to connect to ZooKeeper
   [junit4]   2> 1902909 INFO  (zkCallback-1626-thread-1-processing-n:127.0.0.1:49012_) [n:127.0.0.1:49012_    ] o.a.s.c.c.ConnectionManager Watcher org.apache.solr.common.cloud.ConnectionManager@17765f64 name:ZooKeeperConnection Watcher:127.0.0.1:44966/solr got event WatchedEvent state:SyncConnected type:None path:null path:null type:None
   [junit4]   2> 1902910 INFO  (TEST-LeaderFailoverAfterPartitionTest.test-seed#[FF75ABE235BDDBAE]) [n:127.0.0.1:49012_    ] o.a.s.c.c.ConnectionManager Client is connected to ZooKeeper
   [junit4]   2> 1902910 INFO  (TEST-LeaderFailoverAfterPartitionTest.test-seed#[FF75ABE235BDDBAE]) [n:127.0.0.1:49012_    ] o.a.s.c.c.SolrZkClient makePath: /overseer/queue
   [junit4]   2> 1902911 INFO  (TEST-LeaderFailoverAfterPartitionTest.test-seed#[FF75ABE235BDDBAE]) [n:127.0.0.1:49012_    ] o.a.s.c.c.SolrZkClient makePath: /overseer/collection-queue-work
   [junit4]   2> 1902912 INFO  (TEST-LeaderFailoverAfterPartitionTest.test-seed#[FF75ABE235BDDBAE]) [n:127.0.0.1:49012_    ] o.a.s.c.c.SolrZkClient makePath: /overseer/collection-map-running
   [junit4]   2> 1902913 INFO  (TEST-LeaderFailoverAfterPartitionTest.test-seed#[FF75ABE235BDDBAE]) [n:127.0.0.1:49012_    ] o.a.s.c.c.SolrZkClient makePath: /overseer/collection-map-completed
   [junit4]   2> 1902914 INFO  (TEST-LeaderFailoverAfterPartitionTest.test-seed#[FF75ABE235BDDBAE]) [n:127.0.0.1:49012_    ] o.a.s.c.c.SolrZkClient makePath: /overseer/collection-map-failure
   [junit4]   2> 1902915 INFO  (TEST-LeaderFailoverAfterPartitionTest.test-seed#[FF75ABE235BDDBAE]) [n:127.0.0.1:49012_    ] o.a.s.c.c.SolrZkClient makePath: /live_nodes
   [junit4]   2> 1902916 INFO  (TEST-LeaderFailoverAfterPartitionTest.test-seed#[FF75ABE235BDDBAE]) [n:127.0.0.1:49012_    ] o.a.s.c.c.SolrZkClient makePath: /aliases.json
   [junit4]   2> 1902916 INFO  (TEST-LeaderFailoverAfterPartitionTest.test-seed#[FF75ABE235BDDBAE]) [n:127.0.0.1:49012_    ] o.a.s.c.c.SolrZkClient makePath: /clusterstate.json
   [junit4]   2> 1902917 INFO  (TEST-LeaderFailoverAfterPartitionTest.test-seed#[FF75ABE235BDDBAE]) [n:127.0.0.1:49012_    ] o.a.s.c.c.SolrZkClient makePath: /security.json
   [junit4]   2> 1902917 INFO  (TEST-LeaderFailoverAfterPartitionTest.test-seed#[FF75ABE235BDDBAE]) [n:127.0.0.1:49012_    ] o.a.s.c.c.ZkStateReader Updating cluster state from ZooKeeper... 
   [junit4]   2> 1902918 INFO  (TEST-LeaderFailoverAfterPartitionTest.test-seed#[FF75ABE235BDDBAE]) [n:127.0.0.1:49012_    ] o.a.s.c.c.ZkStateReader Updated live nodes from ZooKeeper... (0) -> (0)
   [junit4]   2> 1902919 INFO  (TEST-LeaderFailoverAfterPartitionTest.test-seed#[FF75ABE235BDDBAE]) [n:127.0.0.1:49012_    ] o.a.s.c.c.SolrZkClient makePath: /overseer_elect
   [junit4]   2> 1902920 INFO  (TEST-LeaderFailoverAfterPartitionTest.test-seed#[FF75ABE235BDDBAE]) [n:127.0.0.1:49012_    ] o.a.s.c.c.SolrZkClient makePath: /overseer_elect/election
   [junit4]   2> 1902921 INFO  (TEST-LeaderFailoverAfterPartitionTest.test-seed#[FF75ABE235BDDBAE]) [n:127.0.0.1:49012_    ] o.a.s.c.Overseer Overseer (id=null) closing
   [junit4]   2> 1902921 INFO  (TEST-LeaderFailoverAfterPartitionTest.test-seed#[FF75ABE235BDDBAE]) [n:127.0.0.1:49012_    ] o.a.s.c.LeaderElector Joined leadership election with path: /overseer_elect/election/95631513051529220-127.0.0.1:49012_-n_0000000000
   [junit4]   2> 1902921 INFO  (TEST-LeaderFailoverAfterPartitionTest.test-seed#[FF75ABE235BDDBAE]) [n:127.0.0.1:49012_    ] o.a.s.c.OverseerElectionContext I am going to be the leader 127.0.0.1:49012_
   [junit4]   2> 1902921 INFO  (TEST-LeaderFailoverAfterPartitionTest.test-seed#[FF75ABE235BDDBAE]) [n:127.0.0.1:49012_    ] o.a.s.c.c.SolrZkClient makePath: /overseer_elect/leader
   [junit4]   2> 1902922 INFO  (TEST-LeaderFailoverAfterPartitionTest.test-seed#[FF75ABE235BDDBAE]) [n:127.0.0.1:49012_    ] o.a.s.c.Overseer Overseer (id=95631513051529220-127.0.0.1:49012_-n_0000000000) starting
   [junit4]   2> 1902942 INFO  (TEST-LeaderFailoverAfterPartitionTest.test-seed#[FF75ABE235BDDBAE]) [n:127.0.0.1:49012_    ] o.a.s.c.c.SolrZkClient makePath: /overseer/queue-work
   [junit4]   2> 1903106 INFO  (TEST-LeaderFailoverAfterPartitionTest.test-seed#[FF75ABE235BDDBAE]) [n:127.0.0.1:49012_    ] o.a.s.c.OverseerAutoReplicaFailoverThread Starting OverseerAutoReplicaFailoverThread autoReplicaFailoverWorkLoopDelay=10000 autoReplicaFailoverWaitAfterExpiration=30000 autoReplicaFailoverBadNodeExpiration=60000
   [junit4]   2> 1903114 INFO  (OverseerStateUpdate-95631513051529220-127.0.0.1:49012_-n_0000000000) [n:127.0.0.1:49012_    ] o.a.s.c.Overseer Starting to work on the main queue
   [junit4]   2> 1903114 INFO  (OverseerCollectionConfigSetProcessor-95631513051529220-127.0.0.1:49012_-n_0000000000) [n:127.0.0.1:49012_    ] o.a.s.c.OverseerTaskProcessor Process current queue of overseer operations
   [junit4]   2> 1903122 INFO  (TEST-LeaderFailoverAfterPartitionTest.test-seed#[FF75ABE235BDDBAE]) [n:127.0.0.1:49012_    ] o.a.s.c.ZkController Register node as live in ZooKeeper:/live_nodes/127.0.0.1:49012_
   [junit4]   2> 1903134 INFO  (TEST-LeaderFailoverAfterPartitionTest.test-seed#[FF75ABE235BDDBAE]) [n:127.0.0.1:49012_    ] o.a.s.c.c.SolrZkClient makePath: /live_nodes/127.0.0.1:49012_
   [junit4]   2> 1903142 INFO  (OverseerStateUpdate-95631513051529220-127.0.0.1:49012_-n_0000000000) [n:127.0.0.1:49012_    ] o.a.s.c.c.ZkStateReader Updated live nodes from ZooKeeper... (0) -> (0)
   [junit4]   2> 1903166 INFO  (zkCallback-1626-thread-1-processing-n:127.0.0.1:49012_) [n:127.0.0.1:49012_    ] o.a.s.c.c.ZkStateReader A live node change: [WatchedEvent state:SyncConnected type:NodeChildrenChanged path:/live_nodes], has occurred - updating... (live nodes size: [0])
   [junit4]   2> 1903173 INFO  (TEST-LeaderFailoverAfterPartitionTest.test-seed#[FF75ABE235BDDBAE]) [n:127.0.0.1:49012_    ] o.a.s.c.CoreContainer Security conf doesn't exist. Skipping setup for authorization module.
   [junit4]   2> 1903173 INFO  (TEST-LeaderFailoverAfterPartitionTest.test-seed#[FF75ABE235BDDBAE]) [n:127.0.0.1:49012_    ] o.a.s.c.CoreContainer No authentication plugin used.
   [junit4]   2> 1903174 INFO  (TEST-LeaderFailoverAfterPartitionTest.test-seed#[FF75ABE235BDDBAE]) [n:127.0.0.1:49012_    ] o.a.s.c.CorePropertiesLocator Looking for core definitions underneath /x1/jenkins/jenkins-slave/workspace/Lucene-Solr-Tests-master/solr/build/solr-core/test/J1/temp/solr.cloud.LeaderFailoverAfterPartitionTest_FF75ABE235BDDBAE-001/control-001/cores
   [junit4]   2> 1903175 INFO  (TEST-LeaderFailoverAfterPartitionTest.test-seed#[FF75ABE235BDDBAE]) [n:127.0.0.1:49012_    ] o.a.s.c.CoreDescriptor Created CoreDescriptor: {name=collection1, config=solrconfig.xml, transient=false, schema=schema.xml, loadOnStartup=true, configSetProperties=configsetprops.json, collection=control_collection, coreNodeName=, dataDir=data/, shard=}
   [junit4]   2> 1903175 INFO  (TEST-LeaderFailoverAfterPartitionTest.test-seed#[FF75ABE235BDDBAE]) [n:127.0.0.1:49012_    ] o.a.s.c.CorePropertiesLocator Found core collection1 in /x1/jenkins/jenkins-slave/workspace/Lucene-Solr-Tests-master/solr/build/solr-core/test/J1/temp/solr.cloud.LeaderFailoverAfterPartitionTest_FF75ABE235BDDBAE-001/control-001/cores/collection1
   [junit4]   2> 1903175 INFO  (TEST-LeaderFailoverAfterPartitionTest.test-seed#[FF75ABE235BDDBAE]) [n:127.0.0.1:49012_    ] o.a.s.c.CorePropertiesLocator Found 1 core definitions
   [junit4]   2> 1903182 INFO  (zkCallback-1626-thread-1-processing-n:127.0.0.1:49012_) [n:127.0.0.1:49012_    ] o.a.s.c.c.ZkStateReader Updated live nodes from ZooKeeper... (0) -> (1)
   [junit4]   2> 1903187 INFO  (TEST-LeaderFailoverAfterPartitionTest.test-seed#[FF75ABE235BDDBAE]) [n:127.0.0.1:49012_    ] o.a.s.s.SolrDispatchFilter user.dir=/x1/jenkins/jenkins-slave/workspace/Lucene-Solr-Tests-master/solr/build/solr-core/test/J1
   [junit4]   2> 1903187 INFO  (TEST-LeaderFailoverAfterPartitionTest.test-seed#[FF75ABE235BDDBAE]) [n:127.0.0.1:49012_    ] o.a.s.s.SolrDispatchFilter SolrDispatchFilter.init() done
   [junit4]   2> 1903188 INFO  (coreLoadExecutor-5104-thread-1-processing-n:127.0.0.1:49012_) [n:127.0.0.1:49012_ c:control_collection   x:collection1] o.a.s.c.ZkController publishing state=down
   [junit4]   2> 1903188 INFO  (coreLoadExecutor-5104-thread-1-processing-n:127.0.0.1:49012_) [n:127.0.0.1:49012_ c:control_collection   x:collection1] o.a.s.c.ZkController numShards not found on descriptor - reading it from system property
   [junit4]   2> 1903189 INFO  (OverseerStateUpdate-95631513051529220-127.0.0.1:49012_-n_0000000000) [n:127.0.0.1:49012_    ] o.a.s.c.Overseer processMessage: queueSize: 1, message = {
   [junit4]   2>   "core":"collection1",
   [junit4]   2>   "roles":null,
   [junit4]   2>   "base_url":"http://127.0.0.1:49012",
   [junit4]   2>   "node_name":"127.0.0.1:49012_",
   [junit4]   2>   "numShards":"1",
   [junit4]   2>   "state":"down",
   [junit4]   2>   "shard":null,
   [junit4]   2>   "collection":"control_collection",
   [junit4]   2>   "operation":"state"} current state version: 0
   [junit4]   2> 1903190 INFO  (coreLoadExecutor-5104-thread-1-processing-n:127.0.0.1:49012_) [n:127.0.0.1:49012_ c:control_collection   x:collection1] o.a.s.c.ZkController look for our core node name
   [junit4]   2> 1903190 INFO  (OverseerStateUpdate-95631513051529220-127.0.0.1:49012_-n_0000000000) [n:127.0.0.1:49012_    ] o.a.s.c.o.ReplicaMutator Update state numShards=1 message={
   [junit4]   2>   "core":"collection1",
   [junit4]   2>   "roles":null,
   [junit4]   2>   "base_url":"http://127.0.0.1:49012",
   [junit4]   2>   "node_name":"127.0.0.1:49012_",
   [junit4]   2>   "numShards":"1",
   [junit4]   2>   "state":"down",
   [junit4]   2>   "shard":null,
   [junit4]   2>   "collection":"control_collection",
   [junit4]   2>   "operation":"state"}
   [junit4]   2> 1903195 INFO  (OverseerStateUpdate-95631513051529220-127.0.0.1:49012_-n_0000000000) [n:127.0.0.1:49012_    ] o.a.s.c.o.ClusterStateMutator building a new cName: control_collection
   [junit4]   2> 1903195 INFO  (OverseerStateUpdate-95631513051529220-127.0.0.1:49012_-n_0000000000) [n:127.0.0.1:49012_    ] o.a.s.c.o.ReplicaMutator Assigning new node to shard shard=shard1
   [junit4]   2> 1903196 INFO  (zkCallback-1626-thread-1-processing-n:127.0.0.1:49012_) [n:127.0.0.1:49012_    ] o.a.s.c.c.ZkStateReader A cluster state change: [WatchedEvent state:SyncConnected type:NodeDataChanged path:/clusterstate.json], has occurred - updating... (live nodes size: [1])
   [junit4]   2> 1904195 INFO  (coreLoadExecutor-5104-thread-1-processing-n:127.0.0.1:49012_) [n:127.0.0.1:49012_ c:control_collection   x:collection1] o.a.s.c.ZkController waiting to find shard id in clusterstate for collection1
   [junit4]   2> 1904195 INFO  (coreLoadExecutor-5104-thread-1-processing-n:127.0.0.1:49012_) [n:127.0.0.1:49012_ c:control_collection   x:collection1] o.a.s.c.ZkController Check for collection zkNode:control_collection
   [junit4]   2> 1904210 INFO  (coreLoadExecutor-5104-thread-1-processing-n:127.0.0.1:49012_) [n:127.0.0.1:49012_ c:control_collection   x:collection1] o.a.s.c.ZkController Collection zkNode exists
   [junit4]   2> 1904210 INFO  (coreLoadExecutor-5104-thread-1-processing-n:127.0.0.1:49012_) [n:127.0.0.1:49012_ c:control_collection   x:collection1] o.a.s.c.c.ZkStateReader Load collection config from: [/collections/control_collection]
   [junit4]   2> 1904326 INFO  (coreLoadExecutor-5104-thread-1-processing-n:127.0.0.1:49012_) [n:127.0.0.1:49012_ c:control_collection   x:collection1] o.a.s.c.c.ZkStateReader path=[/collections/control_collection] [configName]=[conf1] specified config exists in ZooKeeper
   [junit4]   2> 1904326 INFO  (coreLoadExecutor-5104-thread-1-processing-n:127.0.0.1:49012_) [n:127.0.0.1:49012_ c:control_collection   x:collection1] o.a.s.c.SolrResourceLoader new SolrResourceLoader for directory: '/x1/jenkins/jenkins-slave/workspace/Lucene-Solr-Tests-master/solr/build/solr-core/test/J1/temp/solr.cloud.LeaderFailoverAfterPartitionTest_FF75ABE235BDDBAE-001/control-001/cores/collection1'
   [junit4]   2> 1904326 INFO  (coreLoadExecutor-5104-thread-1-processing-n:127.0.0.1:49012_) [n:127.0.0.1:49012_ c:control_collection   x:collection1] o.a.s.c.SolrResourceLoader JNDI not configured for solr (NoInitialContextEx)
   [junit4]   2> 1904326 INFO  (coreLoadExecutor-5104-thread-1-processing-n:127.0.0.1:49012_) [n:127.0.0.1:49012_ c:control_collection   x:collection1] o.a.s.c.SolrResourceLoader solr home defaulted to 'solr/' (could not find system property or JNDI)
   [junit4]   2> 1904358 INFO  (coreLoadExecutor-5104-thread-1-processing-n:127.0.0.1:49012_) [n:127.0.0.1:49012_ c:control_collection   x:collection1] o.a.s.c.Config loaded config solrconfig.xml with version 0 
   [junit4]   2> 1904402 INFO  (coreLoadExecutor-5104-thread-1-processing-n:127.0.0.1:49012_) [n:127.0.0.1:49012_ c:control_collection   x:collection1] o.a.s.c.SolrConfig current version of requestparams : -1
   [junit4]   2> 1904404 WARN  (coreLoadExecutor-5104-thread-1-processing-n:127.0.0.1:49012_) [n:127.0.0.1:49012_ c:control_collection   x:collection1] o.a.s.c.Config Beginning with Solr 5.5, <mergePolicy> is deprecated, use <mergePolicyFactory> instead.
   [junit4]   2> 1904404 INFO  (coreLoadExecutor-5104-thread-1-processing-n:127.0.0.1:49012_) [n:127.0.0.1:49012_ c:control_collection   x:collection1] o.a.s.c.SolrConfig Using Lucene MatchVersion: 7.0.0
   [junit4]   2> 1904424 INFO  (coreLoadExecutor-5104-thread-1-processing-n:127.0.0.1:49012_) [n:127.0.0.1:49012_ c:control_collection   x:collection1] o.a.s.c.SolrConfig Loaded SolrConfig: solrconfig.xml
   [junit4]   2> 1904429 INFO  (coreLoadExecutor-5104-thread-1-processing-n:127.0.0.1:49012_) [n:127.0.0.1:49012_ c:control_collection   x:collection1] o.a.s.s.IndexSchema [collection1] Schema name=test
   [junit4]   2> 1904538 INFO  (coreLoadExecutor-5104-thread-1-processing-n:127.0.0.1:49012_) [n:127.0.0.1:49012_ c:control_collection   x:collection1] o.a.s.s.OpenExchangeRatesOrgProvider Initialized with rates=open-exchange-rates.json, refreshInterval=1440.
   [junit4]   2> 1904558 INFO  (coreLoadExecutor-5104-thread-1-processing-n:127.0.0.1:49012_) [n:127.0.0.1:49012_ c:control_collection   x:collection1] o.a.s.s.IndexSchema default search field in schema is text
   [junit4]   2> 1904563 INFO  (coreLoadExecutor-5104-thread-1-processing-n:127.0.0.1:49012_) [n:127.0.0.1:49012_ c:control_collection   x:collection1] o.a.s.s.IndexSchema unique key field: id
   [junit4]   2> 1904587 INFO  (coreLoadExecutor-5104-thread-1-processing-n:127.0.0.1:49012_) [n:127.0.0.1:49012_ c:control_collection   x:collection1] o.a.s.s.FileExchangeRateProvider Reloading exchange rates from file currency.xml
   [junit4]   2> 1904589 INFO  (coreLoadExecutor-5104-thread-1-processing-n:127.0.0.1:49012_) [n:127.0.0.1:49012_ c:control_collection   x:collection1] o.a.s.s.FileExchangeRateProvider Reloading exchange rates from file currency.xml
   [junit4]   2> 1904590 INFO  (coreLoadExecutor-5104-thread-1-processing-n:127.0.0.1:49012_) [n:127.0.0.1:49012_ c:control_collection   x:collection1] o.a.s.s.OpenExchangeRatesOrgProvider Reloading exchange rates from open-exchange-rates.json
   [junit4]   2> 1904592 INFO  (coreLoadExecutor-5104-thread-1-processing-n:127.0.0.1:49012_) [n:127.0.0.1:49012_ c:control_collection   x:collection1] o.a.s.s.OpenExchangeRatesOrgProvider Reloading exchange rates from open-exchange-rates.json
   [junit4]   2> 1904593 INFO  (coreLoadExecutor-5104-thread-1-processing-n:127.0.0.1:49012_) [n:127.0.0.1:49012_ c:control_collection   x:collection1] o.a.s.c.ConfigSetProperties Did not find ConfigSet properties, assuming default properties: Can't find resource 'configsetprops.json' in classpath or '/configs/conf1', cwd=/x1/jenkins/jenkins-slave/workspace/Lucene-Solr-Tests-master/solr/build/solr-core/test/J1
   [junit4]   2> 1904593 INFO  (coreLoadExecutor-5104-thread-1-processing-n:127.0.0.1:49012_) [n:127.0.0.1:49012_ c:control_collection   x:collection1] o.a.s.c.CoreContainer Creating SolrCore 'collection1' using configuration from collection control_collection
   [junit4]   2> 1904593 INFO  (coreLoadExecutor-5104-thread-1-processing-n:127.0.0.1:49012_) [n:127.0.0.1:49012_ c:control_collection s:shard1 r:core_node1 x:collection1] o.a.s.c.SolrCore org.apache.solr.core.MockDirectoryFactory
   [junit4]   2> 1904593 INFO  (coreLoadExecutor-5104-thread-1-processing-n:127.0.0.1:49012_) [n:127.0.0.1:49012_ c:control_collection s:shard1 r:core_node1 x:collection1] o.a.s.c.SolrCore [[collection1] ] Opening new SolrCore at [/x1/jenkins/jenkins-slave/workspace/Lucene-Solr-Tests-master/solr/build/solr-core/test/J1/temp/solr.cloud.LeaderFailoverAfterPartitionTest_FF75ABE235BDDBAE-001/control-001/cores/collection1], dataDir=[/x1/jenkins/jenkins-slave/workspace/Lucene-Solr-Tests-master/solr/build/solr-core/test/J1/temp/solr.cloud.LeaderFailoverAfterPartitionTest_FF75ABE235BDDBAE-001/control-001/cores/collection1/data/]
   [junit4]   2> 1904594 INFO  (coreLoadExecutor-5104-thread-1-processing-n:127.0.0.1:49012_) [n:127.0.0.1:49012_ c:control_collection s:shard1 r:core_node1 x:collection1] o.a.s.c.JmxMonitoredMap JMX monitoring is enabled. Adding Solr mbeans to JMX Server: com.sun.jmx.mbeanserver.JmxMBeanServer@4c15b7a9
   [junit4]   2> 1904594 INFO  (coreLoadExecutor-5104-thread-1-processing-n:127.0.0.1:49012_) [n:127.0.0.1:49012_ c:control_collection s:shard1 r:core_node1 x:collection1] o.a.s.c.CachingDirectoryFactory return new directory for /x1/jenkins/jenkins-slave/workspace/Lucene-Solr-Tests-master/solr/build/solr-core/test/J1/temp/solr.cloud.LeaderFailoverAfterPartitionTest_FF75ABE235BDDBAE-001/control-001/cores/collection1/data
   [junit4]   2> 1904597 INFO  (coreLoadExecutor-5104-thread-1-processing-n:127.0.0.1:49012_) [n:127.0.0.1:49012_ c:control_collection s:shard1 r:core_node1 x:collection1] o.a.s.c.SolrCore New index directory detected: old=null new=/x1/jenkins/jenkins-slave/workspace/Lucene-Solr-Tests-master/solr/build/solr-core/test/J1/temp/solr.cloud.LeaderFailoverAfterPartitionTest_FF75ABE235BDDBAE-001/control-001/cores/collection1/data/index/
   [junit4]   2> 1904597 WARN  (coreLoadExecutor-5104-thread-1-processing-n:127.0.0.1:49012_) [n:127.0.0.1:49012_ c:control_collection s:shard1 r:core_node1 x:collection1] o.a.s.c.SolrCore [collection1] Solr index directory '/x1/jenkins/jenkins-slave/workspace/Lucene-Solr-Tests-master/solr/build/solr-core/test/J1/temp/solr.cloud.LeaderFailoverAfterPartitionTest_FF75ABE235BDDBAE-001/control-001/cores/collection1/data/index' doesn't exist. Creating new index...
   [junit4]   2> 1904597 INFO  (coreLoadExecutor-5104-thread-1-processing-n:127.0.0.1:49012_) [n:127.0.0.1:49012_ c:control_collection s:shard1 r:core_node1 x:collection1] o.a.s.c.CachingDirectoryFactory return new directory for /x1/jenkins/jenkins-slave/workspace/Lucene-Solr-Tests-master/solr/build/solr-core/test/J1/temp/solr.cloud.LeaderFailoverAfterPartitionTest_FF75ABE235BDDBAE-001/control-001/cores/collection1/data/index
   [junit4]   2> 1904597 INFO  (coreLoadExecutor-5104-thread-1-processing-n:127.0.0.1:49012_) [n:127.0.0.1:49012_ c:control_collection s:shard1 r:core_node1 x:collection1] o.a.s.u.RandomMergePolicy RandomMergePolicy wrapping class org.apache.lucene.index.TieredMergePolicy: [TieredMergePolicy: maxMergeAtOnce=11, maxMergeAtOnceExplicit=41, maxMergedSegmentMB=73.0478515625, floorSegmentMB=0.853515625, forceMergeDeletesPctAllowed=27.090863793479382, segmentsPerTier=29.0, maxCFSSegmentSizeMB=8.796093022207999E12, noCFSRatio=0.2927071394180645
   [junit4]   2> 1904599 INFO  (coreLoadExecutor-5104-thread-1-processing-n:127.0.0.1:49012_) [n:127.0.0.1:49012_ c:control_collection s:shard1 r:core_node1 x:collection1] o.a.s.c.SolrDeletionPolicy SolrDeletionPolicy.onCommit: commits: num=1
   [junit4]   2> 	commit{dir=MockDirectoryWrapper(RAMDirectory@3254d07 lockFactory=org.apache.lucene.store.SingleInstanceLockFactory@2ccc9f3),segFN=segments_1,generation=1}
   [junit4]   2> 1904599 INFO  (coreLoadExecutor-5104-thread-1-processing-n:127.0.0.1:49012_) [n:127.0.0.1:49012_ c:control_collection s:shard1 r:core_node1 x:collection1] o.a.s.c.SolrDeletionPolicy newest commit generation = 1
   [junit4]   2> 1904599 INFO  (OldIndexDirectoryCleanupThreadForCore-collection1) [n:127.0.0.1:49012_ c:control_collection s:shard1 r:core_node1 x:collection1] o.a.s.c.SolrCore Looking for old index directories to cleanup for core collection1 in /x1/jenkins/jenkins-slave/workspace/Lucene-Solr-Tests-master/solr/build/solr-core/test/J1/temp/solr.cloud.LeaderFailoverAfterPartitionTest_FF75ABE235BDDBAE-001/control-001/cores/collection1/data/
   [junit4]   2> 1904600 WARN  (OldIndexDirectoryCleanupThreadForCore-collection1) [n:127.0.0.1:49012_ c:control_collection s:shard1 r:core_node1 x:collection1] o.a.s.c.DirectoryFactory /x1/jenkins/jenkins-slave/workspace/Lucene-Solr-Tests-master/solr/build/solr-core/test/J1/temp/solr.cloud.LeaderFailoverAfterPartitionTest_FF75ABE235BDDBAE-001/control-001/cores/collection1/data/ does not point to a valid data directory; skipping clean-up of old index directories.
   [junit4]   2> 1904602 INFO  (coreLoadExecutor-5104-thread-1-processing-n:127.0.0.1:49012_) [n:127.0.0.1:49012_ c:control_collection s:shard1 r:core_node1 x:collection1] o.a.s.u.p.UpdateRequestProcessorChain creating updateRequestProcessorChain "nodistrib"
   [junit4]   2> 1904602 INFO  (coreLoadExecutor-5104-thread-1-processing-n:127.0.0.1:49012_) [n:127.0.0.1:49012_ c:control_collection s:shard1 r:core_node1 x:collection1] o.a.s.u.p.UpdateRequestProcessorChain creating updateRequestProcessorChain "dedupe"
   [junit4]   2> 1904602 INFO  (coreLoadExecutor-5104-thread-1-processing-n:127.0.0.1:49012_) [n:127.0.0.1:49012_ c:control_collection s:shard1 r:core_node1 x:collection1] o.a.s.u.p.UpdateRequestProcessorChain inserting DistributedUpdateProcessorFactory into updateRequestProcessorChain "dedupe"
   [junit4]   2> 1904602 INFO  (coreLoadExecutor-5104-thread-1-processing-n:127.0.0.1:49012_) [n:127.0.0.1:49012_ c:control_collection s:shard1 r:core_node1 x:collection1] o.a.s.u.p.UpdateRequestProcessorChain creating updateRequestProcessorChain "stored_sig"
   [junit4]   2> 1904602 INFO  (coreLoadExecutor-5104-thread-1-processing-n:127.0.0.1:49012_) [n:127.0.0.1:49012_ c:control_collection s:shard1 r:core_node1 x:collection1] o.a.s.u.p.UpdateRequestProcessorChain inserting DistributedUpdateProcessorFactory into updateRequestProcessorChain "stored_sig"
   [junit4]   2> 1904602 INFO  (coreLoadExecutor-5104-thread-1-processing-n:127.0.0.1:49012_) [n:127.0.0.1:49012_ c:control_collection s:shard1 r:core_node1 x:collection1] o.a.s.u.p.UpdateRequestProcessorChain creating updateRequestProcessorChain "distrib-dup-test-chain-explicit"
   [junit4]   2> 1904602 INFO  (coreLoadExecutor-5104-thread-1-processing-n:127.0.0.1:49012_) [n:127.0.0.1:49012_ c:control_collection s:shard1 r:core_node1 x:collection1] o.a.s.u.p.UpdateRequestProcessorChain creating updateRequestProcessorChain "distrib-dup-test-chain-implicit"
   [junit4]   2> 1904602 INFO  (coreLoadExecutor-5104-thread-1-processing-n:127.0.0.1:49012_) [n:127.0.0.1:49012_ c:control_collection s:shard1 r:core_node1 x:collection1] o.a.s.u.p.UpdateRequestProcessorChain inserting DistributedUpdateProcessorFactory into updateRequestProcessorChain "distrib-dup-test-chain-implicit"
   [junit4]   2> 1904603 INFO  (coreLoadExecutor-5104-thread-1-processing-n:127.0.0.1:49012_) [n:127.0.0.1:49012_ c:control_collection s:shard1 r:core_node1 x:collection1] o.a.s.c.SolrCore no updateRequestProcessorChain defined as default, creating implicit default
   [junit4]   2> 1904603 WARN  (coreLoadExecutor-5104-thread-1-processing-n:127.0.0.1:49012_) [n:127.0.0.1:49012_ c:control_collection s:shard1 r:core_node1 x:collection1] o.a.s.c.RequestHandlers INVALID paramSet a in requestHandler {type = requestHandler,name = /dump,class = DumpRequestHandler,args = {defaults={a=A,b=B}}}
   [junit4]   2> 1904604 INFO  (coreLoadExecutor-5104-thread-1-processing-n:127.0.0.1:49012_) [n:127.0.0.1:49012_ c:control_collection s:shard1 r:core_node1 x:collection1] o.a.s.h.l.XMLLoader xsltCacheLifetimeSeconds=60
   [junit4]   2> 1904604 INFO  (coreLoadExecutor-5104-thread-1-processing-n:127.0.0.1:49012_) [n:127.0.0.1:49012_ c:control_collection s:shard1 r:core_node1 x:collection1] o.a.s.h.l.XMLLoader xsltCacheLifetimeSeconds=60
   [junit4]   2> 1904605 INFO  (coreLoadExecutor-5104-thread-1-processing-n:127.0.0.1:49012_) [n:127.0.0.1:49012_ c:control_collection s:shard1 r:core_node1 x:collection1] o.a.s.h.l.XMLLoader xsltCacheLifetimeSeconds=60
   [junit4]   2> 1904605 INFO  (coreLoadExecutor-5104-thread-1-processing-n:127.0.0.1:49012_) [n:127.0.0.1:49012_ c:control_collection s:shard1 r:core_node1 x:collection1] o.a.s.h.l.XMLLoader xsltCacheLifetimeSeconds=60
   [junit4]   2> 1904607 INFO  (coreLoadExecutor-5104-thread-1-processing-n:127.0.0.1:49012_) [n:127.0.0.1:49012_ c:control_collection s:shard1 r:core_node1 x:collection1] o.a.s.c.RequestHandlers Registered paths: /admin/mbeans,standard,/dump,/update/csv,/sql,/update/json/docs,/admin/luke,/export,/admin/segments,/get,/admin/system,/replication,/admin/properties,/config,/stream,/schema,/admin/plugins,/admin/logging,/update/json,/admin/ping,/admin/threads,/update,/admin/file
   [junit4]   2> 1904607 INFO  (coreLoadExecutor-5104-thread-1-processing-n:127.0.0.1:49012_) [n:127.0.0.1:49012_ c:control_collection s:shard1 r:core_node1 x:collection1] o.a.s.c.SolrCore Using default statsCache cache: org.apache.solr.search.stats.LocalStatsCache
   [junit4]   2> 1904608 INFO  (coreLoadExecutor-5104-thread-1-processing-n:127.0.0.1:49012_) [n:127.0.0.1:49012_ c:control_collection s:shard1 r:core_node1 x:collection1] o.a.s.u.UpdateHandler Using UpdateLog implementation: org.apache.solr.update.UpdateLog
   [junit4]   2> 1904608 INFO  (coreLoadExecutor-5104-thread-1-processing-n:127.0.0.1:49012_) [n:127.0.0.1:49012_ c:control_collection s:shard1 r:core_node1 x:collection1] o.a.s.u.UpdateLog Initializing UpdateLog: dataDir= defaultSyncLevel=FLUSH numRecordsToKeep=100 maxNumLogsToKeep=10 numVersionBuckets=65536
   [junit4]   2> 1904608 INFO  (coreLoadExecutor-5104-thread-1-processing-n:127.0.0.1:49012_) [n:127.0.0.1:49012_ c:control_collection s:shard1 r:core_node1 x:collection1] o.a.s.u.CommitTracker Hard AutoCommit: disabled
   [junit4]   2> 1904608 INFO  (coreLoadExecutor-5104-thread-1-processing-n:127.0.0.1:49012_) [n:127.0.0.1:49012_ c:control_collection s:shard1 r:core_node1 x:collection1] o.a.s.u.CommitTracker Soft AutoCommit: disabled
   [junit4]   2> 1904608 INFO  (coreLoadExecutor-5104-thread-1-processing-n:127.0.0.1:49012_) [n:127.0.0.1:49012_ c:control_collection s:shard1 r:core_node1 x:collection1] o.a.s.u.RandomMergePolicy RandomMergePolicy wrapping class org.apache.lucene.index.TieredMergePolicy: [TieredMergePolicy: maxMergeAtOnce=20, maxMergeAtOnceExplicit=15, maxMergedSegmentMB=11.30078125, floorSegmentMB=0.2041015625, forceMergeDeletesPctAllowed=7.845104127820022, segmentsPerTier=50.0, maxCFSSegmentSizeMB=8.796093022207999E12, noCFSRatio=0.1493903169955723
   [junit4]   2> 1904609 INFO  (coreLoadExecutor-5104-thread-1-processing-n:127.0.0.1:49012_) [n:127.0.0.1:49012_ c:control_collection s:shard1 r:core_node1 x:collection1] o.a.s.c.SolrDeletionPolicy SolrDeletionPolicy.onInit: commits: num=1
   [junit4]   2> 	commit{dir=MockDirectoryWrapper(RAMDirectory@3254d07 lockFactory=org.apache.lucene.store.SingleInstanceLockFactory@2ccc9f3),segFN=segments_1,generation=1}
   [junit4]   2> 1904609 INFO  (coreLoadExecutor-5104-thread-1-processing-n:127.0.0.1:49012_) [n:127.0.0.1:49012_ c:control_collection s:shard1 r:core_node1 x:collection1] o.a.s.c.SolrDeletionPolicy newest commit generation = 1
   [junit4]   2> 1904609 INFO  (coreLoadExecutor-5104-thread-1-processing-n:127.0.0.1:49012_) [n:127.0.0.1:49012_ c:control_collection s:shard1 r:core_node1 x:collection1] o.a.s.s.SolrIndexSearcher Opening [Searcher@2bc5c2b1[collection1] main]
   [junit4]   2> 1904609 INFO  (coreLoadExecutor-5104-thread-1-processing-n:127.0.0.1:49012_) [n:127.0.0.1:49012_ c:control_collection s:shard1 r:core_node1 x:collection1] o.a.s.c.c.ZkStateReader Load collection config from: [/collections/control_collection]
   [junit4]   2> 1904609 INFO  (coreLoadExecutor-5104-thread-1-processing-n:127.0.0.1:49012_) [n:127.0.0.1:49012_ c:control_collection s:shard1 r:core_node1 x:collection1] o.a.s.c.c.ZkStateReader path=[/collections/control_collection] [configName]=[conf1] specified config exists in ZooKeeper
   [junit4]   2> 1904609 INFO  (coreLoadExecutor-5104-thread-1-processing-n:127.0.0.1:49012_) [n:127.0.0.1:49012_ c:control_collection s:shard1 r:core_node1 x:collection1] o.a.s.r.ManagedResourceStorage Setting up ZooKeeper-based storage for the RestManager with znodeBase: /configs/conf1
   [junit4]   2> 1904610 INFO  (coreLoadExecutor-5104-thread-1-processing-n:127.0.0.1:49012_) [n:127.0.0.1:49012_ c:control_collection s:shard1 r:core_node1 x:collection1] o.a.s.r.ManagedResourceStorage Configured ZooKeeperStorageIO with znodeBase: /configs/conf1
   [junit4]   2> 1904610 INFO  (coreLoadExecutor-5104-thread-1-processing-n:127.0.0.1:49012_) [n:127.0.0.1:49012_ c:control_collection s:shard1 r:core_node1 x:collection1] o.a.s.r.RestManager Initializing RestManager with initArgs: {}
   [junit4]   2> 1904610 INFO  (coreLoadExecutor-5104-thread-1-processing-n:127.0.0.1:49012_) [n:127.0.0.1:49012_ c:control_collection s:shard1 r:core_node1 x:collection1] o.a.s.r.ManagedResourceStorage Reading _rest_managed.json using ZooKeeperStorageIO:path=/configs/conf1
   [junit4]   2> 1904610 INFO  (coreLoadExecutor-5104-thread-1-processing-n:127.0.0.1:49012_) [n:127.0.0.1:49012_ c:control_collection s:shard1 r:core_node1 x:collection1] o.a.s.r.ManagedResourceStorage No data found for znode /configs/conf1/_rest_managed.json
   [junit4]   2> 1904610 INFO  (coreLoadExecutor-5104-thread-1-processing-n:127.0.0.1:49012_) [n:127.0.0.1:49012_ c:control_collection s:shard1 r:core_node1 x:collection1] o.a.s.r.ManagedResourceStorage Loaded null at path _rest_managed.json using ZooKeeperStorageIO:path=/configs/conf1
   [junit4]   2> 1904610 INFO  (coreLoadExecutor-5104-thread-1-processing-n:127.0.0.1:49012_) [n:127.0.0.1:49012_ c:control_collection s:shard1 r:core_node1 x:collection1] o.a.s.r.RestManager Initializing 0 registered ManagedResources
   [junit4]   2> 1904610 INFO  (coreLoadExecutor-5104-thread-1-processing-n:127.0.0.1:49012_) [n:127.0.0.1:49012_ c:control_collection s:shard1 r:core_node1 x:collection1] o.a.s.h.ReplicationHandler Commits will be reserved for  10000
   [junit4]   2> 1904611 INFO  (searcherExecutor-5105-thread-1-processing-n:127.0.0.1:49012_ x:collection1 s:shard1 c:control_collection r:core_node1) [n:127.0.0.1:49012_ c:control_collection s:shard1 r:core_node1 x:collection1] o.a.s.c.SolrCore [collection1] Registered new searcher Searcher@2bc5c2b1[collection1] main{ExitableDirectoryReader(UninvertingDirectoryReader())}
   [junit4]   2> 1904611 INFO  (coreLoadExecutor-5104-thread-1-processing-n:127.0.0.1:49012_) [n:127.0.0.1:49012_ c:control_collection s:shard1 r:core_node1 x:collection1] o.a.s.u.UpdateLog Looking up max value of version field to seed version buckets
   [junit4]   2> 1904611 INFO  (coreLoadExecutor-5104-thread-1-processing-n:127.0.0.1:49012_) [n:127.0.0.1:49012_ c:control_collection s:shard1 r:core_node1 x:collection1] o.a.s.u.VersionInfo Refreshing highest value of _version_ for 65536 version buckets from index
   [junit4]   2> 1904611 INFO  (coreLoadExecutor-5104-thread-1-processing-n:127.0.0.1:49012_) [n:127.0.0.1:49012_ c:control_collection s:shard1 r:core_node1 x:collection1] o.a.s.u.VersionInfo No terms found for _version_, cannot seed version bucket highest value from index
   [junit4]   2> 1904611 INFO  (coreLoadExecutor-5104-thread-1-processing-n:127.0.0.1:49012_) [n:127.0.0.1:49012_ c:control_collection s:shard1 r:core_node1 x:collection1] o.a.s.u.UpdateLog Could not find max version in index or recent updates, using new clock 1530104210863947776
   [junit4]   2> 1904613 INFO  (coreLoadExecutor-5104-thread-1-processing-n:127.0.0.1:49012_) [n:127.0.0.1:49012_ c:control_collection s:shard1 r:core_node1 x:collection1] o.a.s.u.UpdateLog Took 1.0ms to seed version buckets with highest version 1530104210863947776
   [junit4]   2> 1904613 INFO  (coreLoadExecutor-5104-thread-1-processing-n:127.0.0.1:49012_) [n:127.0.0.1:49012_ c:control_collection s:shard1 r:core_node1 x:collection1] o.a.s.c.ZkController watch zkdir /configs/conf1
   [junit4]   2> 1904613 INFO  (coreLoadExecutor-5104-thread-1-processing-n:127.0.0.1:49012_) [n:127.0.0.1:49012_ c:control_collection s:shard1 r:core_node1 x:collection1] o.a.s.c.CoreContainer registering core: collection1
   [junit4]   2> 1904613 INFO  (coreZkRegister-5098-thread-1-processing-n:127.0.0.1:49012_ x:collection1 s:shard1 c:control_collection r:core_node1) [n:127.0.0.1:49012_ c:control_collection s:shard1 r:core_node1 x:collection1] o.a.s.c.ZkController Register replica - core:collection1 address:http://127.0.0.1:49012 collection:control_collection shard:shard1
   [junit4]   2> 1904614 INFO  (coreZkRegister-5098-thread-1-processing-n:127.0.0.1:49012_ x:collection1 s:shard1 c:control_collection r:core_node1) [n:127.0.0.1:49012_ c:control_collection s:shard1 r:core_node1 x:collection1] o.a.s.c.c.SolrZkClient makePath: /collections/control_collection/leader_elect/shard1/election
   [junit4]   2> 1904616 INFO  (coreZkRegister-5098-thread-1-processing-n:127.0.0.1:49012_ x:collection1 s:shard1 c:control_collection r:core_node1) [n:127.0.0.1:49012_ c:control_collection s:shard1 r:core_node1 x:collection1] o.a.s.c.LeaderElector Joined leadership election with path: /collections/control_collection/leader_elect/shard1/election/95631513051529220-core_node1-n_0000000000
   [junit4]   2> 1904617 INFO  (coreZkRegister-5098-thread-1-processing-n:127.0.0.1:49012_ x:collection1 s:shard1 c:control_collection r:core_node1) [n:127.0.0.1:49012_ c:control_collection s:shard1 r:core_node1 x:collection1] o.a.s.c.ShardLeaderElectionContext Running the leader process for shard=shard1 and weAreReplacement=false and leaderVoteWait=10000
   [junit4]   2> 1904617 INFO  (coreZkRegister-5098-thread-1-processing-n:127.0.0.1:49012_ x:collection1 s:shard1 c:control_collection r:core_node1) [n:127.0.0.1:49012_ c:control_collection s:shard1 r:core_node1 x:collection1] o.a.s.c.ShardLeaderElectionContext Enough replicas found to continue.
   [junit4]   2> 1904617 INFO  (coreZkRegister-5098-thread-1-processing-n:127.0.0.1:49012_ x:collection1 s:shard1 c:control_collection r:core_node1) [n:127.0.0.1:49012_ c:control_collection s:shard1 r:core_node1 x:collection1] o.a.s.c.ShardLeaderElectionContext I may be the new leader - try and sync
   [junit4]   2> 1904617 INFO  (coreZkRegister-5098-thread-1-processing-n:127.0.0.1:49012_ x:collection1 s:shard1 c:control_collection r:core_node1) [n:127.0.0.1:49012_ c:control_collection s:shard1 r:core_node1 x:collection1] o.a.s.c.SyncStrategy Sync replicas to http://127.0.0.1:49012/collection1/
   [junit4]   2> 1904617 INFO  (coreZkRegister-5098-thread-1-processing-n:127.0.0.1:49012_ x:collection1 s:shard1 c:control_collection r:core_node1) [n:127.0.0.1:49012_ c:control_collection s:shard1 r:core_node1 x:collection1] o.a.s.c.SyncStrategy Sync Success - now sync replicas to me
   [junit4]   2> 1904618 INFO  (coreZkRegister-5098-thread-1-processing-n:127.0.0.1:49012_ x:collection1 s:shard1 c:control_collection r:core_node1) [n:127.0.0.1:49012_ c:control_collection s:shard1 r:core_node1 x:collection1] o.a.s.c.SyncStrategy http://127.0.0.1:49012/collection1/ has no replicas
   [junit4]   2> 1904618 INFO  (coreZkRegister-5098-thread-1-processing-n:127.0.0.1:49012_ x:collection1 s:shard1 c:control_collection r:core_node1) [n:127.0.0.1:49012_ c:control_collection s:shard1 r:core_node1 x:collection1] o.a.s.c.c.SolrZkClient makePath: /collections/control_collection/leaders/shard1
   [junit4]   2> 1904619 INFO  (coreZkRegister-5098-thread-1-processing-n:127.0.0.1:49012_ x:collection1 s:shard1 c:control_collection r:core_node1) [n:127.0.0.1:49012_ c:control_collection s:shard1 r:core_node1 x:collection1] o.a.s.c.ShardLeaderElectionContextBase Creating leader registration node /collections/control_collection/leaders/shard1/leader after winning as /collections/control_collection/leader_elect/shard1/election/95631513051529220-core_node1-n_0000000000
   [junit4]   2> 1904624 INFO  (OverseerStateUpdate-95631513051529220-127.0.0.1:49012_-n_0000000000) [n:127.0.0.1:49012_    ] o.a.s.c.Overseer processMessage: queueSize: 1, message = {
   [junit4]   2>   "operation":"leader",
   [junit4]   2>   "shard":"shard1",
   [junit4]   2>   "collection":"control_collection"} current state version: 1
   [junit4]   2> 1904631 INFO  (coreZkRegister-5098-thread-1-processing-n:127.0.0.1:49012_ x:collection1 s:shard1 c:control_collection r:core_node1) [n:127.0.0.1:49012_ c:control_collection s:shard1 r:core_node1 x:collection1] o.a.s.c.ShardLeaderElectionContext I am the new leader: http://127.0.0.1:49012/collection1/ shard1
   [junit4]   2> 1904632 INFO  (OverseerStateUpdate-95631513051529220-127.0.0.1:49012_-n_0000000000) [n:127.0.0.1:49012_    ] o.a.s.c.Overseer processMessage: queueSize: 1, message = {
   [junit4]   2>   "operation":"leader",
   [junit4]   2>   "shard":"shard1",
   [junit4]   2>   "collection":"control_collection",
   [junit4]   2>   "base_url":"http://127.0.0.1:49012",
   [junit4]   2>   "core":"collection1",
   [junit4]   2>   "state":"active"} current state version: 1
   [junit4]   2> 1904696 INFO  (TEST-LeaderFailoverAfterPartitionTest.test-seed#[FF75ABE235BDDBAE]) [    ] o.a.s.c.c.SolrZkClient Using default ZkCredentialsProvider
   [junit4]   2> 1904696 INFO  (TEST-LeaderFailoverAfterPartitionTest.test-seed#[FF75ABE235BDDBAE]) [    ] o.a.s.c.c.ConnectionManager Waiting for client to connect to ZooKeeper
   [junit4]   2> 1904710 INFO  (zkCallback-1628-thread-1) [    ] o.a.s.c.c.ConnectionManager Watcher org.apache.solr.common.cloud.ConnectionManager@10055bf2 name:ZooKeeperConnection Watcher:127.0.0.1:44966/solr got event WatchedEvent state:SyncConnected type:None path:null path:null type:None
   [junit4]   2> 1904714 INFO  (TEST-LeaderFailoverAfterPartitionTest.test-seed#[FF75ABE235BDDBAE]) [    ] o.a.s.c.c.ConnectionManager Client is connected to ZooKeeper
   [junit4]   2> 1904714 INFO  (TEST-LeaderFailoverAfterPartitionTest.test-seed#[FF75ABE235BDDBAE]) [    ] o.a.s.c.c.SolrZkClient Using default ZkACLProvider
   [junit4]   2> 1904714 INFO  (TEST-LeaderFailoverAfterPartitionTest.test-seed#[FF75ABE235BDDBAE]) [    ] o.a.s.c.c.ZkStateReader Updating cluster state from ZooKeeper... 
   [junit4]   2> 1904730 INFO  (TEST-LeaderFailoverAfterPartitionTest.test-seed#[FF75ABE235BDDBAE]) [    ] o.a.s.c.c.ZkStateReader Updated live nodes from ZooKeeper... (0) -> (1)
   [junit4]   2> 1904733 INFO  (zkCallback-1626-thread-1-processing-n:127.0.0.1:49012_) [n:127.0.0.1:49012_    ] o.a.s.c.c.ZkStateReader A cluster state change: [WatchedEvent state:SyncConnected type:NodeDataChanged path:/clusterstate.json], has occurred - updating... (live nodes size: [1])
   [junit4]   2> 1904734 INFO  (zkCallback-1628-thread-1) [    ] o.a.s.c.c.ZkStateReader A cluster state change: [WatchedEvent state:SyncConnected type:NodeDataChanged path:/clusterstate.json], has occurred - updating... (live nodes size: [1])
   [junit4]   2> 1904738 INFO  (TEST-LeaderFailoverAfterPartitionTest.test-seed#[FF75ABE235BDDBAE]) [    ] o.a.s.c.ChaosMonkey monkey: init - expire sessions:false cause connection loss:false
   [junit4]   2> 1904782 INFO  (coreZkRegister-5098-thread-1-processing-n:127.0.0.1:49012_ x:collection1 s:shard1 c:control_collection r:core_node1) [n:127.0.0.1:49012_ c:control_collection s:shard1 r:core_node1 x:collection1] o.a.s.c.ZkController We are http://127.0.0.1:49012/collection1/ and leader is http://127.0.0.1:49012/collection1/
   [junit4]   2> 1904782 INFO  (coreZkRegister-5098-thread-1-processing-n:127.0.0.1:49012_ x:collection1 s:shard1 c:control_collection r:core_node1) [n:127.0.0.1:49012_ c:control_collection s:shard1 r:core_node1 x:collection1] o.a.s.c.ZkController No LogReplay needed for core=collection1 baseURL=http://127.0.0.1:49012
   [junit4]   2> 1904782 INFO  (coreZkRegister-5098-thread-1-processing-n:127.0.0.1:49012_ x:collection1 s:shard1 c:control_collection r:core_node1) [n:127.0.0.1:49012_ c:control_collection s:shard1 r:core_node1 x:collection1] o.a.s.c.ZkController I am the leader, no recovery necessary
   [junit4]   2> 1904782 INFO  (coreZkRegister-5098-thread-1-processing-n:127.0.0.1:49012_ x:collection1 s:shard1 c:control_collection r:core_node1) [n:127.0.0.1:49012_ c:control_collection s:shard1 r:core_node1 x:collection1] o.a.s.c.ZkController publishing state=active
   [junit4]   2> 1904782 INFO  (coreZkRegister-5098-thread-1-processing-n:127.0.0.1:49012_ x:collection1 s:shard1 c:control_collection r:core_node1) [n:127.0.0.1:49012_ c:control_collection s:shard1 r:core_node1 x:collection1] o.a.s.c.ZkController numShards not found on descriptor - reading it from system property
   [junit4]   2> 1904786 INFO  (OverseerStateUpdate-95631513051529220-127.0.0.1:49012_-n_0000000000) [n:127.0.0.1:49012_    ] o.a.s.c.Overseer processMessage: queueSize: 1, message = {
   [junit4]   2>   "core":"collection1",
   [junit4]   2>   "core_node_name":"core_node1",
   [junit4]   2>   "roles":null,
   [junit4]   2>   "base_url":"http://127.0.0.1:49012",
   [junit4]   2>   "node_name":"127.0.0.1:49012_",
   [junit4]   2>   "numShards":"2",
   [junit4]   2>   "state":"active",
   [junit4]   2>   "shard":"shard1",
   [junit4]   2>   "collection":"control_collection",
   [junit4]   2>   "operation":"state"} current state version: 2
   [junit4]   2> 1904787 INFO  (OverseerStateUpdate-95631513051529220-127.0.0.1:49012_-n_0000000000) [n:127.0.0.1:49012_    ] o.a.s.c.o.ReplicaMutator Update state numShards=2 message={
   [junit4]   2>   "core":"collection1",
   [junit4]   2>   "core_node_name":"core_node1",
   [junit4]   2>   "roles":null,
   [junit4]   2>   "base_url":"http://127.0.0.1:49012",
   [junit4]   2>   "node_name":"127.0.0.1:49012_",
   [junit4]   2>   "numShards":"2",
   [junit4]   2>   "state":"active",
   [junit4]   2>   "shard":"shard1",
   [junit4]   2>   "collection":"control_collection",
   [junit4]   2>   "operation":"state"}
   [junit4]   2> 1904888 INFO  (zkCallback-1626-thread-1-processing-n:127.0.0.1:49012_) [n:127.0.0.1:49012_    ] o.a.s.c.c.ZkStateReader A cluster state change: [WatchedEvent state:SyncConnected type:NodeDataChanged path:/clusterstate.json], has occurred - updating... (live nodes size: [1])
   [junit4]   2> 1904891 INFO  (TEST-LeaderFailoverAfterPartitionTest.test-seed#[FF75ABE235BDDBAE]) [    ] o.a.s.SolrTestCaseJ4 Writing core.properties file to /x1/jenkins/jenkins-slave/workspace/Lucene-Solr-Tests-master/solr/build/solr-core/test/J1/temp/solr.cloud.LeaderFailoverAfterPartitionTest_FF75ABE235BDDBAE-001/shard-1-001/cores/collection1
   [junit4]   2> 1904891 INFO  (TEST-LeaderFailoverAfterPartitionTest.test-seed#[FF75ABE235BDDBAE]) [    ] o.a.s.c.AbstractFullDistribZkTestBase create jetty 1 in directory /x1/jenkins/jenkins-slave/workspace/Lucene-Solr-Tests-master/solr/build/solr-core/test/J1/temp/solr.cloud.LeaderFailoverAfterPartitionTest_FF75ABE235BDDBAE-001/shard-1-001
   [junit4]   2> 1904894 INFO  (zkCallback-1628-thread-1) [    ] o.a.s.c.c.ZkStateReader A cluster state change: [WatchedEvent state:SyncConnected type:NodeDataChanged path:/clusterstate.json], has occurred - updating... (live nodes size: [1])
   [junit4]   2> 1904898 INFO  (TEST-LeaderFailoverAfterPartitionTest.test-seed#[FF75ABE235BDDBAE]) [    ] o.e.j.s.Server jetty-9.3.8.v20160314
   [junit4]   2> 1904942 INFO  (TEST-LeaderFailoverAfterPartitionTest.test-seed#[FF75ABE235BDDBAE]) [    ] o.e.j.s.h.ContextHandler Started o.e.j.s.ServletContextHandler@11805d04{/,null,AVAILABLE}
   [junit4]   2> 1904942 INFO  (TEST-LeaderFailoverAfterPartitionTest.test-seed#[FF75ABE235BDDBAE]) [    ] o.e.j.s.ServerConnector Started ServerConnector@7f83d3a5{HTTP/1.1,[http/1.1]}{127.0.0.1:58414}
   [junit4]   2> 1904942 INFO  (TEST-LeaderFailoverAfterPartitionTest.test-seed#[FF75ABE235BDDBAE]) [    ] o.e.j.s.Server Started @1911206ms
   [junit4]   2> 1904942 INFO  (TEST-LeaderFailoverAfterPartitionTest.test-seed#[FF75ABE235BDDBAE]) [    ] o.a.s.c.s.e.JettySolrRunner Jetty properties: {solr.data.dir=/x1/jenkins/jenkins-slave/workspace/Lucene-Solr-Tests-master/solr/build/solr-core/test/J1/temp/solr.cloud.LeaderFailoverAfterPartitionTest_FF75ABE235BDDBAE-001/tempDir-001/jetty1, solrconfig=solrconfig.xml, hostContext=/, hostPort=48282, coreRootDirectory=/x1/jenkins/jenkins-slave/workspace/Lucene-Solr-Tests-master/solr/build/solr-core/test/J1/temp/solr.cloud.LeaderFailoverAfterPartitionTest_FF75ABE235BDDBAE-001/shard-1-001/cores}
   [junit4]   2> 1904943 INFO  (TEST-LeaderFailoverAfterPartitionTest.test-seed#[FF75ABE235BDDBAE]) [    ] o.a.s.s.SolrDispatchFilter SolrDispatchFilter.init(): sun.misc.Launcher$AppClassLoader@73d16e93
   [junit4]   2> 1904943 INFO  (TEST-LeaderFailoverAfterPartitionTest.test-seed#[FF75ABE235BDDBAE]) [    ] o.a.s.c.SolrResourceLoader new SolrResourceLoader for directory: '/x1/jenkins/jenkins-slave/workspace/Lucene-Solr-Tests-master/solr/build/solr-core/test/J1/temp/solr.cloud.LeaderFailoverAfterPartitionTest_FF75ABE235BDDBAE-001/shard-1-001'
   [junit4]   2> 1904943 INFO  (TEST-LeaderFailoverAfterPartitionTest.test-seed#[FF75ABE235BDDBAE]) [    ] o.a.s.c.SolrResourceLoader JNDI not configured for solr (NoInitialContextEx)
   [junit4]   2> 1904943 INFO  (TEST-LeaderFailoverAfterPartitionTest.test-seed#[FF75ABE235BDDBAE]) [    ] o.a.s.c.SolrResourceLoader solr home defaulted to 'solr/' (could not find system property or JNDI)
   [junit4]   2> 1904943 INFO  (TEST-LeaderFailoverAfterPartitionTest.test-seed#[FF75ABE235BDDBAE]) [    ] o.a.s.c.c.SolrZkClient Using default ZkCredentialsProvider
   [junit4]   2> 1904954 INFO  (TEST-LeaderFailoverAfterPartitionTest.test-seed#[FF75ABE235BDDBAE]) [    ] o.a.s.c.c.ConnectionManager Waiting for client to connect to ZooKeeper
   [junit4]   2> 1904969 INFO  (zkCallback-1629-thread-1) [    ] o.a.s.c.c.ConnectionManager Watcher org.apache.solr.common.cloud.ConnectionManager@4cc93c7c name:ZooKeeperConnection Watcher:127.0.0.1:44966/solr got event WatchedEvent state:SyncConnected type:None path:null path:null type:None
   [junit4]   2> 1904969 INFO  (TEST-LeaderFailoverAfterPartitionTest.test-seed#[FF75ABE235BDDBAE]) [    ] o.a.s.c.c.ConnectionManager Client is connected to ZooKeeper
   [junit4]   2> 1904969 INFO  (TEST-LeaderFailoverAfterPartitionTest.test-seed#[FF75ABE235BDDBAE]) [    ] o.a.s.c.c.SolrZkClient Using default ZkACLProvider
   [junit4]   2> 1904970 INFO  (TEST-LeaderFailoverAfterPartitionTest.test-seed#[FF75ABE235BDDBAE]) [    ] o.a.s.s.SolrDispatchFilter Loading solr.xml from SolrHome (not found in ZooKeeper)
   [junit4]   2> 1904970 INFO  (TEST-LeaderFailoverAfterPartitionTest.test-seed#[FF75ABE235BDDBAE]) [    ] o.a.s.c.SolrXmlConfig Loading container configuration from /x1/jenkins/jenkins-slave/workspace/Lucene-Solr-Tests-master/solr/build/solr-core/test/J1/temp/solr.cloud.LeaderFailoverAfterPartitionTest_FF75ABE235BDDBAE-001/shard-1-001/solr.xml
   [junit4]   2> 1904973 INFO  (TEST-LeaderFailoverAfterPartitionTest.test-seed#[FF75ABE235BDDBAE]) [    ] o.a.s.c.CorePropertiesLocator Config-defined core root directory: /x1/jenkins/jenkins-slave/workspace/Lucene-Solr-Tests-master/solr/build/solr-core/test/J1/temp/solr.cloud.LeaderFailoverAfterPartitionTest_FF75ABE235BDDBAE-001/shard-1-001/cores
   [junit4]   2> 1904973 INFO  (TEST-LeaderFailoverAfterPartitionTest.test-seed#[FF75ABE235BDDBAE]) [    ] o.a.s.c.CoreContainer New CoreContainer 473593384
   [junit4]   2> 1904973 INFO  (TEST-LeaderFailoverAfterPartitionTest.test-seed#[FF75ABE235BDDBAE]) [    ] o.a.s.c.CoreContainer Loading cores into CoreContainer [instanceDir=/x1/jenkins/jenkins-slave/workspace/Lucene-Solr-Tests-master/solr/build/solr-core/test/J1/temp/solr.cloud.LeaderFailoverAfterPartitionTest_FF75ABE235BDDBAE-001/shard-1-001]
   [junit4]   2> 1904973 WARN  (TEST-LeaderFailoverAfterPartitionTest.test-seed#[FF75ABE235BDDBAE]) [    ] o.a.s.c.CoreContainer Couldn't add files from /x1/jenkins/jenkins-slave/workspace/Lucene-Solr-Tests-master/solr/build/solr-core/test/J1/temp/solr.cloud.LeaderFailoverAfterPartitionTest_FF75ABE235BDDBAE-001/shard-1-001/lib to classpath: /x1/jenkins/jenkins-slave/workspace/Lucene-Solr-Tests-master/solr/build/solr-core/test/J1/temp/solr.cloud.LeaderFailoverAfterPartitionTest_FF75ABE235BDDBAE-001/shard-1-001/lib
   [junit4]   2> 1904974 INFO  (TEST-LeaderFailoverAfterPartitionTest.test-seed#[FF75ABE235BDDBAE]) [    ] o.a.s.h.c.HttpShardHandlerFactory created with socketTimeout : 90000,urlScheme : ,connTimeout : 15000,maxConnectionsPerHost : 20,maxConnections : 10000,corePoolSize : 0,maximumPoolSize : 2147483647,maxThreadIdleTime : 5,sizeOfQueue : -1,fairnessPolicy : false,useRetries : false,
   [junit4]   2> 1904974 INFO  (TEST-LeaderFailoverAfterPartitionTest.test-seed#[FF75ABE235BDDBAE]) [    ] o.a.s.u.UpdateShardHandler Creating UpdateShardHandler HTTP client with params: socketTimeout=340000&connTimeout=45000&retry=true
   [junit4]   2> 1904975 INFO  (TEST-LeaderFailoverAfterPartitionTest.test-seed#[FF75ABE235BDDBAE]) [    ] o.a.s.l.LogWatcher SLF4J impl is org.slf4j.impl.Log4jLoggerFactory
   [junit4]   2> 1904975 INFO  (TEST-LeaderFailoverAfterPartitionTest.test-seed#[FF75ABE235BDDBAE]) [    ] o.a.s.l.LogWatcher Registering Log Listener [Log4j (org.slf4j.impl.Log4jLoggerFactory)]
   [junit4]   2> 1904975 INFO  (TEST-LeaderFailoverAfterPartitionTest.test-seed#[FF75ABE235BDDBAE]) [    ] o.a.s.c.ZkContainer Zookeeper client=127.0.0.1:44966/solr
   [junit4]   2> 1904975 INFO  (TEST-LeaderFailoverAfterPartitionTest.test-seed#[FF75ABE235BDDBAE]) [    ] o.a.s.c.ZkController zkHost includes chroot
   [junit4]   2> 1904975 INFO  (TEST-LeaderFailoverAfterPartitionTest.test-seed#[FF75ABE235BDDBAE]) [    ] o.a.s.c.c.SolrZkClient Using default ZkCredentialsProvider
   [junit4]   2> 1904976 INFO  (TEST-LeaderFailoverAfterPartitionTest.test-seed#[FF75ABE235BDDBAE]) [    ] o.a.s.c.c.ConnectionManager Waiting for client to connect to ZooKeeper
   [junit4]   2> 1904978 INFO  (zkCallback-1632-thread-1) [    ] o.a.s.c.c.ConnectionManager Watcher org.apache.solr.common.cloud.ConnectionManager@10dade90 name:ZooKeeperConnection Watcher:127.0.0.1:44966 got event WatchedEvent state:SyncConnected type:None path:null path:null type:None
   [junit4]   2> 1904978 INFO  (TEST-LeaderFailoverAfterPartitionTest.test-seed#[FF75ABE235BDDBAE]) [    ] o.a.s.c.c.ConnectionManager Client is connected to ZooKeeper
   [junit4]   2> 1904979 INFO  (TEST-LeaderFailoverAfterPartitionTest.test-seed#[FF75ABE235BDDBAE]) [    ] o.a.s.c.c.SolrZkClient Using default ZkACLProvider
   [junit4]   2> 1904980 INFO  (TEST-LeaderFailoverAfterPartitionTest.test-seed#[FF75ABE235BDDBAE]) [n:127.0.0.1:48282_    ] o.a.s.c.c.ConnectionManager Waiting for client to connect to ZooKeeper
   [junit4]   2> 1904980 INFO  (zkCallback-1633-thread-1-processing-n:127.0.0.1:48282_) [n:127.0.0.1:48282_    ] o.a.s.c.c.ConnectionManager Watcher org.apache.solr.common.cloud.ConnectionManager@7f22a02d name:ZooKeeperConnection Watcher:127.0.0.1:44966/solr got event WatchedEvent state:SyncConnected type:None path:null path:null type:None
   [junit4]   2> 1904980 INFO  (TEST-LeaderFailoverAfterPartitionTest.test-seed#[FF75ABE235BDDBAE]) [n:127.0.0.1:48282_    ] o.a.s.c.c.ConnectionManager Client is connected to ZooKeeper
   [junit4]   2> 1904984 INFO  (TEST-LeaderFailoverAfterPartitionTest.test-seed#[FF75ABE235BDDBAE]) [n:127.0.0.1:48282_    ] o.a.s.c.c.ZkStateReader Updating cluster state from ZooKeeper... 
   [junit4]   2> 1904984 INFO  (TEST-LeaderFailoverAfterPartitionTest.test-seed#[FF75ABE235BDDBAE]) [n:127.0.0.1:48282_    ] o.a.s.c.c.ZkStateReader Updated live nodes from ZooKeeper... (0) -> (1)
   [junit4]   2> 1904985 INFO  (TEST-LeaderFailoverAfterPartitionTest.test-seed#[FF75ABE235BDDBAE]) [n:127.0.0.1:48282_    ] o.a.s.c.Overseer Overseer (id=null) closing
   [junit4]   2> 1904985 INFO  (TEST-LeaderFailoverAfterPartitionTest.test-seed#[FF75ABE235BDDBAE]) [n:127.0.0.1:48282_    ] o.a.s.c.LeaderElector Joined leadership election with path: /overseer_elect/election/95631513051529224-127.0.0.1:48282_-n_0000000001
   [junit4]   2> 1904986 INFO  (TEST-LeaderFailoverAfterPartitionTest.test-seed#[FF75ABE235BDDBAE]) [n:127.0.0.1:48282_    ] o.a.s.c.LeaderElector Watching path /overseer_elect/election/95631513051529220-127.0.0.1:49012_-n_0000000000 to know if I could be the leader
   [junit4]   2> 1904986 INFO  (TEST-LeaderFailoverAfterPartitionTest.test-seed#[FF75ABE235BDDBAE]) [n:127.0.0.1:48282_    ] o.a.s.c.ZkController Publish node=127.0.0.1:48282_ as DOWN
   [junit4]   2> 1904987 INFO  (OverseerStateUpdate-95631513051529220-127.0.0.1:49012_-n_0000000000) [n:127.0.0.1:49012_    ] o.a.s.c.Overseer processMessage: queueSize: 1, message = {
   [junit4]   2>   "operation":"downnode",
   [junit4]   2>   "node_name":"127.0.0.1:48282_"} current state version: 3
   [junit4]   2> 1904987 INFO  (OverseerStateUpdate-95631513051529220-127.0.0.1:49012_-n_0000000000) [n:127.0.0.1:49012_    ] o.a.s.c.o.NodeMutator DownNode state invoked for node: 127.0.0.1:48282_
   [junit4]   2> 1905090 INFO  (zkCallback-1633-thread-1-processing-n:127.0.0.1:48282_) [n:127.0.0.1:48282_    ] o.a.s.c.c.ZkStateReader A cluster state change: [WatchedEvent state:SyncConnected type:NodeDataChanged path:/clusterstate.json], has occurred - updating... (live nodes size: [1])
   [junit4]   2> 1905090 INFO  (zkCallback-1628-thread-1) [    ] o.a.s.c.c.ZkStateReader A cluster state change: [WatchedEvent state:SyncConnected type:NodeDataChanged path:/clusterstate.json], has occurred - updating... (live nodes size: [1])
   [junit4]   2> 1905090 INFO  (zkCallback-1626-thread-1-processing-n:127.0.0.1:49012_) [n:127.0.0.1:49012_    ] o.a.s.c.c.ZkStateReader A cluster state change: [WatchedEvent state:SyncConnected type:NodeDataChanged path:/clusterstate.json], has occurred - updating... (live nodes size: [1])
   [junit4]   2> 1905994 INFO  (TEST-LeaderFailoverAfterPartitionTest.test-seed#[FF75ABE235BDDBAE]) [n:127.0.0.1:48282_    ] o.a.s.c.ZkController Register node as live in ZooKeeper:/live_nodes/127.0.0.1:48282_
   [junit4]   2> 1906006 INFO  (TEST-LeaderFailoverAfterPartitionTest.test-seed#[FF75ABE235BDDBAE]) [n:127.0.0.1:48282_    ] o.a.s.c.c.SolrZkClient makePath: /live_nodes/127.0.0.1:48282_
   [junit4]   2> 1906026 INFO  (zkCallback-1628-thread-1) [    ] o.a.s.c.c.ZkStateReader A live node change: [WatchedEvent state:SyncConnected type:NodeChildrenChanged path:/live_nodes], has occurred - updating... (live nodes size: [1])
   [junit4]   2> 1906026 INFO  (zkCallback-1626-thread-1-processing-n:127.0.0.1:49012_) [n:127.0.0.1:49012_    ] o.a.s.c.c.ZkStateReader A live node change: [WatchedEvent state:SyncConnected type:NodeChildrenChanged path:/live_nodes], has occurred - updating... (live nodes size: [1])
   [junit4]   2> 1906026 INFO  (zkCallback-1628-thread-1) [    ] o.a.s.c.c.ZkStateReader Updated live nodes from ZooKeeper... (1) -> (2)
   [junit4]   2> 1906030 INFO  (zkCallback-1633-thread-1-processing-n:127.0.0.1:48282_) [n:127.0.0.1:48282_    ] o.a.s.c.c.ZkStateReader A live node change: [WatchedEvent state:SyncConnected type:NodeChildrenChanged path:/live_nodes], has occurred - updating... (live nodes size: [1])
   [junit4]   2> 1906034 INFO  (zkCallback-1633-thread-1-processing-n:127.0.0.1:48282_) [n:127.0.0.1:48282_    ] o.a.s.c.c.ZkStateReader Updated live nodes from ZooKeeper... (1) -> (2)
   [junit4]   2> 1906034 INFO  (zkCallback-1626-thread-1-processing-n:127.0.0.1:49012_) [n:127.0.0.1:49012_    ] o.a.s.c.c.ZkStateReader Updated live nodes from ZooKeeper... (1) -> (2)
   [junit4]   2> 1906057 INFO  (TEST-LeaderFailoverAfterPartitionTest.test-seed#[FF75ABE235BDDBAE]) [n:127.0.0.1:48282_    ] o.a.s.c.CoreContainer Security conf doesn't exist. Skipping setup for authorization module.
   [junit4]   2> 1906057 INFO  (TEST-LeaderFailoverAfterPartitionTest.test-seed#[FF75ABE235BDDBAE]) [n:127.0.0.1:48282_    ] o.a.s.c.CoreContainer No authentication plugin used.
   [junit4]   2> 1906061 INFO  (TEST-LeaderFailoverAfterPartitionTest.test-seed#[FF75ABE235BDDBAE]) [n:127.0.0.1:48282_    ] o.a.s.c.CorePropertiesLocator Looking for core definitions underneath /x1/jenkins/jenkins-slave/workspace/Lucene-Solr-Tests-master/solr/build/solr-core/test/J1/temp/solr.cloud.LeaderFailoverAfterPartitionTest_FF75ABE235BDDBAE-001/shard-1-001/cores
   [junit4]   2> 1906061 INFO  (TEST-LeaderFailoverAfterPartitionTest.test-seed#[FF75ABE235BDDBAE]) [n:127.0.0.1:48282_    ] o.a.s.c.CoreDescriptor Created CoreDescriptor: {name=collection1, config=solrconfig.xml, transient=false, schema=schema.xml, loadOnStartup=true, configSetProperties=configsetprops.json, collection=collection1, coreNodeName=, dataDir=data/, shard=}
   [junit4]   2> 1906061 INFO  (TEST-LeaderFailoverAfterPartitionTest.test-seed#[FF75ABE235BDDBAE]) [n:127.0.0.1:48282_    ] o.a.s.c.CorePropertiesLocator Found core collection1 in /x1/jenkins/jenkins-slave/workspace/Lucene-Solr-Tests-master/solr/build/solr-core/test/J1/temp/solr.cloud.LeaderFailoverAfterPartitionTest_FF75ABE235BDDBAE-001/shard-1-001/cores/collection1
   [junit4]   2> 1906061 INFO  (TEST-LeaderFailoverAfterPartitionTest.test-seed#[FF75ABE235BDDBAE]) [n:127.0.0.1:48282_    ] o.a.s.c.CorePropertiesLocator Found 1 core definitions
   [junit4]   2> 1906074 INFO  (coreLoadExecutor-5115-thread-1-processing-n:127.0.0.1:48282_) [n:127.0.0.1:48282_ c:collection1   x:collection1] o.a.s.c.ZkController publishing state=down
   [junit4]   2> 1906074 INFO  (coreLoadExecutor-5115-thread-1-processing-n:127.0.0.1:48282_) [n:127.0.0.1:48282_ c:collection1   x:collection1] o.a.s.c.ZkController numShards not found on descriptor - reading it from system property
   [junit4]   2> 1906078 INFO  (TEST-LeaderFailoverAfterPartitionTest.test-seed#[FF75ABE235BDDBAE]) [n:127.0.0.1:48282_    ] o.a.s.s.SolrDispatchFilter user.dir=/x1/jenkins/jenkins-slave/workspace/Lucene-Solr-Tests-master/solr/build/solr-core/test/J1
   [junit4]   2> 1906078 INFO  (TEST-LeaderFailoverAfterPartitionTest.test-seed#[FF75ABE235BDDBAE]) [n:127.0.0.1:48282_    ] o.a.s.s.SolrDispatchFilter SolrDispatchFilter.init() done
   [junit4]   2> 1906086 INFO  (OverseerStateUpdate-95631513051529220-127.0.0.1:49012_-n_0000000000) [n:127.0.0.1:49012_    ] o.a.s.c.Overseer processMessage: queueSize: 1, message = {
   [junit4]   2>   "core":"collection1",
   [junit4]   2>   "roles":null,
   [junit4]   2>   "base_url":"http://127.0.0.1:48282",
   [junit4]   2>   "node_name":"127.0.0.1:48282_",
   [junit4]   2>   "numShards":"2",
   [junit4]   2>   "state":"down",
   [junit4]   2>   "shard":null,
   [junit4]   2>   "collection":"collection1",
   [junit4]   2>   "operation":"state"} current state version: 4
   [junit4]   2> 1906086 INFO  (coreLoadExecutor-5115-thread-1-processing-n:127.0.0.1:48282_) [n:127.0.0.1:48282_ c:collection1   x:collection1] o.a.s.c.ZkController look for our core node name
   [junit4]   2> 1906090 INFO  (OverseerStateUpdate-95631513051529220-127.0.0.1:49012_-n_0000000000) [n:127.0.0.1:49012_    ] o.a.s.c.o.ReplicaMutator Update state numShards=2 message={
   [junit4]   2>   "core":"collection1",
   [junit4]   2>   "roles":null,
   [junit4]   2>   "base_url":"http://127.0.0.1:48282",
   [junit4]   2>   "node_name":"127.0.0.1:48282_",
   [junit4]   2>   "numShards":"2",
   [junit4]   2>   "state":"down",
   [junit4]   2>   "shard":null,
   [junit4]   2>   "collection":"collection1",
   [junit4]   2>   "operation":"state"}
   [junit4]   2> 1906090 INFO  (OverseerStateUpdate-95631513051529220-127.0.0.1:49012_-n_0000000000) [n:127.0.0.1:49012_    ] o.a.s.c.o.ClusterStateMutator building a new cName: collection1
   [junit4]   2> 1906090 INFO  (OverseerStateUpdate-95631513051529220-127.0.0.1:49012_-n_0000000000) [n:127.0.0.1:49012_    ] o.a.s.c.o.ReplicaMutator Assigning new node to shard shard=shard2
   [junit4]   2> 1906202 INFO  (zkCallback-1628-thread-1) [    ] o.a.s.c.c.ZkStateReader A cluster state change: [WatchedEvent state:SyncConnected type:NodeDataChanged path:/clusterstate.json], has occurred - updating... (live nodes size: [2])
   [junit4]   2> 1906206 INFO  (zkCallback-1633-thread-1-processing-n:127.0.0.1:48282_) [n:127.0.0.1:48282_    ] o.a.s.c.c.ZkStateReader A cluster state change: [WatchedEvent state:SyncConnected type:NodeDataChanged path:/clusterstate.json], has occurred - updating... (live nodes size: [2])
   [junit4]   2> 1906206 INFO  (zkCallback-1626-thread-1-processing-n:127.0.0.1:49012_) [n:127.0.0.1:49012_    ] o.a.s.c.c.ZkStateReader A cluster state change: [WatchedEvent state:SyncConnected type:NodeDataChanged path:/clusterstate.json], has occurred - updating... (live nodes size: [2])
   [junit4]   2> 1907090 INFO  (coreLoadExecutor-5115-thread-1-processing-n:127.0.0.1:48282_) [n:127.0.0.1:48282_ c:collection1   x:collection1

[...truncated too long message...]

xplicitRefreshLazy-seed#[FF75ABE235BDDBAE]) [    ] o.a.s.c.c.ZkStateReader Updating cluster state from ZooKeeper... 
   [junit4]   2> 2412410 INFO  (TEST-ZkStateReaderTest.testStateFormatUpdateWithExplicitRefreshLazy-seed#[FF75ABE235BDDBAE]) [    ] o.a.s.c.c.ZkStateReader Updated live nodes from ZooKeeper... (0) -> (0)
   [junit4]   2> 2412410 INFO  (TEST-ZkStateReaderTest.testStateFormatUpdateWithExplicitRefreshLazy-seed#[FF75ABE235BDDBAE]) [    ] o.a.s.c.c.SolrZkClient makePath: /collections/c1
   [junit4]   2> 2412424 INFO  (TEST-ZkStateReaderTest.testStateFormatUpdateWithExplicitRefreshLazy-seed#[FF75ABE235BDDBAE]) [    ] o.a.s.c.o.ZkStateWriter going to create_collection /collections/c1/state.json
   [junit4]   2> 2412425 ERROR (TEST-ZkStateReaderTest.testStateFormatUpdateWithExplicitRefreshLazy-seed#[FF75ABE235BDDBAE]-EventThread) [    ] o.a.z.ClientCnxn Error while calling watcher 
   [junit4]   2> java.util.concurrent.RejectedExecutionException: Task org.apache.solr.common.util.ExecutorUtil$MDCAwareThreadPoolExecutor$$Lambda$7/1628128447@4e86aa62 rejected from org.apache.solr.common.util.ExecutorUtil$MDCAwareThreadPoolExecutor@b842dd6[Shutting down, pool size = 2, active threads = 1, queued tasks = 0, completed tasks = 1]
   [junit4]   2> 	at java.util.concurrent.ThreadPoolExecutor$AbortPolicy.rejectedExecution(ThreadPoolExecutor.java:2047)
   [junit4]   2> 	at java.util.concurrent.ThreadPoolExecutor.reject(ThreadPoolExecutor.java:823)
   [junit4]   2> 	at java.util.concurrent.ThreadPoolExecutor.execute(ThreadPoolExecutor.java:1369)
   [junit4]   2> 	at org.apache.solr.common.util.ExecutorUtil$MDCAwareThreadPoolExecutor.execute(ExecutorUtil.java:214)
   [junit4]   2> 	at java.util.concurrent.AbstractExecutorService.submit(AbstractExecutorService.java:112)
   [junit4]   2> 	at org.apache.solr.common.cloud.SolrZkClient$3.process(SolrZkClient.java:266)
   [junit4]   2> 	at org.apache.zookeeper.ClientCnxn$EventThread.processEvent(ClientCnxn.java:522)
   [junit4]   2> 	at org.apache.zookeeper.ClientCnxn$EventThread.run(ClientCnxn.java:498)
   [junit4]   2> 2412426 INFO  (zkCallback-2019-thread-2) [    ] o.a.s.c.c.ZkStateReader A collections change: [WatchedEvent state:SyncConnected type:NodeChildrenChanged path:/collections], has occurred - updating...
   [junit4]   2> 2412426 WARN  (zkCallback-2019-thread-2) [    ] o.a.s.c.c.ZkStateReader ZooKeeper watch triggered, but Solr cannot talk to ZK: [KeeperErrorCode = Session expired for /collections]
   [junit4]   2> 2412430 INFO  (TEST-ZkStateReaderTest.testStateFormatUpdateWithExplicitRefreshLazy-seed#[FF75ABE235BDDBAE]) [    ] o.a.s.c.ZkTestServer connecting to 127.0.0.1:40209 40209
   [junit4]   2> 2412619 INFO  (Thread-6899) [    ] o.a.s.c.ZkTestServer connecting to 127.0.0.1:40209 40209
   [junit4]   2> 2412621 INFO  (TEST-ZkStateReaderTest.testStateFormatUpdateWithExplicitRefreshLazy-seed#[FF75ABE235BDDBAE]) [    ] o.a.s.SolrTestCaseJ4 ###Ending testStateFormatUpdateWithExplicitRefreshLazy
   [junit4]   2> NOTE: reproduce with: ant test  -Dtestcase=ZkStateReaderTest -Dtests.method=testStateFormatUpdateWithExplicitRefreshLazy -Dtests.seed=FF75ABE235BDDBAE -Dtests.multiplier=2 -Dtests.slow=true -Dtests.locale=ar-AE -Dtests.timezone=PRT -Dtests.asserts=true -Dtests.file.encoding=ISO-8859-1
   [junit4] ERROR   0.57s J0 | ZkStateReaderTest.testStateFormatUpdateWithExplicitRefreshLazy <<<
   [junit4]    > Throwable #1: org.apache.solr.common.SolrException: Could not find collection : c1
   [junit4]    > 	at __randomizedtesting.SeedInfo.seed([FF75ABE235BDDBAE:943A0B9F4CB20694]:0)
   [junit4]    > 	at org.apache.solr.common.cloud.ClusterState.getCollection(ClusterState.java:170)
   [junit4]    > 	at org.apache.solr.cloud.overseer.ZkStateReaderTest.testStateFormatUpdate(ZkStateReaderTest.java:135)
   [junit4]    > 	at org.apache.solr.cloud.overseer.ZkStateReaderTest.testStateFormatUpdateWithExplicitRefreshLazy(ZkStateReaderTest.java:46)
   [junit4]    > 	at java.lang.Thread.run(Thread.java:745)
   [junit4]   2> 2412624 INFO  (SUITE-ZkStateReaderTest-seed#[FF75ABE235BDDBAE]-worker) [    ] o.a.s.SolrTestCaseJ4 ###deleteCore
   [junit4]   2> NOTE: leaving temporary files on disk at: /x1/jenkins/jenkins-slave/workspace/Lucene-Solr-Tests-master/solr/build/solr-core/test/J0/temp/solr.cloud.overseer.ZkStateReaderTest_FF75ABE235BDDBAE-001
   [junit4]   2> NOTE: test params are: codec=Asserting(Lucene60): {}, docValues:{}, maxPointsInLeafNode=1146, maxMBSortInHeap=4.633258982063266, sim=RandomSimilarity(queryNorm=true,coord=yes): {}, locale=ar-AE, timezone=PRT
   [junit4]   2> NOTE: Linux 3.13.0-52-generic amd64/Oracle Corporation 1.8.0_74 (64-bit)/cpus=4,threads=1,free=214390872,total=516947968
   [junit4]   2> NOTE: All tests run in this JVM: [UUIDFieldTest, BufferStoreTest, TestTolerantUpdateProcessorCloud, DocumentAnalysisRequestHandlerTest, DocExpirationUpdateProcessorFactoryTest, TestIBSimilarityFactory, RuleEngineTest, ResourceLoaderTest, TestLMDirichletSimilarityFactory, SignatureUpdateProcessorFactoryTest, TestReRankQParserPlugin, JSONWriterTest, RequestLoggingTest, TestMergePolicyConfig, SolrRequestParserTest, ActionThrottleTest, TestPseudoReturnFields, TestConfigSetsAPI, TestHdfsUpdateLog, BasicZkTest, TestHighFrequencyDictionaryFactory, TestConfig, TestReplicationHandlerBackup, TestPKIAuthenticationPlugin, AnalyticsQueryTest, XsltUpdateRequestHandlerTest, CursorPagingTest, SyncSliceTest, TestBadConfig, BlockJoinFacetRandomTest, TestCryptoKeys, DefaultValueUpdateProcessorTest, IndexSchemaRuntimeFieldTest, DistributedQueueTest, EchoParamsTest, BasicAuthIntegrationTest, TestDFISimilarityFactory, TestHashQParserPlugin, HdfsWriteToMultipleCollectionsTest, TestDocSet, PathHierarchyTokenizerFactoryTest, TestCustomSort, TestDistributedSearch, DistributedDebugComponentTest, RAMDirectoryFactoryTest, TestManagedStopFilterFactory, TestManagedResource, CustomCollectionTest, ReturnFieldsTest, TestRandomFaceting, TestRTGBase, JsonLoaderTest, TestCSVLoader, RankQueryTest, CloudMLTQParserTest, BigEndianAscendingWordDeserializerTest, DistributedSuggestComponentTest, TestRawTransformer, AsyncCallRequestStatusResponseTest, AlternateDirectoryTest, TestFieldTypeResource, TestArbitraryIndexDir, TestExpandComponent, DirectoryFactoryTest, TestLRUCache, DistributedFacetPivotWhiteBoxTest, AddBlockUpdateTest, LeaderInitiatedRecoveryOnShardRestartTest, QueryResultKeyTest, TestJoin, JavabinLoaderTest, TestSearcherReuse, CoreAdminCreateDiscoverTest, TestRangeQuery, SynonymTokenizerTest, TestAtomicUpdateErrorCases, PeerSyncTest, CheckHdfsIndexTest, SOLR749Test, HdfsRecoveryZkTest, DisMaxRequestHandlerTest, TestSortByMinMaxFunction, RecoveryAfterSoftCommitTest, TestBinaryField, TriLevelCompositeIdRoutingTest, AtomicUpdatesTest, TestJsonFacets, UUIDUpdateProcessorFallbackTest, EnumFieldTest, TestImplicitCoreProperties, DistribCursorPagingTest, DeleteReplicaTest, SharedFSAutoReplicaFailoverUtilsTest, URLClassifyProcessorTest, TestReplicationHandler, TestRandomDVFaceting, TestRealTimeGet, TestStressReorder, SolrCoreTest, SolrCmdDistributorTest, BasicFunctionalityTest, DirectUpdateHandlerTest, CurrencyFieldOpenExchangeTest, DistributedQueryElevationComponentTest, TestExtendedDismaxParser, CoreAdminHandlerTest, TestStressLucene, SpatialFilterTest, NoCacheHeaderTest, QueryEqualityTest, TestRemoteStreaming, DebugComponentTest, StandardRequestHandlerTest, DirectSolrSpellCheckerTest, TestReversedWildcardFilterFactory, PrimitiveFieldTypeTest, TestOmitPositions, FileBasedSpellCheckerTest, TestValueSourceCache, RequiredFieldsTest, TestSolrQueryParser, LoggingHandlerTest, IndexSchemaTest, TestCSVResponseWriter, PingRequestHandlerTest, UpdateParamsTest, TestSolrIndexConfig, CopyFieldTest, SolrIndexConfigTest, MultiTermTest, TestElisionMultitermQuery, ExternalFileFieldSortTest, NotRequiredUniqueKeyTest, TestLuceneMatchVersion, TestCodecSupport, TestLMJelinekMercerSimilarityFactory, TestFastWriter, OpenExchangeRatesOrgProviderTest, TestFastLRUCache, ChaosMonkeyNothingIsSafeTest, AssignTest, BaseCdcrDistributedZkTest, CdcrReplicationDistributedZkTest, CdcrRequestHandlerTest, CdcrVersionReplicationTest, CollectionReloadTest, CollectionsAPISolrJTest, HttpPartitionTest, OverseerStatusTest, RestartWhileUpdatingTest, RollingRestartTest, TestCloudDeleteByQuery, TestCloudInspectUtil, TestConfigSetsAPIZkFailure, TestDistribDocBasedVersion, TestExclusionRuleCollectionAccess, TestLeaderElectionZkExpiry, TestMiniSolrCloudCluster, TestReplicaProperties, TestSolrCloudWithKerberosAlt, HdfsSyncSliceTest, HdfsThreadLeakTest, TestClusterStateMutator, ZkStateReaderTest]
   [junit4] Completed [476/584 (2!)] on J0 in 2.67s, 5 tests, 1 error <<< FAILURES!

[...truncated 343 lines...]
BUILD FAILED
/x1/jenkins/jenkins-slave/workspace/Lucene-Solr-Tests-master/build.xml:740: The following error occurred while executing this line:
/x1/jenkins/jenkins-slave/workspace/Lucene-Solr-Tests-master/build.xml:684: The following error occurred while executing this line:
/x1/jenkins/jenkins-slave/workspace/Lucene-Solr-Tests-master/build.xml:59: The following error occurred while executing this line:
/x1/jenkins/jenkins-slave/workspace/Lucene-Solr-Tests-master/solr/build.xml:233: The following error occurred while executing this line:
/x1/jenkins/jenkins-slave/workspace/Lucene-Solr-Tests-master/solr/common-build.xml:529: The following error occurred while executing this line:
/x1/jenkins/jenkins-slave/workspace/Lucene-Solr-Tests-master/lucene/common-build.xml:1457: The following error occurred while executing this line:
/x1/jenkins/jenkins-slave/workspace/Lucene-Solr-Tests-master/lucene/common-build.xml:1014: There were test failures: 584 suites (10 ignored), 2357 tests, 1 error, 1 failure, 86 ignored (70 assumptions) [seed: FF75ABE235BDDBAE]

Total time: 85 minutes 9 seconds
Build step 'Invoke Ant' marked build as failure
Archiving artifacts
Recording test results
Email was triggered for: Failure - Any
Sending email for trigger: Failure - Any




Mime
View raw message