lucene-dev mailing list archives

Site index · List index
Message view « Date » · « Thread »
Top « Date » · « Thread »
From Apache Jenkins Server <jenk...@builds.apache.org>
Subject [JENKINS] Lucene-Solr-NightlyTests-6.x - Build # 24 - Failure
Date Mon, 28 Mar 2016 23:14:49 GMT
Build: https://builds.apache.org/job/Lucene-Solr-NightlyTests-6.x/24/

1 tests failed.
FAILED:  org.apache.lucene.search.TestLatLonPointQueries.testRandomBig

Error Message:
wrong hit (first of possibly more):  FAIL: id=921019 should not match but did   query=ConstantScore(point:[-41.26030929386616
TO -41.09334555454552],[-180.0 TO -118.91207604669034] point:[-41.26030929386616 TO -41.09334555454552],[-118.4541823156178
TO 179.99999991618097]) docID=910328   lat=-41.09334555454552 lon=-118.31261415034533   deleted?=false

Stack Trace:
java.lang.AssertionError: wrong hit (first of possibly more):

FAIL: id=921019 should not match but did
  query=ConstantScore(point:[-41.26030929386616 TO -41.09334555454552],[-180.0 TO -118.91207604669034]
point:[-41.26030929386616 TO -41.09334555454552],[-118.4541823156178 TO 179.99999991618097])
docID=910328
  lat=-41.09334555454552 lon=-118.31261415034533
  deleted?=false
	at __randomizedtesting.SeedInfo.seed([16C8460825C35CC0:919F3B87B49A2040]:0)
	at org.junit.Assert.fail(Assert.java:93)
	at org.apache.lucene.spatial.util.BaseGeoPointTestCase.verifyRandomRectangles(BaseGeoPointTestCase.java:855)
	at org.apache.lucene.spatial.util.BaseGeoPointTestCase.verify(BaseGeoPointTestCase.java:740)
	at org.apache.lucene.spatial.util.BaseGeoPointTestCase.doTestRandom(BaseGeoPointTestCase.java:665)
	at org.apache.lucene.spatial.util.BaseGeoPointTestCase.testRandomBig(BaseGeoPointTestCase.java:594)
	at sun.reflect.NativeMethodAccessorImpl.invoke0(Native Method)
	at sun.reflect.NativeMethodAccessorImpl.invoke(NativeMethodAccessorImpl.java:62)
	at sun.reflect.DelegatingMethodAccessorImpl.invoke(DelegatingMethodAccessorImpl.java:43)
	at java.lang.reflect.Method.invoke(Method.java:498)
	at com.carrotsearch.randomizedtesting.RandomizedRunner.invoke(RandomizedRunner.java:1764)
	at com.carrotsearch.randomizedtesting.RandomizedRunner$8.evaluate(RandomizedRunner.java:871)
	at com.carrotsearch.randomizedtesting.RandomizedRunner$9.evaluate(RandomizedRunner.java:907)
	at com.carrotsearch.randomizedtesting.RandomizedRunner$10.evaluate(RandomizedRunner.java:921)
	at org.apache.lucene.util.TestRuleSetupTeardownChained$1.evaluate(TestRuleSetupTeardownChained.java:49)
	at org.apache.lucene.util.AbstractBeforeAfterRule$1.evaluate(AbstractBeforeAfterRule.java:45)
	at org.apache.lucene.util.TestRuleThreadAndTestName$1.evaluate(TestRuleThreadAndTestName.java:48)
	at org.apache.lucene.util.TestRuleIgnoreAfterMaxFailures$1.evaluate(TestRuleIgnoreAfterMaxFailures.java:64)
	at org.apache.lucene.util.TestRuleMarkFailure$1.evaluate(TestRuleMarkFailure.java:47)
	at com.carrotsearch.randomizedtesting.rules.StatementAdapter.evaluate(StatementAdapter.java:36)
	at com.carrotsearch.randomizedtesting.ThreadLeakControl$StatementRunner.run(ThreadLeakControl.java:367)
	at com.carrotsearch.randomizedtesting.ThreadLeakControl.forkTimeoutingTask(ThreadLeakControl.java:809)
	at com.carrotsearch.randomizedtesting.ThreadLeakControl$3.evaluate(ThreadLeakControl.java:460)
	at com.carrotsearch.randomizedtesting.RandomizedRunner.runSingleTest(RandomizedRunner.java:880)
	at com.carrotsearch.randomizedtesting.RandomizedRunner$5.evaluate(RandomizedRunner.java:781)
	at com.carrotsearch.randomizedtesting.RandomizedRunner$6.evaluate(RandomizedRunner.java:816)
	at com.carrotsearch.randomizedtesting.RandomizedRunner$7.evaluate(RandomizedRunner.java:827)
	at org.apache.lucene.util.AbstractBeforeAfterRule$1.evaluate(AbstractBeforeAfterRule.java:45)
	at com.carrotsearch.randomizedtesting.rules.StatementAdapter.evaluate(StatementAdapter.java:36)
	at org.apache.lucene.util.TestRuleStoreClassName$1.evaluate(TestRuleStoreClassName.java:41)
	at com.carrotsearch.randomizedtesting.rules.NoShadowingOrOverridesOnMethodsRule$1.evaluate(NoShadowingOrOverridesOnMethodsRule.java:40)
	at com.carrotsearch.randomizedtesting.rules.NoShadowingOrOverridesOnMethodsRule$1.evaluate(NoShadowingOrOverridesOnMethodsRule.java:40)
	at com.carrotsearch.randomizedtesting.rules.StatementAdapter.evaluate(StatementAdapter.java:36)
	at com.carrotsearch.randomizedtesting.rules.StatementAdapter.evaluate(StatementAdapter.java:36)
	at com.carrotsearch.randomizedtesting.rules.StatementAdapter.evaluate(StatementAdapter.java:36)
	at org.apache.lucene.util.TestRuleAssertionsRequired$1.evaluate(TestRuleAssertionsRequired.java:53)
	at org.apache.lucene.util.TestRuleMarkFailure$1.evaluate(TestRuleMarkFailure.java:47)
	at org.apache.lucene.util.TestRuleIgnoreAfterMaxFailures$1.evaluate(TestRuleIgnoreAfterMaxFailures.java:64)
	at org.apache.lucene.util.TestRuleIgnoreTestSuites$1.evaluate(TestRuleIgnoreTestSuites.java:54)
	at com.carrotsearch.randomizedtesting.rules.StatementAdapter.evaluate(StatementAdapter.java:36)
	at com.carrotsearch.randomizedtesting.ThreadLeakControl$StatementRunner.run(ThreadLeakControl.java:367)
	at java.lang.Thread.run(Thread.java:745)




Build Log:
[...truncated 8955 lines...]
   [junit4] Suite: org.apache.lucene.search.TestLatLonPointQueries
   [junit4]   2> NOTE: download the large Jenkins line-docs file by running 'ant get-jenkins-line-docs'
in the lucene directory.
   [junit4]   2> NOTE: reproduce with: ant test  -Dtestcase=TestLatLonPointQueries -Dtests.method=testRandomBig
-Dtests.seed=16C8460825C35CC0 -Dtests.multiplier=2 -Dtests.nightly=true -Dtests.slow=true
-Dtests.linedocsfile=/x1/jenkins/lucene-data/enwiki.random.lines.txt -Dtests.locale=it-CH
-Dtests.timezone=Europe/Busingen -Dtests.asserts=true -Dtests.file.encoding=UTF-8
   [junit4] FAILURE 56.9s J2 | TestLatLonPointQueries.testRandomBig <<<
   [junit4]    > Throwable #1: java.lang.AssertionError: wrong hit (first of possibly more):
   [junit4]    > FAIL: id=921019 should not match but did
   [junit4]    >   query=ConstantScore(point:[-41.26030929386616 TO -41.09334555454552],[-180.0
TO -118.91207604669034] point:[-41.26030929386616 TO -41.09334555454552],[-118.4541823156178
TO 179.99999991618097]) docID=910328
   [junit4]    >   lat=-41.09334555454552 lon=-118.31261415034533
   [junit4]    >   deleted?=false
   [junit4]    > 	at __randomizedtesting.SeedInfo.seed([16C8460825C35CC0:919F3B87B49A2040]:0)
   [junit4]    > 	at org.apache.lucene.spatial.util.BaseGeoPointTestCase.verifyRandomRectangles(BaseGeoPointTestCase.java:855)
   [junit4]    > 	at org.apache.lucene.spatial.util.BaseGeoPointTestCase.verify(BaseGeoPointTestCase.java:740)
   [junit4]    > 	at org.apache.lucene.spatial.util.BaseGeoPointTestCase.doTestRandom(BaseGeoPointTestCase.java:665)
   [junit4]    > 	at org.apache.lucene.spatial.util.BaseGeoPointTestCase.testRandomBig(BaseGeoPointTestCase.java:594)
   [junit4]    > 	at java.lang.Thread.run(Thread.java:745)
   [junit4]   2> NOTE: leaving temporary files on disk at: /x1/jenkins/jenkins-slave/workspace/Lucene-Solr-NightlyTests-6.x/lucene/build/sandbox/test/J2/temp/lucene.search.TestLatLonPointQueries_16C8460825C35CC0-001
   [junit4]   2> NOTE: test params are: codec=Asserting(Lucene60), sim=RandomSimilarity(queryNorm=false,coord=no):
{}, locale=it-CH, timezone=Europe/Busingen
   [junit4]   2> NOTE: Linux 3.13.0-52-generic amd64/Oracle Corporation 1.8.0_74 (64-bit)/cpus=4,threads=1,free=194400280,total=258473984
   [junit4]   2> NOTE: All tests run in this JVM: [TestInetAddressPoint, TestDocValuesTermsQuery,
TestPayloadSpanUtil, FuzzyLikeThisQueryTest, TestSlowFuzzyQuery2, TestSlowFuzzyQuery, TestFieldCacheTermsFilter,
TestLatLonPointQueries]
   [junit4] Completed [15/15 (1!)] on J2 in 207.95s, 42 tests, 1 failure <<< FAILURES!

[...truncated 11 lines...]
BUILD FAILED
/x1/jenkins/jenkins-slave/workspace/Lucene-Solr-NightlyTests-6.x/build.xml:747: The following
error occurred while executing this line:
/x1/jenkins/jenkins-slave/workspace/Lucene-Solr-NightlyTests-6.x/build.xml:684: The following
error occurred while executing this line:
/x1/jenkins/jenkins-slave/workspace/Lucene-Solr-NightlyTests-6.x/build.xml:59: The following
error occurred while executing this line:
/x1/jenkins/jenkins-slave/workspace/Lucene-Solr-NightlyTests-6.x/lucene/build.xml:476: The
following error occurred while executing this line:
/x1/jenkins/jenkins-slave/workspace/Lucene-Solr-NightlyTests-6.x/lucene/common-build.xml:2187:
The following error occurred while executing this line:
/x1/jenkins/jenkins-slave/workspace/Lucene-Solr-NightlyTests-6.x/lucene/module-build.xml:58:
The following error occurred while executing this line:
/x1/jenkins/jenkins-slave/workspace/Lucene-Solr-NightlyTests-6.x/lucene/common-build.xml:1457:
The following error occurred while executing this line:
/x1/jenkins/jenkins-slave/workspace/Lucene-Solr-NightlyTests-6.x/lucene/common-build.xml:1014:
There were test failures: 15 suites, 118 tests, 1 failure [seed: 16C8460825C35CC0]

Total time: 156 minutes 42 seconds
Build step 'Invoke Ant' marked build as failure
Archiving artifacts
No prior successful build to compare, so performing full copy of artifacts
Recording test results
Email was triggered for: Failure - Any
Sending email for trigger: Failure - Any



Mime
View raw message