lucene-dev mailing list archives

Site index · List index
Message view « Date » · « Thread »
Top « Date » · « Thread »
From Policeman Jenkins Server <jenk...@thetaphi.de>
Subject [JENKINS] Lucene-Solr-6.x-Solaris (64bit/jdk1.8.0) - Build # 40 - Still Failing!
Date Tue, 29 Mar 2016 11:12:05 GMT
Build: http://jenkins.thetaphi.de/job/Lucene-Solr-6.x-Solaris/40/
Java: 64bit/jdk1.8.0 -XX:+UseCompressedOops -XX:+UseSerialGC

1 tests failed.
FAILED:  org.apache.solr.handler.TestReqParamsAPI.test

Error Message:
Could not get expected value  'CY val modified' for path 'response/params/y/c' full output: {   "responseHeader":{     "status":0,     "QTime":0},   "response":{     "znodeVersion":0,     "params":{"x":{         "a":"A val",         "b":"B val",         "":{"v":0}}}}}

Stack Trace:
java.lang.AssertionError: Could not get expected value  'CY val modified' for path 'response/params/y/c' full output: {
  "responseHeader":{
    "status":0,
    "QTime":0},
  "response":{
    "znodeVersion":0,
    "params":{"x":{
        "a":"A val",
        "b":"B val",
        "":{"v":0}}}}}
	at __randomizedtesting.SeedInfo.seed([E461313847EF87DD:6C350EE2E913EA25]:0)
	at org.junit.Assert.fail(Assert.java:93)
	at org.junit.Assert.assertTrue(Assert.java:43)
	at org.apache.solr.core.TestSolrConfigHandler.testForResponseElement(TestSolrConfigHandler.java:458)
	at org.apache.solr.handler.TestReqParamsAPI.testReqParams(TestReqParamsAPI.java:200)
	at org.apache.solr.handler.TestReqParamsAPI.test(TestReqParamsAPI.java:67)
	at sun.reflect.NativeMethodAccessorImpl.invoke0(Native Method)
	at sun.reflect.NativeMethodAccessorImpl.invoke(NativeMethodAccessorImpl.java:62)
	at sun.reflect.DelegatingMethodAccessorImpl.invoke(DelegatingMethodAccessorImpl.java:43)
	at java.lang.reflect.Method.invoke(Method.java:498)
	at com.carrotsearch.randomizedtesting.RandomizedRunner.invoke(RandomizedRunner.java:1764)
	at com.carrotsearch.randomizedtesting.RandomizedRunner$8.evaluate(RandomizedRunner.java:871)
	at com.carrotsearch.randomizedtesting.RandomizedRunner$9.evaluate(RandomizedRunner.java:907)
	at com.carrotsearch.randomizedtesting.RandomizedRunner$10.evaluate(RandomizedRunner.java:921)
	at org.apache.solr.BaseDistributedSearchTestCase$ShardsRepeatRule$ShardsFixedStatement.callStatement(BaseDistributedSearchTestCase.java:996)
	at org.apache.solr.BaseDistributedSearchTestCase$ShardsRepeatRule$ShardsStatement.evaluate(BaseDistributedSearchTestCase.java:971)
	at com.carrotsearch.randomizedtesting.rules.SystemPropertiesRestoreRule$1.evaluate(SystemPropertiesRestoreRule.java:57)
	at org.apache.lucene.util.TestRuleSetupTeardownChained$1.evaluate(TestRuleSetupTeardownChained.java:49)
	at org.apache.lucene.util.AbstractBeforeAfterRule$1.evaluate(AbstractBeforeAfterRule.java:45)
	at org.apache.lucene.util.TestRuleThreadAndTestName$1.evaluate(TestRuleThreadAndTestName.java:48)
	at org.apache.lucene.util.TestRuleIgnoreAfterMaxFailures$1.evaluate(TestRuleIgnoreAfterMaxFailures.java:64)
	at org.apache.lucene.util.TestRuleMarkFailure$1.evaluate(TestRuleMarkFailure.java:47)
	at com.carrotsearch.randomizedtesting.rules.StatementAdapter.evaluate(StatementAdapter.java:36)
	at com.carrotsearch.randomizedtesting.ThreadLeakControl$StatementRunner.run(ThreadLeakControl.java:367)
	at com.carrotsearch.randomizedtesting.ThreadLeakControl.forkTimeoutingTask(ThreadLeakControl.java:809)
	at com.carrotsearch.randomizedtesting.ThreadLeakControl$3.evaluate(ThreadLeakControl.java:460)
	at com.carrotsearch.randomizedtesting.RandomizedRunner.runSingleTest(RandomizedRunner.java:880)
	at com.carrotsearch.randomizedtesting.RandomizedRunner$5.evaluate(RandomizedRunner.java:781)
	at com.carrotsearch.randomizedtesting.RandomizedRunner$6.evaluate(RandomizedRunner.java:816)
	at com.carrotsearch.randomizedtesting.RandomizedRunner$7.evaluate(RandomizedRunner.java:827)
	at com.carrotsearch.randomizedtesting.rules.StatementAdapter.evaluate(StatementAdapter.java:36)
	at com.carrotsearch.randomizedtesting.rules.SystemPropertiesRestoreRule$1.evaluate(SystemPropertiesRestoreRule.java:57)
	at org.apache.lucene.util.AbstractBeforeAfterRule$1.evaluate(AbstractBeforeAfterRule.java:45)
	at com.carrotsearch.randomizedtesting.rules.StatementAdapter.evaluate(StatementAdapter.java:36)
	at org.apache.lucene.util.TestRuleStoreClassName$1.evaluate(TestRuleStoreClassName.java:41)
	at com.carrotsearch.randomizedtesting.rules.NoShadowingOrOverridesOnMethodsRule$1.evaluate(NoShadowingOrOverridesOnMethodsRule.java:40)
	at com.carrotsearch.randomizedtesting.rules.NoShadowingOrOverridesOnMethodsRule$1.evaluate(NoShadowingOrOverridesOnMethodsRule.java:40)
	at com.carrotsearch.randomizedtesting.rules.StatementAdapter.evaluate(StatementAdapter.java:36)
	at com.carrotsearch.randomizedtesting.rules.StatementAdapter.evaluate(StatementAdapter.java:36)
	at com.carrotsearch.randomizedtesting.rules.StatementAdapter.evaluate(StatementAdapter.java:36)
	at org.apache.lucene.util.TestRuleAssertionsRequired$1.evaluate(TestRuleAssertionsRequired.java:53)
	at org.apache.lucene.util.TestRuleMarkFailure$1.evaluate(TestRuleMarkFailure.java:47)
	at org.apache.lucene.util.TestRuleIgnoreAfterMaxFailures$1.evaluate(TestRuleIgnoreAfterMaxFailures.java:64)
	at org.apache.lucene.util.TestRuleIgnoreTestSuites$1.evaluate(TestRuleIgnoreTestSuites.java:54)
	at com.carrotsearch.randomizedtesting.rules.StatementAdapter.evaluate(StatementAdapter.java:36)
	at com.carrotsearch.randomizedtesting.ThreadLeakControl$StatementRunner.run(ThreadLeakControl.java:367)
	at java.lang.Thread.run(Thread.java:745)




Build Log:
[...truncated 11270 lines...]
   [junit4] Suite: org.apache.solr.handler.TestReqParamsAPI
   [junit4]   2> Creating dataDir: /export/home/jenkins/workspace/Lucene-Solr-6.x-Solaris/solr/build/solr-core/test/J1/temp/solr.handler.TestReqParamsAPI_E461313847EF87DD-001/init-core-data-001
   [junit4]   2> 1335059 INFO  (SUITE-TestReqParamsAPI-seed#[E461313847EF87DD]-worker) [    ] o.a.s.SolrTestCaseJ4 Randomized ssl (false) and clientAuth (false)
   [junit4]   2> 1335059 INFO  (SUITE-TestReqParamsAPI-seed#[E461313847EF87DD]-worker) [    ] o.a.s.BaseDistributedSearchTestCase Setting hostContext system property: /
   [junit4]   2> 1335064 INFO  (TEST-TestReqParamsAPI.test-seed#[E461313847EF87DD]) [    ] o.a.s.c.ZkTestServer STARTING ZK TEST SERVER
   [junit4]   2> 1335064 INFO  (Thread-3707) [    ] o.a.s.c.ZkTestServer client port:0.0.0.0/0.0.0.0:0
   [junit4]   2> 1335064 INFO  (Thread-3707) [    ] o.a.s.c.ZkTestServer Starting server
   [junit4]   2> 1335164 INFO  (TEST-TestReqParamsAPI.test-seed#[E461313847EF87DD]) [    ] o.a.s.c.ZkTestServer start zk server on port:58221
   [junit4]   2> 1335164 INFO  (TEST-TestReqParamsAPI.test-seed#[E461313847EF87DD]) [    ] o.a.s.c.c.SolrZkClient Using default ZkCredentialsProvider
   [junit4]   2> 1335165 INFO  (TEST-TestReqParamsAPI.test-seed#[E461313847EF87DD]) [    ] o.a.s.c.c.ConnectionManager Waiting for client to connect to ZooKeeper
   [junit4]   2> 1335176 INFO  (zkCallback-1296-thread-1) [    ] o.a.s.c.c.ConnectionManager Watcher org.apache.solr.common.cloud.ConnectionManager@3c88cd97 name:ZooKeeperConnection Watcher:127.0.0.1:58221 got event WatchedEvent state:SyncConnected type:None path:null path:null type:None
   [junit4]   2> 1335176 INFO  (TEST-TestReqParamsAPI.test-seed#[E461313847EF87DD]) [    ] o.a.s.c.c.ConnectionManager Client is connected to ZooKeeper
   [junit4]   2> 1335176 INFO  (TEST-TestReqParamsAPI.test-seed#[E461313847EF87DD]) [    ] o.a.s.c.c.SolrZkClient Using default ZkACLProvider
   [junit4]   2> 1335176 INFO  (TEST-TestReqParamsAPI.test-seed#[E461313847EF87DD]) [    ] o.a.s.c.c.SolrZkClient makePath: /solr
   [junit4]   2> 1335185 INFO  (TEST-TestReqParamsAPI.test-seed#[E461313847EF87DD]) [    ] o.a.s.c.c.SolrZkClient Using default ZkCredentialsProvider
   [junit4]   2> 1335186 INFO  (TEST-TestReqParamsAPI.test-seed#[E461313847EF87DD]) [    ] o.a.s.c.c.ConnectionManager Waiting for client to connect to ZooKeeper
   [junit4]   2> 1335208 INFO  (zkCallback-1297-thread-1) [    ] o.a.s.c.c.ConnectionManager Watcher org.apache.solr.common.cloud.ConnectionManager@3eee000e name:ZooKeeperConnection Watcher:127.0.0.1:58221/solr got event WatchedEvent state:SyncConnected type:None path:null path:null type:None
   [junit4]   2> 1335208 INFO  (TEST-TestReqParamsAPI.test-seed#[E461313847EF87DD]) [    ] o.a.s.c.c.ConnectionManager Client is connected to ZooKeeper
   [junit4]   2> 1335208 INFO  (TEST-TestReqParamsAPI.test-seed#[E461313847EF87DD]) [    ] o.a.s.c.c.SolrZkClient Using default ZkACLProvider
   [junit4]   2> 1335208 INFO  (TEST-TestReqParamsAPI.test-seed#[E461313847EF87DD]) [    ] o.a.s.c.c.SolrZkClient makePath: /collections/collection1
   [junit4]   2> 1335212 INFO  (TEST-TestReqParamsAPI.test-seed#[E461313847EF87DD]) [    ] o.a.s.c.c.SolrZkClient makePath: /collections/collection1/shards
   [junit4]   2> 1335215 INFO  (TEST-TestReqParamsAPI.test-seed#[E461313847EF87DD]) [    ] o.a.s.c.c.SolrZkClient makePath: /collections/control_collection
   [junit4]   2> 1335217 INFO  (TEST-TestReqParamsAPI.test-seed#[E461313847EF87DD]) [    ] o.a.s.c.c.SolrZkClient makePath: /collections/control_collection/shards
   [junit4]   2> 1335228 INFO  (TEST-TestReqParamsAPI.test-seed#[E461313847EF87DD]) [    ] o.a.s.c.AbstractZkTestCase put /export/home/jenkins/workspace/Lucene-Solr-6.x-Solaris/solr/core/src/test-files/solr/collection1/conf/solrconfig-tlog.xml to /configs/conf1/solrconfig.xml
   [junit4]   2> 1335228 INFO  (TEST-TestReqParamsAPI.test-seed#[E461313847EF87DD]) [    ] o.a.s.c.c.SolrZkClient makePath: /configs/conf1/solrconfig.xml
   [junit4]   2> 1335232 INFO  (TEST-TestReqParamsAPI.test-seed#[E461313847EF87DD]) [    ] o.a.s.c.AbstractZkTestCase put /export/home/jenkins/workspace/Lucene-Solr-6.x-Solaris/solr/core/src/test-files/solr/collection1/conf/schema.xml to /configs/conf1/schema.xml
   [junit4]   2> 1335235 INFO  (TEST-TestReqParamsAPI.test-seed#[E461313847EF87DD]) [    ] o.a.s.c.c.SolrZkClient makePath: /configs/conf1/schema.xml
   [junit4]   2> 1335263 INFO  (TEST-TestReqParamsAPI.test-seed#[E461313847EF87DD]) [    ] o.a.s.c.AbstractZkTestCase put /export/home/jenkins/workspace/Lucene-Solr-6.x-Solaris/solr/core/src/test-files/solr/collection1/conf/solrconfig.snippet.randomindexconfig.xml to /configs/conf1/solrconfig.snippet.randomindexconfig.xml
   [junit4]   2> 1335264 INFO  (TEST-TestReqParamsAPI.test-seed#[E461313847EF87DD]) [    ] o.a.s.c.c.SolrZkClient makePath: /configs/conf1/solrconfig.snippet.randomindexconfig.xml
   [junit4]   2> 1335267 INFO  (TEST-TestReqParamsAPI.test-seed#[E461313847EF87DD]) [    ] o.a.s.c.AbstractZkTestCase put /export/home/jenkins/workspace/Lucene-Solr-6.x-Solaris/solr/core/src/test-files/solr/collection1/conf/stopwords.txt to /configs/conf1/stopwords.txt
   [junit4]   2> 1335267 INFO  (TEST-TestReqParamsAPI.test-seed#[E461313847EF87DD]) [    ] o.a.s.c.c.SolrZkClient makePath: /configs/conf1/stopwords.txt
   [junit4]   2> 1335270 INFO  (TEST-TestReqParamsAPI.test-seed#[E461313847EF87DD]) [    ] o.a.s.c.AbstractZkTestCase put /export/home/jenkins/workspace/Lucene-Solr-6.x-Solaris/solr/core/src/test-files/solr/collection1/conf/protwords.txt to /configs/conf1/protwords.txt
   [junit4]   2> 1335270 INFO  (TEST-TestReqParamsAPI.test-seed#[E461313847EF87DD]) [    ] o.a.s.c.c.SolrZkClient makePath: /configs/conf1/protwords.txt
   [junit4]   2> 1335273 INFO  (TEST-TestReqParamsAPI.test-seed#[E461313847EF87DD]) [    ] o.a.s.c.AbstractZkTestCase put /export/home/jenkins/workspace/Lucene-Solr-6.x-Solaris/solr/core/src/test-files/solr/collection1/conf/currency.xml to /configs/conf1/currency.xml
   [junit4]   2> 1335273 INFO  (TEST-TestReqParamsAPI.test-seed#[E461313847EF87DD]) [    ] o.a.s.c.c.SolrZkClient makePath: /configs/conf1/currency.xml
   [junit4]   2> 1335276 INFO  (TEST-TestReqParamsAPI.test-seed#[E461313847EF87DD]) [    ] o.a.s.c.AbstractZkTestCase put /export/home/jenkins/workspace/Lucene-Solr-6.x-Solaris/solr/core/src/test-files/solr/collection1/conf/enumsConfig.xml to /configs/conf1/enumsConfig.xml
   [junit4]   2> 1335276 INFO  (TEST-TestReqParamsAPI.test-seed#[E461313847EF87DD]) [    ] o.a.s.c.c.SolrZkClient makePath: /configs/conf1/enumsConfig.xml
   [junit4]   2> 1335279 INFO  (TEST-TestReqParamsAPI.test-seed#[E461313847EF87DD]) [    ] o.a.s.c.AbstractZkTestCase put /export/home/jenkins/workspace/Lucene-Solr-6.x-Solaris/solr/core/src/test-files/solr/collection1/conf/open-exchange-rates.json to /configs/conf1/open-exchange-rates.json
   [junit4]   2> 1335279 INFO  (TEST-TestReqParamsAPI.test-seed#[E461313847EF87DD]) [    ] o.a.s.c.c.SolrZkClient makePath: /configs/conf1/open-exchange-rates.json
   [junit4]   2> 1335282 INFO  (TEST-TestReqParamsAPI.test-seed#[E461313847EF87DD]) [    ] o.a.s.c.AbstractZkTestCase put /export/home/jenkins/workspace/Lucene-Solr-6.x-Solaris/solr/core/src/test-files/solr/collection1/conf/mapping-ISOLatin1Accent.txt to /configs/conf1/mapping-ISOLatin1Accent.txt
   [junit4]   2> 1335282 INFO  (TEST-TestReqParamsAPI.test-seed#[E461313847EF87DD]) [    ] o.a.s.c.c.SolrZkClient makePath: /configs/conf1/mapping-ISOLatin1Accent.txt
   [junit4]   2> 1335285 INFO  (TEST-TestReqParamsAPI.test-seed#[E461313847EF87DD]) [    ] o.a.s.c.AbstractZkTestCase put /export/home/jenkins/workspace/Lucene-Solr-6.x-Solaris/solr/core/src/test-files/solr/collection1/conf/old_synonyms.txt to /configs/conf1/old_synonyms.txt
   [junit4]   2> 1335286 INFO  (TEST-TestReqParamsAPI.test-seed#[E461313847EF87DD]) [    ] o.a.s.c.c.SolrZkClient makePath: /configs/conf1/old_synonyms.txt
   [junit4]   2> 1335288 INFO  (TEST-TestReqParamsAPI.test-seed#[E461313847EF87DD]) [    ] o.a.s.c.AbstractZkTestCase put /export/home/jenkins/workspace/Lucene-Solr-6.x-Solaris/solr/core/src/test-files/solr/collection1/conf/synonyms.txt to /configs/conf1/synonyms.txt
   [junit4]   2> 1335288 INFO  (TEST-TestReqParamsAPI.test-seed#[E461313847EF87DD]) [    ] o.a.s.c.c.SolrZkClient makePath: /configs/conf1/synonyms.txt
   [junit4]   2> 1335478 INFO  (TEST-TestReqParamsAPI.test-seed#[E461313847EF87DD]) [    ] o.a.s.SolrTestCaseJ4 Writing core.properties file to /export/home/jenkins/workspace/Lucene-Solr-6.x-Solaris/solr/build/solr-core/test/J1/temp/solr.handler.TestReqParamsAPI_E461313847EF87DD-001/control-001/cores/collection1
   [junit4]   2> 1335479 INFO  (TEST-TestReqParamsAPI.test-seed#[E461313847EF87DD]) [    ] o.e.j.s.Server jetty-9.3.8.v20160314
   [junit4]   2> 1335481 INFO  (TEST-TestReqParamsAPI.test-seed#[E461313847EF87DD]) [    ] o.e.j.s.h.ContextHandler Started o.e.j.s.ServletContextHandler@56399080{/,null,AVAILABLE}
   [junit4]   2> 1335482 INFO  (TEST-TestReqParamsAPI.test-seed#[E461313847EF87DD]) [    ] o.e.j.s.ServerConnector Started ServerConnector@337d46c2{HTTP/1.1,[http/1.1]}{127.0.0.1:60341}
   [junit4]   2> 1335482 INFO  (TEST-TestReqParamsAPI.test-seed#[E461313847EF87DD]) [    ] o.e.j.s.Server Started @1338504ms
   [junit4]   2> 1335482 INFO  (TEST-TestReqParamsAPI.test-seed#[E461313847EF87DD]) [    ] o.a.s.c.s.e.JettySolrRunner Jetty properties: {solr.data.dir=/export/home/jenkins/workspace/Lucene-Solr-6.x-Solaris/solr/build/solr-core/test/J1/temp/solr.handler.TestReqParamsAPI_E461313847EF87DD-001/tempDir-001/control/data, hostContext=/, hostPort=60341, coreRootDirectory=/export/home/jenkins/workspace/Lucene-Solr-6.x-Solaris/solr/build/solr-core/test/J1/temp/solr.handler.TestReqParamsAPI_E461313847EF87DD-001/control-001/cores}
   [junit4]   2> 1335482 INFO  (TEST-TestReqParamsAPI.test-seed#[E461313847EF87DD]) [    ] o.a.s.s.SolrDispatchFilter SolrDispatchFilter.init(): sun.misc.Launcher$AppClassLoader@6d06d69c
   [junit4]   2> 1335482 INFO  (TEST-TestReqParamsAPI.test-seed#[E461313847EF87DD]) [    ] o.a.s.c.SolrResourceLoader new SolrResourceLoader for directory: '/export/home/jenkins/workspace/Lucene-Solr-6.x-Solaris/solr/build/solr-core/test/J1/temp/solr.handler.TestReqParamsAPI_E461313847EF87DD-001/control-001'
   [junit4]   2> 1335482 INFO  (TEST-TestReqParamsAPI.test-seed#[E461313847EF87DD]) [    ] o.a.s.c.SolrResourceLoader JNDI not configured for solr (NoInitialContextEx)
   [junit4]   2> 1335482 INFO  (TEST-TestReqParamsAPI.test-seed#[E461313847EF87DD]) [    ] o.a.s.c.SolrResourceLoader solr home defaulted to 'solr/' (could not find system property or JNDI)
   [junit4]   2> 1335482 INFO  (TEST-TestReqParamsAPI.test-seed#[E461313847EF87DD]) [    ] o.a.s.c.c.SolrZkClient Using default ZkCredentialsProvider
   [junit4]   2> 1335484 INFO  (TEST-TestReqParamsAPI.test-seed#[E461313847EF87DD]) [    ] o.a.s.c.c.ConnectionManager Waiting for client to connect to ZooKeeper
   [junit4]   2> 1335485 INFO  (zkCallback-1298-thread-1) [    ] o.a.s.c.c.ConnectionManager Watcher org.apache.solr.common.cloud.ConnectionManager@4c67b3e6 name:ZooKeeperConnection Watcher:127.0.0.1:58221/solr got event WatchedEvent state:SyncConnected type:None path:null path:null type:None
   [junit4]   2> 1335486 INFO  (TEST-TestReqParamsAPI.test-seed#[E461313847EF87DD]) [    ] o.a.s.c.c.ConnectionManager Client is connected to ZooKeeper
   [junit4]   2> 1335486 INFO  (TEST-TestReqParamsAPI.test-seed#[E461313847EF87DD]) [    ] o.a.s.c.c.SolrZkClient Using default ZkACLProvider
   [junit4]   2> 1335488 INFO  (TEST-TestReqParamsAPI.test-seed#[E461313847EF87DD]) [    ] o.a.s.s.SolrDispatchFilter Loading solr.xml from SolrHome (not found in ZooKeeper)
   [junit4]   2> 1335488 INFO  (TEST-TestReqParamsAPI.test-seed#[E461313847EF87DD]) [    ] o.a.s.c.SolrXmlConfig Loading container configuration from /export/home/jenkins/workspace/Lucene-Solr-6.x-Solaris/solr/build/solr-core/test/J1/temp/solr.handler.TestReqParamsAPI_E461313847EF87DD-001/control-001/solr.xml
   [junit4]   2> 1335492 INFO  (TEST-TestReqParamsAPI.test-seed#[E461313847EF87DD]) [    ] o.a.s.c.CorePropertiesLocator Config-defined core root directory: /export/home/jenkins/workspace/Lucene-Solr-6.x-Solaris/solr/build/solr-core/test/J1/temp/solr.handler.TestReqParamsAPI_E461313847EF87DD-001/control-001/cores
   [junit4]   2> 1335492 INFO  (TEST-TestReqParamsAPI.test-seed#[E461313847EF87DD]) [    ] o.a.s.c.CoreContainer New CoreContainer 646805519
   [junit4]   2> 1335492 INFO  (TEST-TestReqParamsAPI.test-seed#[E461313847EF87DD]) [    ] o.a.s.c.CoreContainer Loading cores into CoreContainer [instanceDir=/export/home/jenkins/workspace/Lucene-Solr-6.x-Solaris/solr/build/solr-core/test/J1/temp/solr.handler.TestReqParamsAPI_E461313847EF87DD-001/control-001]
   [junit4]   2> 1335493 WARN  (TEST-TestReqParamsAPI.test-seed#[E461313847EF87DD]) [    ] o.a.s.c.CoreContainer Couldn't add files from /export/home/jenkins/workspace/Lucene-Solr-6.x-Solaris/solr/build/solr-core/test/J1/temp/solr.handler.TestReqParamsAPI_E461313847EF87DD-001/control-001/lib to classpath: /export/home/jenkins/workspace/Lucene-Solr-6.x-Solaris/solr/build/solr-core/test/J1/temp/solr.handler.TestReqParamsAPI_E461313847EF87DD-001/control-001/lib
   [junit4]   2> 1335493 INFO  (TEST-TestReqParamsAPI.test-seed#[E461313847EF87DD]) [    ] o.a.s.h.c.HttpShardHandlerFactory created with socketTimeout : 90000,urlScheme : ,connTimeout : 15000,maxConnectionsPerHost : 20,maxConnections : 10000,corePoolSize : 0,maximumPoolSize : 2147483647,maxThreadIdleTime : 5,sizeOfQueue : -1,fairnessPolicy : false,useRetries : false,
   [junit4]   2> 1335494 INFO  (TEST-TestReqParamsAPI.test-seed#[E461313847EF87DD]) [    ] o.a.s.u.UpdateShardHandler Creating UpdateShardHandler HTTP client with params: socketTimeout=340000&connTimeout=45000&retry=true
   [junit4]   2> 1335494 INFO  (TEST-TestReqParamsAPI.test-seed#[E461313847EF87DD]) [    ] o.a.s.l.LogWatcher SLF4J impl is org.slf4j.impl.Log4jLoggerFactory
   [junit4]   2> 1335494 INFO  (TEST-TestReqParamsAPI.test-seed#[E461313847EF87DD]) [    ] o.a.s.l.LogWatcher Registering Log Listener [Log4j (org.slf4j.impl.Log4jLoggerFactory)]
   [junit4]   2> 1335495 INFO  (TEST-TestReqParamsAPI.test-seed#[E461313847EF87DD]) [    ] o.a.s.c.ZkContainer Zookeeper client=127.0.0.1:58221/solr
   [junit4]   2> 1335495 INFO  (TEST-TestReqParamsAPI.test-seed#[E461313847EF87DD]) [    ] o.a.s.c.ZkController zkHost includes chroot
   [junit4]   2> 1335495 INFO  (TEST-TestReqParamsAPI.test-seed#[E461313847EF87DD]) [    ] o.a.s.c.c.SolrZkClient Using default ZkCredentialsProvider
   [junit4]   2> 1335495 INFO  (TEST-TestReqParamsAPI.test-seed#[E461313847EF87DD]) [    ] o.a.s.c.c.ConnectionManager Waiting for client to connect to ZooKeeper
   [junit4]   2> 1335497 INFO  (zkCallback-1301-thread-1) [    ] o.a.s.c.c.ConnectionManager Watcher org.apache.solr.common.cloud.ConnectionManager@78ce946f name:ZooKeeperConnection Watcher:127.0.0.1:58221 got event WatchedEvent state:SyncConnected type:None path:null path:null type:None
   [junit4]   2> 1335497 INFO  (TEST-TestReqParamsAPI.test-seed#[E461313847EF87DD]) [    ] o.a.s.c.c.ConnectionManager Client is connected to ZooKeeper
   [junit4]   2> 1335497 INFO  (TEST-TestReqParamsAPI.test-seed#[E461313847EF87DD]) [    ] o.a.s.c.c.SolrZkClient Using default ZkACLProvider
   [junit4]   2> 1335499 INFO  (TEST-TestReqParamsAPI.test-seed#[E461313847EF87DD]) [n:127.0.0.1:60341_    ] o.a.s.c.c.ConnectionManager Waiting for client to connect to ZooKeeper
   [junit4]   2> 1335501 INFO  (zkCallback-1302-thread-1-processing-n:127.0.0.1:60341_) [n:127.0.0.1:60341_    ] o.a.s.c.c.ConnectionManager Watcher org.apache.solr.common.cloud.ConnectionManager@6df5418b name:ZooKeeperConnection Watcher:127.0.0.1:58221/solr got event WatchedEvent state:SyncConnected type:None path:null path:null type:None
   [junit4]   2> 1335501 INFO  (TEST-TestReqParamsAPI.test-seed#[E461313847EF87DD]) [n:127.0.0.1:60341_    ] o.a.s.c.c.ConnectionManager Client is connected to ZooKeeper
   [junit4]   2> 1335502 INFO  (TEST-TestReqParamsAPI.test-seed#[E461313847EF87DD]) [n:127.0.0.1:60341_    ] o.a.s.c.c.SolrZkClient makePath: /overseer/queue
   [junit4]   2> 1335505 INFO  (TEST-TestReqParamsAPI.test-seed#[E461313847EF87DD]) [n:127.0.0.1:60341_    ] o.a.s.c.c.SolrZkClient makePath: /overseer/collection-queue-work
   [junit4]   2> 1335509 INFO  (TEST-TestReqParamsAPI.test-seed#[E461313847EF87DD]) [n:127.0.0.1:60341_    ] o.a.s.c.c.SolrZkClient makePath: /overseer/collection-map-running
   [junit4]   2> 1335512 INFO  (TEST-TestReqParamsAPI.test-seed#[E461313847EF87DD]) [n:127.0.0.1:60341_    ] o.a.s.c.c.SolrZkClient makePath: /overseer/collection-map-completed
   [junit4]   2> 1335515 INFO  (TEST-TestReqParamsAPI.test-seed#[E461313847EF87DD]) [n:127.0.0.1:60341_    ] o.a.s.c.c.SolrZkClient makePath: /overseer/collection-map-failure
   [junit4]   2> 1335518 INFO  (TEST-TestReqParamsAPI.test-seed#[E461313847EF87DD]) [n:127.0.0.1:60341_    ] o.a.s.c.c.SolrZkClient makePath: /live_nodes
   [junit4]   2> 1335521 INFO  (TEST-TestReqParamsAPI.test-seed#[E461313847EF87DD]) [n:127.0.0.1:60341_    ] o.a.s.c.c.SolrZkClient makePath: /aliases.json
   [junit4]   2> 1335523 INFO  (TEST-TestReqParamsAPI.test-seed#[E461313847EF87DD]) [n:127.0.0.1:60341_    ] o.a.s.c.c.SolrZkClient makePath: /clusterstate.json
   [junit4]   2> 1335525 INFO  (TEST-TestReqParamsAPI.test-seed#[E461313847EF87DD]) [n:127.0.0.1:60341_    ] o.a.s.c.c.SolrZkClient makePath: /security.json
   [junit4]   2> 1335526 INFO  (TEST-TestReqParamsAPI.test-seed#[E461313847EF87DD]) [n:127.0.0.1:60341_    ] o.a.s.c.c.ZkStateReader Updating cluster state from ZooKeeper... 
   [junit4]   2> 1335528 INFO  (TEST-TestReqParamsAPI.test-seed#[E461313847EF87DD]) [n:127.0.0.1:60341_    ] o.a.s.c.c.ZkStateReader Updated live nodes from ZooKeeper... (0) -> (0)
   [junit4]   2> 1335530 INFO  (TEST-TestReqParamsAPI.test-seed#[E461313847EF87DD]) [n:127.0.0.1:60341_    ] o.a.s.c.c.SolrZkClient makePath: /overseer_elect
   [junit4]   2> 1335532 INFO  (TEST-TestReqParamsAPI.test-seed#[E461313847EF87DD]) [n:127.0.0.1:60341_    ] o.a.s.c.c.SolrZkClient makePath: /overseer_elect/election
   [junit4]   2> 1335534 INFO  (TEST-TestReqParamsAPI.test-seed#[E461313847EF87DD]) [n:127.0.0.1:60341_    ] o.a.s.c.Overseer Overseer (id=null) closing
   [junit4]   2> 1335535 INFO  (TEST-TestReqParamsAPI.test-seed#[E461313847EF87DD]) [n:127.0.0.1:60341_    ] o.a.s.c.LeaderElector Joined leadership election with path: /overseer_elect/election/95633275991556100-127.0.0.1:60341_-n_0000000000
   [junit4]   2> 1335535 INFO  (TEST-TestReqParamsAPI.test-seed#[E461313847EF87DD]) [n:127.0.0.1:60341_    ] o.a.s.c.OverseerElectionContext I am going to be the leader 127.0.0.1:60341_
   [junit4]   2> 1335536 INFO  (TEST-TestReqParamsAPI.test-seed#[E461313847EF87DD]) [n:127.0.0.1:60341_    ] o.a.s.c.c.SolrZkClient makePath: /overseer_elect/leader
   [junit4]   2> 1335537 INFO  (TEST-TestReqParamsAPI.test-seed#[E461313847EF87DD]) [n:127.0.0.1:60341_    ] o.a.s.c.Overseer Overseer (id=95633275991556100-127.0.0.1:60341_-n_0000000000) starting
   [junit4]   2> 1335540 INFO  (TEST-TestReqParamsAPI.test-seed#[E461313847EF87DD]) [n:127.0.0.1:60341_    ] o.a.s.c.c.SolrZkClient makePath: /overseer/queue-work
   [junit4]   2> 1335549 INFO  (TEST-TestReqParamsAPI.test-seed#[E461313847EF87DD]) [n:127.0.0.1:60341_    ] o.a.s.c.OverseerAutoReplicaFailoverThread Starting OverseerAutoReplicaFailoverThread autoReplicaFailoverWorkLoopDelay=10000 autoReplicaFailoverWaitAfterExpiration=30000 autoReplicaFailoverBadNodeExpiration=60000
   [junit4]   2> 1335550 INFO  (OverseerCollectionConfigSetProcessor-95633275991556100-127.0.0.1:60341_-n_0000000000) [n:127.0.0.1:60341_    ] o.a.s.c.OverseerTaskProcessor Process current queue of overseer operations
   [junit4]   2> 1335567 INFO  (TEST-TestReqParamsAPI.test-seed#[E461313847EF87DD]) [n:127.0.0.1:60341_    ] o.a.s.c.ZkController Register node as live in ZooKeeper:/live_nodes/127.0.0.1:60341_
   [junit4]   2> 1335567 INFO  (OverseerStateUpdate-95633275991556100-127.0.0.1:60341_-n_0000000000) [n:127.0.0.1:60341_    ] o.a.s.c.Overseer Starting to work on the main queue
   [junit4]   2> 1335568 INFO  (TEST-TestReqParamsAPI.test-seed#[E461313847EF87DD]) [n:127.0.0.1:60341_    ] o.a.s.c.c.SolrZkClient makePath: /live_nodes/127.0.0.1:60341_
   [junit4]   2> 1335570 INFO  (zkCallback-1302-thread-1-processing-n:127.0.0.1:60341_) [n:127.0.0.1:60341_    ] o.a.s.c.c.ZkStateReader A live node change: [WatchedEvent state:SyncConnected type:NodeChildrenChanged path:/live_nodes], has occurred - updating... (live nodes size: [0])
   [junit4]   2> 1335572 INFO  (OverseerStateUpdate-95633275991556100-127.0.0.1:60341_-n_0000000000) [n:127.0.0.1:60341_    ] o.a.s.c.c.ZkStateReader Updated live nodes from ZooKeeper... (0) -> (1)
   [junit4]   2> 1335572 INFO  (zkCallback-1302-thread-1-processing-n:127.0.0.1:60341_) [n:127.0.0.1:60341_    ] o.a.s.c.c.ZkStateReader Updated live nodes from ZooKeeper... (1) -> (1)
   [junit4]   2> 1335604 INFO  (TEST-TestReqParamsAPI.test-seed#[E461313847EF87DD]) [n:127.0.0.1:60341_    ] o.a.s.c.CoreContainer Security conf doesn't exist. Skipping setup for authorization module.
   [junit4]   2> 1335604 INFO  (TEST-TestReqParamsAPI.test-seed#[E461313847EF87DD]) [n:127.0.0.1:60341_    ] o.a.s.c.CoreContainer No authentication plugin used.
   [junit4]   2> 1335605 INFO  (TEST-TestReqParamsAPI.test-seed#[E461313847EF87DD]) [n:127.0.0.1:60341_    ] o.a.s.c.CorePropertiesLocator Looking for core definitions underneath /export/home/jenkins/workspace/Lucene-Solr-6.x-Solaris/solr/build/solr-core/test/J1/temp/solr.handler.TestReqParamsAPI_E461313847EF87DD-001/control-001/cores
   [junit4]   2> 1335606 INFO  (TEST-TestReqParamsAPI.test-seed#[E461313847EF87DD]) [n:127.0.0.1:60341_    ] o.a.s.c.CoreDescriptor Created CoreDescriptor: {name=collection1, config=solrconfig.xml, transient=false, schema=schema.xml, loadOnStartup=true, configSetProperties=configsetprops.json, collection=control_collection, coreNodeName=, dataDir=data/, shard=}
   [junit4]   2> 1335606 INFO  (TEST-TestReqParamsAPI.test-seed#[E461313847EF87DD]) [n:127.0.0.1:60341_    ] o.a.s.c.CorePropertiesLocator Found core collection1 in /export/home/jenkins/workspace/Lucene-Solr-6.x-Solaris/solr/build/solr-core/test/J1/temp/solr.handler.TestReqParamsAPI_E461313847EF87DD-001/control-001/cores/collection1
   [junit4]   2> 1335606 INFO  (TEST-TestReqParamsAPI.test-seed#[E461313847EF87DD]) [n:127.0.0.1:60341_    ] o.a.s.c.CorePropertiesLocator Found 1 core definitions
   [junit4]   2> 1335608 INFO  (TEST-TestReqParamsAPI.test-seed#[E461313847EF87DD]) [n:127.0.0.1:60341_    ] o.a.s.s.SolrDispatchFilter user.dir=/export/home/jenkins/workspace/Lucene-Solr-6.x-Solaris/solr/build/solr-core/test/J1
   [junit4]   2> 1335608 INFO  (TEST-TestReqParamsAPI.test-seed#[E461313847EF87DD]) [n:127.0.0.1:60341_    ] o.a.s.s.SolrDispatchFilter SolrDispatchFilter.init() done
   [junit4]   2> 1335608 INFO  (coreLoadExecutor-4820-thread-1-processing-n:127.0.0.1:60341_) [n:127.0.0.1:60341_ c:control_collection   x:collection1] o.a.s.c.ZkController publishing state=down
   [junit4]   2> 1335608 INFO  (coreLoadExecutor-4820-thread-1-processing-n:127.0.0.1:60341_) [n:127.0.0.1:60341_ c:control_collection   x:collection1] o.a.s.c.ZkController numShards not found on descriptor - reading it from system property
   [junit4]   2> 1335611 INFO  (OverseerStateUpdate-95633275991556100-127.0.0.1:60341_-n_0000000000) [n:127.0.0.1:60341_    ] o.a.s.c.Overseer processMessage: queueSize: 1, message = {
   [junit4]   2>   "core":"collection1",
   [junit4]   2>   "roles":null,
   [junit4]   2>   "base_url":"http://127.0.0.1:60341",
   [junit4]   2>   "node_name":"127.0.0.1:60341_",
   [junit4]   2>   "numShards":"1",
   [junit4]   2>   "state":"down",
   [junit4]   2>   "shard":null,
   [junit4]   2>   "collection":"control_collection",
   [junit4]   2>   "operation":"state"} current state version: 0
   [junit4]   2> 1335611 INFO  (coreLoadExecutor-4820-thread-1-processing-n:127.0.0.1:60341_) [n:127.0.0.1:60341_ c:control_collection   x:collection1] o.a.s.c.ZkController look for our core node name
   [junit4]   2> 1335612 INFO  (OverseerStateUpdate-95633275991556100-127.0.0.1:60341_-n_0000000000) [n:127.0.0.1:60341_    ] o.a.s.c.o.ReplicaMutator Update state numShards=1 message={
   [junit4]   2>   "core":"collection1",
   [junit4]   2>   "roles":null,
   [junit4]   2>   "base_url":"http://127.0.0.1:60341",
   [junit4]   2>   "node_name":"127.0.0.1:60341_",
   [junit4]   2>   "numShards":"1",
   [junit4]   2>   "state":"down",
   [junit4]   2>   "shard":null,
   [junit4]   2>   "collection":"control_collection",
   [junit4]   2>   "operation":"state"}
   [junit4]   2> 1335612 INFO  (OverseerStateUpdate-95633275991556100-127.0.0.1:60341_-n_0000000000) [n:127.0.0.1:60341_    ] o.a.s.c.o.ClusterStateMutator building a new cName: control_collection
   [junit4]   2> 1335613 INFO  (OverseerStateUpdate-95633275991556100-127.0.0.1:60341_-n_0000000000) [n:127.0.0.1:60341_    ] o.a.s.c.o.ReplicaMutator Assigning new node to shard shard=shard1
   [junit4]   2> 1335615 INFO  (zkCallback-1302-thread-1-processing-n:127.0.0.1:60341_) [n:127.0.0.1:60341_    ] o.a.s.c.c.ZkStateReader A cluster state change: [WatchedEvent state:SyncConnected type:NodeDataChanged path:/clusterstate.json], has occurred - updating... (live nodes size: [1])
   [junit4]   2> 1336614 INFO  (coreLoadExecutor-4820-thread-1-processing-n:127.0.0.1:60341_) [n:127.0.0.1:60341_ c:control_collection   x:collection1] o.a.s.c.ZkController waiting to find shard id in clusterstate for collection1
   [junit4]   2> 1336614 INFO  (coreLoadExecutor-4820-thread-1-processing-n:127.0.0.1:60341_) [n:127.0.0.1:60341_ c:control_collection   x:collection1] o.a.s.c.ZkController Check for collection zkNode:control_collection
   [junit4]   2> 1336615 INFO  (coreLoadExecutor-4820-thread-1-processing-n:127.0.0.1:60341_) [n:127.0.0.1:60341_ c:control_collection   x:collection1] o.a.s.c.ZkController Collection zkNode exists
   [junit4]   2> 1336615 INFO  (coreLoadExecutor-4820-thread-1-processing-n:127.0.0.1:60341_) [n:127.0.0.1:60341_ c:control_collection   x:collection1] o.a.s.c.c.ZkStateReader Load collection config from: [/collections/control_collection]
   [junit4]   2> 1336616 INFO  (coreLoadExecutor-4820-thread-1-processing-n:127.0.0.1:60341_) [n:127.0.0.1:60341_ c:control_collection   x:collection1] o.a.s.c.c.ZkStateReader path=[/collections/control_collection] [configName]=[conf1] specified config exists in ZooKeeper
   [junit4]   2> 1336617 INFO  (coreLoadExecutor-4820-thread-1-processing-n:127.0.0.1:60341_) [n:127.0.0.1:60341_ c:control_collection   x:collection1] o.a.s.c.SolrResourceLoader new SolrResourceLoader for directory: '/export/home/jenkins/workspace/Lucene-Solr-6.x-Solaris/solr/build/solr-core/test/J1/temp/solr.handler.TestReqParamsAPI_E461313847EF87DD-001/control-001/cores/collection1'
   [junit4]   2> 1336617 INFO  (coreLoadExecutor-4820-thread-1-processing-n:127.0.0.1:60341_) [n:127.0.0.1:60341_ c:control_collection   x:collection1] o.a.s.c.SolrResourceLoader JNDI not configured for solr (NoInitialContextEx)
   [junit4]   2> 1336617 INFO  (coreLoadExecutor-4820-thread-1-processing-n:127.0.0.1:60341_) [n:127.0.0.1:60341_ c:control_collection   x:collection1] o.a.s.c.SolrResourceLoader solr home defaulted to 'solr/' (could not find system property or JNDI)
   [junit4]   2> 1336619 INFO  (coreLoadExecutor-4820-thread-1-processing-n:127.0.0.1:60341_) [n:127.0.0.1:60341_ c:control_collection   x:collection1] o.a.s.c.Config loaded config solrconfig.xml with version 0 
   [junit4]   2> 1336626 INFO  (coreLoadExecutor-4820-thread-1-processing-n:127.0.0.1:60341_) [n:127.0.0.1:60341_ c:control_collection   x:collection1] o.a.s.c.SolrConfig current version of requestparams : -1
   [junit4]   2> 1336630 WARN  (coreLoadExecutor-4820-thread-1-processing-n:127.0.0.1:60341_) [n:127.0.0.1:60341_ c:control_collection   x:collection1] o.a.s.c.Config Beginning with Solr 5.5, <mergePolicy> is deprecated, use <mergePolicyFactory> instead.
   [junit4]   2> 1336631 INFO  (coreLoadExecutor-4820-thread-1-processing-n:127.0.0.1:60341_) [n:127.0.0.1:60341_ c:control_collection   x:collection1] o.a.s.c.SolrConfig Using Lucene MatchVersion: 6.1.0
   [junit4]   2> 1336642 INFO  (coreLoadExecutor-4820-thread-1-processing-n:127.0.0.1:60341_) [n:127.0.0.1:60341_ c:control_collection   x:collection1] o.a.s.c.SolrConfig Loaded SolrConfig: solrconfig.xml
   [junit4]   2> 1336648 INFO  (coreLoadExecutor-4820-thread-1-processing-n:127.0.0.1:60341_) [n:127.0.0.1:60341_ c:control_collection   x:collection1] o.a.s.s.IndexSchema [collection1] Schema name=test
   [junit4]   2> 1336749 INFO  (coreLoadExecutor-4820-thread-1-processing-n:127.0.0.1:60341_) [n:127.0.0.1:60341_ c:control_collection   x:collection1] o.a.s.s.OpenExchangeRatesOrgProvider Initialized with rates=open-exchange-rates.json, refreshInterval=1440.
   [junit4]   2> 1336759 INFO  (coreLoadExecutor-4820-thread-1-processing-n:127.0.0.1:60341_) [n:127.0.0.1:60341_ c:control_collection   x:collection1] o.a.s.s.IndexSchema default search field in schema is text
   [junit4]   2> 1336761 INFO  (coreLoadExecutor-4820-thread-1-processing-n:127.0.0.1:60341_) [n:127.0.0.1:60341_ c:control_collection   x:collection1] o.a.s.s.IndexSchema unique key field: id
   [junit4]   2> 1336779 INFO  (coreLoadExecutor-4820-thread-1-processing-n:127.0.0.1:60341_) [n:127.0.0.1:60341_ c:control_collection   x:collection1] o.a.s.s.FileExchangeRateProvider Reloading exchange rates from file currency.xml
   [junit4]   2> 1336787 INFO  (coreLoadExecutor-4820-thread-1-processing-n:127.0.0.1:60341_) [n:127.0.0.1:60341_ c:control_collection   x:collection1] o.a.s.s.FileExchangeRateProvider Reloading exchange rates from file currency.xml
   [junit4]   2> 1336793 INFO  (coreLoadExecutor-4820-thread-1-processing-n:127.0.0.1:60341_) [n:127.0.0.1:60341_ c:control_collection   x:collection1] o.a.s.s.OpenExchangeRatesOrgProvider Reloading exchange rates from open-exchange-rates.json
   [junit4]   2> 1336795 INFO  (coreLoadExecutor-4820-thread-1-processing-n:127.0.0.1:60341_) [n:127.0.0.1:60341_ c:control_collection   x:collection1] o.a.s.s.OpenExchangeRatesOrgProvider Reloading exchange rates from open-exchange-rates.json
   [junit4]   2> 1336799 INFO  (coreLoadExecutor-4820-thread-1-processing-n:127.0.0.1:60341_) [n:127.0.0.1:60341_ c:control_collection   x:collection1] o.a.s.c.ConfigSetProperties Did not find ConfigSet properties, assuming default properties: Can't find resource 'configsetprops.json' in classpath or '/configs/conf1', cwd=/export/home/jenkins/workspace/Lucene-Solr-6.x-Solaris/solr/build/solr-core/test/J1
   [junit4]   2> 1336799 INFO  (coreLoadExecutor-4820-thread-1-processing-n:127.0.0.1:60341_) [n:127.0.0.1:60341_ c:control_collection   x:collection1] o.a.s.c.CoreContainer Creating SolrCore 'collection1' using configuration from collection control_collection
   [junit4]   2> 1336800 INFO  (coreLoadExecutor-4820-thread-1-processing-n:127.0.0.1:60341_) [n:127.0.0.1:60341_ c:control_collection s:shard1 r:core_node1 x:collection1] o.a.s.c.SolrCore org.apache.solr.core.MockDirectoryFactory
   [junit4]   2> 1336801 INFO  (coreLoadExecutor-4820-thread-1-processing-n:127.0.0.1:60341_) [n:127.0.0.1:60341_ c:control_collection s:shard1 r:core_node1 x:collection1] o.a.s.c.SolrCore [[collection1] ] Opening new SolrCore at [/export/home/jenkins/workspace/Lucene-Solr-6.x-Solaris/solr/build/solr-core/test/J1/temp/solr.handler.TestReqParamsAPI_E461313847EF87DD-001/control-001/cores/collection1], dataDir=[/export/home/jenkins/workspace/Lucene-Solr-6.x-Solaris/solr/build/solr-core/test/J1/temp/solr.handler.TestReqParamsAPI_E461313847EF87DD-001/control-001/cores/collection1/data/]
   [junit4]   2> 1336801 INFO  (coreLoadExecutor-4820-thread-1-processing-n:127.0.0.1:60341_) [n:127.0.0.1:60341_ c:control_collection s:shard1 r:core_node1 x:collection1] o.a.s.c.JmxMonitoredMap JMX monitoring is enabled. Adding Solr mbeans to JMX Server: com.sun.jmx.mbeanserver.JmxMBeanServer@2d5a9874
   [junit4]   2> 1336802 INFO  (coreLoadExecutor-4820-thread-1-processing-n:127.0.0.1:60341_) [n:127.0.0.1:60341_ c:control_collection s:shard1 r:core_node1 x:collection1] o.a.s.c.CachingDirectoryFactory return new directory for /export/home/jenkins/workspace/Lucene-Solr-6.x-Solaris/solr/build/solr-core/test/J1/temp/solr.handler.TestReqParamsAPI_E461313847EF87DD-001/control-001/cores/collection1/data
   [junit4]   2> 1336802 INFO  (coreLoadExecutor-4820-thread-1-processing-n:127.0.0.1:60341_) [n:127.0.0.1:60341_ c:control_collection s:shard1 r:core_node1 x:collection1] o.a.s.c.SolrCore New index directory detected: old=null new=/export/home/jenkins/workspace/Lucene-Solr-6.x-Solaris/solr/build/solr-core/test/J1/temp/solr.handler.TestReqParamsAPI_E461313847EF87DD-001/control-001/cores/collection1/data/index/
   [junit4]   2> 1336802 WARN  (coreLoadExecutor-4820-thread-1-processing-n:127.0.0.1:60341_) [n:127.0.0.1:60341_ c:control_collection s:shard1 r:core_node1 x:collection1] o.a.s.c.SolrCore [collection1] Solr index directory '/export/home/jenkins/workspace/Lucene-Solr-6.x-Solaris/solr/build/solr-core/test/J1/temp/solr.handler.TestReqParamsAPI_E461313847EF87DD-001/control-001/cores/collection1/data/index' doesn't exist. Creating new index...
   [junit4]   2> 1336803 INFO  (coreLoadExecutor-4820-thread-1-processing-n:127.0.0.1:60341_) [n:127.0.0.1:60341_ c:control_collection s:shard1 r:core_node1 x:collection1] o.a.s.c.CachingDirectoryFactory return new directory for /export/home/jenkins/workspace/Lucene-Solr-6.x-Solaris/solr/build/solr-core/test/J1/temp/solr.handler.TestReqParamsAPI_E461313847EF87DD-001/control-001/cores/collection1/data/index
   [junit4]   2> 1336803 INFO  (coreLoadExecutor-4820-thread-1-processing-n:127.0.0.1:60341_) [n:127.0.0.1:60341_ c:control_collection s:shard1 r:core_node1 x:collection1] o.a.s.u.RandomMergePolicy RandomMergePolicy wrapping class org.apache.lucene.index.LogByteSizeMergePolicy: [LogByteSizeMergePolicy: minMergeSize=1677721, mergeFactor=39, maxMergeSize=2147483648, maxMergeSizeForForcedMerge=9223372036854775807, calibrateSizeByDeletes=true, maxMergeDocs=2147483647, maxCFSSegmentSizeMB=8.796093022207999E12, noCFSRatio=0.0]
   [junit4]   2> 1336804 INFO  (coreLoadExecutor-4820-thread-1-processing-n:127.0.0.1:60341_) [n:127.0.0.1:60341_ c:control_collection s:shard1 r:core_node1 x:collection1] o.a.s.c.SolrDeletionPolicy SolrDeletionPolicy.onCommit: commits: num=1
   [junit4]   2> 	commit{dir=MockDirectoryWrapper(RAMDirectory@1ee3fc72 lockFactory=org.apache.lucene.store.SingleInstanceLockFactory@d1ee26),segFN=segments_1,generation=1}
   [junit4]   2> 1336804 INFO  (coreLoadExecutor-4820-thread-1-processing-n:127.0.0.1:60341_) [n:127.0.0.1:60341_ c:control_collection s:shard1 r:core_node1 x:collection1] o.a.s.c.SolrDeletionPolicy newest commit generation = 1
   [junit4]   2> 1336805 INFO  (OldIndexDirectoryCleanupThreadForCore-collection1) [n:127.0.0.1:60341_ c:control_collection s:shard1 r:core_node1 x:collection1] o.a.s.c.SolrCore Looking for old index directories to cleanup for core collection1 in /export/home/jenkins/workspace/Lucene-Solr-6.x-Solaris/solr/build/solr-core/test/J1/temp/solr.handler.TestReqParamsAPI_E461313847EF87DD-001/control-001/cores/collection1/data/
   [junit4]   2> 1336806 WARN  (OldIndexDirectoryCleanupThreadForCore-collection1) [n:127.0.0.1:60341_ c:control_collection s:shard1 r:core_node1 x:collection1] o.a.s.c.DirectoryFactory /export/home/jenkins/workspace/Lucene-Solr-6.x-Solaris/solr/build/solr-core/test/J1/temp/solr.handler.TestReqParamsAPI_E461313847EF87DD-001/control-001/cores/collection1/data/ does not point to a valid data directory; skipping clean-up of old index directories.
   [junit4]   2> 1336808 INFO  (coreLoadExecutor-4820-thread-1-processing-n:127.0.0.1:60341_) [n:127.0.0.1:60341_ c:control_collection s:shard1 r:core_node1 x:collection1] o.a.s.u.p.UpdateRequestProcessorChain creating updateRequestProcessorChain "nodistrib"
   [junit4]   2> 1336809 INFO  (coreLoadExecutor-4820-thread-1-processing-n:127.0.0.1:60341_) [n:127.0.0.1:60341_ c:control_collection s:shard1 r:core_node1 x:collection1] o.a.s.u.p.UpdateRequestProcessorChain creating updateRequestProcessorChain "dedupe"
   [junit4]   2> 1336809 INFO  (coreLoadExecutor-4820-thread-1-processing-n:127.0.0.1:60341_) [n:127.0.0.1:60341_ c:control_collection s:shard1 r:core_node1 x:collection1] o.a.s.u.p.UpdateRequestProcessorChain inserting DistributedUpdateProcessorFactory into updateRequestProcessorChain "dedupe"
   [junit4]   2> 1336809 INFO  (coreLoadExecutor-4820-thread-1-processing-n:127.0.0.1:60341_) [n:127.0.0.1:60341_ c:control_collection s:shard1 r:core_node1 x:collection1] o.a.s.u.p.UpdateRequestProcessorChain creating updateRequestProcessorChain "stored_sig"
   [junit4]   2> 1336809 INFO  (coreLoadExecutor-4820-thread-1-processing-n:127.0.0.1:60341_) [n:127.0.0.1:60341_ c:control_collection s:shard1 r:core_node1 x:collection1] o.a.s.u.p.UpdateRequestProcessorChain inserting DistributedUpdateProcessorFactory into updateRequestProcessorChain "stored_sig"
   [junit4]   2> 1336809 INFO  (coreLoadExecutor-4820-thread-1-processing-n:127.0.0.1:60341_) [n:127.0.0.1:60341_ c:control_collection s:shard1 r:core_node1 x:collection1] o.a.s.u.p.UpdateRequestProcessorChain creating updateRequestProcessorChain "distrib-dup-test-chain-explicit"
   [junit4]   2> 1336810 INFO  (coreLoadExecutor-4820-thread-1-processing-n:127.0.0.1:60341_) [n:127.0.0.1:60341_ c:control_collection s:shard1 r:core_node1 x:collection1] o.a.s.u.p.UpdateRequestProcessorChain creating updateRequestProcessorChain "distrib-dup-test-chain-implicit"
   [junit4]   2> 1336810 INFO  (coreLoadExecutor-4820-thread-1-processing-n:127.0.0.1:60341_) [n:127.0.0.1:60341_ c:control_collection s:shard1 r:core_node1 x:collection1] o.a.s.u.p.UpdateRequestProcessorChain inserting DistributedUpdateProcessorFactory into updateRequestProcessorChain "distrib-dup-test-chain-implicit"
   [junit4]   2> 1336810 INFO  (coreLoadExecutor-4820-thread-1-processing-n:127.0.0.1:60341_) [n:127.0.0.1:60341_ c:control_collection s:shard1 r:core_node1 x:collection1] o.a.s.c.SolrCore no updateRequestProcessorChain defined as default, creating implicit default
   [junit4]   2> 1336810 WARN  (coreLoadExecutor-4820-thread-1-processing-n:127.0.0.1:60341_) [n:127.0.0.1:60341_ c:control_collection s:shard1 r:core_node1 x:collection1] o.a.s.c.RequestHandlers INVALID paramSet a in requestHandler {type = requestHandler,name = /dump,class = DumpRequestHandler,args = {defaults={a=A,b=B}}}
   [junit4]   2> 1336812 INFO  (coreLoadExecutor-4820-thread-1-processing-n:127.0.0.1:60341_) [n:127.0.0.1:60341_ c:control_collection s:shard1 r:core_node1 x:collection1] o.a.s.h.l.XMLLoader xsltCacheLifetimeSeconds=60
   [junit4]   2> 1336814 INFO  (coreLoadExecutor-4820-thread-1-processing-n:127.0.0.1:60341_) [n:127.0.0.1:60341_ c:control_collection s:shard1 r:core_node1 x:collection1] o.a.s.h.l.XMLLoader xsltCacheLifetimeSeconds=60
   [junit4]   2> 1336815 INFO  (coreLoadExecutor-4820-thread-1-processing-n:127.0.0.1:60341_) [n:127.0.0.1:60341_ c:control_collection s:shard1 r:core_node1 x:collection1] o.a.s.h.l.XMLLoader xsltCacheLifetimeSeconds=60
   [junit4]   2> 1336816 INFO  (coreLoadExecutor-4820-thread-1-processing-n:127.0.0.1:60341_) [n:127.0.0.1:60341_ c:control_collection s:shard1 r:core_node1 x:collection1] o.a.s.h.l.XMLLoader xsltCacheLifetimeSeconds=60
   [junit4]   2> 1336821 INFO  (coreLoadExecutor-4820-thread-1-processing-n:127.0.0.1:60341_) [n:127.0.0.1:60341_ c:control_collection s:shard1 r:core_node1 x:collection1] o.a.s.c.RequestHandlers Registered paths: /admin/mbeans,standard,/dump,/update/csv,/sql,/update/json/docs,/admin/luke,/export,/admin/segments,/get,/admin/system,/replication,/admin/properties,/config,/stream,/schema,/admin/plugins,/admin/logging,/update/json,/admin/ping,/admin/threads,/update,/admin/file
   [junit4]   2> 1336821 INFO  (coreLoadExecutor-4820-thread-1-processing-n:127.0.0.1:60341_) [n:127.0.0.1:60341_ c:control_collection s:shard1 r:core_node1 x:collection1] o.a.s.c.SolrCore Using default statsCache cache: org.apache.solr.search.stats.LocalStatsCache
   [junit4]   2> 1336822 INFO  (coreLoadExecutor-4820-thread-1-processing-n:127.0.0.1:60341_) [n:127.0.0.1:60341_ c:control_collection s:shard1 r:core_node1 x:collection1] o.a.s.u.UpdateHandler Using UpdateLog implementation: org.apache.solr.update.UpdateLog
   [junit4]   2> 1336822 INFO  (coreLoadExecutor-4820-thread-1-processing-n:127.0.0.1:60341_) [n:127.0.0.1:60341_ c:control_collection s:shard1 r:core_node1 x:collection1] o.a.s.u.UpdateLog Initializing UpdateLog: dataDir= defaultSyncLevel=FLUSH numRecordsToKeep=100 maxNumLogsToKeep=10 numVersionBuckets=65536
   [junit4]   2> 1336823 INFO  (coreLoadExecutor-4820-thread-1-processing-n:127.0.0.1:60341_) [n:127.0.0.1:60341_ c:control_collection s:shard1 r:core_node1 x:collection1] o.a.s.u.CommitTracker Hard AutoCommit: disabled
   [junit4]   2> 1336823 INFO  (coreLoadExecutor-4820-thread-1-processing-n:127.0.0.1:60341_) [n:127.0.0.1:60341_ c:control_collection s:shard1 r:core_node1 x:collection1] o.a.s.u.CommitTracker Soft AutoCommit: disabled
   [junit4]   2> 1336823 INFO  (coreLoadExecutor-4820-thread-1-processing-n:127.0.0.1:60341_) [n:127.0.0.1:60341_ c:control_collection s:shard1 r:core_node1 x:collection1] o.a.s.u.RandomMergePolicy RandomMergePolicy wrapping class org.apache.lucene.index.TieredMergePolicy: [TieredMergePolicy: maxMergeAtOnce=43, maxMergeAtOnceExplicit=30, maxMergedSegmentMB=1.9375, floorSegmentMB=0.9033203125, forceMergeDeletesPctAllowed=18.970783602145342, segmentsPerTier=38.0, maxCFSSegmentSizeMB=8.796093022207999E12, noCFSRatio=1.0
   [junit4]   2> 1336823 INFO  (coreLoadExecutor-4820-thread-1-processing-n:127.0.0.1:60341_) [n:127.0.0.1:60341_ c:control_collection s:shard1 r:core_node1 x:collection1] o.a.s.c.SolrDeletionPolicy SolrDeletionPolicy.onInit: commits: num=1
   [junit4]   2> 	commit{dir=MockDirectoryWrapper(RAMDirectory@1ee3fc72 lockFactory=org.apache.lucene.store.SingleInstanceLockFactory@d1ee26),segFN=segments_1,generation=1}
   [junit4]   2> 1336824 INFO  (coreLoadExecutor-4820-thread-1-processing-n:127.0.0.1:60341_) [n:127.0.0.1:60341_ c:control_collection s:shard1 r:core_node1 x:collection1] o.a.s.c.SolrDeletionPolicy newest commit generation = 1
   [junit4]   2> 1336824 INFO  (coreLoadExecutor-4820-thread-1-processing-n:127.0.0.1:60341_) [n:127.0.0.1:60341_ c:control_collection s:shard1 r:core_node1 x:collection1] o.a.s.s.SolrIndexSearcher Opening [Searcher@787cd70a[collection1] main]
   [junit4]   2> 1336824 INFO  (coreLoadExecutor-4820-thread-1-processing-n:127.0.0.1:60341_) [n:127.0.0.1:60341_ c:control_collection s:shard1 r:core_node1 x:collection1] o.a.s.c.c.ZkStateReader Load collection config from: [/collections/control_collection]
   [junit4]   2> 1336825 INFO  (coreLoadExecutor-4820-thread-1-processing-n:127.0.0.1:60341_) [n:127.0.0.1:60341_ c:control_collection s:shard1 r:core_node1 x:collection1] o.a.s.c.c.ZkStateReader path=[/collections/control_collection] [configName]=[conf1] specified config exists in ZooKeeper
   [junit4]   2> 1336825 INFO  (coreLoadExecutor-4820-thread-1-processing-n:127.0.0.1:60341_) [n:127.0.0.1:60341_ c:control_collection s:shard1 r:core_node1 x:collection1] o.a.s.r.ManagedResourceStorage Setting up ZooKeeper-based storage for the RestManager with znodeBase: /configs/conf1
   [junit4]   2> 1336826 INFO  (coreLoadExecutor-4820-thread-1-processing-n:127.0.0.1:60341_) [n:127.0.0.1:60341_ c:control_collection s:shard1 r:core_node1 x:collection1] o.a.s.r.ManagedResourceStorage Configured ZooKeeperStorageIO with znodeBase: /configs/conf1
   [junit4]   2> 1336826 INFO  (coreLoadExecutor-4820-thread-1-processing-n:127.0.0.1:60341_) [n:127.0.0.1:60341_ c:control_collection s:shard1 r:core_node1 x:collection1] o.a.s.r.RestManager Initializing RestManager with initArgs: {}
   [junit4]   2> 1336826 INFO  (coreLoadExecutor-4820-thread-1-processing-n:127.0.0.1:60341_) [n:127.0.0.1:60341_ c:control_collection s:shard1 r:core_node1 x:collection1] o.a.s.r.ManagedResourceStorage Reading _rest_managed.json using ZooKeeperStorageIO:path=/configs/conf1
   [junit4]   2> 1336826 INFO  (coreLoadExecutor-4820-thread-1-processing-n:127.0.0.1:60341_) [n:127.0.0.1:60341_ c:control_collection s:shard1 r:core_node1 x:collection1] o.a.s.r.ManagedResourceStorage No data found for znode /configs/conf1/_rest_managed.json
   [junit4]   2> 1336827 INFO  (coreLoadExecutor-4820-thread-1-processing-n:127.0.0.1:60341_) [n:127.0.0.1:60341_ c:control_collection s:shard1 r:core_node1 x:collection1] o.a.s.r.ManagedResourceStorage Loaded null at path _rest_managed.json using ZooKeeperStorageIO:path=/configs/conf1
   [junit4]   2> 1336827 INFO  (coreLoadExecutor-4820-thread-1-processing-n:127.0.0.1:60341_) [n:127.0.0.1:60341_ c:control_collection s:shard1 r:core_node1 x:collection1] o.a.s.r.RestManager Initializing 0 registered ManagedResources
   [junit4]   2> 1336827 INFO  (coreLoadExecutor-4820-thread-1-processing-n:127.0.0.1:60341_) [n:127.0.0.1:60341_ c:control_collection s:shard1 r:core_node1 x:collection1] o.a.s.h.ReplicationHandler Commits will be reserved for  10000
   [junit4]   2> 1336828 INFO  (searcherExecutor-4821-thread-1-processing-n:127.0.0.1:60341_ x:collection1 s:shard1 c:control_collection r:core_node1) [n:127.0.0.1:60341_ c:control_collection s:shard1 r:core_node1 x:collection1] o.a.s.c.SolrCore [collection1] Registered new searcher Searcher@787cd70a[collection1] main{ExitableDirectoryReader(UninvertingDirectoryReader())}
   [junit4]   2> 1336829 INFO  (coreLoadExecutor-4820-thread-1-processing-n:127.0.0.1:60341_) [n:127.0.0.1:60341_ c:control_collection s:shard1 r:core_node1 x:collection1] o.a.s.u.UpdateLog Looking up max value of version field to seed version buckets
   [junit4]   2> 1336829 INFO  (coreLoadExecutor-4820-thread-1-processing-n:127.0.0.1:60341_) [n:127.0.0.1:60341_ c:control_collection s:shard1 r:core_node1 x:collection1] o.a.s.u.VersionInfo Refreshing highest value of _version_ for 65536 version buckets from index
   [junit4]   2> 1336829 INFO  (coreLoadExecutor-4820-thread-1-processing-n:127.0.0.1:60341_) [n:127.0.0.1:60341_ c:control_collection s:shard1 r:core_node1 x:collection1] o.a.s.u.VersionInfo No terms found for _version_, cannot seed version bucket highest value from index
   [junit4]   2> 1336829 INFO  (coreLoadExecutor-4820-thread-1-processing-n:127.0.0.1:60341_) [n:127.0.0.1:60341_ c:control_collection s:shard1 r:core_node1 x:collection1] o.a.s.u.UpdateLog Could not find max version in index or recent updates, using new clock 1530132417714585600
   [junit4]   2> 1336832 INFO  (coreLoadExecutor-4820-thread-1-processing-n:127.0.0.1:60341_) [n:127.0.0.1:60341_ c:control_collection s:shard1 r:core_node1 x:collection1] o.a.s.u.UpdateLog Took 3.0ms to seed version buckets with highest version 1530132417714585600
   [junit4]   2> 1336832 INFO  (coreLoadExecutor-4820-thread-1-processing-n:127.0.0.1:60341_) [n:127.0.0.1:60341_ c:control_collection s:shard1 r:core_node1 x:collection1] o.a.s.c.ZkController watch zkdir /configs/conf1
   [junit4]   2> 1336833 INFO  (coreLoadExecutor-4820-thread-1-processing-n:127.0.0.1:60341_) [n:127.0.0.1:60341_ c:control_collection s:shard1 r:core_node1 x:collection1] o.a.s.c.CoreContainer registering core: collection1
   [junit4]   2> 1336835 INFO  (coreZkRegister-4814-thread-1-processing-n:127.0.0.1:60341_ x:collection1 s:shard1 c:control_collection r:core_node1) [n:127.0.0.1:60341_ c:control_collection s:shard1 r:core_node1 x:collection1] o.a.s.c.ZkController Register replica - core:collection1 address:http://127.0.0.1:60341 collection:control_collection shard:shard1
   [junit4]   2> 1336836 INFO  (coreZkRegister-4814-thread-1-processing-n:127.0.0.1:60341_ x:collection1 s:shard1 c:control_collection r:core_node1) [n:127.0.0.1:60341_ c:control_collection s:shard1 r:core_node1 x:collection1] o.a.s.c.c.SolrZkClient makePath: /collections/control_collection/leader_elect/shard1/election
   [junit4]   2> 1336843 INFO  (coreZkRegister-4814-thread-1-processing-n:127.0.0.1:60341_ x:collection1 s:shard1 c:control_collection r:core_node1) [n:127.0.0.1:60341_ c:control_collection s:shard1 r:core_node1 x:collection1] o.a.s.c.LeaderElector Joined leadership election with path: /collections/control_collection/leader_elect/shard1/election/95633275991556100-core_node1-n_0000000000
   [junit4]   2> 1336844 INFO  (coreZkRegister-4814-thread-1-processing-n:127.0.0.1:60341_ x:collection1 s:shard1 c:control_collection r:core_node1) [n:127.0.0.1:60341_ c:control_collection s:shard1 r:core_node1 x:collection1] o.a.s.c.ShardLeaderElectionContext Running the leader process for shard=shard1 and weAreReplacement=false and leaderVoteWait=10000
   [junit4]   2> 1336847 INFO  (coreZkRegister-4814-thread-1-processing-n:127.0.0.1:60341_ x:collection1 s:shard1 c:control_collection r:core_node1) [n:127.0.0.1:60341_ c:control_collection s:shard1 r:core_node1 x:collection1] o.a.s.c.ShardLeaderElectionContext Enough replicas found to continue.
   [junit4]   2> 1336847 INFO  (coreZkRegister-4814-thread-1-processing-n:127.0.0.1:60341_ x:collection1 s:shard1 c:control_collection r:core_node1) [n:127.0.0.1:60341_ c:control_collection s:shard1 r:core_node1 x:collection1] o.a.s.c.ShardLeaderElectionContext I may be the new leader - try and sync
   [junit4]   2> 1336847 INFO  (coreZkRegister-4814-thread-1-processing-n:127.0.0.1:60341_ x:collection1 s:shard1 c:control_collection r:core_node1) [n:127.0.0.1:60341_ c:control_collection s:shard1 r:core_node1 x:collection1] o.a.s.c.SyncStrategy Sync replicas to http://127.0.0.1:60341/collection1/
   [junit4]   2> 1336847 INFO  (coreZkRegister-4814-thread-1-processing-n:127.0.0.1:60341_ x:collection1 s:shard1 c:control_collection r:core_node1) [n:127.0.0.1:60341_ c:control_collection s:shard1 r:core_node1 x:collection1] o.a.s.c.SyncStrategy Sync Success - now sync replicas to me
   [junit4]   2> 1336848 INFO  (coreZkRegister-4814-thread-1-processing-n:127.0.0.1:60341_ x:collection1 s:shard1 c:control_collection r:core_node1) [n:127.0.0.1:60341_ c:control_collection s:shard1 r:core_node1 x:collection1] o.a.s.c.SyncStrategy http://127.0.0.1:60341/collection1/ has no replicas
   [junit4]   2> 1336848 INFO  (OverseerStateUpdate-95633275991556100-127.0.0.1:60341_-n_0000000000) [n:127.0.0.1:60341_    ] o.a.s.c.Overseer processMessage: queueSize: 1, message = {
   [junit4]   2>   "operation":"leader",
   [junit4]   2>   "shard":"shard1",
   [junit4]   2>   "collection":"control_collection"} current state version: 1
   [junit4]   2> 1336849 INFO  (coreZkRegister-4814-thread-1-processing-n:127.0.0.1:60341_ x:collection1 s:shard1 c:control_collection r:core_node1) [n:127.0.0.1:60341_ c:control_collection s:shard1 r:core_node1 x:collection1] o.a.s.c.c.SolrZkClient makePath: /collections/control_collection/leaders/shard1
   [junit4]   2> 1336853 INFO  (coreZkRegister-4814-thread-1-processing-n:127.0.0.1:60341_ x:collection1 s:shard1 c:control_collection r:core_node1) [n:127.0.0.1:60341_ c:control_collection s:shard1 r:core_node1 x:collection1] o.a.s.c.ShardLeaderElectionContextBase Creating leader registration node /collections/control_collection/leaders/shard1/leader after winning as /collections/control_collection/leader_elect/shard1/election/95633275991556100-core_node1-n_0000000000
   [junit4]   2> 1336857 INFO  (coreZkRegister-4814-thread-1-processing-n:127.0.0.1:60341_ x:collection1 s:shard1 c:control_collection r:core_node1) [n:127.0.0.1:60341_ c:control_collection s:shard1 r:core_node1 x:collection1] o.a.s.c.ShardLeaderElectionContext I am the new leader: http://127.0.0.1:60341/collection1/ shard1
   [junit4]   2> 1336858 INFO  (OverseerStateUpdate-95633275991556100-127.0.0.1:60341_-n_0000000000) [n:127.0.0.1:60341_    ] o.a.s.c.Overseer processMessage: queueSize: 1, message = {
   [junit4]   2>   "operation":"leader",
   [junit4]   2>   "shard":"shard1",
   [junit4]   2>   "collection":"control_collection",
   [junit4]   2>   "base_url":"http://127.0.0.1:60341",
   [junit4]   2>   "core":"collection1",
   [junit4]   2>   "state":"active"} current state version: 1
   [junit4]   2> 1336963 INFO  (zkCallback-1302-thread-1-processing-n:127.0.0.1:60341_) [n:127.0.0.1:60341_    ] o.a.s.c.c.ZkStateReader A cluster state change: [WatchedEvent state:SyncConnected type:NodeDataChanged path:/clusterstate.json], has occurred - updating... (live nodes size: [1])
   [junit4]   2> 1337010 INFO  (coreZkRegister-4814-thread-1-processing-n:127.0.0.1:60341_ x:collection1 s:shard1 c:control_collection r:core_node1) [n:127.0.0.1:60341_ c:control_collection s:shard1 r:core_node1 x:collection1] o.a.s.c.ZkController We are http://127.0.0.1:60341/collection1/ and leader is http://127.0.0.1:60341/collection1/
   [junit4]   2> 1337010 INFO  (coreZkRegister-4814-thread-1-processing-n:127.0.0.1:60341_ x:collection1 s:shard1 c:control_collection r:core_node1) [n:127.0.0.1:60341_ c:control_collection s:shard1 r:core_node1 x:collection1] o.a.s.c.ZkController No LogReplay needed for core=collection1 baseURL=http://127.0.0.1:60341
   [junit4]   2> 1337010 INFO  (coreZkRegister-4814-thread-1-processing-n:127.0.0.1:60341_ x:collection1 s:shard1 c:control_collection r:core_node1) [n:127.0.0.1:60341_ c:control_collection s:shard1 r:core_node1 x:collection1] o.a.s.c.ZkController I am the leader, no recovery necessary
   [junit4]   2> 1337010 INFO  (coreZkRegister-4814-thread-1-processing-n:127.0.0.1:60341_ x:collection1 s:shard1 c:control_collection r:core_node1) [n:127.0.0.1:60341_ c:control_collection s:shard1 r:core_node1 x:collection1] o.a.s.c.ZkController publishing state=active
   [junit4]   2> 1337010 INFO  (coreZkRegister-4814-thread-1-processing-n:127.0.0.1:60341_ x:collection1 s:shard1 c:control_collection r:core_node1) [n:127.0.0.1:60341_ c:control_collection s:shard1 r:core_node1 x:collection1] o.a.s.c.ZkController numShards not found on descriptor - reading it from system property
   [junit4]   2> 1337014 INFO  (OverseerStateUpdate-95633275991556100-127.0.0.1:60341_-n_0000000000) [n:127.0.0.1:60341_    ] o.a.s.c.Overseer processMessage: queueSize: 1, message = {
   [junit4]   2>   "core":"collection1",
   [junit4]   2>   "core_node_name":"core_node1",
   [junit4]   2>   "roles":null,
   [junit4]   2>   "base_url":"http://127.0.0.1:60341",
   [junit4]   2>   "node_name":"127.0.0.1:60341_",
   [junit4]   2>   "numShards":"1",
   [junit4]   2>   "state":"active",
   [junit4]   2>   "shard":"shard1",
   [junit4]   2>   "collection":"control_collection",
   [junit4]   2>   "operation":"state"} current state version: 2
   [junit4]   2> 1337014 INFO  (OverseerStateUpdate-95633275991556100-127.0.0.1:60341_-n_0000000000) [n:127.0.0.1:60341_    ] o.a.s.c.o.ReplicaMutator Update state numShards=1 message={
   [junit4]   2>   "core":"collection1",
   [junit4]   2>   "core_node_name":"core_node1",
   [junit4]   2>   "roles":null,
   [junit4]   2>   "base_url":"http://127.0.0.1:60341",
   [junit4]   2>   "node_name":"127.0.0.1:60341_",
   [junit4]   2>   "numShards":"1",
   [junit4]   2>   "state":"active",
   [junit4]   2>   "shard":"shard1",
   [junit4]   2>   "collection":"control_collection",
   [junit4]   2>   "operation":"state"}
   [junit4]   2> 1337112 INFO  (TEST-TestReqParamsAPI.test-seed#[E461313847EF87DD]) [    ] o.a.s.c.c.SolrZkClient Using default ZkCredentialsProvider
   [junit4]   2> 1337113 INFO  (TEST-TestReqParamsAPI.test-seed#[E461313847EF87DD]) [    ] o.a.s.c.c.ConnectionManager Waiting for client to connect to ZooKeeper
   [junit4]   2> 1337114 INFO  (zkCallback-1304-thread-1) [    ] o.a.s.c.c.ConnectionManager Watcher org.apache.solr.common.cloud.ConnectionManager@36bc9ac9 name:ZooKeeperConnection Watcher:127.0.0.1:58221/solr got event WatchedEvent state:SyncConnected type:None path:null path:null type:None
   [junit4]   2> 1337115 INFO  (TEST-TestReqParamsAPI.test-seed#[E461313847EF87DD]) [    ] o.a.s.c.c.ConnectionManager Client is connected to ZooKeeper
   [junit4]   2> 1337115 INFO  (TEST-TestReqParamsAPI.test-seed#[E461313847EF87DD]) [    ] o.a.s.c.c.SolrZkClient Using default ZkACLProvider
   [junit4]   2> 1337115 INFO  (TEST-TestReqParamsAPI.test-seed#[E461313847EF87DD]) [    ] o.a.s.c.c.ZkStateReader Updating cluster state from ZooKeeper... 
   [junit4]   2> 1337117 INFO  (TEST-TestReqParamsAPI.test-seed#[E461313847EF87DD]) [    ] o.a.s.c.c.ZkStateReader Updated live nodes from ZooKeeper... (0) -> (1)
   [junit4]   2> 1337118 INFO  (zkCallback-1304-thread-1) [    ] o.a.s.c.c.ZkStateReader A cluster state change: [WatchedEvent state:SyncConnected type:NodeDataChanged path:/clusterstate.json], has occurred - updating... (live nodes size: [1])
   [junit4]   2> 1337118 INFO  (zkCallback-1302-thread-1-processing-n:127.0.0.1:60341_) [n:127.0.0.1:60341_    ] o.a.s.c.c.ZkStateReader A cluster state change: [WatchedEvent state:SyncConnected type:NodeDataChanged path:/clusterstate.json], has occurred - updating... (live nodes size: [1])
   [junit4]   2> 1337120 INFO  (TEST-TestReqParamsAPI.test-seed#[E461313847EF87DD]) [    ] o.a.s.c.ChaosMonkey monkey: init - expire sessions:false cause connection loss:false
   [junit4]   2> 1337320 INFO  (TEST-TestReqParamsAPI.test-seed#[E461313847EF87DD]) [    ] o.a.s.SolrTestCaseJ4 Writing core.properties file to /export/home/jenkins/workspace/Lucene-Solr-6.x-Solaris/solr/build/solr-core/test/J1/temp/solr.handler.TestReqParamsAPI_E461313847EF87DD-001/shard-1-001/cores/collection1
   [junit4]   2> 1337321 INFO  (TEST-TestReqParamsAPI.test-seed#[E461313847EF87DD]) [    ] o.a.s.c.AbstractFullDistribZkTestBase create jetty 1 in directory /export/home/jenkins/workspace/Lucene-Solr-6.x-Solaris/solr/build/solr-core/test/J1/temp/solr.handler.TestReqParamsAPI_E461313847EF87DD-001/shard-1-001
   [junit4]   2> 1337321 INFO  (TEST-TestReqParamsAPI.test-seed#[E461313847EF87DD]) [    ] o.e.j.s.Server jetty-9.3.8.v20160314
   [junit4]   2> 1337324 INFO  (TEST-TestReqParamsAPI.test-seed#[E461313847EF87DD]) [    ] o.e.j.s.h.ContextHandler Started o.e.j.s.ServletContextHandler@638106a4{/,null,AVAILABLE}
   [junit4]   2> 1337325 INFO  (TEST-TestReqParamsAPI.test-seed#[E461313847EF87DD]) [    ] o.e.j.s.ServerConnector Started ServerConnector@93b93e{HTTP/1.1,[http/1.1]}{127.0.0.1:45284}
   [junit4]   2> 1337325 INFO  (TEST-TestReqParamsAPI.test-seed#[E461313847EF87DD]) [    ] o.e.j.s.Server Started @1340347ms
   [junit4]   2> 1337325 INFO  (TEST-TestReqParamsAPI.test-seed#[E461313847EF87DD]) [    ] o.a.s.c.s.e.JettySolrRunner Jetty properties: {solr.data.dir=/export/home/jenkins/workspace/Lucene-Solr-6.x-Solaris/solr/build/solr-core/test/J1/temp/solr.handler.TestReqParamsAPI_E461313847EF87DD-001/tempDir-001/jetty1, solrconfig=solrconfig.xml, hostContext=/, hostPort=45284, coreRootDirectory=/export/home/jenkins/workspace/Lucene-Solr-6.x-Solaris/solr/build/solr-core/test/J1/../../../../../../../../../../export/home/jenkins/workspace/Lucene-Solr-6.x-Solaris/solr/build/solr-core/test/J1/temp/solr.handler.TestReqParamsAPI_E461313847EF87DD-001/shard-1-001/cores}
   [junit4]   2> 1337325 INFO  (TEST-TestReqParamsAPI.test-seed#[E461313847EF87DD]) [    ] o.a.s.s.SolrDispatchFilter SolrDispatchFilter.init(): sun.misc.Launcher$AppClassLoader@6d06d69c
   [junit4]   2> 1337325 INFO  (TEST-TestReqParamsAPI.test-seed#[E461313847EF87DD]) [    ] o.a.s.c.SolrResourceLoader new SolrResourceLoader for directory: '/export/home/jenkins/workspace/Lucene-Solr-6.x-Solaris/solr/build/solr-core/test/J1/temp/solr.handler.TestReqParamsAPI_E461313847EF87DD-001/shard-1-001'
   [junit4]   2> 1337325 INFO  (TEST-TestReqParamsAPI.test-seed#[E461313847EF87DD]) [    ] o.a.s.c.SolrResourceLoader JNDI not configured for solr (NoInitialContextEx)
   [junit4]   2> 1337325 INFO  (TEST-TestReqParamsAPI.test-seed#[E461313847EF87DD]) [    ] o.a.s.c.SolrResourceLoader solr home defaulted to 'solr/' (could not find system property or JNDI)
   [junit4]   2> 1337325 INFO  (TEST-TestReqParamsAPI.test-seed#[E461313847EF87DD]) [    ] o.a.s.c.c.SolrZkClient Using default ZkCredentialsProvider
   [junit4]   2> 1337327 INFO  (TEST-TestReqParamsAPI.test-seed#[E461313847EF87DD]) [    ] o.a.s.c.c.ConnectionManager Waiting for client to connect to ZooKeeper
   [junit4]   2> 1337328 INFO  (zkCallback-1305-thread-1) [    ] o.a.s.c.c.ConnectionManager Watcher org.apache.solr.common.cloud.ConnectionManager@73074920 name:ZooKeeperConnection Watcher:127.0.0.1:58221/solr got event WatchedEvent state:SyncConnected type:None path:null path:null type:None
   [junit4]   2> 1337328 INFO  (TEST-TestReqParamsAPI.test-seed#[E461313847EF87DD]) [    ] o.a.s.c.c.ConnectionManager Client is connected to ZooKeeper
   [junit4]   2> 1337328 INFO  (TEST-TestReqParamsAPI.test-seed#[E461313847EF87DD]) [    ] o.a.s.c.c.SolrZkClient Using default ZkACLProvider
   [junit4]   2> 1337330 INFO  (TEST-TestReqParamsAPI.test-seed#[E461313847EF87DD]) [    ] o.a.s.s.SolrDispatchFilter Loading solr.xml from SolrHome (not found in ZooKeeper)
   [junit4]   2> 1337330 INFO  (TEST-TestReqParamsAPI.test-seed#[E461313847EF87DD]) [    ] o.a.s.c.SolrXmlConfig Loading container configuration from /export/home/jenkins/workspace/Lucene-Solr-6.x-Solaris/solr/build/solr-core/test/J1/temp/solr.handler.TestReqParamsAPI_E461313847EF87DD-001/shard-1-001/solr.xml
   [junit4]   2> 1337334 INFO  (TEST-TestReqParamsAPI.test-seed#[E461313847EF87DD]) [    ] o.a.s.c.CorePropertiesLocator Config-defined core root directory: /export/home/jenkins/workspace/Lucene-Solr-6.x-Solaris/solr/build/solr-core/test/J1/../../../../../../../../../../export/home/jenkins/workspace/Lucene-Solr-6.x-Solaris/solr/build/solr-core/test/J1/temp/solr.handler.TestReqParamsAPI_E461313847EF87DD-001/shard-1-001/cores
   [junit4]   2> 1337334 INFO  (TEST-TestReqParamsAPI.test-seed#[E461313847EF87DD]) [    ] o.a.s.c.CoreContainer New CoreContainer 2075013707
   [junit4]   2> 1337334 INFO  (TEST-TestReqParamsAPI.test-seed#[E461313847EF87DD]) [    ] o.a.s.c.CoreContainer Loading cores into CoreContainer [instanceDir=/export/home/jenkins/workspace/Lucene-Solr-6.x-Solaris/solr/build/solr-core/test/J1/temp/solr.handler.TestReqParamsAPI_E461313847EF87DD-001/shard-1-001]
   [junit4]   2> 1337334 WARN  (TEST-TestReqParamsAPI.test-seed#[E461313847EF87DD]) [    ] o.a.s.c.CoreContainer Couldn't add files from /export/home/jenkins/workspace/Lucene-Solr-6.x-Solaris/solr/build/solr-core/test/J1/temp/solr.handler.TestReqParamsAPI_E461313847EF87DD-001/shard-1-001/lib to classpath: /export/home/jenkins/workspace/Lucene-Solr-6.x-Solaris/solr/build/solr-core/test/J1/temp/solr.handler.TestReqParamsAPI_E461313847EF87DD-001/shard-1-001/lib
   [junit4]   2> 1337334 INFO  (TEST-TestReqParamsAPI.test-seed#[E461313847EF87DD]) [    ] o.a.s.h.c.HttpShardHandlerFactory created with socketTimeout : 90000,urlScheme : ,connTimeout : 15000,maxConnectionsPerHost : 20,maxConnections : 10000,corePoolSize : 0,maximumPoolSize : 2147483647,maxThreadIdleTime : 5,sizeOfQueue : -1,fairnessPolicy : false,useRetries : false,
   [junit4]   2> 1337336 INFO  (TEST-TestReqParamsAPI.test-seed#[E461313847EF87DD]) [    ] o.a.s.u.UpdateShardHandler Creating UpdateShardHandler HTTP client with params: socketTimeout=340000&connTimeout=45000&retry=true
   [junit4]   2> 1337336 INFO  (TEST-TestReqParamsAPI.test-seed#[E461313847EF87DD]) [    ] o.a.s.l.LogWatcher SLF4J impl is org.slf4j.impl.Log4jLoggerFactory
   [junit4]   2> 1337336 INFO  (TEST-TestReqParamsAPI.test-seed#[E461313847EF87DD]) [    ] o.a.s.l.LogWatcher Registering Log Listener [Log4j (org.slf4j.impl.Log4jLoggerFactory)]
   [junit4]   2> 1337336 INFO  (TEST-TestReqParamsAPI.test-seed#[E461313847EF87DD]) [    ] o.a.s.c.ZkContainer Zookeeper client=127.0.0.1:58221/solr
   [junit4]   2> 1337337 INFO  (TEST-TestReqParamsAPI.test-seed#[E461313847EF87DD]) [    ] o.a.s.c.ZkController zkHost includes chroot
   [junit4]   2> 1337337 INFO  (TEST-TestReqParamsAPI.test-seed#[E461313847EF87DD]) [    ] o.a.s.c.c.SolrZkClient Using default ZkCredentialsProvider
   [junit4]   2> 1337337 INFO  (TEST-TestReqParamsAPI.test-seed#[E461313847EF87DD]) [    ] o.a.s.c.c.ConnectionManager Waiting for client to connect to ZooKeeper
   [junit4]   2> 1337339 INFO  (zkCallback-1308-thread-1) [    ] o.a.s.c.c.ConnectionManager Watcher org.apache.solr.common.cloud.ConnectionManager@48c8c51a name:ZooKeeperConnection Watcher:127.0.0.1:58221 got event WatchedEvent state:SyncConnected type:None path:null path:null type:None
   [junit4]   2> 1337339 INFO  (TEST-TestReqParamsAPI.test-seed#[E461313847EF87DD]) [    ] o.a.s.c.c.ConnectionManager Client is connected to ZooKeeper
   [junit4]   2> 1337340 INFO  (TEST-TestReqParamsAPI.test-seed#[E461313847EF87DD]) [    ] o.a.s.c.c.SolrZkClient Using default ZkACLProvider
   [junit4]   2> 1337341 INFO  (TEST-TestReqParamsAPI.test-seed#[E461313847EF87DD]) [n:127.0.0.1:45284_    ] o.a.s.c.c.ConnectionManager Waiting for client to connect to ZooKeeper
   [junit4]   2> 1337344 INFO  (zkCallback-1309-thread-1-processing-n:127.0.0.1:45284_) [n:127.0.0.1:45284_    ] o.a.s.c.c.ConnectionManager Watcher org.apache.solr.common.cloud.ConnectionManager@6c15a22e name:ZooKeeperConnection Watcher:127.0.0.1:58221/solr got event WatchedEvent state:SyncConnected type:None path:null path:null type:None
   [junit4]   2> 1337345 INFO  (TEST-TestReqParamsAPI.test-seed#[E461313847EF87DD]) [n:127.0.0.1:45284_    ] o.a.s.c.c.ConnectionManager Client is connected to ZooKeeper
   [junit4]   2> 1337354 INFO  (TEST-TestReqParamsAPI.test-seed#[E461313847EF87DD]) [n:127.0.0.1:45284_    ] o.a.s.c.c.ZkStateReader Updating cluster state from ZooKeeper... 
   [junit4]   2> 1337357 INFO  (TEST-TestReqParamsAPI.test-seed#[E461313847EF87DD]) [n:127.0.0.1:45284_    ] o.a.s.c.c.ZkStateReader Updated live nodes from ZooKeeper... (0) -> (1)
   [junit4]   2> 1337362 INFO  (TEST-TestReqParamsAPI.test-seed#[E461313847EF87DD]) [n:127.0.0.1:45284_    ] o.a.s.c.Overseer Overseer (id=null) closing
   [junit4]   2> 1337363 INFO  (TEST-TestReqParamsAPI.test-seed#[E461313847EF87DD]) [n:127.0.0.1:45284_    ] o.a.s.c.LeaderElector Joined leadership election with path: /overseer_elect/election/95633275991556104-127.0.0.1:45284_-n_0000000001
   [junit4]   2> 1337364 INFO  (TEST-TestReqParamsAPI.test-seed#[E461313847EF87DD]) [n:127.0.0.1:45284_    ] o.a.s.c.LeaderElector Watching path /overseer_elect/election/95633275991556100-127.0.0.1:60341_-n_0000000000 to know if I could be the leader
   [junit4]   2> 1337365 INFO  (TEST-TestReqParamsAPI.test-seed#[E461313847EF87DD]) [n:127.0.0.1:45284_    ] o.a.s.c.ZkController Publish node=127.0.0.1:45284_ as DOWN
   [junit4]   2> 1337368 INFO  (OverseerStateUpdate-95633275991556100-127.0.0.1:60341_-n_0000000000) [n:127.0.0.1:60341_    ] o.a.s.c.Overseer processMessage: queueSize: 1, message = {
   [junit4]   2>   "operation":"downnode",
   [junit4]   2>   "node_name":"127.0.0.1:45284_"} current state version: 3
   [junit4]   2> 1337368 INFO  (OverseerStateUpdate-95633275991556100-127.0.0.1:60341_-n_0000000000) [n:127.0.0.1:60341_    ] o.a.s.c.o.NodeMutator DownNode state invoked for node: 127.0.0.1:45284_
   [junit4]   2> 1337471 INFO  (zkCallback-1304-thread-1) [    ] o.a.s.c.c.ZkStateReader A cluster state change: [WatchedEvent state:SyncConnected type:NodeDataChanged path:/clusterstate.json], has occurred - updating... (live nodes size: [1])
   [junit4]   2> 1337471 INFO  (zkCallback-1302-thread-1-processing-n:127.0.0.1:60341_) [n:127.0.0.1:60341_    ] o.a.s.c.c.ZkStateReader A cluster state change: [WatchedEvent state:SyncConnected type:NodeDataChanged path:/clusterstate.json], has occurred - updating... (live nodes size: [1])
   [junit4]   2> 1337472 INFO  (zkCallback-1309-thread-1-processing-n:127.0.0.1:45284_) [n:127.0.0.1:45284_    ] o.a.s.c.c.ZkStateReader A cluster state change: [WatchedEvent state:SyncConnected type:NodeDataChanged path:/clusterstate.json], has occurred - updating... (live nodes size: [1])
   [junit4]   2> 1338369 INFO  (TEST-TestReqParamsAPI.test-seed#[E461313847EF87DD]) [n:127.0.0.1:45284_    ] o.a.s.c.ZkController Register node as live in ZooKeeper:/live_nodes/127.0.0.1:45284_
   [junit4]   2> 1338370 INFO  (TEST-TestReqParamsAPI.test-seed#[E461313847EF87DD]) [n:127.0.0.1:45284_    ] o.a.s.c.c.SolrZkClient makePath: /live_nodes/127.0.0.1:45284_
   [junit4]   2> 1338374 INFO  (zkCallback-1302-thread-1-processing-n:127.0.0.1:60341_) [n:127.0.0.1:60341_    ] o.a.s.c.c.ZkStateReader A live node change: [WatchedEvent state:SyncConnected type:NodeChildrenChanged path:/live_nodes], has occurred - updating... (live nodes size: [1])
   [junit4]   2> 1338375 INFO  (zkCallback-1302-thread-1-processing-n:127.0.0.1:60341_) [n:127.0.0.1:60341_    ] o.a.s.c.c.ZkStateReader Updated live nodes from ZooKeeper... (1) -> (2)
   [junit4]   2> 1338409 INFO  (zkCallback-1309-thread-1-processing-n:127.0.0.1:45284_) [n:127.0.0.1:45284_    ] o.a.s.c.c.ZkStateReader A live node change: [WatchedEvent state:SyncConnected type:NodeChildrenChanged path:/live_nodes], has occurred - updating... (live nodes size: [1])
   [junit4]   2> 1338409 INFO  (zkCallback-1304-thread-1) [    ] o.a.s.c.c.ZkStateReader A live node change: [WatchedEvent state:SyncConnected type:NodeChildrenChanged path:/live_nodes], has occurred - updating... (live nodes size: [1])
   [junit4]   2> 1338409 INFO  (zkCallback-1309-thread-1-processing-n:127.0.0.1:45284_) [n:127.0.0.1:45284_    ] o.a.s.c.c.ZkStateReader Updated live nodes from ZooKeeper... (1) -> (2)
   [junit4]   2> 1338410 INFO  (zkCallback-1304-thread-1) [    ] o.a.s.c.c.ZkStateReader Updated live nodes from ZooKeeper... (1) -> (2)
   [junit4]   2> 1338412 INFO  (TEST-TestReqParamsAPI.test-seed#[E461313847EF87DD]) [n:127.0.0.1:45284_    ] o.a.s.c.CoreContainer Security conf doesn't exist. Skipping setup for authorization module.
   [junit4]   2> 1338412 INFO  (TEST-TestReqParamsAPI.test-seed#[E461313847EF87DD]) [n:127.0.0.1:45284_    ] o.a.s.c.CoreContainer No authentication plugin used.
   [junit4]   2> 1338412 INFO  (TEST-TestReqParamsAPI.test-seed#[E461313847EF87DD]) [n:127.0.0.1:45284_    ] o.a.s.c.CorePropertiesLocator Looking for core definitions underneath /export/home/jenkins/workspace/Lucene-Solr-6.x-Solaris/solr/build/solr-core/test/J1/../../../../../../../../../../export/home/jenkins/workspace/Lucene-Solr-6.x-Solaris/solr/build/solr-core/test/J1/temp/solr.handler.TestReqParamsAPI_E461313847EF87DD-001/shard-1-001/cores
   [junit4]   2> 1338413 INFO  (TEST-TestReqParamsAPI.test-seed#[E461313847EF87DD]) [n:127.0.0.1:45284_    ] o.a.s.c.CoreDescriptor Created CoreDescriptor: {name=collection1, config=solrconfig.xml, transient=false, schema=schema.xml, loadOnStartup=true, configSetProperties=configsetprops.json, collection=collection1, coreNodeName=, dataDir=data/, shard=}
   [junit4]   2> 1338413 INFO  (TEST-TestReqParamsAPI.test-seed#[E461313847EF87DD]) [n:127.0.0.1:45284_    ] o.a.s.c.CorePropertiesLocator Found core collection1 in /export/home/jenkins/workspace/Lucene-Solr-6.x-Solaris/solr/build/solr-core/test/J1/../../../../../../../../../../export/home/jenkins/workspace/Lucene-Solr-6.x-Solaris/solr/build/solr-core/test/J1/temp/solr.handler.TestReqParamsAPI_E461313847EF87DD-001/shard-1-001/cores/collection1
   [junit4]   2> 1338413 INFO  (TEST-TestReqParamsAPI.test-seed#[E461313847EF87DD]) [n:127.0.0.1:45284_    ] o.a.s.c.CorePropertiesLocator Found 1 core definitions
   [junit4]   2> 1338415 INFO  (TEST-TestReqParamsAPI.test-seed#[E461313847EF87DD]) [n:127.0.0.1:45284_    ] o.a.s.s.SolrDispatchFilter user.dir=/export/home/jenkins/workspace/Lucene-Solr-6.x-Solaris/solr/build/solr-core/test/J1
   [junit4]   2> 1338415 INFO  (TEST-TestReqParamsAPI.test-seed#[E461313847EF87DD]) [n:127.0.0.1:45284_    ] o.a.s.s.SolrDispatchFilter SolrDispatchFilter.init() done
   [junit4]   2> 1338417 INFO  (coreLoadExecutor-4831-thread-1-processing-n:127.0.0.1:45284_) [n:127.0.0.1:45284_ c:collection1   x:collection1] o.a.s.c.ZkController publishing state=down
   [junit4]   2> 1338417 INFO  (coreLoadExecutor-4831-thread-1-processing-n:127.0.0.1:45284_) [n:127.0.0.1:45284_ c:collection1   x:collection1] o.a.s.c.ZkController numShards not found on descriptor - reading it from system property
   [junit4]   2> 1338419 INFO  (OverseerStateUpdate-95633275991556100-127.0.0.1:60341_-n_0000000000) [n:127.0.0.1:60341_    ] o.a.s.c.Overseer processMessage: queueSize: 1, message = {
   [junit4]   2>   "core":"collection1",
   [junit4]   2>   "roles":null,
   [junit4]   2>   "base_url":"http://127.0.0.1:45284",
   [junit4]   2>   "node_name":"127.0.0.1:45284_",
   [junit4]   2>   "numShards":"2",
   [junit4]   2>   "state":"down",
   [junit4]   2>   "shard":null,
   [junit4]   2>   "collection":"collection1",
   [junit4]   2>   "operation":"state"} current state version: 4
   [junit4]   2> 1338419 INFO  (coreLoadExecutor-4831-thread-1-processing-n:127.0.0.1:45284_) [n:127.0.0.1:45284_ c:collection1   x:collection1] o.a.s.c.ZkController look for our core node name
   [junit4]   2> 1338419 INFO  (OverseerStateUpdate-95633275991556100-127.0.0.1:60341_-n_0000000000) [n:127.0.0.1:60341_    ] o.a.s.c.o.ReplicaMutator Update state numShards=2 message={
   [junit4]   2>   "core":"collection1",
   [junit4]   2>   "roles":null,
   [junit4]   2>   "base_url":"http://127.0.0.1:45284",
   [junit4]   2>   "node_name":"127.0.0.1:45284_",
   [junit4]   2>   "numShards":"2",
   [junit4]   2>   "state":"down",
   [junit4]   2>   "shard":null,
   [junit4]   2>   "collection":"collection1",
   [junit4]   2>   "operation":"state"}
   [junit4]   2> 1338419 INFO  (OverseerStateUpdate-95633275991556100-127.0.0.1:60341_-n_0000000000) [n:127.0.0.1:60341_    ] o.a.s.c.o.ClusterStateMutator building a new cName: collection1
   [junit4]   2> 1338419 INFO  (OverseerStateUpdate-95633275991556100-127.0.0.1:60341_-n_0000000000) [n:127.0.0.1:60341_    ] o.a.s.c.o.ReplicaMutator Assigning new node to shard shard=shard2
   [junit4]   2> 1338522 INFO  (zkCallback-1309-thread-1-processing-n:127.0.0.1:45284_) [n:127.0.0.1:45284_    ] o.a.s.c.c.ZkStateReader A cluster state change: [WatchedEvent state:SyncConnected type:NodeDataChanged path:/clusterstate.json], has occurred - updating... (live nodes size: [2])
   [junit4]   2> 1338522 INFO  (zkCallback-1302-thread-1-processing-n:127.0.0.1:60341_) [n:127.0.0.1:60341_    ] o.a.s.c.c.ZkStateReader A cluster state change: [WatchedEvent state:SyncConnected type:NodeDataChanged path:/clusterstate.json], has occurred - updating... (live nodes size: [2])
   [junit4]   2> 1338534 INFO  (zkCallback-1304-thread-1) [    ] o.a.s.c.c.ZkStateReader A cluster state change: [WatchedEvent state:SyncConnected type:NodeDataChanged path:/clusterstate.json], has occurred - updating... (live nodes size: [2])
   [junit4]   2> 1339421 INFO  (coreLoadExecutor-4831-thread-1-processing-n:127.0.0.1:45284_) [n:127.0.0.1:45284_ c:collection1   x:collection1] o.a.s.c.ZkController waiting to find shard id in clusterstate for collection1
   [junit4]   2> 1339421 INFO  (coreLoadExecutor-4831-thread-1-processing-n:127.0.0.1:45284_) [n:127.0.0.1:45284_ c:collection1   x:collection1] o.a.s.c.ZkController Check for collection zkNode:collection1
   [junit4]   2> 1339421 INFO  (coreLoadExecutor-4831-thread-1-processing-n:127.0.0.1:45284_) [n:127.0.0.1:45284_ c:collection1   x:collection1] o.a.s.c.ZkController Collection zkNode exists
   [junit4]   2> 1339422 INFO  (coreLoadExecutor-4831-thread-1-processing-n:127.0.0.1:45284_) [n:127.0.0.1:45284_ c:collection1   x:collection1] o.a.s.c.c.ZkStateReader Load collection config from: [/collections/collection1]
   [junit4]   2> 1339423 INFO  (coreLoadExecutor-4831-thread-1-processing-n:127.0.0.1:45284_) [n:127.0.0.1:45284_ c:collection1   x:collection1] o.a.s.c.c.ZkStateReader path=[/collections/collection1] [configName]=[conf1] specified config exists in ZooKeeper
   [junit4]   2> 1339423 INFO  (coreLoadExecutor-4831-thread-1-processing-n:127.0.0.1:45284_) [n:127.0.0.1:45284_ c:collection1   x:collection1] o.a.s.c.SolrResourceLoader new SolrResourceLoader for directory: '/export/home/jenkins/workspace/Lucene-Solr-6.x-Solaris/solr/build/solr-core/test/J1/temp/solr.handler.TestReqParamsAPI_E461313847EF87DD-001/shard-1-001/cores/collection1'
   [junit4]   2> 1339424 INFO  (coreLoadExecutor-4831-thread-1-processing-n:127.0.0.1:45284_) [n:127.0.0.1:45284_ c:collection1   x:collection1] o.a.s.c.SolrResourceLoader JNDI not configured for solr (NoInitialContextEx)
   [junit4]   2> 1339424 INFO  (coreLoadExecutor-4831-thread-1-processing-n:127.0.0.1:45284_) [n:127.0.0.1:45284_ c:collection1   x:collection1] o.a.s.c.SolrResourceLoader solr home defaulted to 'solr/' (could not find system property or JNDI)
   [junit4]   2> 1339426 INFO  (coreLoadExecutor-4831-thread-1-processing-n:127.0.0.1:45284_) [n:127.0.0.1:45284_ c:collection1   x:collection1] o.a.s.c.Config loaded config solrconfig.xml with version 0 
   [junit4]   2> 1339433 INFO  (coreLoadExecutor-4831-thread-1-processing-n:127.0.0.1:45284_) [n:127.0.0.1:45284_ c:collection1   x:collection1] o.a.s.c.SolrConfig current version of requestparams : -1
   [junit4]   2> 1339436 WARN  (coreLoadExecutor-4831-thread-1-processing-n:127.0.0.1:45284_) [n:127.0.0.1:45284_ c:collection1   x:collection1] o.a.s.c.Config Beginning with Solr 5.5, <mergePolicy> is deprecated, use <mergePolicyFactory> instead.
   [junit4]   2> 1339437 INFO  (coreLoadExecutor-4831-thread-1-processing-n:127.0.0.1:45284_) [n:127.0.0.1:45284_ c:collection1   x:collection1] o.a.s.c.SolrConfig Using Lucene MatchVersion: 6.1.0
   [junit4]   2> 1339447 INFO  (coreLoadExecutor-4831-thread-1-processing-n:127.0.0.1:45284_) [n:127.0.0.1:45284_ c:collection1   x:collection1] o.a.s.c.SolrConfig Loaded SolrConfig: solrconfig.xml
   [junit4]   2> 1339454 INFO  (coreLoadExecutor-4831-thread-1-processing-n:127.0.0.1:45284_) [n:127.0.0.1:45284_ c:collection1   x:collection1] o.a.s.s.IndexSchema [collection1] Schema name=test
   [junit4]   2> 1339575 INFO  (coreLoadExecutor-4831-thread-1-processing-n:127.0.0.1:45284_) [n:127.0.0.1:45284_ c:collection1   x:collection1] o.a.s.s.OpenExchangeRatesOrgProvider Initialized with rates=open-exchange-rates.json, refreshInterval=1440.
   [junit4]   2> 1339583 INFO  (coreLoadExecutor-4831-thread-1-processing-n:127.0.0.1:45284_) [n:127.0.0.1:45284_ c:collection1   x:collection1] o.a.s.s.IndexSchema default search field in schema is text
   [junit4]   2> 1339584 INFO  (coreLoadExecutor-4831-thread-1-processing-n:127.0.0.1:45284_) [n:127.0.0.1:45284_ c:collection1   x:collection1] o.a.s.s.IndexSchema unique key field: id
   [junit4]   2> 1339600 INFO  (coreLoadExecutor-4831-thread-1-processing-n:127.0.0.1:45284_) [n:127.0.0.1:45284_ c:collection1   x:collection1] o.a.s.s.FileExchangeRateProvider Reloading exchange rates from file currency.xml
   [junit4]   2> 1339604 INFO  (coreLoadExecutor-4831-thread-1-processing-n:127.0.0.1:45284_) [n:127.0.0.1:45284_ c:collection1   x:collection1] o.a.s.s.FileExchangeRateProvider Reloading exchange rates from file currency.xml
   [junit4]   2> 1339606 INFO  (coreLoadExecutor-4831-thread-1-processing-n:127.0.0.1:45284_) [n:127.0.0.1:45284_ c:collection1   x:collection1] o.a.s.s.OpenExchangeRatesOrgProvider Reloading exchange rates from open-exchange-rates.json
   [junit4]   2> 1339607 INFO  (coreLoadExecutor-4831-thread-1-processing-n:127.0.0.1:45284_) [n:127.0.0.1:45284_ c:collection1   x:collection1] o.a.s.s.OpenExchangeRatesOrgProvider Reloading exchange rates from open-exchange-rates.json
   [junit4]   2> 1339610 INFO  (coreLoadExecutor-4831-thread-1-processing-n:127.0.0.1:45284_) [n:127.0.0.1:45284_ c:collection1   x:collection1] o.a.s.c.ConfigSetProperties Did not find ConfigSet properties, assuming default properties: Can't find resource 'configsetprops.json' in classpath or '/configs/conf1', cwd=/export/home/jenkins/workspace/Lucene-Solr-6.x-Solaris/solr/build/solr-core/test/J1
   [junit4]   2> 1339610 INFO  (coreLoadExecutor-4831-thread-1-processing-n:127.0.0.1:45284_) [n:127.0.0.1:45284_ c:collection1   x:collection1] o.a.s.c.CoreContainer Creating SolrCore 'collection1' using configuration from collection collection1
   [junit4]   2> 1339610 INFO  (coreLoadExecutor-4831-thread-1-processing-n:127.0.0.1:45284_) [n:127.0.0.1:45284_ c:collection1 s:shard2 r:core_node1 x:collection1] o.a.s.c.SolrCore org.apache.solr.core.MockDirectoryFactory
   [junit4]   2> 1339611 INFO  (coreLoadExecutor-4831-thread-1-processing-n:127.0.0.1:45284_) [n:127.0.0.1:45284_ c:collection1 s:shard2 r:core_node1 x:collection1] o.a.s.c.SolrCore [[collection1] ] Opening new SolrCore at [/export/home/jenkins/workspace/Lucene-Solr-6.x-Solaris/solr/build/solr-core/test/J1/temp/solr.handler.TestReqParamsAPI_E461313847EF87DD-001/shard-1-001/cores/collection1], dataDir=[/export/home/jenkins/workspace/Lucene-Solr-6.x-Solaris/solr/build/solr-core/test/J1/../../../../../../../../../../export/home/jenkins/workspace/Lucene-Solr-6.x-Solaris/solr/build/solr-core/test/J1/temp/solr.handler.TestReqParamsAPI_E461313847EF87DD-001/shard-1-001/cores/collection1/data/]
   [junit4]   2> 1339611 INFO  (coreLoadExecutor-4831-thread-1-processing-n:127.0.0.1:45284_) [n:127.0.0.1:45284_ c:collection1 s:shard2 r:core_node1 x:collection1] o.a.s.c.JmxMonitoredMap JMX monitoring is enabled. Adding Solr mbeans to JMX Server: com.sun.jmx.mbeanserver.JmxMBeanServer@2d5a9874
   [junit4]   2> 1339611 INFO  (coreLoadExecutor-4831-thread-1-processing-n:127.0.0.1:45284_) [n:127.0.0.1:45284_ c:collection1 s:shard2 r:core_node1 x:collection1] o.a.s.c.CachingDirectoryFactory return new directory for /export/home/jenkins/workspace/Lucene-Solr-6.x-Solaris/solr/build/solr-core/test/J1/../../../../../../../../../../export/home/jenkins/workspace/Lucene-Solr-6.x-Solaris/solr/build/solr-core/test/J1/temp/solr.handler.TestReqParamsAPI_E461313847EF87DD-001/shard-1-001/cores/collection1/data
   [junit4]   2> 1339612 INFO  (coreLoadExecutor-4831-thread-1-processing-n:127.0.0.1:45284_) [n:127.0.0.1:45284_ c:collection1 s:shard2 r:core_node1 x:collection1] o.a.s.c.SolrCore New index directory detected: old=null new=/export/home/jenkins/workspace/Lucene-Solr-6.x-Solaris/solr/build/solr-core/test/J1/../../../../../../../../../../export/home/jenkins/workspace/Lucene-Solr-6.x-Solaris/solr/build/solr-core/test/J1/temp/solr.handler.TestReqParamsAPI_E461313847EF87DD-001/shard-1-001/cores/collection1/data/index/
   [junit4]   2> 1339612 WARN  (coreLoadExecutor-4831-thread-1-processing-n:127.0.0.1:45284_) [n:127.0.0.1:45284_ c:collection1 s:shard2 r:core_node1 x:collection1] o.a.s.c.SolrCore [collection1] Solr index directory '/export/home/jenkins/workspace/Lucene-Solr-6.x-Solaris/solr/build/solr-core/test/J1/../../../../../../../../../../export/home/jenkins/workspace/Lucene-Solr-6.x-Solaris/solr/build/solr-core/test/J1/temp/solr.handler.TestReqParamsAPI_E461313847EF87DD-001/shard-1-001/cores/collection1/data/index' doesn't exist. Creating new index...
   [junit4]   2> 1339612 INFO  (coreLoadExecutor-4831-thread-1-processing-n:127.0.0.1:45284_) [n:127.0.0.1:45284_ c:collection1 s:shard2 r:core_node1 x:collection1] o.a.s.c.CachingDirectoryFactory return new directory for /export/home/jenkins/workspace/Lucene-Solr-6.x-Solaris/solr/build/solr-core/test/J1/../../../../../../../../../../export/home/jenkins/workspace/Lucene-Solr-6.x-Solaris/solr/build/solr-core/test/J1/temp/solr.handler.TestReqParamsAPI_E461313847EF87DD-001/shard-1-001/cores/collection1/data/index
   [junit4]   2> 1339612 INFO  (coreLoadExecutor-4831-thread-1-processing-n:127.0.0.1:45284_) [n:127.0.0.1:45284_ c:collection1 s:shard2 r:core_node1 x:collection1] o.a.s.u.RandomMergePolicy RandomMergePolicy wrapping class org.apache.lucene.index.LogByteSizeMergePolicy: [LogByteSizeMergePolicy: minMergeSize=1677721, mergeFactor=39, maxMergeSize=2147483648, maxMergeSizeForForcedMerge=9223372036854775807, calibrateSizeByDeletes=true, maxMergeDocs=2147483647, maxCFSSegmentSizeMB=8.796093022207999E12, noCFSRatio=0.0]
   [junit4]   2> 1339613 INFO  (coreLoadExecutor-4831-thread-1-processing-n:127.0.0.1:45284_) [n:127.0.0.1:45284_ c:collection1 s:shard2 r:core_node1 x:collection1] o.a.s.c.SolrDeletionPolicy SolrDeletionPolicy.onCommit: commits: num=1

[...truncated too long message...]

keeper.KeeperException.create(KeeperException.java:51)
   [junit4]   2> 	at org.apache.zookeeper.ZooKeeper.delete(ZooKeeper.java:873)
   [junit4]   2> 	at org.apache.solr.common.cloud.SolrZkClient$2.execute(SolrZkClient.java:244)
   [junit4]   2> 	at org.apache.solr.common.cloud.SolrZkClient$2.execute(SolrZkClient.java:241)
   [junit4]   2> 	at org.apache.solr.common.cloud.ZkCmdExecutor.retryOperation(ZkCmdExecutor.java:60)
   [junit4]   2> 	at org.apache.solr.common.cloud.SolrZkClient.delete(SolrZkClient.java:241)
   [junit4]   2> 	at org.apache.solr.cloud.ElectionContext.cancelElection(ElectionContext.java:86)
   [junit4]   2> 	at org.apache.solr.cloud.ShardLeaderElectionContextBase.cancelElection(ElectionContext.java:143)
   [junit4]   2> 	at org.apache.solr.cloud.ShardLeaderElectionContext.cancelElection(ElectionContext.java:279)
   [junit4]   2> 	at org.apache.solr.cloud.ShardLeaderElectionContext.runLeaderProcess(ElectionContext.java:455)
   [junit4]   2> 	at org.apache.solr.cloud.LeaderElector.runIamLeaderProcess(LeaderElector.java:170)
   [junit4]   2> 	at org.apache.solr.cloud.LeaderElector.checkIfIamLeader(LeaderElector.java:135)
   [junit4]   2> 	at org.apache.solr.cloud.LeaderElector.access$200(LeaderElector.java:56)
   [junit4]   2> 	at org.apache.solr.cloud.LeaderElector$ElectionWatcher.process(LeaderElector.java:348)
   [junit4]   2> 	at org.apache.solr.common.cloud.SolrZkClient$3.lambda$process$0(SolrZkClient.java:266)
   [junit4]   2> 	at java.util.concurrent.Executors$RunnableAdapter.call(Executors.java:511)
   [junit4]   2> 	at java.util.concurrent.FutureTask.run(FutureTask.java:266)
   [junit4]   2> 	at org.apache.solr.common.util.ExecutorUtil$MDCAwareThreadPoolExecutor.lambda$execute$0(ExecutorUtil.java:229)
   [junit4]   2> 	at java.util.concurrent.ThreadPoolExecutor.runWorker(ThreadPoolExecutor.java:1142)
   [junit4]   2> 	at java.util.concurrent.ThreadPoolExecutor$Worker.run(ThreadPoolExecutor.java:617)
   [junit4]   2> 	at java.lang.Thread.run(Thread.java:745)
   [junit4]   2> 1365582 INFO  (TEST-TestReqParamsAPI.test-seed#[E461313847EF87DD]) [    ] o.e.j.s.ServerConnector Stopped ServerConnector@659068f3{HTTP/1.1,[http/1.1]}{127.0.0.1:0}
   [junit4]   2> 1365582 INFO  (TEST-TestReqParamsAPI.test-seed#[E461313847EF87DD]) [    ] o.e.j.s.h.ContextHandler Stopped o.e.j.s.ServletContextHandler@1232525a{/,null,UNAVAILABLE}
   [junit4]   2> 1365586 INFO  (TEST-TestReqParamsAPI.test-seed#[E461313847EF87DD]) [    ] o.a.s.c.ZkTestServer connecting to 127.0.0.1:58221 58221
   [junit4]   2> 1365645 INFO  (Thread-3707) [    ] o.a.s.c.ZkTestServer connecting to 127.0.0.1:58221 58221
   [junit4]   2> 1365646 WARN  (Thread-3707) [    ] o.a.s.c.ZkTestServer Watch limit violations: 
   [junit4]   2> Maximum concurrent create/delete watches above limit:
   [junit4]   2> 
   [junit4]   2> 	30	/solr/configs/conf1
   [junit4]   2> 	6	/solr/aliases.json
   [junit4]   2> 	5	/solr/security.json
   [junit4]   2> 
   [junit4]   2> Maximum concurrent data watches above limit:
   [junit4]   2> 
   [junit4]   2> 	6	/solr/clusterstate.json
   [junit4]   2> 
   [junit4]   2> Maximum concurrent children watches above limit:
   [junit4]   2> 
   [junit4]   2> 	6	/solr/live_nodes
   [junit4]   2> 	6	/solr/collections
   [junit4]   2> 	3	/solr/overseer/collection-queue-work
   [junit4]   2> 	2	/solr/overseer/queue
   [junit4]   2> 
   [junit4]   2> NOTE: reproduce with: ant test  -Dtestcase=TestReqParamsAPI -Dtests.method=test -Dtests.seed=E461313847EF87DD -Dtests.slow=true -Dtests.locale=ga-IE -Dtests.timezone=America/Recife -Dtests.asserts=true -Dtests.file.encoding=ISO-8859-1
   [junit4] FAILURE 30.6s J1 | TestReqParamsAPI.test <<<
   [junit4]    > Throwable #1: java.lang.AssertionError: Could not get expected value  'CY val modified' for path 'response/params/y/c' full output: {
   [junit4]    >   "responseHeader":{
   [junit4]    >     "status":0,
   [junit4]    >     "QTime":0},
   [junit4]    >   "response":{
   [junit4]    >     "znodeVersion":0,
   [junit4]    >     "params":{"x":{
   [junit4]    >         "a":"A val",
   [junit4]    >         "b":"B val",
   [junit4]    >         "":{"v":0}}}}}
   [junit4]    > 	at __randomizedtesting.SeedInfo.seed([E461313847EF87DD:6C350EE2E913EA25]:0)
   [junit4]    > 	at org.apache.solr.core.TestSolrConfigHandler.testForResponseElement(TestSolrConfigHandler.java:458)
   [junit4]    > 	at org.apache.solr.handler.TestReqParamsAPI.testReqParams(TestReqParamsAPI.java:200)
   [junit4]    > 	at org.apache.solr.handler.TestReqParamsAPI.test(TestReqParamsAPI.java:67)
   [junit4]    > 	at org.apache.solr.BaseDistributedSearchTestCase$ShardsRepeatRule$ShardsFixedStatement.callStatement(BaseDistributedSearchTestCase.java:996)
   [junit4]    > 	at org.apache.solr.BaseDistributedSearchTestCase$ShardsRepeatRule$ShardsStatement.evaluate(BaseDistributedSearchTestCase.java:971)
   [junit4]    > 	at java.lang.Thread.run(Thread.java:745)
   [junit4]   2> 1365656 INFO  (SUITE-TestReqParamsAPI-seed#[E461313847EF87DD]-worker) [    ] o.a.s.SolrTestCaseJ4 ###deleteCore
   [junit4]   2> NOTE: leaving temporary files on disk at: /export/home/jenkins/workspace/Lucene-Solr-6.x-Solaris/solr/build/solr-core/test/J1/temp/solr.handler.TestReqParamsAPI_E461313847EF87DD-001
   [junit4]   2> Mar 29, 2016 10:40:16 AM com.carrotsearch.randomizedtesting.ThreadLeakControl checkThreadLeaks
   [junit4]   2> WARNING: Will linger awaiting termination of 1 leaked thread(s).
   [junit4]   2> NOTE: test params are: codec=Asserting(Lucene60): {}, docValues:{}, maxPointsInLeafNode=829, maxMBSortInHeap=5.876858436573142, sim=RandomSimilarity(queryNorm=false,coord=yes): {}, locale=ga-IE, timezone=America/Recife
   [junit4]   2> NOTE: SunOS 5.11 amd64/Oracle Corporation 1.8.0_72 (64-bit)/cpus=3,threads=1,free=116946528,total=518979584
   [junit4]   2> NOTE: All tests run in this JVM: [TestUtils, TestSimpleQParserPlugin, DistributedFacetPivotSmallTest, TestFieldResource, CloneFieldUpdateProcessorFactoryTest, AtomicUpdatesTest, TestShardHandlerFactory, TestFreeTextSuggestions, TestManagedSchema, TestCustomDocTransformer, SignatureUpdateProcessorFactoryTest, SparseHLLTest, TestBM25SimilarityFactory, TestSha256AuthenticationProvider, NoCacheHeaderTest, TestStandardQParsers, CustomCollectionTest, TestMacros, CdcrReplicationHandlerTest, TestRawResponseWriter, CacheHeaderTest, CursorMarkTest, TestJettySolrRunner, TestTrie, CollectionTooManyReplicasTest, TestCharFilters, SolrCmdDistributorTest, SuggesterTest, TriLevelCompositeIdRoutingTest, TestCrossCoreJoin, TestLRUStatsCache, HdfsDirectoryFactoryTest, IgnoreCommitOptimizeUpdateProcessorFactoryTest, MinimalSchemaTest, CollectionsAPIDistributedZkTest, TestDefaultStatsCache, DistributedTermsComponentTest, TestRTGBase, TestSolrJ, FieldAnalysisRequestHandlerTest, VersionInfoTest, FieldMutatingUpdateProcessorTest, TestPerFieldSimilarity, TestUniqueKeyFieldResource, TestSolr4Spatial, TestQueryUtils, NumericFieldsTest, TermVectorComponentDistributedTest, CollectionsAPISolrJTest, SpellPossibilityIteratorTest, SharedFSAutoReplicaFailoverTest, TestQueryTypes, TestReRankQParserPlugin, CleanupOldIndexTest, SolrPluginUtilsTest, RequestLoggingTest, TestFuzzyAnalyzedSuggestions, TestReload, DistanceUnitsTest, SmileWriterTest, TestBadConfig, DistributedQueryComponentCustomSortTest, TestRandomCollapseQParserPlugin, TestBinaryField, RollingRestartTest, TestCollapseQParserPlugin, SaslZkACLProviderTest, AnalysisErrorHandlingTest, TestDistribDocBasedVersion, TestSimpleTrackingShardHandler, ConnectionReuseTest, TestNRTOpen, StatsComponentTest, AliasIntegrationTest, TestPHPSerializedResponseWriter, BlockJoinFacetRandomTest, SynonymTokenizerTest, TestCSVResponseWriter, TestAtomicUpdateErrorCases, BasicFunctionalityTest, SolrCoreCheckLockOnStartupTest, HdfsLockFactoryTest, RulesTest, ConjunctionSolrSpellCheckerTest, TestCloudDeleteByQuery, BlockCacheTest, CoreAdminRequestStatusTest, PluginInfoTest, TestDistributedGrouping, DistribCursorPagingTest, TestLeaderInitiatedRecoveryThread, OpenCloseCoreStressTest, BasicZkTest, DateMathParserTest, FileUtilsTest, HdfsRestartWhileUpdatingTest, CollectionReloadTest, DistributedVersionInfoTest, InfoHandlerTest, TestConfigSetsAPI, RankQueryTest, DateFieldTest, ZkSolrClientTest, ResponseLogComponentTest, HLLSerializationTest, TestSolrDeletionPolicy2, HdfsThreadLeakTest, DirectSolrConnectionTest, RecoveryAfterSoftCommitTest, TestConfigOverlay, TestMiniSolrCloudClusterSSL, ChaosMonkeySafeLeaderTest, DistributedExpandComponentTest, ZkNodePropsTest, TestTrieFacet, TestSolrQueryResponse, TestReqParamsAPI]
   [junit4] Completed [237/585 (1!)] on J1 in 31.37s, 1 test, 1 failure <<< FAILURES!

[...truncated 1131 lines...]
BUILD FAILED
/export/home/jenkins/workspace/Lucene-Solr-6.x-Solaris/build.xml:740: The following error occurred while executing this line:
/export/home/jenkins/workspace/Lucene-Solr-6.x-Solaris/build.xml:684: The following error occurred while executing this line:
/export/home/jenkins/workspace/Lucene-Solr-6.x-Solaris/build.xml:59: The following error occurred while executing this line:
/export/home/jenkins/workspace/Lucene-Solr-6.x-Solaris/solr/build.xml:233: The following error occurred while executing this line:
/export/home/jenkins/workspace/Lucene-Solr-6.x-Solaris/solr/common-build.xml:529: The following error occurred while executing this line:
/export/home/jenkins/workspace/Lucene-Solr-6.x-Solaris/lucene/common-build.xml:1457: The following error occurred while executing this line:
/export/home/jenkins/workspace/Lucene-Solr-6.x-Solaris/lucene/common-build.xml:1014: There were test failures: 585 suites (10 ignored), 2364 tests, 1 failure, 86 ignored (70 assumptions) [seed: E461313847EF87DD]

Total time: 75 minutes 35 seconds
Build step 'Invoke Ant' marked build as failure
Archiving artifacts
[WARNINGS] Skipping publisher since build result is FAILURE
Recording test results
Email was triggered for: Failure - Any
Sending email for trigger: Failure - Any



Mime
View raw message