lucene-dev mailing list archives

Site index · List index
Message view « Date » · « Thread »
Top « Date » · « Thread »
From Policeman Jenkins Server <jenk...@thetaphi.de>
Subject [JENKINS] Lucene-Solr-trunk-Linux (32bit/jdk1.8.0_72) - Build # 16085 - Still Failing!
Date Thu, 03 Mar 2016 12:26:53 GMT
Build: http://jenkins.thetaphi.de/job/Lucene-Solr-trunk-Linux/16085/
Java: 32bit/jdk1.8.0_72 -client -XX:+UseConcMarkSweepGC

12 tests failed.
FAILED:  junit.framework.TestSuite.org.apache.solr.cloud.TestCloudPivotFacet

Error Message:
Suite timeout exceeded (>= 7200000 msec).

Stack Trace:
java.lang.Exception: Suite timeout exceeded (>= 7200000 msec).
	at __randomizedtesting.SeedInfo.seed([714BE5B51DAC7C7F]:0)


FAILED:  org.apache.solr.cloud.CloudExitableDirectoryReaderTest.test

Error Message:
There are still nodes recoverying - waited for 330 seconds

Stack Trace:
java.lang.AssertionError: There are still nodes recoverying - waited for 330 seconds
	at __randomizedtesting.SeedInfo.seed([714BE5B51DAC7C7F:F91FDA6FB3501187]:0)
	at org.junit.Assert.fail(Assert.java:93)
	at org.apache.solr.cloud.AbstractDistribZkTestBase.waitForRecoveriesToFinish(AbstractDistribZkTestBase.java:174)
	at org.apache.solr.cloud.AbstractDistribZkTestBase.waitForRecoveriesToFinish(AbstractDistribZkTestBase.java:135)
	at org.apache.solr.cloud.AbstractDistribZkTestBase.waitForRecoveriesToFinish(AbstractDistribZkTestBase.java:130)
	at org.apache.solr.cloud.AbstractFullDistribZkTestBase.waitForRecoveriesToFinish(AbstractFullDistribZkTestBase.java:844)
	at org.apache.solr.cloud.CloudExitableDirectoryReaderTest.test(CloudExitableDirectoryReaderTest.java:48)
	at sun.reflect.NativeMethodAccessorImpl.invoke0(Native Method)
	at sun.reflect.NativeMethodAccessorImpl.invoke(NativeMethodAccessorImpl.java:62)
	at sun.reflect.DelegatingMethodAccessorImpl.invoke(DelegatingMethodAccessorImpl.java:43)
	at java.lang.reflect.Method.invoke(Method.java:498)
	at com.carrotsearch.randomizedtesting.RandomizedRunner.invoke(RandomizedRunner.java:1764)
	at com.carrotsearch.randomizedtesting.RandomizedRunner$8.evaluate(RandomizedRunner.java:871)
	at com.carrotsearch.randomizedtesting.RandomizedRunner$9.evaluate(RandomizedRunner.java:907)
	at com.carrotsearch.randomizedtesting.RandomizedRunner$10.evaluate(RandomizedRunner.java:921)
	at org.apache.solr.BaseDistributedSearchTestCase$ShardsRepeatRule$ShardsFixedStatement.callStatement(BaseDistributedSearchTestCase.java:996)
	at org.apache.solr.BaseDistributedSearchTestCase$ShardsRepeatRule$ShardsStatement.evaluate(BaseDistributedSearchTestCase.java:971)
	at com.carrotsearch.randomizedtesting.rules.SystemPropertiesRestoreRule$1.evaluate(SystemPropertiesRestoreRule.java:57)
	at org.apache.lucene.util.TestRuleSetupTeardownChained$1.evaluate(TestRuleSetupTeardownChained.java:49)
	at org.apache.lucene.util.AbstractBeforeAfterRule$1.evaluate(AbstractBeforeAfterRule.java:45)
	at org.apache.lucene.util.TestRuleThreadAndTestName$1.evaluate(TestRuleThreadAndTestName.java:48)
	at org.apache.lucene.util.TestRuleIgnoreAfterMaxFailures$1.evaluate(TestRuleIgnoreAfterMaxFailures.java:64)
	at org.apache.lucene.util.TestRuleMarkFailure$1.evaluate(TestRuleMarkFailure.java:47)
	at com.carrotsearch.randomizedtesting.rules.StatementAdapter.evaluate(StatementAdapter.java:36)
	at com.carrotsearch.randomizedtesting.ThreadLeakControl$StatementRunner.run(ThreadLeakControl.java:367)
	at com.carrotsearch.randomizedtesting.ThreadLeakControl.forkTimeoutingTask(ThreadLeakControl.java:809)
	at com.carrotsearch.randomizedtesting.ThreadLeakControl$3.evaluate(ThreadLeakControl.java:460)
	at com.carrotsearch.randomizedtesting.RandomizedRunner.runSingleTest(RandomizedRunner.java:880)
	at com.carrotsearch.randomizedtesting.RandomizedRunner$5.evaluate(RandomizedRunner.java:781)
	at com.carrotsearch.randomizedtesting.RandomizedRunner$6.evaluate(RandomizedRunner.java:816)
	at com.carrotsearch.randomizedtesting.RandomizedRunner$7.evaluate(RandomizedRunner.java:827)
	at com.carrotsearch.randomizedtesting.rules.StatementAdapter.evaluate(StatementAdapter.java:36)
	at com.carrotsearch.randomizedtesting.rules.SystemPropertiesRestoreRule$1.evaluate(SystemPropertiesRestoreRule.java:57)
	at org.apache.lucene.util.AbstractBeforeAfterRule$1.evaluate(AbstractBeforeAfterRule.java:45)
	at com.carrotsearch.randomizedtesting.rules.StatementAdapter.evaluate(StatementAdapter.java:36)
	at org.apache.lucene.util.TestRuleStoreClassName$1.evaluate(TestRuleStoreClassName.java:41)
	at com.carrotsearch.randomizedtesting.rules.NoShadowingOrOverridesOnMethodsRule$1.evaluate(NoShadowingOrOverridesOnMethodsRule.java:40)
	at com.carrotsearch.randomizedtesting.rules.NoShadowingOrOverridesOnMethodsRule$1.evaluate(NoShadowingOrOverridesOnMethodsRule.java:40)
	at com.carrotsearch.randomizedtesting.rules.StatementAdapter.evaluate(StatementAdapter.java:36)
	at com.carrotsearch.randomizedtesting.rules.StatementAdapter.evaluate(StatementAdapter.java:36)
	at com.carrotsearch.randomizedtesting.rules.StatementAdapter.evaluate(StatementAdapter.java:36)
	at org.apache.lucene.util.TestRuleAssertionsRequired$1.evaluate(TestRuleAssertionsRequired.java:53)
	at org.apache.lucene.util.TestRuleMarkFailure$1.evaluate(TestRuleMarkFailure.java:47)
	at org.apache.lucene.util.TestRuleIgnoreAfterMaxFailures$1.evaluate(TestRuleIgnoreAfterMaxFailures.java:64)
	at org.apache.lucene.util.TestRuleIgnoreTestSuites$1.evaluate(TestRuleIgnoreTestSuites.java:54)
	at com.carrotsearch.randomizedtesting.rules.StatementAdapter.evaluate(StatementAdapter.java:36)
	at com.carrotsearch.randomizedtesting.ThreadLeakControl$StatementRunner.run(ThreadLeakControl.java:367)
	at java.lang.Thread.run(Thread.java:745)


FAILED:  org.apache.solr.cloud.ShardSplitTest.test

Error Message:
There are still nodes recoverying - waited for 15 seconds

Stack Trace:
java.lang.AssertionError: There are still nodes recoverying - waited for 15 seconds
	at __randomizedtesting.SeedInfo.seed([714BE5B51DAC7C7F:F91FDA6FB3501187]:0)
	at org.junit.Assert.fail(Assert.java:93)
	at org.apache.solr.cloud.AbstractDistribZkTestBase.waitForRecoveriesToFinish(AbstractDistribZkTestBase.java:174)
	at org.apache.solr.cloud.AbstractFullDistribZkTestBase.waitForRecoveriesToFinish(AbstractFullDistribZkTestBase.java:856)
	at org.apache.solr.cloud.AbstractFullDistribZkTestBase.waitForThingsToLevelOut(AbstractFullDistribZkTestBase.java:1412)
	at org.apache.solr.cloud.ShardSplitTest.test(ShardSplitTest.java:74)
	at sun.reflect.NativeMethodAccessorImpl.invoke0(Native Method)
	at sun.reflect.NativeMethodAccessorImpl.invoke(NativeMethodAccessorImpl.java:62)
	at sun.reflect.DelegatingMethodAccessorImpl.invoke(DelegatingMethodAccessorImpl.java:43)
	at java.lang.reflect.Method.invoke(Method.java:498)
	at com.carrotsearch.randomizedtesting.RandomizedRunner.invoke(RandomizedRunner.java:1764)
	at com.carrotsearch.randomizedtesting.RandomizedRunner$8.evaluate(RandomizedRunner.java:871)
	at com.carrotsearch.randomizedtesting.RandomizedRunner$9.evaluate(RandomizedRunner.java:907)
	at com.carrotsearch.randomizedtesting.RandomizedRunner$10.evaluate(RandomizedRunner.java:921)
	at org.apache.solr.BaseDistributedSearchTestCase$ShardsRepeatRule$ShardsFixedStatement.callStatement(BaseDistributedSearchTestCase.java:996)
	at org.apache.solr.BaseDistributedSearchTestCase$ShardsRepeatRule$ShardsStatement.evaluate(BaseDistributedSearchTestCase.java:971)
	at com.carrotsearch.randomizedtesting.rules.SystemPropertiesRestoreRule$1.evaluate(SystemPropertiesRestoreRule.java:57)
	at org.apache.lucene.util.TestRuleSetupTeardownChained$1.evaluate(TestRuleSetupTeardownChained.java:49)
	at org.apache.lucene.util.AbstractBeforeAfterRule$1.evaluate(AbstractBeforeAfterRule.java:45)
	at org.apache.lucene.util.TestRuleThreadAndTestName$1.evaluate(TestRuleThreadAndTestName.java:48)
	at org.apache.lucene.util.TestRuleIgnoreAfterMaxFailures$1.evaluate(TestRuleIgnoreAfterMaxFailures.java:64)
	at org.apache.lucene.util.TestRuleMarkFailure$1.evaluate(TestRuleMarkFailure.java:47)
	at com.carrotsearch.randomizedtesting.rules.StatementAdapter.evaluate(StatementAdapter.java:36)
	at com.carrotsearch.randomizedtesting.ThreadLeakControl$StatementRunner.run(ThreadLeakControl.java:367)
	at com.carrotsearch.randomizedtesting.ThreadLeakControl.forkTimeoutingTask(ThreadLeakControl.java:809)
	at com.carrotsearch.randomizedtesting.ThreadLeakControl$3.evaluate(ThreadLeakControl.java:460)
	at com.carrotsearch.randomizedtesting.RandomizedRunner.runSingleTest(RandomizedRunner.java:880)
	at com.carrotsearch.randomizedtesting.RandomizedRunner$5.evaluate(RandomizedRunner.java:781)
	at com.carrotsearch.randomizedtesting.RandomizedRunner$6.evaluate(RandomizedRunner.java:816)
	at com.carrotsearch.randomizedtesting.RandomizedRunner$7.evaluate(RandomizedRunner.java:827)
	at com.carrotsearch.randomizedtesting.rules.StatementAdapter.evaluate(StatementAdapter.java:36)
	at com.carrotsearch.randomizedtesting.rules.SystemPropertiesRestoreRule$1.evaluate(SystemPropertiesRestoreRule.java:57)
	at org.apache.lucene.util.AbstractBeforeAfterRule$1.evaluate(AbstractBeforeAfterRule.java:45)
	at com.carrotsearch.randomizedtesting.rules.StatementAdapter.evaluate(StatementAdapter.java:36)
	at org.apache.lucene.util.TestRuleStoreClassName$1.evaluate(TestRuleStoreClassName.java:41)
	at com.carrotsearch.randomizedtesting.rules.NoShadowingOrOverridesOnMethodsRule$1.evaluate(NoShadowingOrOverridesOnMethodsRule.java:40)
	at com.carrotsearch.randomizedtesting.rules.NoShadowingOrOverridesOnMethodsRule$1.evaluate(NoShadowingOrOverridesOnMethodsRule.java:40)
	at com.carrotsearch.randomizedtesting.rules.StatementAdapter.evaluate(StatementAdapter.java:36)
	at com.carrotsearch.randomizedtesting.rules.StatementAdapter.evaluate(StatementAdapter.java:36)
	at com.carrotsearch.randomizedtesting.rules.StatementAdapter.evaluate(StatementAdapter.java:36)
	at org.apache.lucene.util.TestRuleAssertionsRequired$1.evaluate(TestRuleAssertionsRequired.java:53)
	at org.apache.lucene.util.TestRuleMarkFailure$1.evaluate(TestRuleMarkFailure.java:47)
	at org.apache.lucene.util.TestRuleIgnoreAfterMaxFailures$1.evaluate(TestRuleIgnoreAfterMaxFailures.java:64)
	at org.apache.lucene.util.TestRuleIgnoreTestSuites$1.evaluate(TestRuleIgnoreTestSuites.java:54)
	at com.carrotsearch.randomizedtesting.rules.StatementAdapter.evaluate(StatementAdapter.java:36)
	at com.carrotsearch.randomizedtesting.ThreadLeakControl$StatementRunner.run(ThreadLeakControl.java:367)
	at java.lang.Thread.run(Thread.java:745)


FAILED:  org.apache.solr.cloud.TestAuthenticationFramework.testCollectionCreateWithoutCoresThenDelete

Error Message:
No live SolrServers available to handle this request:[http://127.0.0.1:35541/solr, http://127.0.0.1:40232/solr, http://127.0.0.1:35792/solr, http://127.0.0.1:55022/solr, http://127.0.0.1:57956/solr]

Stack Trace:
org.apache.solr.client.solrj.SolrServerException: No live SolrServers available to handle this request:[http://127.0.0.1:35541/solr, http://127.0.0.1:40232/solr, http://127.0.0.1:35792/solr, http://127.0.0.1:55022/solr, http://127.0.0.1:57956/solr]
	at __randomizedtesting.SeedInfo.seed([714BE5B51DAC7C7F:C28E2A7412D4AF3E]:0)
	at org.apache.solr.client.solrj.impl.LBHttpSolrClient.request(LBHttpSolrClient.java:352)
	at org.apache.solr.client.solrj.impl.CloudSolrClient.sendRequest(CloudSolrClient.java:1100)
	at org.apache.solr.client.solrj.impl.CloudSolrClient.requestWithRetryOnStaleState(CloudSolrClient.java:870)
	at org.apache.solr.client.solrj.impl.CloudSolrClient.request(CloudSolrClient.java:806)
	at org.apache.solr.client.solrj.SolrClient.request(SolrClient.java:1219)
	at org.apache.solr.cloud.MiniSolrCloudCluster.makeCollectionsRequest(MiniSolrCloudCluster.java:415)
	at org.apache.solr.cloud.MiniSolrCloudCluster.createCollection(MiniSolrCloudCluster.java:399)
	at org.apache.solr.cloud.TestMiniSolrCloudCluster.createCollection(TestMiniSolrCloudCluster.java:122)
	at org.apache.solr.cloud.TestMiniSolrCloudCluster.testCollectionCreateWithoutCoresThenDelete(TestMiniSolrCloudCluster.java:315)
	at sun.reflect.NativeMethodAccessorImpl.invoke0(Native Method)
	at sun.reflect.NativeMethodAccessorImpl.invoke(NativeMethodAccessorImpl.java:62)
	at sun.reflect.DelegatingMethodAccessorImpl.invoke(DelegatingMethodAccessorImpl.java:43)
	at java.lang.reflect.Method.invoke(Method.java:498)
	at com.carrotsearch.randomizedtesting.RandomizedRunner.invoke(RandomizedRunner.java:1764)
	at com.carrotsearch.randomizedtesting.RandomizedRunner$8.evaluate(RandomizedRunner.java:871)
	at com.carrotsearch.randomizedtesting.RandomizedRunner$9.evaluate(RandomizedRunner.java:907)
	at com.carrotsearch.randomizedtesting.RandomizedRunner$10.evaluate(RandomizedRunner.java:921)
	at com.carrotsearch.randomizedtesting.rules.SystemPropertiesRestoreRule$1.evaluate(SystemPropertiesRestoreRule.java:57)
	at org.apache.lucene.util.TestRuleSetupTeardownChained$1.evaluate(TestRuleSetupTeardownChained.java:49)
	at org.apache.lucene.util.AbstractBeforeAfterRule$1.evaluate(AbstractBeforeAfterRule.java:45)
	at org.apache.lucene.util.TestRuleThreadAndTestName$1.evaluate(TestRuleThreadAndTestName.java:48)
	at org.apache.lucene.util.TestRuleIgnoreAfterMaxFailures$1.evaluate(TestRuleIgnoreAfterMaxFailures.java:64)
	at org.apache.lucene.util.TestRuleMarkFailure$1.evaluate(TestRuleMarkFailure.java:47)
	at com.carrotsearch.randomizedtesting.rules.StatementAdapter.evaluate(StatementAdapter.java:36)
	at com.carrotsearch.randomizedtesting.ThreadLeakControl$StatementRunner.run(ThreadLeakControl.java:367)
	at com.carrotsearch.randomizedtesting.ThreadLeakControl.forkTimeoutingTask(ThreadLeakControl.java:809)
	at com.carrotsearch.randomizedtesting.ThreadLeakControl$3.evaluate(ThreadLeakControl.java:460)
	at com.carrotsearch.randomizedtesting.RandomizedRunner.runSingleTest(RandomizedRunner.java:880)
	at com.carrotsearch.randomizedtesting.RandomizedRunner$5.evaluate(RandomizedRunner.java:781)
	at com.carrotsearch.randomizedtesting.RandomizedRunner$6.evaluate(RandomizedRunner.java:816)
	at com.carrotsearch.randomizedtesting.RandomizedRunner$7.evaluate(RandomizedRunner.java:827)
	at com.carrotsearch.randomizedtesting.rules.StatementAdapter.evaluate(StatementAdapter.java:36)
	at com.carrotsearch.randomizedtesting.rules.SystemPropertiesRestoreRule$1.evaluate(SystemPropertiesRestoreRule.java:57)
	at org.apache.lucene.util.AbstractBeforeAfterRule$1.evaluate(AbstractBeforeAfterRule.java:45)
	at com.carrotsearch.randomizedtesting.rules.StatementAdapter.evaluate(StatementAdapter.java:36)
	at org.apache.lucene.util.TestRuleStoreClassName$1.evaluate(TestRuleStoreClassName.java:41)
	at com.carrotsearch.randomizedtesting.rules.NoShadowingOrOverridesOnMethodsRule$1.evaluate(NoShadowingOrOverridesOnMethodsRule.java:40)
	at com.carrotsearch.randomizedtesting.rules.NoShadowingOrOverridesOnMethodsRule$1.evaluate(NoShadowingOrOverridesOnMethodsRule.java:40)
	at com.carrotsearch.randomizedtesting.rules.StatementAdapter.evaluate(StatementAdapter.java:36)
	at com.carrotsearch.randomizedtesting.rules.StatementAdapter.evaluate(StatementAdapter.java:36)
	at com.carrotsearch.randomizedtesting.rules.StatementAdapter.evaluate(StatementAdapter.java:36)
	at org.apache.lucene.util.TestRuleAssertionsRequired$1.evaluate(TestRuleAssertionsRequired.java:53)
	at org.apache.lucene.util.TestRuleMarkFailure$1.evaluate(TestRuleMarkFailure.java:47)
	at org.apache.lucene.util.TestRuleIgnoreAfterMaxFailures$1.evaluate(TestRuleIgnoreAfterMaxFailures.java:64)
	at org.apache.lucene.util.TestRuleIgnoreTestSuites$1.evaluate(TestRuleIgnoreTestSuites.java:54)
	at com.carrotsearch.randomizedtesting.rules.StatementAdapter.evaluate(StatementAdapter.java:36)
	at com.carrotsearch.randomizedtesting.ThreadLeakControl$StatementRunner.run(ThreadLeakControl.java:367)
	at java.lang.Thread.run(Thread.java:745)
Caused by: org.apache.solr.client.solrj.SolrServerException: IOException occured when talking to server at: http://127.0.0.1:55022/solr
	at org.apache.solr.client.solrj.impl.HttpSolrClient.executeMethod(HttpSolrClient.java:591)
	at org.apache.solr.client.solrj.impl.HttpSolrClient.request(HttpSolrClient.java:241)
	at org.apache.solr.client.solrj.impl.HttpSolrClient.request(HttpSolrClient.java:230)
	at org.apache.solr.client.solrj.impl.LBHttpSolrClient.doRequest(LBHttpSolrClient.java:372)
	at org.apache.solr.client.solrj.impl.LBHttpSolrClient.request(LBHttpSolrClient.java:325)
	... 47 more
Caused by: java.net.SocketException: Connection reset
	at java.net.SocketInputStream.read(SocketInputStream.java:209)
	at java.net.SocketInputStream.read(SocketInputStream.java:141)
	at org.apache.http.impl.io.AbstractSessionInputBuffer.fillBuffer(AbstractSessionInputBuffer.java:160)
	at org.apache.http.impl.io.SocketInputBuffer.fillBuffer(SocketInputBuffer.java:84)
	at org.apache.http.impl.io.AbstractSessionInputBuffer.readLine(AbstractSessionInputBuffer.java:273)
	at org.apache.http.impl.conn.DefaultHttpResponseParser.parseHead(DefaultHttpResponseParser.java:140)
	at org.apache.http.impl.conn.DefaultHttpResponseParser.parseHead(DefaultHttpResponseParser.java:57)
	at org.apache.http.impl.io.AbstractMessageParser.parse(AbstractMessageParser.java:261)
	at org.apache.http.impl.AbstractHttpClientConnection.receiveResponseHeader(AbstractHttpClientConnection.java:283)
	at org.apache.http.impl.conn.DefaultClientConnection.receiveResponseHeader(DefaultClientConnection.java:251)
	at org.apache.http.impl.conn.ManagedClientConnectionImpl.receiveResponseHeader(ManagedClientConnectionImpl.java:197)
	at org.apache.http.protocol.HttpRequestExecutor.doReceiveResponse(HttpRequestExecutor.java:272)
	at org.apache.http.protocol.HttpRequestExecutor.execute(HttpRequestExecutor.java:124)
	at org.apache.http.impl.client.DefaultRequestDirector.tryExecute(DefaultRequestDirector.java:685)
	at org.apache.http.impl.client.DefaultRequestDirector.execute(DefaultRequestDirector.java:487)
	at org.apache.http.impl.client.AbstractHttpClient.doExecute(AbstractHttpClient.java:882)
	at org.apache.http.impl.client.CloseableHttpClient.execute(CloseableHttpClient.java:82)
	at org.apache.http.impl.client.CloseableHttpClient.execute(CloseableHttpClient.java:107)
	at org.apache.http.impl.client.CloseableHttpClient.execute(CloseableHttpClient.java:55)
	at org.apache.solr.client.solrj.impl.HttpSolrClient.executeMethod(HttpSolrClient.java:482)
	... 51 more


FAILED:  org.apache.solr.cloud.TestAuthenticationFramework.testCollectionCreateSearchDelete

Error Message:
No live SolrServers available to handle this request:[http://127.0.0.1:47002/solr, http://127.0.0.1:56852/solr, http://127.0.0.1:47692/solr, http://127.0.0.1:39649/solr, http://127.0.0.1:44318/solr]

Stack Trace:
org.apache.solr.client.solrj.SolrServerException: No live SolrServers available to handle this request:[http://127.0.0.1:47002/solr, http://127.0.0.1:56852/solr, http://127.0.0.1:47692/solr, http://127.0.0.1:39649/solr, http://127.0.0.1:44318/solr]
	at __randomizedtesting.SeedInfo.seed([714BE5B51DAC7C7F:D2B14B109A4496DA]:0)
	at org.apache.solr.client.solrj.impl.LBHttpSolrClient.request(LBHttpSolrClient.java:352)
	at org.apache.solr.client.solrj.impl.CloudSolrClient.sendRequest(CloudSolrClient.java:1100)
	at org.apache.solr.client.solrj.impl.CloudSolrClient.requestWithRetryOnStaleState(CloudSolrClient.java:870)
	at org.apache.solr.client.solrj.impl.CloudSolrClient.request(CloudSolrClient.java:806)
	at org.apache.solr.client.solrj.SolrClient.request(SolrClient.java:1219)
	at org.apache.solr.cloud.MiniSolrCloudCluster.makeCollectionsRequest(MiniSolrCloudCluster.java:415)
	at org.apache.solr.cloud.MiniSolrCloudCluster.createCollection(MiniSolrCloudCluster.java:399)
	at org.apache.solr.cloud.TestMiniSolrCloudCluster.createCollection(TestMiniSolrCloudCluster.java:122)
	at org.apache.solr.cloud.TestMiniSolrCloudCluster.testCollectionCreateSearchDelete(TestMiniSolrCloudCluster.java:156)
	at sun.reflect.NativeMethodAccessorImpl.invoke0(Native Method)
	at sun.reflect.NativeMethodAccessorImpl.invoke(NativeMethodAccessorImpl.java:62)
	at sun.reflect.DelegatingMethodAccessorImpl.invoke(DelegatingMethodAccessorImpl.java:43)
	at java.lang.reflect.Method.invoke(Method.java:498)
	at com.carrotsearch.randomizedtesting.RandomizedRunner.invoke(RandomizedRunner.java:1764)
	at com.carrotsearch.randomizedtesting.RandomizedRunner$8.evaluate(RandomizedRunner.java:871)
	at com.carrotsearch.randomizedtesting.RandomizedRunner$9.evaluate(RandomizedRunner.java:907)
	at com.carrotsearch.randomizedtesting.RandomizedRunner$10.evaluate(RandomizedRunner.java:921)
	at com.carrotsearch.randomizedtesting.rules.SystemPropertiesRestoreRule$1.evaluate(SystemPropertiesRestoreRule.java:57)
	at org.apache.lucene.util.TestRuleSetupTeardownChained$1.evaluate(TestRuleSetupTeardownChained.java:49)
	at org.apache.lucene.util.AbstractBeforeAfterRule$1.evaluate(AbstractBeforeAfterRule.java:45)
	at org.apache.lucene.util.TestRuleThreadAndTestName$1.evaluate(TestRuleThreadAndTestName.java:48)
	at org.apache.lucene.util.TestRuleIgnoreAfterMaxFailures$1.evaluate(TestRuleIgnoreAfterMaxFailures.java:64)
	at org.apache.lucene.util.TestRuleMarkFailure$1.evaluate(TestRuleMarkFailure.java:47)
	at com.carrotsearch.randomizedtesting.rules.StatementAdapter.evaluate(StatementAdapter.java:36)
	at com.carrotsearch.randomizedtesting.ThreadLeakControl$StatementRunner.run(ThreadLeakControl.java:367)
	at com.carrotsearch.randomizedtesting.ThreadLeakControl.forkTimeoutingTask(ThreadLeakControl.java:809)
	at com.carrotsearch.randomizedtesting.ThreadLeakControl$3.evaluate(ThreadLeakControl.java:460)
	at com.carrotsearch.randomizedtesting.RandomizedRunner.runSingleTest(RandomizedRunner.java:880)
	at com.carrotsearch.randomizedtesting.RandomizedRunner$5.evaluate(RandomizedRunner.java:781)
	at com.carrotsearch.randomizedtesting.RandomizedRunner$6.evaluate(RandomizedRunner.java:816)
	at com.carrotsearch.randomizedtesting.RandomizedRunner$7.evaluate(RandomizedRunner.java:827)
	at com.carrotsearch.randomizedtesting.rules.StatementAdapter.evaluate(StatementAdapter.java:36)
	at com.carrotsearch.randomizedtesting.rules.SystemPropertiesRestoreRule$1.evaluate(SystemPropertiesRestoreRule.java:57)
	at org.apache.lucene.util.AbstractBeforeAfterRule$1.evaluate(AbstractBeforeAfterRule.java:45)
	at com.carrotsearch.randomizedtesting.rules.StatementAdapter.evaluate(StatementAdapter.java:36)
	at org.apache.lucene.util.TestRuleStoreClassName$1.evaluate(TestRuleStoreClassName.java:41)
	at com.carrotsearch.randomizedtesting.rules.NoShadowingOrOverridesOnMethodsRule$1.evaluate(NoShadowingOrOverridesOnMethodsRule.java:40)
	at com.carrotsearch.randomizedtesting.rules.NoShadowingOrOverridesOnMethodsRule$1.evaluate(NoShadowingOrOverridesOnMethodsRule.java:40)
	at com.carrotsearch.randomizedtesting.rules.StatementAdapter.evaluate(StatementAdapter.java:36)
	at com.carrotsearch.randomizedtesting.rules.StatementAdapter.evaluate(StatementAdapter.java:36)
	at com.carrotsearch.randomizedtesting.rules.StatementAdapter.evaluate(StatementAdapter.java:36)
	at org.apache.lucene.util.TestRuleAssertionsRequired$1.evaluate(TestRuleAssertionsRequired.java:53)
	at org.apache.lucene.util.TestRuleMarkFailure$1.evaluate(TestRuleMarkFailure.java:47)
	at org.apache.lucene.util.TestRuleIgnoreAfterMaxFailures$1.evaluate(TestRuleIgnoreAfterMaxFailures.java:64)
	at org.apache.lucene.util.TestRuleIgnoreTestSuites$1.evaluate(TestRuleIgnoreTestSuites.java:54)
	at com.carrotsearch.randomizedtesting.rules.StatementAdapter.evaluate(StatementAdapter.java:36)
	at com.carrotsearch.randomizedtesting.ThreadLeakControl$StatementRunner.run(ThreadLeakControl.java:367)
	at java.lang.Thread.run(Thread.java:745)
Caused by: org.apache.solr.client.solrj.SolrServerException: IOException occured when talking to server at: http://127.0.0.1:39649/solr
	at org.apache.solr.client.solrj.impl.HttpSolrClient.executeMethod(HttpSolrClient.java:591)
	at org.apache.solr.client.solrj.impl.HttpSolrClient.request(HttpSolrClient.java:241)
	at org.apache.solr.client.solrj.impl.HttpSolrClient.request(HttpSolrClient.java:230)
	at org.apache.solr.client.solrj.impl.LBHttpSolrClient.doRequest(LBHttpSolrClient.java:372)
	at org.apache.solr.client.solrj.impl.LBHttpSolrClient.request(LBHttpSolrClient.java:325)
	... 47 more
Caused by: java.net.SocketException: Connection reset
	at java.net.SocketInputStream.read(SocketInputStream.java:209)
	at java.net.SocketInputStream.read(SocketInputStream.java:141)
	at org.apache.http.impl.io.AbstractSessionInputBuffer.fillBuffer(AbstractSessionInputBuffer.java:160)
	at org.apache.http.impl.io.SocketInputBuffer.fillBuffer(SocketInputBuffer.java:84)
	at org.apache.http.impl.io.AbstractSessionInputBuffer.readLine(AbstractSessionInputBuffer.java:273)
	at org.apache.http.impl.conn.DefaultHttpResponseParser.parseHead(DefaultHttpResponseParser.java:140)
	at org.apache.http.impl.conn.DefaultHttpResponseParser.parseHead(DefaultHttpResponseParser.java:57)
	at org.apache.http.impl.io.AbstractMessageParser.parse(AbstractMessageParser.java:261)
	at org.apache.http.impl.AbstractHttpClientConnection.receiveResponseHeader(AbstractHttpClientConnection.java:283)
	at org.apache.http.impl.conn.DefaultClientConnection.receiveResponseHeader(DefaultClientConnection.java:251)
	at org.apache.http.impl.conn.ManagedClientConnectionImpl.receiveResponseHeader(ManagedClientConnectionImpl.java:197)
	at org.apache.http.protocol.HttpRequestExecutor.doReceiveResponse(HttpRequestExecutor.java:272)
	at org.apache.http.protocol.HttpRequestExecutor.execute(HttpRequestExecutor.java:124)
	at org.apache.http.impl.client.DefaultRequestDirector.tryExecute(DefaultRequestDirector.java:685)
	at org.apache.http.impl.client.DefaultRequestDirector.execute(DefaultRequestDirector.java:487)
	at org.apache.http.impl.client.AbstractHttpClient.doExecute(AbstractHttpClient.java:882)
	at org.apache.http.impl.client.CloseableHttpClient.execute(CloseableHttpClient.java:82)
	at org.apache.http.impl.client.CloseableHttpClient.execute(CloseableHttpClient.java:107)
	at org.apache.http.impl.client.CloseableHttpClient.execute(CloseableHttpClient.java:55)
	at org.apache.solr.client.solrj.impl.HttpSolrClient.executeMethod(HttpSolrClient.java:482)
	... 51 more


FAILED:  org.apache.solr.cloud.TestAuthenticationFramework.testStopAllStartAll

Error Message:
No live SolrServers available to handle this request:[http://127.0.0.1:45193/solr, http://127.0.0.1:52701/solr, http://127.0.0.1:50772/solr, http://127.0.0.1:44965/solr, http://127.0.0.1:36330/solr]

Stack Trace:
org.apache.solr.client.solrj.SolrServerException: No live SolrServers available to handle this request:[http://127.0.0.1:45193/solr, http://127.0.0.1:52701/solr, http://127.0.0.1:50772/solr, http://127.0.0.1:44965/solr, http://127.0.0.1:36330/solr]
	at __randomizedtesting.SeedInfo.seed([714BE5B51DAC7C7F:775FAC65C9BD150]:0)
	at org.apache.solr.client.solrj.impl.LBHttpSolrClient.request(LBHttpSolrClient.java:352)
	at org.apache.solr.client.solrj.impl.CloudSolrClient.sendRequest(CloudSolrClient.java:1100)
	at org.apache.solr.client.solrj.impl.CloudSolrClient.requestWithRetryOnStaleState(CloudSolrClient.java:870)
	at org.apache.solr.client.solrj.impl.CloudSolrClient.request(CloudSolrClient.java:806)
	at org.apache.solr.client.solrj.SolrClient.request(SolrClient.java:1219)
	at org.apache.solr.cloud.MiniSolrCloudCluster.makeCollectionsRequest(MiniSolrCloudCluster.java:415)
	at org.apache.solr.cloud.MiniSolrCloudCluster.createCollection(MiniSolrCloudCluster.java:399)
	at org.apache.solr.cloud.TestMiniSolrCloudCluster.createCollection(TestMiniSolrCloudCluster.java:122)
	at org.apache.solr.cloud.TestMiniSolrCloudCluster.testStopAllStartAll(TestMiniSolrCloudCluster.java:362)
	at sun.reflect.NativeMethodAccessorImpl.invoke0(Native Method)
	at sun.reflect.NativeMethodAccessorImpl.invoke(NativeMethodAccessorImpl.java:62)
	at sun.reflect.DelegatingMethodAccessorImpl.invoke(DelegatingMethodAccessorImpl.java:43)
	at java.lang.reflect.Method.invoke(Method.java:498)
	at com.carrotsearch.randomizedtesting.RandomizedRunner.invoke(RandomizedRunner.java:1764)
	at com.carrotsearch.randomizedtesting.RandomizedRunner$8.evaluate(RandomizedRunner.java:871)
	at com.carrotsearch.randomizedtesting.RandomizedRunner$9.evaluate(RandomizedRunner.java:907)
	at com.carrotsearch.randomizedtesting.RandomizedRunner$10.evaluate(RandomizedRunner.java:921)
	at com.carrotsearch.randomizedtesting.rules.SystemPropertiesRestoreRule$1.evaluate(SystemPropertiesRestoreRule.java:57)
	at org.apache.lucene.util.TestRuleSetupTeardownChained$1.evaluate(TestRuleSetupTeardownChained.java:49)
	at org.apache.lucene.util.AbstractBeforeAfterRule$1.evaluate(AbstractBeforeAfterRule.java:45)
	at org.apache.lucene.util.TestRuleThreadAndTestName$1.evaluate(TestRuleThreadAndTestName.java:48)
	at org.apache.lucene.util.TestRuleIgnoreAfterMaxFailures$1.evaluate(TestRuleIgnoreAfterMaxFailures.java:64)
	at org.apache.lucene.util.TestRuleMarkFailure$1.evaluate(TestRuleMarkFailure.java:47)
	at com.carrotsearch.randomizedtesting.rules.StatementAdapter.evaluate(StatementAdapter.java:36)
	at com.carrotsearch.randomizedtesting.ThreadLeakControl$StatementRunner.run(ThreadLeakControl.java:367)
	at com.carrotsearch.randomizedtesting.ThreadLeakControl.forkTimeoutingTask(ThreadLeakControl.java:809)
	at com.carrotsearch.randomizedtesting.ThreadLeakControl$3.evaluate(ThreadLeakControl.java:460)
	at com.carrotsearch.randomizedtesting.RandomizedRunner.runSingleTest(RandomizedRunner.java:880)
	at com.carrotsearch.randomizedtesting.RandomizedRunner$5.evaluate(RandomizedRunner.java:781)
	at com.carrotsearch.randomizedtesting.RandomizedRunner$6.evaluate(RandomizedRunner.java:816)
	at com.carrotsearch.randomizedtesting.RandomizedRunner$7.evaluate(RandomizedRunner.java:827)
	at com.carrotsearch.randomizedtesting.rules.StatementAdapter.evaluate(StatementAdapter.java:36)
	at com.carrotsearch.randomizedtesting.rules.SystemPropertiesRestoreRule$1.evaluate(SystemPropertiesRestoreRule.java:57)
	at org.apache.lucene.util.AbstractBeforeAfterRule$1.evaluate(AbstractBeforeAfterRule.java:45)
	at com.carrotsearch.randomizedtesting.rules.StatementAdapter.evaluate(StatementAdapter.java:36)
	at org.apache.lucene.util.TestRuleStoreClassName$1.evaluate(TestRuleStoreClassName.java:41)
	at com.carrotsearch.randomizedtesting.rules.NoShadowingOrOverridesOnMethodsRule$1.evaluate(NoShadowingOrOverridesOnMethodsRule.java:40)
	at com.carrotsearch.randomizedtesting.rules.NoShadowingOrOverridesOnMethodsRule$1.evaluate(NoShadowingOrOverridesOnMethodsRule.java:40)
	at com.carrotsearch.randomizedtesting.rules.StatementAdapter.evaluate(StatementAdapter.java:36)
	at com.carrotsearch.randomizedtesting.rules.StatementAdapter.evaluate(StatementAdapter.java:36)
	at com.carrotsearch.randomizedtesting.rules.StatementAdapter.evaluate(StatementAdapter.java:36)
	at org.apache.lucene.util.TestRuleAssertionsRequired$1.evaluate(TestRuleAssertionsRequired.java:53)
	at org.apache.lucene.util.TestRuleMarkFailure$1.evaluate(TestRuleMarkFailure.java:47)
	at org.apache.lucene.util.TestRuleIgnoreAfterMaxFailures$1.evaluate(TestRuleIgnoreAfterMaxFailures.java:64)
	at org.apache.lucene.util.TestRuleIgnoreTestSuites$1.evaluate(TestRuleIgnoreTestSuites.java:54)
	at com.carrotsearch.randomizedtesting.rules.StatementAdapter.evaluate(StatementAdapter.java:36)
	at com.carrotsearch.randomizedtesting.ThreadLeakControl$StatementRunner.run(ThreadLeakControl.java:367)
	at java.lang.Thread.run(Thread.java:745)
Caused by: org.apache.solr.client.solrj.SolrServerException: IOException occured when talking to server at: http://127.0.0.1:45193/solr
	at org.apache.solr.client.solrj.impl.HttpSolrClient.executeMethod(HttpSolrClient.java:591)
	at org.apache.solr.client.solrj.impl.HttpSolrClient.request(HttpSolrClient.java:241)
	at org.apache.solr.client.solrj.impl.HttpSolrClient.request(HttpSolrClient.java:230)
	at org.apache.solr.client.solrj.impl.LBHttpSolrClient.doRequest(LBHttpSolrClient.java:372)
	at org.apache.solr.client.solrj.impl.LBHttpSolrClient.request(LBHttpSolrClient.java:325)
	... 47 more
Caused by: java.net.SocketException: Connection reset
	at java.net.SocketInputStream.read(SocketInputStream.java:209)
	at java.net.SocketInputStream.read(SocketInputStream.java:141)
	at org.apache.http.impl.io.AbstractSessionInputBuffer.fillBuffer(AbstractSessionInputBuffer.java:160)
	at org.apache.http.impl.io.SocketInputBuffer.fillBuffer(SocketInputBuffer.java:84)
	at org.apache.http.impl.io.AbstractSessionInputBuffer.readLine(AbstractSessionInputBuffer.java:273)
	at org.apache.http.impl.conn.DefaultHttpResponseParser.parseHead(DefaultHttpResponseParser.java:140)
	at org.apache.http.impl.conn.DefaultHttpResponseParser.parseHead(DefaultHttpResponseParser.java:57)
	at org.apache.http.impl.io.AbstractMessageParser.parse(AbstractMessageParser.java:261)
	at org.apache.http.impl.AbstractHttpClientConnection.receiveResponseHeader(AbstractHttpClientConnection.java:283)
	at org.apache.http.impl.conn.DefaultClientConnection.receiveResponseHeader(DefaultClientConnection.java:251)
	at org.apache.http.impl.conn.ManagedClientConnectionImpl.receiveResponseHeader(ManagedClientConnectionImpl.java:197)
	at org.apache.http.protocol.HttpRequestExecutor.doReceiveResponse(HttpRequestExecutor.java:272)
	at org.apache.http.protocol.HttpRequestExecutor.execute(HttpRequestExecutor.java:124)
	at org.apache.http.impl.client.DefaultRequestDirector.tryExecute(DefaultRequestDirector.java:685)
	at org.apache.http.impl.client.DefaultRequestDirector.execute(DefaultRequestDirector.java:487)
	at org.apache.http.impl.client.AbstractHttpClient.doExecute(AbstractHttpClient.java:882)
	at org.apache.http.impl.client.CloseableHttpClient.execute(CloseableHttpClient.java:82)
	at org.apache.http.impl.client.CloseableHttpClient.execute(CloseableHttpClient.java:107)
	at org.apache.http.impl.client.CloseableHttpClient.execute(CloseableHttpClient.java:55)
	at org.apache.solr.client.solrj.impl.HttpSolrClient.executeMethod(HttpSolrClient.java:482)
	... 51 more


FAILED:  org.apache.solr.cloud.TestAuthenticationFramework.testBasics

Error Message:
No live SolrServers available to handle this request:[http://127.0.0.1:48807/solr, http://127.0.0.1:55982/solr, http://127.0.0.1:56244/solr, http://127.0.0.1:55216/solr, http://127.0.0.1:35294/solr]

Stack Trace:
org.apache.solr.client.solrj.SolrServerException: No live SolrServers available to handle this request:[http://127.0.0.1:48807/solr, http://127.0.0.1:55982/solr, http://127.0.0.1:56244/solr, http://127.0.0.1:55216/solr, http://127.0.0.1:35294/solr]
	at __randomizedtesting.SeedInfo.seed([714BE5B51DAC7C7F:4C934B992542220F]:0)
	at org.apache.solr.client.solrj.impl.LBHttpSolrClient.request(LBHttpSolrClient.java:352)
	at org.apache.solr.client.solrj.impl.CloudSolrClient.sendRequest(CloudSolrClient.java:1100)
	at org.apache.solr.client.solrj.impl.CloudSolrClient.requestWithRetryOnStaleState(CloudSolrClient.java:870)
	at org.apache.solr.client.solrj.impl.CloudSolrClient.request(CloudSolrClient.java:806)
	at org.apache.solr.client.solrj.SolrClient.request(SolrClient.java:1219)
	at org.apache.solr.cloud.MiniSolrCloudCluster.makeCollectionsRequest(MiniSolrCloudCluster.java:415)
	at org.apache.solr.cloud.MiniSolrCloudCluster.createCollection(MiniSolrCloudCluster.java:399)
	at org.apache.solr.cloud.TestMiniSolrCloudCluster.createCollection(TestMiniSolrCloudCluster.java:122)
	at org.apache.solr.cloud.TestMiniSolrCloudCluster.testCollectionCreateSearchDelete(TestMiniSolrCloudCluster.java:156)
	at org.apache.solr.cloud.TestAuthenticationFramework.testBasics(TestAuthenticationFramework.java:92)
	at sun.reflect.NativeMethodAccessorImpl.invoke0(Native Method)
	at sun.reflect.NativeMethodAccessorImpl.invoke(NativeMethodAccessorImpl.java:62)
	at sun.reflect.DelegatingMethodAccessorImpl.invoke(DelegatingMethodAccessorImpl.java:43)
	at java.lang.reflect.Method.invoke(Method.java:498)
	at com.carrotsearch.randomizedtesting.RandomizedRunner.invoke(RandomizedRunner.java:1764)
	at com.carrotsearch.randomizedtesting.RandomizedRunner$8.evaluate(RandomizedRunner.java:871)
	at com.carrotsearch.randomizedtesting.RandomizedRunner$9.evaluate(RandomizedRunner.java:907)
	at com.carrotsearch.randomizedtesting.RandomizedRunner$10.evaluate(RandomizedRunner.java:921)
	at com.carrotsearch.randomizedtesting.rules.SystemPropertiesRestoreRule$1.evaluate(SystemPropertiesRestoreRule.java:57)
	at org.apache.lucene.util.TestRuleSetupTeardownChained$1.evaluate(TestRuleSetupTeardownChained.java:49)
	at org.apache.lucene.util.AbstractBeforeAfterRule$1.evaluate(AbstractBeforeAfterRule.java:45)
	at org.apache.lucene.util.TestRuleThreadAndTestName$1.evaluate(TestRuleThreadAndTestName.java:48)
	at org.apache.lucene.util.TestRuleIgnoreAfterMaxFailures$1.evaluate(TestRuleIgnoreAfterMaxFailures.java:64)
	at org.apache.lucene.util.TestRuleMarkFailure$1.evaluate(TestRuleMarkFailure.java:47)
	at com.carrotsearch.randomizedtesting.rules.StatementAdapter.evaluate(StatementAdapter.java:36)
	at com.carrotsearch.randomizedtesting.ThreadLeakControl$StatementRunner.run(ThreadLeakControl.java:367)
	at com.carrotsearch.randomizedtesting.ThreadLeakControl.forkTimeoutingTask(ThreadLeakControl.java:809)
	at com.carrotsearch.randomizedtesting.ThreadLeakControl$3.evaluate(ThreadLeakControl.java:460)
	at com.carrotsearch.randomizedtesting.RandomizedRunner.runSingleTest(RandomizedRunner.java:880)
	at com.carrotsearch.randomizedtesting.RandomizedRunner$5.evaluate(RandomizedRunner.java:781)
	at com.carrotsearch.randomizedtesting.RandomizedRunner$6.evaluate(RandomizedRunner.java:816)
	at com.carrotsearch.randomizedtesting.RandomizedRunner$7.evaluate(RandomizedRunner.java:827)
	at com.carrotsearch.randomizedtesting.rules.StatementAdapter.evaluate(StatementAdapter.java:36)
	at com.carrotsearch.randomizedtesting.rules.SystemPropertiesRestoreRule$1.evaluate(SystemPropertiesRestoreRule.java:57)
	at org.apache.lucene.util.AbstractBeforeAfterRule$1.evaluate(AbstractBeforeAfterRule.java:45)
	at com.carrotsearch.randomizedtesting.rules.StatementAdapter.evaluate(StatementAdapter.java:36)
	at org.apache.lucene.util.TestRuleStoreClassName$1.evaluate(TestRuleStoreClassName.java:41)
	at com.carrotsearch.randomizedtesting.rules.NoShadowingOrOverridesOnMethodsRule$1.evaluate(NoShadowingOrOverridesOnMethodsRule.java:40)
	at com.carrotsearch.randomizedtesting.rules.NoShadowingOrOverridesOnMethodsRule$1.evaluate(NoShadowingOrOverridesOnMethodsRule.java:40)
	at com.carrotsearch.randomizedtesting.rules.StatementAdapter.evaluate(StatementAdapter.java:36)
	at com.carrotsearch.randomizedtesting.rules.StatementAdapter.evaluate(StatementAdapter.java:36)
	at com.carrotsearch.randomizedtesting.rules.StatementAdapter.evaluate(StatementAdapter.java:36)
	at org.apache.lucene.util.TestRuleAssertionsRequired$1.evaluate(TestRuleAssertionsRequired.java:53)
	at org.apache.lucene.util.TestRuleMarkFailure$1.evaluate(TestRuleMarkFailure.java:47)
	at org.apache.lucene.util.TestRuleIgnoreAfterMaxFailures$1.evaluate(TestRuleIgnoreAfterMaxFailures.java:64)
	at org.apache.lucene.util.TestRuleIgnoreTestSuites$1.evaluate(TestRuleIgnoreTestSuites.java:54)
	at com.carrotsearch.randomizedtesting.rules.StatementAdapter.evaluate(StatementAdapter.java:36)
	at com.carrotsearch.randomizedtesting.ThreadLeakControl$StatementRunner.run(ThreadLeakControl.java:367)
	at java.lang.Thread.run(Thread.java:745)
Caused by: org.apache.solr.client.solrj.SolrServerException: IOException occured when talking to server at: http://127.0.0.1:55216/solr
	at org.apache.solr.client.solrj.impl.HttpSolrClient.executeMethod(HttpSolrClient.java:591)
	at org.apache.solr.client.solrj.impl.HttpSolrClient.request(HttpSolrClient.java:241)
	at org.apache.solr.client.solrj.impl.HttpSolrClient.request(HttpSolrClient.java:230)
	at org.apache.solr.client.solrj.impl.LBHttpSolrClient.doRequest(LBHttpSolrClient.java:372)
	at org.apache.solr.client.solrj.impl.LBHttpSolrClient.request(LBHttpSolrClient.java:325)
	... 48 more
Caused by: java.net.SocketException: Connection reset
	at java.net.SocketInputStream.read(SocketInputStream.java:209)
	at java.net.SocketInputStream.read(SocketInputStream.java:141)
	at org.apache.http.impl.io.AbstractSessionInputBuffer.fillBuffer(AbstractSessionInputBuffer.java:160)
	at org.apache.http.impl.io.SocketInputBuffer.fillBuffer(SocketInputBuffer.java:84)
	at org.apache.http.impl.io.AbstractSessionInputBuffer.readLine(AbstractSessionInputBuffer.java:273)
	at org.apache.http.impl.conn.DefaultHttpResponseParser.parseHead(DefaultHttpResponseParser.java:140)
	at org.apache.http.impl.conn.DefaultHttpResponseParser.parseHead(DefaultHttpResponseParser.java:57)
	at org.apache.http.impl.io.AbstractMessageParser.parse(AbstractMessageParser.java:261)
	at org.apache.http.impl.AbstractHttpClientConnection.receiveResponseHeader(AbstractHttpClientConnection.java:283)
	at org.apache.http.impl.conn.DefaultClientConnection.receiveResponseHeader(DefaultClientConnection.java:251)
	at org.apache.http.impl.conn.ManagedClientConnectionImpl.receiveResponseHeader(ManagedClientConnectionImpl.java:197)
	at org.apache.http.protocol.HttpRequestExecutor.doReceiveResponse(HttpRequestExecutor.java:272)
	at org.apache.http.protocol.HttpRequestExecutor.execute(HttpRequestExecutor.java:124)
	at org.apache.http.impl.client.DefaultRequestDirector.tryExecute(DefaultRequestDirector.java:685)
	at org.apache.http.impl.client.DefaultRequestDirector.execute(DefaultRequestDirector.java:487)
	at org.apache.http.impl.client.AbstractHttpClient.doExecute(AbstractHttpClient.java:882)
	at org.apache.http.impl.client.CloseableHttpClient.execute(CloseableHttpClient.java:82)
	at org.apache.http.impl.client.CloseableHttpClient.execute(CloseableHttpClient.java:107)
	at org.apache.http.impl.client.CloseableHttpClient.execute(CloseableHttpClient.java:55)
	at org.apache.solr.client.solrj.impl.HttpSolrClient.executeMethod(HttpSolrClient.java:482)
	... 52 more


FAILED:  org.apache.solr.cloud.TestAuthenticationFramework.testSegmentTerminateEarly

Error Message:
No live SolrServers available to handle this request:[http://127.0.0.1:37110/solr, http://127.0.0.1:49814/solr, http://127.0.0.1:35921/solr, http://127.0.0.1:33341/solr, http://127.0.0.1:34581/solr]

Stack Trace:
org.apache.solr.client.solrj.SolrServerException: No live SolrServers available to handle this request:[http://127.0.0.1:37110/solr, http://127.0.0.1:49814/solr, http://127.0.0.1:35921/solr, http://127.0.0.1:33341/solr, http://127.0.0.1:34581/solr]
	at __randomizedtesting.SeedInfo.seed([714BE5B51DAC7C7F:A1ED2218C1FEE815]:0)
	at org.apache.solr.client.solrj.impl.LBHttpSolrClient.request(LBHttpSolrClient.java:352)
	at org.apache.solr.client.solrj.impl.CloudSolrClient.sendRequest(CloudSolrClient.java:1100)
	at org.apache.solr.client.solrj.impl.CloudSolrClient.requestWithRetryOnStaleState(CloudSolrClient.java:870)
	at org.apache.solr.client.solrj.impl.CloudSolrClient.request(CloudSolrClient.java:806)
	at org.apache.solr.client.solrj.SolrClient.request(SolrClient.java:1219)
	at org.apache.solr.cloud.MiniSolrCloudCluster.makeCollectionsRequest(MiniSolrCloudCluster.java:415)
	at org.apache.solr.cloud.MiniSolrCloudCluster.createCollection(MiniSolrCloudCluster.java:399)
	at org.apache.solr.cloud.TestMiniSolrCloudCluster.createCollection(TestMiniSolrCloudCluster.java:122)
	at org.apache.solr.cloud.TestMiniSolrCloudCluster.testSegmentTerminateEarly(TestMiniSolrCloudCluster.java:485)
	at sun.reflect.NativeMethodAccessorImpl.invoke0(Native Method)
	at sun.reflect.NativeMethodAccessorImpl.invoke(NativeMethodAccessorImpl.java:62)
	at sun.reflect.DelegatingMethodAccessorImpl.invoke(DelegatingMethodAccessorImpl.java:43)
	at java.lang.reflect.Method.invoke(Method.java:498)
	at com.carrotsearch.randomizedtesting.RandomizedRunner.invoke(RandomizedRunner.java:1764)
	at com.carrotsearch.randomizedtesting.RandomizedRunner$8.evaluate(RandomizedRunner.java:871)
	at com.carrotsearch.randomizedtesting.RandomizedRunner$9.evaluate(RandomizedRunner.java:907)
	at com.carrotsearch.randomizedtesting.RandomizedRunner$10.evaluate(RandomizedRunner.java:921)
	at com.carrotsearch.randomizedtesting.rules.SystemPropertiesRestoreRule$1.evaluate(SystemPropertiesRestoreRule.java:57)
	at org.apache.lucene.util.TestRuleSetupTeardownChained$1.evaluate(TestRuleSetupTeardownChained.java:49)
	at org.apache.lucene.util.AbstractBeforeAfterRule$1.evaluate(AbstractBeforeAfterRule.java:45)
	at org.apache.lucene.util.TestRuleThreadAndTestName$1.evaluate(TestRuleThreadAndTestName.java:48)
	at org.apache.lucene.util.TestRuleIgnoreAfterMaxFailures$1.evaluate(TestRuleIgnoreAfterMaxFailures.java:64)
	at org.apache.lucene.util.TestRuleMarkFailure$1.evaluate(TestRuleMarkFailure.java:47)
	at com.carrotsearch.randomizedtesting.rules.StatementAdapter.evaluate(StatementAdapter.java:36)
	at com.carrotsearch.randomizedtesting.ThreadLeakControl$StatementRunner.run(ThreadLeakControl.java:367)
	at com.carrotsearch.randomizedtesting.ThreadLeakControl.forkTimeoutingTask(ThreadLeakControl.java:809)
	at com.carrotsearch.randomizedtesting.ThreadLeakControl$3.evaluate(ThreadLeakControl.java:460)
	at com.carrotsearch.randomizedtesting.RandomizedRunner.runSingleTest(RandomizedRunner.java:880)
	at com.carrotsearch.randomizedtesting.RandomizedRunner$5.evaluate(RandomizedRunner.java:781)
	at com.carrotsearch.randomizedtesting.RandomizedRunner$6.evaluate(RandomizedRunner.java:816)
	at com.carrotsearch.randomizedtesting.RandomizedRunner$7.evaluate(RandomizedRunner.java:827)
	at com.carrotsearch.randomizedtesting.rules.StatementAdapter.evaluate(StatementAdapter.java:36)
	at com.carrotsearch.randomizedtesting.rules.SystemPropertiesRestoreRule$1.evaluate(SystemPropertiesRestoreRule.java:57)
	at org.apache.lucene.util.AbstractBeforeAfterRule$1.evaluate(AbstractBeforeAfterRule.java:45)
	at com.carrotsearch.randomizedtesting.rules.StatementAdapter.evaluate(StatementAdapter.java:36)
	at org.apache.lucene.util.TestRuleStoreClassName$1.evaluate(TestRuleStoreClassName.java:41)
	at com.carrotsearch.randomizedtesting.rules.NoShadowingOrOverridesOnMethodsRule$1.evaluate(NoShadowingOrOverridesOnMethodsRule.java:40)
	at com.carrotsearch.randomizedtesting.rules.NoShadowingOrOverridesOnMethodsRule$1.evaluate(NoShadowingOrOverridesOnMethodsRule.java:40)
	at com.carrotsearch.randomizedtesting.rules.StatementAdapter.evaluate(StatementAdapter.java:36)
	at com.carrotsearch.randomizedtesting.rules.StatementAdapter.evaluate(StatementAdapter.java:36)
	at com.carrotsearch.randomizedtesting.rules.StatementAdapter.evaluate(StatementAdapter.java:36)
	at org.apache.lucene.util.TestRuleAssertionsRequired$1.evaluate(TestRuleAssertionsRequired.java:53)
	at org.apache.lucene.util.TestRuleMarkFailure$1.evaluate(TestRuleMarkFailure.java:47)
	at org.apache.lucene.util.TestRuleIgnoreAfterMaxFailures$1.evaluate(TestRuleIgnoreAfterMaxFailures.java:64)
	at org.apache.lucene.util.TestRuleIgnoreTestSuites$1.evaluate(TestRuleIgnoreTestSuites.java:54)
	at com.carrotsearch.randomizedtesting.rules.StatementAdapter.evaluate(StatementAdapter.java:36)
	at com.carrotsearch.randomizedtesting.ThreadLeakControl$StatementRunner.run(ThreadLeakControl.java:367)
	at java.lang.Thread.run(Thread.java:745)
Caused by: org.apache.solr.client.solrj.SolrServerException: IOException occured when talking to server at: http://127.0.0.1:33341/solr
	at org.apache.solr.client.solrj.impl.HttpSolrClient.executeMethod(HttpSolrClient.java:591)
	at org.apache.solr.client.solrj.impl.HttpSolrClient.request(HttpSolrClient.java:241)
	at org.apache.solr.client.solrj.impl.HttpSolrClient.request(HttpSolrClient.java:230)
	at org.apache.solr.client.solrj.impl.LBHttpSolrClient.doRequest(LBHttpSolrClient.java:372)
	at org.apache.solr.client.solrj.impl.LBHttpSolrClient.request(LBHttpSolrClient.java:325)
	... 47 more
Caused by: java.net.SocketException: Connection reset
	at java.net.SocketInputStream.read(SocketInputStream.java:209)
	at java.net.SocketInputStream.read(SocketInputStream.java:141)
	at org.apache.http.impl.io.AbstractSessionInputBuffer.fillBuffer(AbstractSessionInputBuffer.java:160)
	at org.apache.http.impl.io.SocketInputBuffer.fillBuffer(SocketInputBuffer.java:84)
	at org.apache.http.impl.io.AbstractSessionInputBuffer.readLine(AbstractSessionInputBuffer.java:273)
	at org.apache.http.impl.conn.DefaultHttpResponseParser.parseHead(DefaultHttpResponseParser.java:140)
	at org.apache.http.impl.conn.DefaultHttpResponseParser.parseHead(DefaultHttpResponseParser.java:57)
	at org.apache.http.impl.io.AbstractMessageParser.parse(AbstractMessageParser.java:261)
	at org.apache.http.impl.AbstractHttpClientConnection.receiveResponseHeader(AbstractHttpClientConnection.java:283)
	at org.apache.http.impl.conn.DefaultClientConnection.receiveResponseHeader(DefaultClientConnection.java:251)
	at org.apache.http.impl.conn.ManagedClientConnectionImpl.receiveResponseHeader(ManagedClientConnectionImpl.java:197)
	at org.apache.http.protocol.HttpRequestExecutor.doReceiveResponse(HttpRequestExecutor.java:272)
	at org.apache.http.protocol.HttpRequestExecutor.execute(HttpRequestExecutor.java:124)
	at org.apache.http.impl.client.DefaultRequestDirector.tryExecute(DefaultRequestDirector.java:685)
	at org.apache.http.impl.client.DefaultRequestDirector.execute(DefaultRequestDirector.java:487)
	at org.apache.http.impl.client.AbstractHttpClient.doExecute(AbstractHttpClient.java:882)
	at org.apache.http.impl.client.CloseableHttpClient.execute(CloseableHttpClient.java:82)
	at org.apache.http.impl.client.CloseableHttpClient.execute(CloseableHttpClient.java:107)
	at org.apache.http.impl.client.CloseableHttpClient.execute(CloseableHttpClient.java:55)
	at org.apache.solr.client.solrj.impl.HttpSolrClient.executeMethod(HttpSolrClient.java:482)
	... 51 more


FAILED:  org.apache.solr.cloud.TestCloudPivotFacet.test

Error Message:
Test abandoned because suite timeout was reached.

Stack Trace:
java.lang.Exception: Test abandoned because suite timeout was reached.
	at __randomizedtesting.SeedInfo.seed([714BE5B51DAC7C7F]:0)


FAILED:  org.apache.solr.cloud.TriLevelCompositeIdRoutingTest.test

Error Message:
There are still nodes recoverying - waited for 330 seconds

Stack Trace:
java.lang.AssertionError: There are still nodes recoverying - waited for 330 seconds
	at __randomizedtesting.SeedInfo.seed([714BE5B51DAC7C7F:F91FDA6FB3501187]:0)
	at org.junit.Assert.fail(Assert.java:93)
	at org.apache.solr.cloud.AbstractDistribZkTestBase.waitForRecoveriesToFinish(AbstractDistribZkTestBase.java:174)
	at org.apache.solr.cloud.AbstractDistribZkTestBase.waitForRecoveriesToFinish(AbstractDistribZkTestBase.java:135)
	at org.apache.solr.cloud.AbstractDistribZkTestBase.waitForRecoveriesToFinish(AbstractDistribZkTestBase.java:130)
	at org.apache.solr.cloud.AbstractFullDistribZkTestBase.waitForRecoveriesToFinish(AbstractFullDistribZkTestBase.java:844)
	at org.apache.solr.cloud.TriLevelCompositeIdRoutingTest.test(TriLevelCompositeIdRoutingTest.java:67)
	at sun.reflect.NativeMethodAccessorImpl.invoke0(Native Method)
	at sun.reflect.NativeMethodAccessorImpl.invoke(NativeMethodAccessorImpl.java:62)
	at sun.reflect.DelegatingMethodAccessorImpl.invoke(DelegatingMethodAccessorImpl.java:43)
	at java.lang.reflect.Method.invoke(Method.java:498)
	at com.carrotsearch.randomizedtesting.RandomizedRunner.invoke(RandomizedRunner.java:1764)
	at com.carrotsearch.randomizedtesting.RandomizedRunner$8.evaluate(RandomizedRunner.java:871)
	at com.carrotsearch.randomizedtesting.RandomizedRunner$9.evaluate(RandomizedRunner.java:907)
	at com.carrotsearch.randomizedtesting.RandomizedRunner$10.evaluate(RandomizedRunner.java:921)
	at org.apache.solr.BaseDistributedSearchTestCase$ShardsRepeatRule$ShardsFixedStatement.callStatement(BaseDistributedSearchTestCase.java:996)
	at org.apache.solr.BaseDistributedSearchTestCase$ShardsRepeatRule$ShardsStatement.evaluate(BaseDistributedSearchTestCase.java:971)
	at com.carrotsearch.randomizedtesting.rules.SystemPropertiesRestoreRule$1.evaluate(SystemPropertiesRestoreRule.java:57)
	at org.apache.lucene.util.TestRuleSetupTeardownChained$1.evaluate(TestRuleSetupTeardownChained.java:49)
	at org.apache.lucene.util.AbstractBeforeAfterRule$1.evaluate(AbstractBeforeAfterRule.java:45)
	at org.apache.lucene.util.TestRuleThreadAndTestName$1.evaluate(TestRuleThreadAndTestName.java:48)
	at org.apache.lucene.util.TestRuleIgnoreAfterMaxFailures$1.evaluate(TestRuleIgnoreAfterMaxFailures.java:64)
	at org.apache.lucene.util.TestRuleMarkFailure$1.evaluate(TestRuleMarkFailure.java:47)
	at com.carrotsearch.randomizedtesting.rules.StatementAdapter.evaluate(StatementAdapter.java:36)
	at com.carrotsearch.randomizedtesting.ThreadLeakControl$StatementRunner.run(ThreadLeakControl.java:367)
	at com.carrotsearch.randomizedtesting.ThreadLeakControl.forkTimeoutingTask(ThreadLeakControl.java:809)
	at com.carrotsearch.randomizedtesting.ThreadLeakControl$3.evaluate(ThreadLeakControl.java:460)
	at com.carrotsearch.randomizedtesting.RandomizedRunner.runSingleTest(RandomizedRunner.java:880)
	at com.carrotsearch.randomizedtesting.RandomizedRunner$5.evaluate(RandomizedRunner.java:781)
	at com.carrotsearch.randomizedtesting.RandomizedRunner$6.evaluate(RandomizedRunner.java:816)
	at com.carrotsearch.randomizedtesting.RandomizedRunner$7.evaluate(RandomizedRunner.java:827)
	at com.carrotsearch.randomizedtesting.rules.StatementAdapter.evaluate(StatementAdapter.java:36)
	at com.carrotsearch.randomizedtesting.rules.SystemPropertiesRestoreRule$1.evaluate(SystemPropertiesRestoreRule.java:57)
	at org.apache.lucene.util.AbstractBeforeAfterRule$1.evaluate(AbstractBeforeAfterRule.java:45)
	at com.carrotsearch.randomizedtesting.rules.StatementAdapter.evaluate(StatementAdapter.java:36)
	at org.apache.lucene.util.TestRuleStoreClassName$1.evaluate(TestRuleStoreClassName.java:41)
	at com.carrotsearch.randomizedtesting.rules.NoShadowingOrOverridesOnMethodsRule$1.evaluate(NoShadowingOrOverridesOnMethodsRule.java:40)
	at com.carrotsearch.randomizedtesting.rules.NoShadowingOrOverridesOnMethodsRule$1.evaluate(NoShadowingOrOverridesOnMethodsRule.java:40)
	at com.carrotsearch.randomizedtesting.rules.StatementAdapter.evaluate(StatementAdapter.java:36)
	at com.carrotsearch.randomizedtesting.rules.StatementAdapter.evaluate(StatementAdapter.java:36)
	at com.carrotsearch.randomizedtesting.rules.StatementAdapter.evaluate(StatementAdapter.java:36)
	at org.apache.lucene.util.TestRuleAssertionsRequired$1.evaluate(TestRuleAssertionsRequired.java:53)
	at org.apache.lucene.util.TestRuleMarkFailure$1.evaluate(TestRuleMarkFailure.java:47)
	at org.apache.lucene.util.TestRuleIgnoreAfterMaxFailures$1.evaluate(TestRuleIgnoreAfterMaxFailures.java:64)
	at org.apache.lucene.util.TestRuleIgnoreTestSuites$1.evaluate(TestRuleIgnoreTestSuites.java:54)
	at com.carrotsearch.randomizedtesting.rules.StatementAdapter.evaluate(StatementAdapter.java:36)
	at com.carrotsearch.randomizedtesting.ThreadLeakControl$StatementRunner.run(ThreadLeakControl.java:367)
	at java.lang.Thread.run(Thread.java:745)


FAILED:  org.apache.solr.cloud.UnloadDistributedZkTest.test

Error Message:
Captured an uncaught exception in thread: Thread[id=7311, name=testExecutor-3300-thread-5, state=RUNNABLE, group=TGRP-UnloadDistributedZkTest]

Stack Trace:
com.carrotsearch.randomizedtesting.UncaughtExceptionError: Captured an uncaught exception in thread: Thread[id=7311, name=testExecutor-3300-thread-5, state=RUNNABLE, group=TGRP-UnloadDistributedZkTest]
Caused by: java.lang.RuntimeException: org.apache.solr.client.solrj.SolrServerException: Timeout occured while waiting response from server at: http://127.0.0.1:47192/cb_a/ct
	at __randomizedtesting.SeedInfo.seed([714BE5B51DAC7C7F]:0)
	at org.apache.solr.cloud.BasicDistributedZkTest$1.run(BasicDistributedZkTest.java:586)
	at org.apache.solr.common.util.ExecutorUtil$MDCAwareThreadPoolExecutor$1.run(ExecutorUtil.java:231)
	at java.util.concurrent.ThreadPoolExecutor.runWorker(ThreadPoolExecutor.java:1142)
	at java.util.concurrent.ThreadPoolExecutor$Worker.run(ThreadPoolExecutor.java:617)
	at java.lang.Thread.run(Thread.java:745)
Caused by: org.apache.solr.client.solrj.SolrServerException: Timeout occured while waiting response from server at: http://127.0.0.1:47192/cb_a/ct
	at org.apache.solr.client.solrj.impl.HttpSolrClient.executeMethod(HttpSolrClient.java:588)
	at org.apache.solr.client.solrj.impl.HttpSolrClient.request(HttpSolrClient.java:241)
	at org.apache.solr.client.solrj.impl.HttpSolrClient.request(HttpSolrClient.java:230)
	at org.apache.solr.client.solrj.SolrClient.request(SolrClient.java:1219)
	at org.apache.solr.cloud.BasicDistributedZkTest$1.run(BasicDistributedZkTest.java:584)
	... 4 more
Caused by: java.net.SocketTimeoutException: Read timed out
	at java.net.SocketInputStream.socketRead0(Native Method)
	at java.net.SocketInputStream.socketRead(SocketInputStream.java:116)
	at java.net.SocketInputStream.read(SocketInputStream.java:170)
	at java.net.SocketInputStream.read(SocketInputStream.java:141)
	at org.apache.http.impl.io.AbstractSessionInputBuffer.fillBuffer(AbstractSessionInputBuffer.java:160)
	at org.apache.http.impl.io.SocketInputBuffer.fillBuffer(SocketInputBuffer.java:84)
	at org.apache.http.impl.io.AbstractSessionInputBuffer.readLine(AbstractSessionInputBuffer.java:273)
	at org.apache.http.impl.conn.DefaultHttpResponseParser.parseHead(DefaultHttpResponseParser.java:140)
	at org.apache.http.impl.conn.DefaultHttpResponseParser.parseHead(DefaultHttpResponseParser.java:57)
	at org.apache.http.impl.io.AbstractMessageParser.parse(AbstractMessageParser.java:261)
	at org.apache.http.impl.AbstractHttpClientConnection.receiveResponseHeader(AbstractHttpClientConnection.java:283)
	at org.apache.http.impl.conn.DefaultClientConnection.receiveResponseHeader(DefaultClientConnection.java:251)
	at org.apache.http.impl.conn.ManagedClientConnectionImpl.receiveResponseHeader(ManagedClientConnectionImpl.java:197)
	at org.apache.http.protocol.HttpRequestExecutor.doReceiveResponse(HttpRequestExecutor.java:272)
	at org.apache.http.protocol.HttpRequestExecutor.execute(HttpRequestExecutor.java:124)
	at org.apache.http.impl.client.DefaultRequestDirector.tryExecute(DefaultRequestDirector.java:685)
	at org.apache.http.impl.client.DefaultRequestDirector.execute(DefaultRequestDirector.java:487)
	at org.apache.http.impl.client.AbstractHttpClient.doExecute(AbstractHttpClient.java:882)
	at org.apache.http.impl.client.CloseableHttpClient.execute(CloseableHttpClient.java:82)
	at org.apache.http.impl.client.CloseableHttpClient.execute(CloseableHttpClient.java:107)
	at org.apache.http.impl.client.CloseableHttpClient.execute(CloseableHttpClient.java:55)
	at org.apache.solr.client.solrj.impl.HttpSolrClient.executeMethod(HttpSolrClient.java:482)
	... 8 more


FAILED:  org.apache.solr.handler.component.DistributedFacetPivotWhiteBoxTest.test

Error Message:
IOException occured when talking to server at: https://127.0.0.1:52582/jfj/pt/collection1

Stack Trace:
org.apache.solr.client.solrj.SolrServerException: IOException occured when talking to server at: https://127.0.0.1:52582/jfj/pt/collection1
	at __randomizedtesting.SeedInfo.seed([714BE5B51DAC7C7F:F91FDA6FB3501187]:0)
	at org.apache.solr.client.solrj.impl.HttpSolrClient.executeMethod(HttpSolrClient.java:591)
	at org.apache.solr.client.solrj.impl.HttpSolrClient.request(HttpSolrClient.java:241)
	at org.apache.solr.client.solrj.impl.HttpSolrClient.request(HttpSolrClient.java:230)
	at org.apache.solr.client.solrj.SolrRequest.process(SolrRequest.java:149)
	at org.apache.solr.client.solrj.SolrClient.deleteByQuery(SolrClient.java:895)
	at org.apache.solr.client.solrj.SolrClient.deleteByQuery(SolrClient.java:858)
	at org.apache.solr.client.solrj.SolrClient.deleteByQuery(SolrClient.java:873)
	at org.apache.solr.BaseDistributedSearchTestCase.del(BaseDistributedSearchTestCase.java:551)
	at org.apache.solr.handler.component.DistributedFacetPivotWhiteBoxTest.test(DistributedFacetPivotWhiteBoxTest.java:34)
	at sun.reflect.NativeMethodAccessorImpl.invoke0(Native Method)
	at sun.reflect.NativeMethodAccessorImpl.invoke(NativeMethodAccessorImpl.java:62)
	at sun.reflect.DelegatingMethodAccessorImpl.invoke(DelegatingMethodAccessorImpl.java:43)
	at java.lang.reflect.Method.invoke(Method.java:498)
	at com.carrotsearch.randomizedtesting.RandomizedRunner.invoke(RandomizedRunner.java:1764)
	at com.carrotsearch.randomizedtesting.RandomizedRunner$8.evaluate(RandomizedRunner.java:871)
	at com.carrotsearch.randomizedtesting.RandomizedRunner$9.evaluate(RandomizedRunner.java:907)
	at com.carrotsearch.randomizedtesting.RandomizedRunner$10.evaluate(RandomizedRunner.java:921)
	at org.apache.solr.BaseDistributedSearchTestCase$ShardsRepeatRule$ShardsFixedStatement.callStatement(BaseDistributedSearchTestCase.java:996)
	at org.apache.solr.BaseDistributedSearchTestCase$ShardsRepeatRule$ShardsStatement.evaluate(BaseDistributedSearchTestCase.java:971)
	at com.carrotsearch.randomizedtesting.rules.SystemPropertiesRestoreRule$1.evaluate(SystemPropertiesRestoreRule.java:57)
	at org.apache.lucene.util.TestRuleSetupTeardownChained$1.evaluate(TestRuleSetupTeardownChained.java:49)
	at org.apache.lucene.util.AbstractBeforeAfterRule$1.evaluate(AbstractBeforeAfterRule.java:45)
	at org.apache.lucene.util.TestRuleThreadAndTestName$1.evaluate(TestRuleThreadAndTestName.java:48)
	at org.apache.lucene.util.TestRuleIgnoreAfterMaxFailures$1.evaluate(TestRuleIgnoreAfterMaxFailures.java:64)
	at org.apache.lucene.util.TestRuleMarkFailure$1.evaluate(TestRuleMarkFailure.java:47)
	at com.carrotsearch.randomizedtesting.rules.StatementAdapter.evaluate(StatementAdapter.java:36)
	at com.carrotsearch.randomizedtesting.ThreadLeakControl$StatementRunner.run(ThreadLeakControl.java:367)
	at com.carrotsearch.randomizedtesting.ThreadLeakControl.forkTimeoutingTask(ThreadLeakControl.java:809)
	at com.carrotsearch.randomizedtesting.ThreadLeakControl$3.evaluate(ThreadLeakControl.java:460)
	at com.carrotsearch.randomizedtesting.RandomizedRunner.runSingleTest(RandomizedRunner.java:880)
	at com.carrotsearch.randomizedtesting.RandomizedRunner$5.evaluate(RandomizedRunner.java:781)
	at com.carrotsearch.randomizedtesting.RandomizedRunner$6.evaluate(RandomizedRunner.java:816)
	at com.carrotsearch.randomizedtesting.RandomizedRunner$7.evaluate(RandomizedRunner.java:827)
	at com.carrotsearch.randomizedtesting.rules.StatementAdapter.evaluate(StatementAdapter.java:36)
	at com.carrotsearch.randomizedtesting.rules.SystemPropertiesRestoreRule$1.evaluate(SystemPropertiesRestoreRule.java:57)
	at org.apache.lucene.util.AbstractBeforeAfterRule$1.evaluate(AbstractBeforeAfterRule.java:45)
	at com.carrotsearch.randomizedtesting.rules.StatementAdapter.evaluate(StatementAdapter.java:36)
	at org.apache.lucene.util.TestRuleStoreClassName$1.evaluate(TestRuleStoreClassName.java:41)
	at com.carrotsearch.randomizedtesting.rules.NoShadowingOrOverridesOnMethodsRule$1.evaluate(NoShadowingOrOverridesOnMethodsRule.java:40)
	at com.carrotsearch.randomizedtesting.rules.NoShadowingOrOverridesOnMethodsRule$1.evaluate(NoShadowingOrOverridesOnMethodsRule.java:40)
	at com.carrotsearch.randomizedtesting.rules.StatementAdapter.evaluate(StatementAdapter.java:36)
	at com.carrotsearch.randomizedtesting.rules.StatementAdapter.evaluate(StatementAdapter.java:36)
	at com.carrotsearch.randomizedtesting.rules.StatementAdapter.evaluate(StatementAdapter.java:36)
	at org.apache.lucene.util.TestRuleAssertionsRequired$1.evaluate(TestRuleAssertionsRequired.java:53)
	at org.apache.lucene.util.TestRuleMarkFailure$1.evaluate(TestRuleMarkFailure.java:47)
	at org.apache.lucene.util.TestRuleIgnoreAfterMaxFailures$1.evaluate(TestRuleIgnoreAfterMaxFailures.java:64)
	at org.apache.lucene.util.TestRuleIgnoreTestSuites$1.evaluate(TestRuleIgnoreTestSuites.java:54)
	at com.carrotsearch.randomizedtesting.rules.StatementAdapter.evaluate(StatementAdapter.java:36)
	at com.carrotsearch.randomizedtesting.ThreadLeakControl$StatementRunner.run(ThreadLeakControl.java:367)
	at java.lang.Thread.run(Thread.java:745)
Caused by: java.net.SocketException: Connection reset
	at java.net.SocketInputStream.read(SocketInputStream.java:209)
	at java.net.SocketInputStream.read(SocketInputStream.java:141)
	at sun.security.ssl.InputRecord.readFully(InputRecord.java:465)
	at sun.security.ssl.InputRecord.read(InputRecord.java:503)
	at sun.security.ssl.SSLSocketImpl.readRecord(SSLSocketImpl.java:973)
	at sun.security.ssl.SSLSocketImpl.performInitialHandshake(SSLSocketImpl.java:1375)
	at sun.security.ssl.SSLSocketImpl.startHandshake(SSLSocketImpl.java:1403)
	at sun.security.ssl.SSLSocketImpl.startHandshake(SSLSocketImpl.java:1387)
	at org.apache.http.conn.ssl.SSLSocketFactory.connectSocket(SSLSocketFactory.java:543)
	at org.apache.http.conn.ssl.SSLSocketFactory.connectSocket(SSLSocketFactory.java:409)
	at org.apache.http.impl.conn.DefaultClientConnectionOperator.openConnection(DefaultClientConnectionOperator.java:177)
	at org.apache.http.impl.conn.ManagedClientConnectionImpl.open(ManagedClientConnectionImpl.java:304)
	at org.apache.http.impl.client.DefaultRequestDirector.tryConnect(DefaultRequestDirector.java:611)
	at org.apache.http.impl.client.DefaultRequestDirector.execute(DefaultRequestDirector.java:446)
	at org.apache.http.impl.client.AbstractHttpClient.doExecute(AbstractHttpClient.java:882)
	at org.apache.http.impl.client.CloseableHttpClient.execute(CloseableHttpClient.java:82)
	at org.apache.http.impl.client.CloseableHttpClient.execute(CloseableHttpClient.java:107)
	at org.apache.http.impl.client.CloseableHttpClient.execute(CloseableHttpClient.java:55)
	at org.apache.solr.client.solrj.impl.HttpSolrClient.executeMethod(HttpSolrClient.java:482)
	... 49 more




Build Log:
[...truncated 10491 lines...]
   [junit4] Suite: org.apache.solr.handler.component.DistributedFacetPivotWhiteBoxTest
   [junit4]   2> Creating dataDir: /home/jenkins/workspace/Lucene-Solr-trunk-Linux/solr/build/solr-core/test/J0/temp/solr.handler.component.DistributedFacetPivotWhiteBoxTest_714BE5B51DAC7C7F-001/init-core-data-001
   [junit4]   2> 0    INFO  (SUITE-DistributedFacetPivotWhiteBoxTest-seed#[714BE5B51DAC7C7F]-worker) [    ] o.a.s.SolrTestCaseJ4 Randomized ssl (true) and clientAuth (false)
   [junit4]   2> 16   INFO  (SUITE-DistributedFacetPivotWhiteBoxTest-seed#[714BE5B51DAC7C7F]-worker) [    ] o.a.s.BaseDistributedSearchTestCase Setting hostContext system property: /jfj/pt
   [junit4]   2> 113  INFO  (TEST-DistributedFacetPivotWhiteBoxTest.test-seed#[714BE5B51DAC7C7F]) [    ] o.a.s.SolrTestCaseJ4 Writing core.properties file to /home/jenkins/workspace/Lucene-Solr-trunk-Linux/solr/build/solr-core/test/J0/temp/solr.handler.component.DistributedFacetPivotWhiteBoxTest_714BE5B51DAC7C7F-001/tempDir-001/control/cores/collection1
   [junit4]   2> 141  INFO  (TEST-DistributedFacetPivotWhiteBoxTest.test-seed#[714BE5B51DAC7C7F]) [    ] o.e.j.u.log Logging initialized @1316ms
   [junit4]   2> 323  INFO  (TEST-DistributedFacetPivotWhiteBoxTest.test-seed#[714BE5B51DAC7C7F]) [    ] o.e.j.s.Server jetty-9.3.6.v20151106
   [junit4]   2> 353  INFO  (TEST-DistributedFacetPivotWhiteBoxTest.test-seed#[714BE5B51DAC7C7F]) [    ] o.e.j.s.h.ContextHandler Started o.e.j.s.ServletContextHandler@1aa0dcc{/jfj/pt,null,AVAILABLE}
   [junit4]   2> 381  INFO  (TEST-DistributedFacetPivotWhiteBoxTest.test-seed#[714BE5B51DAC7C7F]) [    ] o.e.j.u.s.SslContextFactory x509=X509@130f5ba(solrtest,h=[],w=[]) for SslContextFactory@2aa378(file:///home/jenkins/workspace/Lucene-Solr-trunk-Linux/solr/server/etc/test/solrtest.keystore,file:///home/jenkins/workspace/Lucene-Solr-trunk-Linux/solr/server/etc/test/solrtest.keystore)
   [junit4]   2> 596  INFO  (TEST-DistributedFacetPivotWhiteBoxTest.test-seed#[714BE5B51DAC7C7F]) [    ] o.e.j.s.ServerConnector Started ServerConnector@1050e1b{SSL,[ssl, http/1.1]}{127.0.0.1:52582}
   [junit4]   2> 597  INFO  (TEST-DistributedFacetPivotWhiteBoxTest.test-seed#[714BE5B51DAC7C7F]) [    ] o.e.j.s.Server Started @1773ms
   [junit4]   2> 597  INFO  (TEST-DistributedFacetPivotWhiteBoxTest.test-seed#[714BE5B51DAC7C7F]) [    ] o.a.s.c.s.e.JettySolrRunner Jetty properties: {hostContext=/jfj/pt, hostPort=52582, coreRootDirectory=/home/jenkins/workspace/Lucene-Solr-trunk-Linux/solr/build/solr-core/test/J0/temp/solr.handler.component.DistributedFacetPivotWhiteBoxTest_714BE5B51DAC7C7F-001/tempDir-001/control/cores}
   [junit4]   2> 607  INFO  (TEST-DistributedFacetPivotWhiteBoxTest.test-seed#[714BE5B51DAC7C7F]) [    ] o.a.s.s.SolrDispatchFilter SolrDispatchFilter.init(): sun.misc.Launcher$AppClassLoader@1d16e93
   [junit4]   2> 628  INFO  (TEST-DistributedFacetPivotWhiteBoxTest.test-seed#[714BE5B51DAC7C7F]) [    ] o.a.s.c.SolrResourceLoader new SolrResourceLoader for directory: '/home/jenkins/workspace/Lucene-Solr-trunk-Linux/solr/build/solr-core/test/J0/temp/solr.handler.component.DistributedFacetPivotWhiteBoxTest_714BE5B51DAC7C7F-001/tempDir-001/control'
   [junit4]   2> 631  INFO  (TEST-DistributedFacetPivotWhiteBoxTest.test-seed#[714BE5B51DAC7C7F]) [    ] o.a.s.c.SolrResourceLoader JNDI not configured for solr (NoInitialContextEx)
   [junit4]   2> 631  INFO  (TEST-DistributedFacetPivotWhiteBoxTest.test-seed#[714BE5B51DAC7C7F]) [    ] o.a.s.c.SolrResourceLoader solr home defaulted to 'solr/' (could not find system property or JNDI)
   [junit4]   2> 637  INFO  (TEST-DistributedFacetPivotWhiteBoxTest.test-seed#[714BE5B51DAC7C7F]) [    ] o.a.s.c.SolrXmlConfig Loading container configuration from /home/jenkins/workspace/Lucene-Solr-trunk-Linux/solr/build/solr-core/test/J0/temp/solr.handler.component.DistributedFacetPivotWhiteBoxTest_714BE5B51DAC7C7F-001/tempDir-001/control/solr.xml
   [junit4]   2> 724  INFO  (TEST-DistributedFacetPivotWhiteBoxTest.test-seed#[714BE5B51DAC7C7F]) [    ] o.a.s.c.CorePropertiesLocator Config-defined core root directory: /home/jenkins/workspace/Lucene-Solr-trunk-Linux/solr/build/solr-core/test/J0/temp/solr.handler.component.DistributedFacetPivotWhiteBoxTest_714BE5B51DAC7C7F-001/tempDir-001/control/cores
   [junit4]   2> 774  INFO  (TEST-DistributedFacetPivotWhiteBoxTest.test-seed#[714BE5B51DAC7C7F]) [    ] o.a.s.c.CoreContainer New CoreContainer 30554204
   [junit4]   2> 774  INFO  (TEST-DistributedFacetPivotWhiteBoxTest.test-seed#[714BE5B51DAC7C7F]) [    ] o.a.s.c.CoreContainer Loading cores into CoreContainer [instanceDir=/home/jenkins/workspace/Lucene-Solr-trunk-Linux/solr/build/solr-core/test/J0/temp/solr.handler.component.DistributedFacetPivotWhiteBoxTest_714BE5B51DAC7C7F-001/tempDir-001/control]
   [junit4]   2> 775  WARN  (TEST-DistributedFacetPivotWhiteBoxTest.test-seed#[714BE5B51DAC7C7F]) [    ] o.a.s.c.CoreContainer Couldn't add files from /home/jenkins/workspace/Lucene-Solr-trunk-Linux/solr/build/solr-core/test/J0/temp/solr.handler.component.DistributedFacetPivotWhiteBoxTest_714BE5B51DAC7C7F-001/tempDir-001/control/lib to classpath: /home/jenkins/workspace/Lucene-Solr-trunk-Linux/solr/build/solr-core/test/J0/temp/solr.handler.component.DistributedFacetPivotWhiteBoxTest_714BE5B51DAC7C7F-001/tempDir-001/control/lib
   [junit4]   2> 799  INFO  (TEST-DistributedFacetPivotWhiteBoxTest.test-seed#[714BE5B51DAC7C7F]) [    ] o.a.s.h.c.HttpShardHandlerFactory created with socketTimeout : 90000,urlScheme : https,connTimeout : 15000,maxConnectionsPerHost : 20,maxConnections : 10000,corePoolSize : 0,maximumPoolSize : 2147483647,maxThreadIdleTime : 5,sizeOfQueue : -1,fairnessPolicy : false,useRetries : false,
   [junit4]   2> 925  INFO  (TEST-DistributedFacetPivotWhiteBoxTest.test-seed#[714BE5B51DAC7C7F]) [    ] o.a.s.u.UpdateShardHandler Creating UpdateShardHandler HTTP client with params: socketTimeout=340000&connTimeout=45000&retry=true
   [junit4]   2> 932  INFO  (TEST-DistributedFacetPivotWhiteBoxTest.test-seed#[714BE5B51DAC7C7F]) [    ] o.a.s.l.LogWatcher SLF4J impl is org.slf4j.impl.Log4jLoggerFactory
   [junit4]   2> 933  INFO  (TEST-DistributedFacetPivotWhiteBoxTest.test-seed#[714BE5B51DAC7C7F]) [    ] o.a.s.l.LogWatcher Registering Log Listener [Log4j (org.slf4j.impl.Log4jLoggerFactory)]
   [junit4]   2> 936  INFO  (TEST-DistributedFacetPivotWhiteBoxTest.test-seed#[714BE5B51DAC7C7F]) [    ] o.a.s.c.CoreContainer Security conf doesn't exist. Skipping setup for authorization module.
   [junit4]   2> 936  INFO  (TEST-DistributedFacetPivotWhiteBoxTest.test-seed#[714BE5B51DAC7C7F]) [    ] o.a.s.c.CoreContainer No authentication plugin used.
   [junit4]   2> 1008 INFO  (TEST-DistributedFacetPivotWhiteBoxTest.test-seed#[714BE5B51DAC7C7F]) [    ] o.a.s.c.CorePropertiesLocator Looking for core definitions underneath /home/jenkins/workspace/Lucene-Solr-trunk-Linux/solr/build/solr-core/test/J0/temp/solr.handler.component.DistributedFacetPivotWhiteBoxTest_714BE5B51DAC7C7F-001/tempDir-001/control/cores
   [junit4]   2> 1014 INFO  (TEST-DistributedFacetPivotWhiteBoxTest.test-seed#[714BE5B51DAC7C7F]) [    ] o.a.s.c.CoreDescriptor Created CoreDescriptor: {name=collection1, config=solrconfig.xml, loadOnStartup=true, schema=schema.xml, configSetProperties=configsetprops.json, transient=false, dataDir=data/, configSet=collection1}
   [junit4]   2> 1014 INFO  (TEST-DistributedFacetPivotWhiteBoxTest.test-seed#[714BE5B51DAC7C7F]) [    ] o.a.s.c.CorePropertiesLocator Found core collection1 in /home/jenkins/workspace/Lucene-Solr-trunk-Linux/solr/build/solr-core/test/J0/temp/solr.handler.component.DistributedFacetPivotWhiteBoxTest_714BE5B51DAC7C7F-001/tempDir-001/control/cores/collection1
   [junit4]   2> 1015 INFO  (TEST-DistributedFacetPivotWhiteBoxTest.test-seed#[714BE5B51DAC7C7F]) [    ] o.a.s.c.CorePropertiesLocator Found 1 core definitions
   [junit4]   2> 1018 INFO  (TEST-DistributedFacetPivotWhiteBoxTest.test-seed#[714BE5B51DAC7C7F]) [    ] o.a.s.s.SolrDispatchFilter user.dir=/home/jenkins/workspace/Lucene-Solr-trunk-Linux/solr/build/solr-core/test/J0
   [junit4]   2> 1018 INFO  (TEST-DistributedFacetPivotWhiteBoxTest.test-seed#[714BE5B51DAC7C7F]) [    ] o.a.s.s.SolrDispatchFilter SolrDispatchFilter.init() done
   [junit4]   2> 1019 INFO  (coreLoadExecutor-6-thread-1) [    ] o.a.s.c.SolrResourceLoader new SolrResourceLoader for directory: '/home/jenkins/workspace/Lucene-Solr-trunk-Linux/solr/core/src/test-files/solr/collection1'
   [junit4]   2> 1019 INFO  (coreLoadExecutor-6-thread-1) [    ] o.a.s.c.SolrResourceLoader JNDI not configured for solr (NoInitialContextEx)
   [junit4]   2> 1019 INFO  (coreLoadExecutor-6-thread-1) [    ] o.a.s.c.SolrResourceLoader solr home defaulted to 'solr/' (could not find system property or JNDI)
   [junit4]   2> 1019 INFO  (coreLoadExecutor-6-thread-1) [    ] o.a.s.c.SolrResourceLoader Adding 'file:/home/jenkins/workspace/Lucene-Solr-trunk-Linux/solr/core/src/test-files/solr/collection1/lib/classes/' to classloader
   [junit4]   2> 1019 INFO  (coreLoadExecutor-6-thread-1) [    ] o.a.s.c.SolrResourceLoader Adding 'file:/home/jenkins/workspace/Lucene-Solr-trunk-Linux/solr/core/src/test-files/solr/collection1/lib/README' to classloader
   [junit4]   2> 1174 INFO  (coreLoadExecutor-6-thread-1) [    ] o.a.s.c.SolrConfig current version of requestparams : -1
   [junit4]   2> 1201 INFO  (coreLoadExecutor-6-thread-1) [    ] o.a.s.c.SolrConfig Using Lucene MatchVersion: 7.0.0
   [junit4]   2> 1267 INFO  (coreLoadExecutor-6-thread-1) [    ] o.a.s.c.SolrConfig Loaded SolrConfig: solrconfig.xml
   [junit4]   2> 1324 INFO  (coreLoadExecutor-6-thread-1) [    ] o.a.s.s.IndexSchema [collection1] Schema name=test
   [junit4]   2> 1876 INFO  (coreLoadExecutor-6-thread-1) [    ] o.a.s.s.OpenExchangeRatesOrgProvider Initialized with rates=open-exchange-rates.json, refreshInterval=1440.
   [junit4]   2> 1893 INFO  (coreLoadExecutor-6-thread-1) [    ] o.a.s.s.IndexSchema default search field in schema is text
   [junit4]   2> 1894 INFO  (coreLoadExecutor-6-thread-1) [    ] o.a.s.s.IndexSchema unique key field: id
   [junit4]   2> 2023 INFO  (coreLoadExecutor-6-thread-1) [    ] o.a.s.s.FileExchangeRateProvider Reloading exchange rates from file currency.xml
   [junit4]   2> 2027 INFO  (coreLoadExecutor-6-thread-1) [    ] o.a.s.s.FileExchangeRateProvider Reloading exchange rates from file currency.xml
   [junit4]   2> 2029 INFO  (coreLoadExecutor-6-thread-1) [    ] o.a.s.s.OpenExchangeRatesOrgProvider Reloading exchange rates from open-exchange-rates.json
   [junit4]   2> 2031 INFO  (coreLoadExecutor-6-thread-1) [    ] o.a.s.s.OpenExchangeRatesOrgProvider Reloading exchange rates from open-exchange-rates.json
   [junit4]   2> 2034 INFO  (coreLoadExecutor-6-thread-1) [    ] o.a.s.c.ConfigSetProperties Did not find ConfigSet properties, assuming default properties: Can't find resource 'configsetprops.json' in classpath or '/home/jenkins/workspace/Lucene-Solr-trunk-Linux/solr/core/src/test-files/solr/collection1'
   [junit4]   2> 2035 INFO  (coreLoadExecutor-6-thread-1) [    ] o.a.s.c.CoreContainer Creating SolrCore 'collection1' using configuration from configset /home/jenkins/workspace/Lucene-Solr-trunk-Linux/solr/core/src/test-files/solr/collection1
   [junit4]   2> 2069 INFO  (coreLoadExecutor-6-thread-1) [    x:collection1] o.a.s.c.SolrCore org.apache.solr.core.MockDirectoryFactory
   [junit4]   2> 2079 INFO  (coreLoadExecutor-6-thread-1) [    x:collection1] o.a.s.c.SolrCore [[collection1] ] Opening new SolrCore at [/home/jenkins/workspace/Lucene-Solr-trunk-Linux/solr/core/src/test-files/solr/collection1], dataDir=[/home/jenkins/workspace/Lucene-Solr-trunk-Linux/solr/build/solr-core/test/J0/temp/solr.handler.component.DistributedFacetPivotWhiteBoxTest_714BE5B51DAC7C7F-001/tempDir-001/control/cores/collection1/data/]
   [junit4]   2> 2081 INFO  (coreLoadExecutor-6-thread-1) [    x:collection1] o.a.s.c.JmxMonitoredMap No JMX servers found, not exposing Solr information with JMX.
   [junit4]   2> 2098 INFO  (coreLoadExecutor-6-thread-1) [    x:collection1] o.a.s.c.CachingDirectoryFactory return new directory for /home/jenkins/workspace/Lucene-Solr-trunk-Linux/solr/build/solr-core/test/J0/temp/solr.handler.component.DistributedFacetPivotWhiteBoxTest_714BE5B51DAC7C7F-001/tempDir-001/control/cores/collection1/data
   [junit4]   2> 2099 INFO  (coreLoadExecutor-6-thread-1) [    x:collection1] o.a.s.c.SolrCore New index directory detected: old=null new=/home/jenkins/workspace/Lucene-Solr-trunk-Linux/solr/build/solr-core/test/J0/temp/solr.handler.component.DistributedFacetPivotWhiteBoxTest_714BE5B51DAC7C7F-001/tempDir-001/control/cores/collection1/data/index/
   [junit4]   2> 2099 WARN  (coreLoadExecutor-6-thread-1) [    x:collection1] o.a.s.c.SolrCore [collection1] Solr index directory '/home/jenkins/workspace/Lucene-Solr-trunk-Linux/solr/build/solr-core/test/J0/temp/solr.handler.component.DistributedFacetPivotWhiteBoxTest_714BE5B51DAC7C7F-001/tempDir-001/control/cores/collection1/data/index' doesn't exist. Creating new index...
   [junit4]   2> 2110 INFO  (coreLoadExecutor-6-thread-1) [    x:collection1] o.a.s.c.CachingDirectoryFactory return new directory for /home/jenkins/workspace/Lucene-Solr-trunk-Linux/solr/build/solr-core/test/J0/temp/solr.handler.component.DistributedFacetPivotWhiteBoxTest_714BE5B51DAC7C7F-001/tempDir-001/control/cores/collection1/data/index
   [junit4]   2> 2113 INFO  (coreLoadExecutor-6-thread-1) [    x:collection1] o.a.s.u.RandomMergePolicy RandomMergePolicy wrapping class org.apache.lucene.index.TieredMergePolicy: [TieredMergePolicy: maxMergeAtOnce=17, maxMergeAtOnceExplicit=29, maxMergedSegmentMB=34.9892578125, floorSegmentMB=0.48046875, forceMergeDeletesPctAllowed=22.142323744689346, segmentsPerTier=20.0, maxCFSSegmentSizeMB=8.796093022207999E12, noCFSRatio=1.0
   [junit4]   2> 2157 INFO  (coreLoadExecutor-6-thread-1) [    x:collection1] o.a.s.c.SolrDeletionPolicy SolrDeletionPolicy.onCommit: commits: num=1
   [junit4]   2> 	commit{dir=MockDirectoryWrapper(RAMDirectory@1d4ca57 lockFactory=org.apache.lucene.store.SingleInstanceLockFactory@cdc4af),segFN=segments_1,generation=1}
   [junit4]   2> 2158 INFO  (coreLoadExecutor-6-thread-1) [    x:collection1] o.a.s.c.SolrDeletionPolicy newest commit generation = 1
   [junit4]   2> 2159 INFO  (OldIndexDirectoryCleanupThreadForCore-collection1) [    x:collection1] o.a.s.c.SolrCore Looking for old index directories to cleanup for core collection1 in /home/jenkins/workspace/Lucene-Solr-trunk-Linux/solr/build/solr-core/test/J0/temp/solr.handler.component.DistributedFacetPivotWhiteBoxTest_714BE5B51DAC7C7F-001/tempDir-001/control/cores/collection1/data/
   [junit4]   2> 2159 WARN  (OldIndexDirectoryCleanupThreadForCore-collection1) [    x:collection1] o.a.s.c.DirectoryFactory /home/jenkins/workspace/Lucene-Solr-trunk-Linux/solr/build/solr-core/test/J0/temp/solr.handler.component.DistributedFacetPivotWhiteBoxTest_714BE5B51DAC7C7F-001/tempDir-001/control/cores/collection1/data/ does not point to a valid data directory; skipping clean-up of old index directories.
   [junit4]   2> 2349 INFO  (coreLoadExecutor-6-thread-1) [    x:collection1] o.a.s.u.p.UpdateRequestProcessorChain creating updateRequestProcessorChain "dedupe"
   [junit4]   2> 2361 INFO  (coreLoadExecutor-6-thread-1) [    x:collection1] o.a.s.u.p.UpdateRequestProcessorChain inserting DistributedUpdateProcessorFactory into updateRequestProcessorChain "dedupe"
   [junit4]   2> 2362 INFO  (coreLoadExecutor-6-thread-1) [    x:collection1] o.a.s.u.p.UpdateRequestProcessorChain creating updateRequestProcessorChain "dedupe-allfields"
   [junit4]   2> 2362 INFO  (coreLoadExecutor-6-thread-1) [    x:collection1] o.a.s.u.p.UpdateRequestProcessorChain inserting DistributedUpdateProcessorFactory into updateRequestProcessorChain "dedupe-allfields"
   [junit4]   2> 2362 INFO  (coreLoadExecutor-6-thread-1) [    x:collection1] o.a.s.u.p.UpdateRequestProcessorChain creating updateRequestProcessorChain "stored_sig"
   [junit4]   2> 2362 INFO  (coreLoadExecutor-6-thread-1) [    x:collection1] o.a.s.u.p.UpdateRequestProcessorChain inserting DistributedUpdateProcessorFactory into updateRequestProcessorChain "stored_sig"
   [junit4]   2> 2362 INFO  (coreLoadExecutor-6-thread-1) [    x:collection1] o.a.s.u.p.UpdateRequestProcessorChain creating updateRequestProcessorChain "uniq-fields"
   [junit4]   2> 2365 INFO  (coreLoadExecutor-6-thread-1) [    x:collection1] o.a.s.u.p.UpdateRequestProcessorChain inserting DistributedUpdateProcessorFactory into updateRequestProcessorChain "uniq-fields"
   [junit4]   2> 2366 INFO  (coreLoadExecutor-6-thread-1) [    x:collection1] o.a.s.u.p.UpdateRequestProcessorChain creating updateRequestProcessorChain "distrib-dup-test-chain-explicit"
   [junit4]   2> 2386 INFO  (coreLoadExecutor-6-thread-1) [    x:collection1] o.a.s.u.p.UpdateRequestProcessorChain creating updateRequestProcessorChain "distrib-dup-test-chain-implicit"
   [junit4]   2> 2386 INFO  (coreLoadExecutor-6-thread-1) [    x:collection1] o.a.s.u.p.UpdateRequestProcessorChain inserting DistributedUpdateProcessorFactory into updateRequestProcessorChain "distrib-dup-test-chain-implicit"
   [junit4]   2> 2386 INFO  (coreLoadExecutor-6-thread-1) [    x:collection1] o.a.s.c.SolrCore no updateRequestProcessorChain defined as default, creating implicit default
   [junit4]   2> 2423 INFO  (coreLoadExecutor-6-thread-1) [    x:collection1] o.a.s.h.l.XMLLoader xsltCacheLifetimeSeconds=60
   [junit4]   2> 2426 INFO  (coreLoadExecutor-6-thread-1) [    x:collection1] o.a.s.h.l.XMLLoader xsltCacheLifetimeSeconds=60
   [junit4]   2> 2427 INFO  (coreLoadExecutor-6-thread-1) [    x:collection1] o.a.s.h.l.XMLLoader xsltCacheLifetimeSeconds=60
   [junit4]   2> 2427 INFO  (coreLoadExecutor-6-thread-1) [    x:collection1] o.a.s.h.l.XMLLoader xsltCacheLifetimeSeconds=60
   [junit4]   2> 2629 INFO  (coreLoadExecutor-6-thread-1) [    x:collection1] o.a.s.c.PluginBag requestHandler : 'lazy' created with startup=lazy 
   [junit4]   2> 2637 INFO  (coreLoadExecutor-6-thread-1) [    x:collection1] o.a.s.c.RequestHandlers Registered paths: /admin/mbeans,standard,spellCheckCompRH,lazy,/update/json/docs,/admin/luke,/export,spellCheckWithWordbreak_Direct,tvrh,/get,/admin/properties,/update/json,mltrh,/admin/threads,/search-facet-def,/update/csv,/sql,/search-facet-invariants,/admin/segments,spellCheckCompRH1,/mlt,/admin/system,/replication,dismax,defaults,/config,/stream,/schema,/admin/plugins,/admin/logging,spellCheckWithWordbreak,mock,/admin/ping,/update,/admin/file,/terms,spellCheckCompRH_Direct,/debug/dump
   [junit4]   2> 2638 WARN  (coreLoadExecutor-6-thread-1) [    x:collection1] o.a.s.c.SolrCore solrconfig.xml uses deprecated <admin/gettableFiles>, Please update your config to use the ShowFileRequestHandler.
   [junit4]   2> 2639 INFO  (coreLoadExecutor-6-thread-1) [    x:collection1] o.a.s.c.SolrCore Using default statsCache cache: org.apache.solr.search.stats.LocalStatsCache
   [junit4]   2> 2652 INFO  (coreLoadExecutor-6-thread-1) [    x:collection1] o.a.s.u.UpdateHandler Using UpdateLog implementation: org.apache.solr.update.UpdateLog
   [junit4]   2> 2652 INFO  (coreLoadExecutor-6-thread-1) [    x:collection1] o.a.s.u.UpdateLog Initializing UpdateLog: dataDir= defaultSyncLevel=FLUSH numRecordsToKeep=100 maxNumLogsToKeep=10 numVersionBuckets=65536
   [junit4]   2> 2661 INFO  (coreLoadExecutor-6-thread-1) [    x:collection1] o.a.s.u.CommitTracker Hard AutoCommit: disabled
   [junit4]   2> 2661 INFO  (coreLoadExecutor-6-thread-1) [    x:collection1] o.a.s.u.CommitTracker Soft AutoCommit: disabled
   [junit4]   2> 2661 INFO  (coreLoadExecutor-6-thread-1) [    x:collection1] o.a.s.u.RandomMergePolicy RandomMergePolicy wrapping class org.apache.lucene.index.LogByteSizeMergePolicy: [LogByteSizeMergePolicy: minMergeSize=1677721, mergeFactor=29, maxMergeSize=2147483648, maxMergeSizeForForcedMerge=9223372036854775807, calibrateSizeByDeletes=true, maxMergeDocs=2147483647, maxCFSSegmentSizeMB=8.796093022207999E12, noCFSRatio=0.4434087635709266]
   [junit4]   2> 2665 INFO  (coreLoadExecutor-6-thread-1) [    x:collection1] o.a.s.c.SolrDeletionPolicy SolrDeletionPolicy.onInit: commits: num=1
   [junit4]   2> 	commit{dir=MockDirectoryWrapper(RAMDirectory@1d4ca57 lockFactory=org.apache.lucene.store.SingleInstanceLockFactory@cdc4af),segFN=segments_1,generation=1}
   [junit4]   2> 2665 INFO  (coreLoadExecutor-6-thread-1) [    x:collection1] o.a.s.c.SolrDeletionPolicy newest commit generation = 1
   [junit4]   2> 2683 INFO  (coreLoadExecutor-6-thread-1) [    x:collection1] o.a.s.s.SolrIndexSearcher Opening [Searcher@18cef1a[collection1] main]
   [junit4]   2> 2690 INFO  (coreLoadExecutor-6-thread-1) [    x:collection1] o.a.s.r.RestManager Initializing RestManager with initArgs: {storageIO=org.apache.solr.rest.ManagedResourceStorage$InMemoryStorageIO}
   [junit4]   2> 2708 INFO  (coreLoadExecutor-6-thread-1) [    x:collection1] o.a.s.r.ManagedResourceStorage Reading _rest_managed.json using InMemoryStorage
   [junit4]   2> 2708 INFO  (coreLoadExecutor-6-thread-1) [    x:collection1] o.a.s.r.RestManager Initializing 0 registered ManagedResources
   [junit4]   2> 2721 INFO  (coreLoadExecutor-6-thread-1) [    x:collection1] o.a.s.h.c.SpellCheckComponent Initializing spell checkers
   [junit4]   2> 2801 INFO  (coreLoadExecutor-6-thread-1) [    x:collection1] o.a.s.s.DirectSolrSpellChecker init: {name=direct,classname=DirectSolrSpellChecker,field=lowerfilt,minQueryLength=3}
   [junit4]   2> 3099 INFO  (coreLoadExecutor-6-thread-1) [    x:collection1] o.a.s.h.ReplicationHandler Commits will be reserved for  10000
   [junit4]   2> 3124 INFO  (searcherExecutor-7-thread-1-processing-x:collection1) [    x:collection1] o.a.s.h.c.SpellCheckComponent Loading spell index for spellchecker: default
   [junit4]   2> 3125 INFO  (searcherExecutor-7-thread-1-processing-x:collection1) [    x:collection1] o.a.s.h.c.SpellCheckComponent Loading spell index for spellchecker: direct
   [junit4]   2> 3125 INFO  (searcherExecutor-7-thread-1-processing-x:collection1) [    x:collection1] o.a.s.h.c.SpellCheckComponent Loading spell index for spellchecker: wordbreak
   [junit4]   2> 3125 INFO  (searcherExecutor-7-thread-1-processing-x:collection1) [    x:collection1] o.a.s.h.c.SpellCheckComponent Loading spell index for spellchecker: multipleFields
   [junit4]   2> 3126 INFO  (coreLoadExecutor-6-thread-1) [    x:collection1] o.a.s.u.UpdateLog Looking up max value of version field to seed version buckets
   [junit4]   2> 3126 INFO  (searcherExecutor-7-thread-1-processing-x:collection1) [    x:collection1] o.a.s.h.c.SpellCheckComponent Loading spell index for spellchecker: jarowinkler
   [junit4]   2> 3127 INFO  (searcherExecutor-7-thread-1-processing-x:collection1) [    x:collection1] o.a.s.h.c.SpellCheckComponent Loading spell index for spellchecker: external
   [junit4]   2> 3127 INFO  (coreLoadExecutor-6-thread-1) [    x:collection1] o.a.s.u.VersionInfo Refreshing highest value of _version_ for 65536 version buckets from index
   [junit4]   2> 3127 INFO  (coreLoadExecutor-6-thread-1) [    x:collection1] o.a.s.u.VersionInfo No terms found for _version_, cannot seed version bucket highest value from index
   [junit4]   2> 3128 INFO  (coreLoadExecutor-6-thread-1) [    x:collection1] o.a.s.u.UpdateLog Could not find max version in index or recent updates, using new clock 1527775189953150976
   [junit4]   2> 3128 INFO  (searcherExecutor-7-thread-1-processing-x:collection1) [    x:collection1] o.a.s.h.c.SpellCheckComponent Loading spell index for spellchecker: freq
   [junit4]   2> 3129 INFO  (searcherExecutor-7-thread-1-processing-x:collection1) [    x:collection1] o.a.s.h.c.SpellCheckComponent Loading spell index for spellchecker: fqcn
   [junit4]   2> 3130 INFO  (searcherExecutor-7-thread-1-processing-x:collection1) [    x:collection1] o.a.s.h.c.SpellCheckComponent Loading spell index for spellchecker: perDict
   [junit4]   2> 3130 INFO  (searcherExecutor-7-thread-1-processing-x:collection1) [    x:collection1] o.a.s.c.SolrCore [collection1] Registered new searcher Searcher@18cef1a[collection1] main{ExitableDirectoryReader(UninvertingDirectoryReader())}
   [junit4]   2> 3132 INFO  (coreLoadExecutor-6-thread-1) [    x:collection1] o.a.s.u.UpdateLog Took 4.0ms to seed version buckets with highest version 1527775189953150976
   [junit4]   2> 3132 INFO  (coreLoadExecutor-6-thread-1) [    x:collection1] o.a.s.c.CoreContainer registering core: collection1
   [junit4]   2> 3764 INFO  (TEST-DistributedFacetPivotWhiteBoxTest.test-seed#[714BE5B51DAC7C7F]) [    ] o.a.s.SolrTestCaseJ4 Writing 

[...truncated too long message...]

t org.apache.zookeeper.ClientCnxn$SendThread.startConnect(ClientCnxn.java:940)
   [junit4]   2> 	at org.apache.zookeeper.ClientCnxn$SendThread.run(ClientCnxn.java:1003)
   [junit4]   2> 8052062 INFO  (TEST-TestCloudPivotFacet.test-seed#[714BE5B51DAC7C7F]) [    ] o.a.s.c.ZkController Could not publish node as down: java.lang.InterruptedException: sleep interrupted
   [junit4]   2> 8052062 WARN  (TEST-TestCloudPivotFacet.test-seed#[714BE5B51DAC7C7F]-SendThread(127.0.0.1:38650)) [n:127.0.0.1:59159_    ] o.a.z.ClientCnxn Session 0x1533c03a7b10011 for server null, unexpected error, closing socket connection and attempting reconnect
   [junit4]   2> java.net.ConnectException: Connection refused
   [junit4]   2> 	at sun.nio.ch.SocketChannelImpl.checkConnect(Native Method)
   [junit4]   2> 	at sun.nio.ch.SocketChannelImpl.finishConnect(SocketChannelImpl.java:717)
   [junit4]   2> 	at org.apache.zookeeper.ClientCnxnSocketNIO.doTransport(ClientCnxnSocketNIO.java:361)
   [junit4]   2> 	at org.apache.zookeeper.ClientCnxn$SendThread.run(ClientCnxn.java:1081)
   [junit4]   2> 8052062 INFO  (coreCloseExecutor-694-thread-1) [n:127.0.0.1:59159_ c:collection1 s:shard1 r:core_node4 x:collection1] o.a.s.c.SolrCore [collection1]  CLOSING SolrCore org.apache.solr.core.SolrCore@1c773f2
   [junit4]   2> 8052062 INFO  (coreCloseExecutor-694-thread-1) [n:127.0.0.1:59159_ c:collection1 s:shard1 r:core_node4 x:collection1] o.a.s.c.ZkController removed listener for config directory [/configs/conf1]
   [junit4]   2> 8052062 INFO  (coreCloseExecutor-694-thread-1) [n:127.0.0.1:59159_ c:collection1 s:shard1 r:core_node4 x:collection1] o.a.s.c.ZkController No more listeners for config directory [/configs/conf1]
   [junit4]   2> 8052063 INFO  (coreCloseExecutor-694-thread-1) [n:127.0.0.1:59159_ c:collection1 s:shard1 r:core_node4 x:collection1] o.a.s.u.DirectUpdateHandler2 closing DirectUpdateHandler2{commits=0,autocommits=0,soft autocommits=0,optimizes=0,rollbacks=0,expungeDeletes=0,docsPending=0,adds=0,deletesById=0,deletesByQuery=0,errors=0,cumulative_adds=0,cumulative_deletesById=0,cumulative_deletesByQuery=0,cumulative_errors=0,transaction_logs_total_size=0,transaction_logs_total_number=0}
   [junit4]   2> 8052063 INFO  (coreCloseExecutor-694-thread-1) [n:127.0.0.1:59159_ c:collection1 s:shard1 r:core_node4 x:collection1] o.a.s.u.SolrCoreState Closing SolrCoreState
   [junit4]   2> 8052063 WARN  (coreCloseExecutor-694-thread-1) [n:127.0.0.1:59159_ c:collection1 s:shard1 r:core_node4 x:collection1] o.a.s.c.RecoveryStrategy Stopping recovery for core=[collection1] coreNodeName=[core_node4]
   [junit4]   2> 8052063 INFO  (coreCloseExecutor-694-thread-1) [n:127.0.0.1:59159_ c:collection1 s:shard1 r:core_node4 x:collection1] o.a.s.u.DefaultSolrCoreState SolrCoreState ref count has reached 0 - closing IndexWriter
   [junit4]   2> 8052063 INFO  (coreCloseExecutor-694-thread-1) [n:127.0.0.1:59159_ c:collection1 s:shard1 r:core_node4 x:collection1] o.a.s.u.DefaultSolrCoreState closing IndexWriter with IndexWriterCloser
   [junit4]   2> 8052063 INFO  (coreCloseExecutor-694-thread-1) [n:127.0.0.1:59159_ c:collection1 s:shard1 r:core_node4 x:collection1] o.a.s.c.SolrCore [collection1] Closing main searcher on request.
   [junit4]   2> 8052084 INFO  (coreCloseExecutor-694-thread-1) [n:127.0.0.1:59159_ c:collection1 s:shard1 r:core_node4 x:collection1] o.a.s.c.CachingDirectoryFactory Closing MockDirectoryFactory - 2 directories currently being tracked
   [junit4]   2> 8052084 INFO  (coreCloseExecutor-694-thread-1) [n:127.0.0.1:59159_ c:collection1 s:shard1 r:core_node4 x:collection1] o.a.s.c.CachingDirectoryFactory looking to close /home/jenkins/workspace/Lucene-Solr-trunk-Linux/solr/build/solr-core/test/J0/../../../../../../../../../home/jenkins/workspace/Lucene-Solr-trunk-Linux/solr/build/solr-core/test/J0/temp/solr.cloud.TestCloudPivotFacet_714BE5B51DAC7C7F-001/shard-4-001/cores/collection1/data/index [CachedDir<<refCount=0;path=/home/jenkins/workspace/Lucene-Solr-trunk-Linux/solr/build/solr-core/test/J0/../../../../../../../../../home/jenkins/workspace/Lucene-Solr-trunk-Linux/solr/build/solr-core/test/J0/temp/solr.cloud.TestCloudPivotFacet_714BE5B51DAC7C7F-001/shard-4-001/cores/collection1/data/index;done=false>>]
   [junit4]   2> 8052084 INFO  (coreCloseExecutor-694-thread-1) [n:127.0.0.1:59159_ c:collection1 s:shard1 r:core_node4 x:collection1] o.a.s.c.CachingDirectoryFactory Closing directory: /home/jenkins/workspace/Lucene-Solr-trunk-Linux/solr/build/solr-core/test/J0/../../../../../../../../../home/jenkins/workspace/Lucene-Solr-trunk-Linux/solr/build/solr-core/test/J0/temp/solr.cloud.TestCloudPivotFacet_714BE5B51DAC7C7F-001/shard-4-001/cores/collection1/data/index
   [junit4]   2> 8052084 INFO  (coreCloseExecutor-694-thread-1) [n:127.0.0.1:59159_ c:collection1 s:shard1 r:core_node4 x:collection1] o.a.s.c.CachingDirectoryFactory looking to close /home/jenkins/workspace/Lucene-Solr-trunk-Linux/solr/build/solr-core/test/J0/../../../../../../../../../home/jenkins/workspace/Lucene-Solr-trunk-Linux/solr/build/solr-core/test/J0/temp/solr.cloud.TestCloudPivotFacet_714BE5B51DAC7C7F-001/shard-4-001/cores/collection1/data [CachedDir<<refCount=0;path=/home/jenkins/workspace/Lucene-Solr-trunk-Linux/solr/build/solr-core/test/J0/../../../../../../../../../home/jenkins/workspace/Lucene-Solr-trunk-Linux/solr/build/solr-core/test/J0/temp/solr.cloud.TestCloudPivotFacet_714BE5B51DAC7C7F-001/shard-4-001/cores/collection1/data;done=false>>]
   [junit4]   2> 8052085 INFO  (coreCloseExecutor-694-thread-1) [n:127.0.0.1:59159_ c:collection1 s:shard1 r:core_node4 x:collection1] o.a.s.c.CachingDirectoryFactory Closing directory: /home/jenkins/workspace/Lucene-Solr-trunk-Linux/solr/build/solr-core/test/J0/../../../../../../../../../home/jenkins/workspace/Lucene-Solr-trunk-Linux/solr/build/solr-core/test/J0/temp/solr.cloud.TestCloudPivotFacet_714BE5B51DAC7C7F-001/shard-4-001/cores/collection1/data
   [junit4]   2> 8052183 INFO  (TEST-TestCloudPivotFacet.test-seed#[714BE5B51DAC7C7F]) [    ] o.e.j.s.ServerConnector Stopped ServerConnector@145b6ab{HTTP/1.1,[http/1.1]}{127.0.0.1:0}
   [junit4]   2> 8052183 INFO  (TEST-TestCloudPivotFacet.test-seed#[714BE5B51DAC7C7F]) [    ] o.e.j.s.h.ContextHandler Stopped o.e.j.s.ServletContextHandler@1c61559{/,null,UNAVAILABLE}
   [junit4]   2> 8052184 INFO  (TEST-TestCloudPivotFacet.test-seed#[714BE5B51DAC7C7F]) [    ] o.a.s.c.ZkTestServer connecting to 127.0.0.1:38650 38650
   [junit4]   2> 8052250 INFO  (SUITE-TestCloudPivotFacet-seed#[714BE5B51DAC7C7F]-worker) [    ] o.a.s.SolrTestCaseJ4 ###deleteCore
   [junit4]   2> NOTE: leaving temporary files on disk at: /home/jenkins/workspace/Lucene-Solr-trunk-Linux/solr/build/solr-core/test/J0/temp/solr.cloud.TestCloudPivotFacet_714BE5B51DAC7C7F-001
   [junit4]   2> Mar 03, 2016 12:26:49 PM com.carrotsearch.randomizedtesting.ThreadLeakControl tryToInterruptAll
   [junit4]   2> SEVERE: There are still zombie threads that couldn't be terminated:
   [junit4]   2>    1) Thread[id=2080, name=TEST-TestCloudPivotFacet.test-seed#[714BE5B51DAC7C7F]-SendThread(127.0.0.1:38650), state=TIMED_WAITING, group=TGRP-TestCloudPivotFacet]
   [junit4]   2>         at java.lang.Thread.sleep(Native Method)
   [junit4]   2>         at org.apache.zookeeper.ClientCnxn$SendThread.run(ClientCnxn.java:994)
   [junit4]   2> NOTE: test params are: codec=Asserting(Lucene60): {}, docValues:{}, maxPointsInLeafNode=985, maxMBSortInHeap=4.619055121805081, sim=ClassicSimilarity, locale=sr-Latn-BA, timezone=America/Argentina/Salta
   [junit4]   2> NOTE: Linux 3.19.0-51-generic i386/Oracle Corporation 1.8.0_72 (32-bit)/cpus=12,threads=2,free=9665720,total=66584576
   [junit4]   2> NOTE: All tests run in this JVM: [DistributedFacetPivotWhiteBoxTest, CurrencyFieldOpenExchangeTest, CloudExitableDirectoryReaderTest, TestAuthenticationFramework, TestScoreJoinQPScore, UUIDUpdateProcessorFallbackTest, TestCustomDocTransformer, ShardSplitTest, TriLevelCompositeIdRoutingTest, RequestLoggingTest, SystemInfoHandlerTest, QueryEqualityTest, ReturnFieldsTest, TestFileDictionaryLookup, TestCloudPivotFacet]
   [junit4]   2> NOTE: reproduce with: ant test  -Dtestcase=TestCloudPivotFacet -Dtests.seed=714BE5B51DAC7C7F -Dtests.multiplier=3 -Dtests.slow=true -Dtests.locale=sr-Latn-BA -Dtests.timezone=America/Argentina/Salta -Dtests.asserts=true -Dtests.file.encoding=UTF-8
   [junit4] ERROR   0.00s J0 | TestCloudPivotFacet (suite) <<<
   [junit4]    > Throwable #1: java.lang.Exception: Suite timeout exceeded (>= 7200000 msec).
   [junit4]    > 	at __randomizedtesting.SeedInfo.seed([714BE5B51DAC7C7F]:0)
   [junit4] Completed [499/581 (7!)] on J0 in 7223.54s, 1 test, 2 errors <<< FAILURES!

[...truncated 263 lines...]
BUILD FAILED
/home/jenkins/workspace/Lucene-Solr-trunk-Linux/build.xml:740: The following error occurred while executing this line:
/home/jenkins/workspace/Lucene-Solr-trunk-Linux/build.xml:684: The following error occurred while executing this line:
/home/jenkins/workspace/Lucene-Solr-trunk-Linux/build.xml:59: The following error occurred while executing this line:
/home/jenkins/workspace/Lucene-Solr-trunk-Linux/solr/build.xml:233: The following error occurred while executing this line:
/home/jenkins/workspace/Lucene-Solr-trunk-Linux/solr/common-build.xml:524: The following error occurred while executing this line:
/home/jenkins/workspace/Lucene-Solr-trunk-Linux/lucene/common-build.xml:1457: The following error occurred while executing this line:
/home/jenkins/workspace/Lucene-Solr-trunk-Linux/lucene/common-build.xml:1014: There were test failures: 581 suites (8 ignored), 2345 tests, 1 suite-level error, 8 errors, 3 failures, 473 ignored (69 assumptions) [seed: 714BE5B51DAC7C7F]

Total time: 169 minutes 48 seconds
Build step 'Invoke Ant' marked build as failure
Archiving artifacts
[WARNINGS] Skipping publisher since build result is FAILURE
Recording test results
Email was triggered for: Failure - Any
Sending email for trigger: Failure - Any



Mime
View raw message