lucene-dev mailing list archives

Site index · List index
Message view « Date » · « Thread »
Top « Date » · « Thread »
From Policeman Jenkins Server <jenk...@thetaphi.de>
Subject [JENKINS-EA] Lucene-Solr-master-Linux (32bit/jdk-9-jigsaw-ea+110) - Build # 16321 - Failure!
Date Thu, 24 Mar 2016 21:32:04 GMT
Build: http://jenkins.thetaphi.de/job/Lucene-Solr-master-Linux/16321/
Java: 32bit/jdk-9-jigsaw-ea+110 -client -XX:+UseParallelGC -XX:-CompactStrings

3 tests failed.
FAILED:  junit.framework.TestSuite.org.apache.solr.core.TestLazyCores

Error Message:
ObjectTracker found 4 object(s) that were not released!!! [MockDirectoryWrapper, MockDirectoryWrapper, SolrCore, MDCAwareThreadPoolExecutor]

Stack Trace:
java.lang.AssertionError: ObjectTracker found 4 object(s) that were not released!!! [MockDirectoryWrapper, MockDirectoryWrapper, SolrCore, MDCAwareThreadPoolExecutor]
	at __randomizedtesting.SeedInfo.seed([86700937836D4776]:0)
	at org.junit.Assert.fail(Assert.java:93)
	at org.junit.Assert.assertTrue(Assert.java:43)
	at org.junit.Assert.assertNull(Assert.java:551)
	at org.apache.solr.SolrTestCaseJ4.afterClass(SolrTestCaseJ4.java:238)
	at sun.reflect.GeneratedMethodAccessor16.invoke(Unknown Source)
	at sun.reflect.DelegatingMethodAccessorImpl.invoke(java.base@9-ea/DelegatingMethodAccessorImpl.java:43)
	at java.lang.reflect.Method.invoke(java.base@9-ea/Method.java:531)
	at com.carrotsearch.randomizedtesting.RandomizedRunner.invoke(RandomizedRunner.java:1764)
	at com.carrotsearch.randomizedtesting.RandomizedRunner$7.evaluate(RandomizedRunner.java:834)
	at com.carrotsearch.randomizedtesting.rules.StatementAdapter.evaluate(StatementAdapter.java:36)
	at com.carrotsearch.randomizedtesting.rules.SystemPropertiesRestoreRule$1.evaluate(SystemPropertiesRestoreRule.java:57)
	at org.apache.lucene.util.AbstractBeforeAfterRule$1.evaluate(AbstractBeforeAfterRule.java:45)
	at com.carrotsearch.randomizedtesting.rules.StatementAdapter.evaluate(StatementAdapter.java:36)
	at org.apache.lucene.util.TestRuleStoreClassName$1.evaluate(TestRuleStoreClassName.java:41)
	at com.carrotsearch.randomizedtesting.rules.NoShadowingOrOverridesOnMethodsRule$1.evaluate(NoShadowingOrOverridesOnMethodsRule.java:40)
	at com.carrotsearch.randomizedtesting.rules.NoShadowingOrOverridesOnMethodsRule$1.evaluate(NoShadowingOrOverridesOnMethodsRule.java:40)
	at com.carrotsearch.randomizedtesting.rules.StatementAdapter.evaluate(StatementAdapter.java:36)
	at com.carrotsearch.randomizedtesting.rules.StatementAdapter.evaluate(StatementAdapter.java:36)
	at com.carrotsearch.randomizedtesting.rules.StatementAdapter.evaluate(StatementAdapter.java:36)
	at org.apache.lucene.util.TestRuleAssertionsRequired$1.evaluate(TestRuleAssertionsRequired.java:53)
	at org.apache.lucene.util.TestRuleMarkFailure$1.evaluate(TestRuleMarkFailure.java:47)
	at org.apache.lucene.util.TestRuleIgnoreAfterMaxFailures$1.evaluate(TestRuleIgnoreAfterMaxFailures.java:64)
	at org.apache.lucene.util.TestRuleIgnoreTestSuites$1.evaluate(TestRuleIgnoreTestSuites.java:54)
	at com.carrotsearch.randomizedtesting.rules.StatementAdapter.evaluate(StatementAdapter.java:36)
	at com.carrotsearch.randomizedtesting.ThreadLeakControl$StatementRunner.run(ThreadLeakControl.java:367)
	at java.lang.Thread.run(java.base@9-ea/Thread.java:804)


FAILED:  junit.framework.TestSuite.org.apache.solr.core.TestLazyCores

Error Message:
1 thread leaked from SUITE scope at org.apache.solr.core.TestLazyCores:     1) Thread[id=7229, name=searcherExecutor-3512-thread-1, state=WAITING, group=TGRP-TestLazyCores]         at jdk.internal.misc.Unsafe.park(java.base@9-ea/Native Method)         at java.util.concurrent.locks.LockSupport.park(java.base@9-ea/LockSupport.java:190)         at java.util.concurrent.locks.AbstractQueuedSynchronizer$ConditionObject.await(java.base@9-ea/AbstractQueuedSynchronizer.java:2064)         at java.util.concurrent.LinkedBlockingQueue.take(java.base@9-ea/LinkedBlockingQueue.java:442)         at java.util.concurrent.ThreadPoolExecutor.getTask(java.base@9-ea/ThreadPoolExecutor.java:1083)         at java.util.concurrent.ThreadPoolExecutor.runWorker(java.base@9-ea/ThreadPoolExecutor.java:1143)         at java.util.concurrent.ThreadPoolExecutor$Worker.run(java.base@9-ea/ThreadPoolExecutor.java:632)         at java.lang.Thread.run(java.base@9-ea/Thread.java:804)

Stack Trace:
com.carrotsearch.randomizedtesting.ThreadLeakError: 1 thread leaked from SUITE scope at org.apache.solr.core.TestLazyCores: 
   1) Thread[id=7229, name=searcherExecutor-3512-thread-1, state=WAITING, group=TGRP-TestLazyCores]
        at jdk.internal.misc.Unsafe.park(java.base@9-ea/Native Method)
        at java.util.concurrent.locks.LockSupport.park(java.base@9-ea/LockSupport.java:190)
        at java.util.concurrent.locks.AbstractQueuedSynchronizer$ConditionObject.await(java.base@9-ea/AbstractQueuedSynchronizer.java:2064)
        at java.util.concurrent.LinkedBlockingQueue.take(java.base@9-ea/LinkedBlockingQueue.java:442)
        at java.util.concurrent.ThreadPoolExecutor.getTask(java.base@9-ea/ThreadPoolExecutor.java:1083)
        at java.util.concurrent.ThreadPoolExecutor.runWorker(java.base@9-ea/ThreadPoolExecutor.java:1143)
        at java.util.concurrent.ThreadPoolExecutor$Worker.run(java.base@9-ea/ThreadPoolExecutor.java:632)
        at java.lang.Thread.run(java.base@9-ea/Thread.java:804)
	at __randomizedtesting.SeedInfo.seed([86700937836D4776]:0)


FAILED:  junit.framework.TestSuite.org.apache.solr.core.TestLazyCores

Error Message:
There are still zombie threads that couldn't be terminated:    1) Thread[id=7229, name=searcherExecutor-3512-thread-1, state=WAITING, group=TGRP-TestLazyCores]         at jdk.internal.misc.Unsafe.park(java.base@9-ea/Native Method)         at java.util.concurrent.locks.LockSupport.park(java.base@9-ea/LockSupport.java:190)         at java.util.concurrent.locks.AbstractQueuedSynchronizer$ConditionObject.await(java.base@9-ea/AbstractQueuedSynchronizer.java:2064)         at java.util.concurrent.LinkedBlockingQueue.take(java.base@9-ea/LinkedBlockingQueue.java:442)         at java.util.concurrent.ThreadPoolExecutor.getTask(java.base@9-ea/ThreadPoolExecutor.java:1083)         at java.util.concurrent.ThreadPoolExecutor.runWorker(java.base@9-ea/ThreadPoolExecutor.java:1143)         at java.util.concurrent.ThreadPoolExecutor$Worker.run(java.base@9-ea/ThreadPoolExecutor.java:632)         at java.lang.Thread.run(java.base@9-ea/Thread.java:804)

Stack Trace:
com.carrotsearch.randomizedtesting.ThreadLeakError: There are still zombie threads that couldn't be terminated:
   1) Thread[id=7229, name=searcherExecutor-3512-thread-1, state=WAITING, group=TGRP-TestLazyCores]
        at jdk.internal.misc.Unsafe.park(java.base@9-ea/Native Method)
        at java.util.concurrent.locks.LockSupport.park(java.base@9-ea/LockSupport.java:190)
        at java.util.concurrent.locks.AbstractQueuedSynchronizer$ConditionObject.await(java.base@9-ea/AbstractQueuedSynchronizer.java:2064)
        at java.util.concurrent.LinkedBlockingQueue.take(java.base@9-ea/LinkedBlockingQueue.java:442)
        at java.util.concurrent.ThreadPoolExecutor.getTask(java.base@9-ea/ThreadPoolExecutor.java:1083)
        at java.util.concurrent.ThreadPoolExecutor.runWorker(java.base@9-ea/ThreadPoolExecutor.java:1143)
        at java.util.concurrent.ThreadPoolExecutor$Worker.run(java.base@9-ea/ThreadPoolExecutor.java:632)
        at java.lang.Thread.run(java.base@9-ea/Thread.java:804)
	at __randomizedtesting.SeedInfo.seed([86700937836D4776]:0)




Build Log:
[...truncated 11915 lines...]
   [junit4] Suite: org.apache.solr.core.TestLazyCores
   [junit4]   2> Creating dataDir: /home/jenkins/workspace/Lucene-Solr-master-Linux/solr/build/solr-core/test/J1/temp/solr.core.TestLazyCores_86700937836D4776-001/init-core-data-001
   [junit4]   2> 1167251 INFO  (SUITE-TestLazyCores-seed#[86700937836D4776]-worker) [    ] o.a.s.SolrTestCaseJ4 Randomized ssl (false) and clientAuth (false)
   [junit4]   2> 1167253 INFO  (TEST-TestLazyCores.testCreateTransientFromAdmin-seed#[86700937836D4776]) [    ] o.a.s.SolrTestCaseJ4 ###Starting testCreateTransientFromAdmin
   [junit4]   2> 1167266 INFO  (TEST-TestLazyCores.testCreateTransientFromAdmin-seed#[86700937836D4776]) [    ] o.a.s.c.SolrResourceLoader new SolrResourceLoader for directory: '/home/jenkins/workspace/Lucene-Solr-master-Linux/solr/build/solr-core/test/J1/temp/solr.core.TestLazyCores_86700937836D4776-001/tempDir-001'
   [junit4]   2> 1167266 INFO  (TEST-TestLazyCores.testCreateTransientFromAdmin-seed#[86700937836D4776]) [    ] o.a.s.c.SolrResourceLoader JNDI not configured for solr (NoInitialContextEx)
   [junit4]   2> 1167266 INFO  (TEST-TestLazyCores.testCreateTransientFromAdmin-seed#[86700937836D4776]) [    ] o.a.s.c.SolrResourceLoader solr home defaulted to 'solr/' (could not find system property or JNDI)
   [junit4]   2> 1167266 INFO  (TEST-TestLazyCores.testCreateTransientFromAdmin-seed#[86700937836D4776]) [    ] o.a.s.c.CoreContainer New CoreContainer 4076776
   [junit4]   2> 1167266 INFO  (TEST-TestLazyCores.testCreateTransientFromAdmin-seed#[86700937836D4776]) [    ] o.a.s.c.CoreContainer Loading cores into CoreContainer [instanceDir=/home/jenkins/workspace/Lucene-Solr-master-Linux/solr/build/solr-core/test/J1/temp/solr.core.TestLazyCores_86700937836D4776-001/tempDir-001]
   [junit4]   2> 1167266 WARN  (TEST-TestLazyCores.testCreateTransientFromAdmin-seed#[86700937836D4776]) [    ] o.a.s.c.CoreContainer Couldn't add files from /home/jenkins/workspace/Lucene-Solr-master-Linux/solr/build/solr-core/test/J1/temp/solr.core.TestLazyCores_86700937836D4776-001/tempDir-001/lib to classpath: /home/jenkins/workspace/Lucene-Solr-master-Linux/solr/build/solr-core/test/J1/temp/solr.core.TestLazyCores_86700937836D4776-001/tempDir-001/lib
   [junit4]   2> 1167267 INFO  (TEST-TestLazyCores.testCreateTransientFromAdmin-seed#[86700937836D4776]) [    ] o.a.s.h.c.HttpShardHandlerFactory created with socketTimeout : 600000,connTimeout : 60000,maxConnectionsPerHost : 20,maxConnections : 10000,corePoolSize : 0,maximumPoolSize : 2147483647,maxThreadIdleTime : 5,sizeOfQueue : -1,fairnessPolicy : false,useRetries : false,
   [junit4]   2> 1167269 INFO  (TEST-TestLazyCores.testCreateTransientFromAdmin-seed#[86700937836D4776]) [    ] o.a.s.u.UpdateShardHandler Creating UpdateShardHandler HTTP client with params: socketTimeout=600000&connTimeout=60000&retry=true
   [junit4]   2> 1167269 INFO  (TEST-TestLazyCores.testCreateTransientFromAdmin-seed#[86700937836D4776]) [    ] o.a.s.c.SolrCores Allocating transient cache for 4 transient cores
   [junit4]   2> 1167270 INFO  (TEST-TestLazyCores.testCreateTransientFromAdmin-seed#[86700937836D4776]) [    ] o.a.s.l.LogWatcher SLF4J impl is org.slf4j.impl.Log4jLoggerFactory
   [junit4]   2> 1167270 INFO  (TEST-TestLazyCores.testCreateTransientFromAdmin-seed#[86700937836D4776]) [    ] o.a.s.l.LogWatcher Registering Log Listener [Log4j (org.slf4j.impl.Log4jLoggerFactory)]
   [junit4]   2> 1167270 INFO  (TEST-TestLazyCores.testCreateTransientFromAdmin-seed#[86700937836D4776]) [    ] o.a.s.c.CoreContainer Security conf doesn't exist. Skipping setup for authorization module.
   [junit4]   2> 1167270 INFO  (TEST-TestLazyCores.testCreateTransientFromAdmin-seed#[86700937836D4776]) [    ] o.a.s.c.CoreContainer No authentication plugin used.
   [junit4]   2> 1167271 INFO  (TEST-TestLazyCores.testCreateTransientFromAdmin-seed#[86700937836D4776]) [    ] o.a.s.c.CoreDescriptor Created CoreDescriptor: {name=collection1, config=solrconfig.xml, loadOnStartup=true, schema=schema.xml, configSetProperties=configsetprops.json, transient=false, dataDir=data/}
   [junit4]   2> 1167271 INFO  (TEST-TestLazyCores.testCreateTransientFromAdmin-seed#[86700937836D4776]) [    ] o.a.s.c.CoreDescriptor Created CoreDescriptor: {name=collection2, config=solrconfig.xml, loadOnStartup=true, schema=schema.xml, configSetProperties=configsetprops.json, transient=true, dataDir=data/}
   [junit4]   2> 1167271 INFO  (TEST-TestLazyCores.testCreateTransientFromAdmin-seed#[86700937836D4776]) [    ] o.a.s.c.CoreDescriptor Created CoreDescriptor: {name=collection3, config=solrconfig.xml, loadOnStartup=false, schema=schema.xml, configSetProperties=configsetprops.json, transient=on, dataDir=data/}
   [junit4]   2> 1167271 INFO  (TEST-TestLazyCores.testCreateTransientFromAdmin-seed#[86700937836D4776]) [    ] o.a.s.c.CoreDescriptor Created CoreDescriptor: {name=collection4, config=solrconfig.xml, loadOnStartup=false, schema=schema.xml, configSetProperties=configsetprops.json, transient=false, dataDir=data/}
   [junit4]   2> 1167271 INFO  (TEST-TestLazyCores.testCreateTransientFromAdmin-seed#[86700937836D4776]) [    ] o.a.s.c.CoreDescriptor Created CoreDescriptor: {name=collection5, config=solrconfig.xml, loadOnStartup=true, schema=schema.xml, configSetProperties=configsetprops.json, transient=false, dataDir=data/}
   [junit4]   2> 1167272 INFO  (TEST-TestLazyCores.testCreateTransientFromAdmin-seed#[86700937836D4776]) [    ] o.a.s.c.CoreDescriptor Created CoreDescriptor: {name=collection6, config=solrconfig.xml, loadOnStartup=false, schema=schema.xml, configSetProperties=configsetprops.json, transient=true, dataDir=data/}
   [junit4]   2> 1167272 INFO  (TEST-TestLazyCores.testCreateTransientFromAdmin-seed#[86700937836D4776]) [    ] o.a.s.c.CoreDescriptor Created CoreDescriptor: {name=collection7, config=solrconfig.xml, loadOnStartup=false, schema=schema.xml, configSetProperties=configsetprops.json, transient=true, dataDir=data/}
   [junit4]   2> 1167272 INFO  (TEST-TestLazyCores.testCreateTransientFromAdmin-seed#[86700937836D4776]) [    ] o.a.s.c.CoreDescriptor Created CoreDescriptor: {name=collection8, config=solrconfig.xml, loadOnStartup=false, schema=schema.xml, configSetProperties=configsetprops.json, transient=true, dataDir=data/}
   [junit4]   2> 1167272 INFO  (TEST-TestLazyCores.testCreateTransientFromAdmin-seed#[86700937836D4776]) [    ] o.a.s.c.CoreDescriptor Created CoreDescriptor: {name=collection9, config=solrconfig.xml, loadOnStartup=false, schema=schema.xml, configSetProperties=configsetprops.json, transient=true, dataDir=data/}
   [junit4]   2> 1167272 INFO  (coreLoadExecutor-3392-thread-1) [    ] o.a.s.c.SolrResourceLoader new SolrResourceLoader for directory: '/home/jenkins/workspace/Lucene-Solr-master-Linux/solr/build/solr-core/test/J1/temp/solr.core.TestLazyCores_86700937836D4776-001/tempDir-001/collection1'
   [junit4]   2> 1167272 INFO  (coreLoadExecutor-3392-thread-2) [    ] o.a.s.c.SolrResourceLoader new SolrResourceLoader for directory: '/home/jenkins/workspace/Lucene-Solr-master-Linux/solr/build/solr-core/test/J1/temp/solr.core.TestLazyCores_86700937836D4776-001/tempDir-001/collection2'
   [junit4]   2> 1167273 INFO  (coreLoadExecutor-3392-thread-1) [    ] o.a.s.c.SolrResourceLoader JNDI not configured for solr (NoInitialContextEx)
   [junit4]   2> 1167273 INFO  (coreLoadExecutor-3392-thread-1) [    ] o.a.s.c.SolrResourceLoader solr home defaulted to 'solr/' (could not find system property or JNDI)
   [junit4]   2> 1167273 INFO  (coreLoadExecutor-3392-thread-2) [    ] o.a.s.c.SolrResourceLoader JNDI not configured for solr (NoInitialContextEx)
   [junit4]   2> 1167273 INFO  (coreLoadExecutor-3392-thread-2) [    ] o.a.s.c.SolrResourceLoader solr home defaulted to 'solr/' (could not find system property or JNDI)
   [junit4]   2> 1167273 INFO  (coreLoadExecutor-3392-thread-3) [    ] o.a.s.c.SolrResourceLoader new SolrResourceLoader for directory: '/home/jenkins/workspace/Lucene-Solr-master-Linux/solr/build/solr-core/test/J1/temp/solr.core.TestLazyCores_86700937836D4776-001/tempDir-001/collection5'
   [junit4]   2> 1167273 INFO  (coreLoadExecutor-3392-thread-3) [    ] o.a.s.c.SolrResourceLoader JNDI not configured for solr (NoInitialContextEx)
   [junit4]   2> 1167273 INFO  (coreLoadExecutor-3392-thread-3) [    ] o.a.s.c.SolrResourceLoader solr home defaulted to 'solr/' (could not find system property or JNDI)
   [junit4]   2> 1167281 INFO  (coreLoadExecutor-3392-thread-2) [    ] o.a.s.c.SolrConfig current version of requestparams : -1
   [junit4]   2> 1167281 INFO  (coreLoadExecutor-3392-thread-3) [    ] o.a.s.c.SolrConfig current version of requestparams : -1
   [junit4]   2> 1167281 INFO  (coreLoadExecutor-3392-thread-1) [    ] o.a.s.c.SolrConfig current version of requestparams : -1
   [junit4]   2> 1167283 WARN  (coreLoadExecutor-3392-thread-3) [    ] o.a.s.c.Config Beginning with Solr 5.5, <mergePolicy> is deprecated, use <mergePolicyFactory> instead.
   [junit4]   2> 1167284 WARN  (coreLoadExecutor-3392-thread-2) [    ] o.a.s.c.Config Beginning with Solr 5.5, <mergePolicy> is deprecated, use <mergePolicyFactory> instead.
   [junit4]   2> 1167284 WARN  (coreLoadExecutor-3392-thread-1) [    ] o.a.s.c.Config Beginning with Solr 5.5, <mergePolicy> is deprecated, use <mergePolicyFactory> instead.
   [junit4]   2> 1167284 INFO  (coreLoadExecutor-3392-thread-3) [    ] o.a.s.c.SolrConfig Using Lucene MatchVersion: 7.0.0
   [junit4]   2> 1167285 INFO  (coreLoadExecutor-3392-thread-1) [    ] o.a.s.c.SolrConfig Using Lucene MatchVersion: 7.0.0
   [junit4]   2> 1167285 INFO  (coreLoadExecutor-3392-thread-2) [    ] o.a.s.c.SolrConfig Using Lucene MatchVersion: 7.0.0
   [junit4]   2> 1167296 INFO  (coreLoadExecutor-3392-thread-3) [    ] o.a.s.c.SolrConfig Loaded SolrConfig: solrconfig.xml
   [junit4]   2> 1167297 INFO  (coreLoadExecutor-3392-thread-1) [    ] o.a.s.c.SolrConfig Loaded SolrConfig: solrconfig.xml
   [junit4]   2> 1167297 INFO  (coreLoadExecutor-3392-thread-2) [    ] o.a.s.c.SolrConfig Loaded SolrConfig: solrconfig.xml
   [junit4]   2> 1167299 INFO  (coreLoadExecutor-3392-thread-3) [    ] o.a.s.s.IndexSchema [collection5] Schema name=tiny
   [junit4]   2> 1167300 INFO  (coreLoadExecutor-3392-thread-2) [    ] o.a.s.s.IndexSchema [collection2] Schema name=tiny
   [junit4]   2> 1167300 INFO  (coreLoadExecutor-3392-thread-1) [    ] o.a.s.s.IndexSchema [collection1] Schema name=tiny
   [junit4]   2> 1167302 INFO  (coreLoadExecutor-3392-thread-3) [    ] o.a.s.s.IndexSchema unique key field: id
   [junit4]   2> 1167303 INFO  (coreLoadExecutor-3392-thread-1) [    ] o.a.s.s.IndexSchema unique key field: id
   [junit4]   2> 1167303 INFO  (coreLoadExecutor-3392-thread-2) [    ] o.a.s.s.IndexSchema unique key field: id
   [junit4]   2> 1167305 INFO  (coreLoadExecutor-3392-thread-3) [    ] o.a.s.c.ConfigSetProperties Did not find ConfigSet properties, assuming default properties: Can't find resource 'configsetprops.json' in classpath or '/home/jenkins/workspace/Lucene-Solr-master-Linux/solr/build/solr-core/test/J1/temp/solr.core.TestLazyCores_86700937836D4776-001/tempDir-001/collection5'
   [junit4]   2> 1167305 INFO  (coreLoadExecutor-3392-thread-1) [    ] o.a.s.c.ConfigSetProperties Did not find ConfigSet properties, assuming default properties: Can't find resource 'configsetprops.json' in classpath or '/home/jenkins/workspace/Lucene-Solr-master-Linux/solr/build/solr-core/test/J1/temp/solr.core.TestLazyCores_86700937836D4776-001/tempDir-001/collection1'
   [junit4]   2> 1167305 INFO  (coreLoadExecutor-3392-thread-2) [    ] o.a.s.c.ConfigSetProperties Did not find ConfigSet properties, assuming default properties: Can't find resource 'configsetprops.json' in classpath or '/home/jenkins/workspace/Lucene-Solr-master-Linux/solr/build/solr-core/test/J1/temp/solr.core.TestLazyCores_86700937836D4776-001/tempDir-001/collection2'
   [junit4]   2> 1167305 INFO  (coreLoadExecutor-3392-thread-3) [    ] o.a.s.c.CoreContainer Creating SolrCore 'collection5' using configuration from instancedir /home/jenkins/workspace/Lucene-Solr-master-Linux/solr/build/solr-core/test/J1/temp/solr.core.TestLazyCores_86700937836D4776-001/tempDir-001/collection5
   [junit4]   2> 1167305 INFO  (coreLoadExecutor-3392-thread-2) [    ] o.a.s.c.CoreContainer Creating SolrCore 'collection2' using configuration from instancedir /home/jenkins/workspace/Lucene-Solr-master-Linux/solr/build/solr-core/test/J1/temp/solr.core.TestLazyCores_86700937836D4776-001/tempDir-001/collection2
   [junit4]   2> 1167305 INFO  (coreLoadExecutor-3392-thread-1) [    ] o.a.s.c.CoreContainer Creating SolrCore 'collection1' using configuration from instancedir /home/jenkins/workspace/Lucene-Solr-master-Linux/solr/build/solr-core/test/J1/temp/solr.core.TestLazyCores_86700937836D4776-001/tempDir-001/collection1
   [junit4]   2> 1167305 INFO  (coreLoadExecutor-3392-thread-3) [    ] o.a.s.c.SolrCore org.apache.solr.core.MockDirectoryFactory
   [junit4]   2> 1167305 INFO  (coreLoadExecutor-3392-thread-2) [    ] o.a.s.c.SolrCore org.apache.solr.core.MockDirectoryFactory
   [junit4]   2> 1167305 INFO  (coreLoadExecutor-3392-thread-1) [    ] o.a.s.c.SolrCore org.apache.solr.core.MockDirectoryFactory
   [junit4]   2> 1167305 INFO  (coreLoadExecutor-3392-thread-3) [    ] o.a.s.c.SolrCore [[collection5] ] Opening new SolrCore at [/home/jenkins/workspace/Lucene-Solr-master-Linux/solr/build/solr-core/test/J1/temp/solr.core.TestLazyCores_86700937836D4776-001/tempDir-001/collection5], dataDir=[/home/jenkins/workspace/Lucene-Solr-master-Linux/solr/build/solr-core/test/J1/temp/solr.core.TestLazyCores_86700937836D4776-001/tempDir-001/collection5/data/]
   [junit4]   2> 1167305 INFO  (coreLoadExecutor-3392-thread-3) [    ] o.a.s.c.SolrCore JMX monitoring not detected for core: collection5
   [junit4]   2> 1167305 INFO  (coreLoadExecutor-3392-thread-2) [    ] o.a.s.c.SolrCore [[collection2] ] Opening new SolrCore at [/home/jenkins/workspace/Lucene-Solr-master-Linux/solr/build/solr-core/test/J1/temp/solr.core.TestLazyCores_86700937836D4776-001/tempDir-001/collection2], dataDir=[/home/jenkins/workspace/Lucene-Solr-master-Linux/solr/build/solr-core/test/J1/temp/solr.core.TestLazyCores_86700937836D4776-001/tempDir-001/collection2/data/]
   [junit4]   2> 1167305 INFO  (coreLoadExecutor-3392-thread-1) [    ] o.a.s.c.SolrCore [[collection1] ] Opening new SolrCore at [/home/jenkins/workspace/Lucene-Solr-master-Linux/solr/build/solr-core/test/J1/temp/solr.core.TestLazyCores_86700937836D4776-001/tempDir-001/collection1], dataDir=[/home/jenkins/workspace/Lucene-Solr-master-Linux/solr/build/solr-core/test/J1/temp/solr.core.TestLazyCores_86700937836D4776-001/tempDir-001/collection1/data/]
   [junit4]   2> 1167306 INFO  (coreLoadExecutor-3392-thread-1) [    ] o.a.s.c.SolrCore JMX monitoring not detected for core: collection1
   [junit4]   2> 1167306 INFO  (coreLoadExecutor-3392-thread-2) [    ] o.a.s.c.SolrCore JMX monitoring not detected for core: collection2
   [junit4]   2> 1167306 INFO  (coreLoadExecutor-3392-thread-1) [    ] o.a.s.c.CachingDirectoryFactory return new directory for /home/jenkins/workspace/Lucene-Solr-master-Linux/solr/build/solr-core/test/J1/temp/solr.core.TestLazyCores_86700937836D4776-001/tempDir-001/collection1/data
   [junit4]   2> 1167306 INFO  (coreLoadExecutor-3392-thread-3) [    ] o.a.s.c.CachingDirectoryFactory return new directory for /home/jenkins/workspace/Lucene-Solr-master-Linux/solr/build/solr-core/test/J1/temp/solr.core.TestLazyCores_86700937836D4776-001/tempDir-001/collection5/data
   [junit4]   2> 1167306 INFO  (coreLoadExecutor-3392-thread-3) [    ] o.a.s.c.SolrCore New index directory detected: old=null new=/home/jenkins/workspace/Lucene-Solr-master-Linux/solr/build/solr-core/test/J1/temp/solr.core.TestLazyCores_86700937836D4776-001/tempDir-001/collection5/data/index/
   [junit4]   2> 1167306 INFO  (coreLoadExecutor-3392-thread-1) [    ] o.a.s.c.SolrCore New index directory detected: old=null new=/home/jenkins/workspace/Lucene-Solr-master-Linux/solr/build/solr-core/test/J1/temp/solr.core.TestLazyCores_86700937836D4776-001/tempDir-001/collection1/data/index/
   [junit4]   2> 1167306 WARN  (coreLoadExecutor-3392-thread-3) [    ] o.a.s.c.SolrCore [collection5] Solr index directory '/home/jenkins/workspace/Lucene-Solr-master-Linux/solr/build/solr-core/test/J1/temp/solr.core.TestLazyCores_86700937836D4776-001/tempDir-001/collection5/data/index' doesn't exist. Creating new index...
   [junit4]   2> 1167306 INFO  (coreLoadExecutor-3392-thread-2) [    ] o.a.s.c.CachingDirectoryFactory return new directory for /home/jenkins/workspace/Lucene-Solr-master-Linux/solr/build/solr-core/test/J1/temp/solr.core.TestLazyCores_86700937836D4776-001/tempDir-001/collection2/data
   [junit4]   2> 1167306 WARN  (coreLoadExecutor-3392-thread-1) [    ] o.a.s.c.SolrCore [collection1] Solr index directory '/home/jenkins/workspace/Lucene-Solr-master-Linux/solr/build/solr-core/test/J1/temp/solr.core.TestLazyCores_86700937836D4776-001/tempDir-001/collection1/data/index' doesn't exist. Creating new index...
   [junit4]   2> 1167307 INFO  (coreLoadExecutor-3392-thread-2) [    ] o.a.s.c.SolrCore New index directory detected: old=null new=/home/jenkins/workspace/Lucene-Solr-master-Linux/solr/build/solr-core/test/J1/temp/solr.core.TestLazyCores_86700937836D4776-001/tempDir-001/collection2/data/index/
   [junit4]   2> 1167307 INFO  (coreLoadExecutor-3392-thread-3) [    ] o.a.s.c.CachingDirectoryFactory return new directory for /home/jenkins/workspace/Lucene-Solr-master-Linux/solr/build/solr-core/test/J1/temp/solr.core.TestLazyCores_86700937836D4776-001/tempDir-001/collection5/data/index
   [junit4]   2> 1167307 WARN  (coreLoadExecutor-3392-thread-2) [    ] o.a.s.c.SolrCore [collection2] Solr index directory '/home/jenkins/workspace/Lucene-Solr-master-Linux/solr/build/solr-core/test/J1/temp/solr.core.TestLazyCores_86700937836D4776-001/tempDir-001/collection2/data/index' doesn't exist. Creating new index...
   [junit4]   2> 1167307 INFO  (coreLoadExecutor-3392-thread-1) [    ] o.a.s.c.CachingDirectoryFactory return new directory for /home/jenkins/workspace/Lucene-Solr-master-Linux/solr/build/solr-core/test/J1/temp/solr.core.TestLazyCores_86700937836D4776-001/tempDir-001/collection1/data/index
   [junit4]   2> 1167307 INFO  (coreLoadExecutor-3392-thread-3) [    ] o.a.s.u.RandomMergePolicy RandomMergePolicy wrapping class org.apache.lucene.index.AlcoholicMergePolicy: [AlcoholicMergePolicy: minMergeSize=0, mergeFactor=10, maxMergeSize=1268764220, maxMergeSizeForForcedMerge=9223372036854775807, calibrateSizeByDeletes=true, maxMergeDocs=2147483647, maxCFSSegmentSizeMB=8.796093022207999E12, noCFSRatio=0.1]
   [junit4]   2> 1167307 INFO  (coreLoadExecutor-3392-thread-2) [    ] o.a.s.c.CachingDirectoryFactory return new directory for /home/jenkins/workspace/Lucene-Solr-master-Linux/solr/build/solr-core/test/J1/temp/solr.core.TestLazyCores_86700937836D4776-001/tempDir-001/collection2/data/index
   [junit4]   2> 1167309 INFO  (coreLoadExecutor-3392-thread-1) [    ] o.a.s.u.RandomMergePolicy RandomMergePolicy wrapping class org.apache.lucene.index.AlcoholicMergePolicy: [AlcoholicMergePolicy: minMergeSize=0, mergeFactor=10, maxMergeSize=1268764220, maxMergeSizeForForcedMerge=9223372036854775807, calibrateSizeByDeletes=true, maxMergeDocs=2147483647, maxCFSSegmentSizeMB=8.796093022207999E12, noCFSRatio=0.1]
   [junit4]   2> 1167310 INFO  (coreLoadExecutor-3392-thread-2) [    ] o.a.s.u.RandomMergePolicy RandomMergePolicy wrapping class org.apache.lucene.index.AlcoholicMergePolicy: [AlcoholicMergePolicy: minMergeSize=0, mergeFactor=10, maxMergeSize=1268764220, maxMergeSizeForForcedMerge=9223372036854775807, calibrateSizeByDeletes=true, maxMergeDocs=2147483647, maxCFSSegmentSizeMB=8.796093022207999E12, noCFSRatio=0.1]
   [junit4]   2> 1167310 INFO  (coreLoadExecutor-3392-thread-1) [    ] o.a.s.c.SolrDeletionPolicy SolrDeletionPolicy.onCommit: commits: num=1
   [junit4]   2> 	commit{dir=MockDirectoryWrapper(RAMDirectory@132e393 lockFactory=org.apache.lucene.store.SingleInstanceLockFactory@d1b93f),segFN=segments_1,generation=1}
   [junit4]   2> 1167310 INFO  (coreLoadExecutor-3392-thread-1) [    ] o.a.s.c.SolrDeletionPolicy newest commit generation = 1
   [junit4]   2> 1167310 INFO  (coreLoadExecutor-3392-thread-3) [    ] o.a.s.c.SolrDeletionPolicy SolrDeletionPolicy.onCommit: commits: num=1
   [junit4]   2> 	commit{dir=MockDirectoryWrapper(RAMDirectory@692217 lockFactory=org.apache.lucene.store.SingleInstanceLockFactory@b123c4),segFN=segments_1,generation=1}
   [junit4]   2> 1167311 INFO  (coreLoadExecutor-3392-thread-2) [    ] o.a.s.c.SolrDeletionPolicy SolrDeletionPolicy.onCommit: commits: num=1
   [junit4]   2> 	commit{dir=MockDirectoryWrapper(RAMDirectory@10fe818 lockFactory=org.apache.lucene.store.SingleInstanceLockFactory@41f2d8),segFN=segments_1,generation=1}
   [junit4]   2> 1167311 INFO  (coreLoadExecutor-3392-thread-3) [    ] o.a.s.c.SolrDeletionPolicy newest commit generation = 1
   [junit4]   2> 1167311 INFO  (coreLoadExecutor-3392-thread-2) [    ] o.a.s.c.SolrDeletionPolicy newest commit generation = 1
   [junit4]   2> 1167311 INFO  (OldIndexDirectoryCleanupThreadForCore-collection1) [    ] o.a.s.c.SolrCore Looking for old index directories to cleanup for core collection1 in /home/jenkins/workspace/Lucene-Solr-master-Linux/solr/build/solr-core/test/J1/temp/solr.core.TestLazyCores_86700937836D4776-001/tempDir-001/collection1/data/
   [junit4]   2> 1167311 INFO  (OldIndexDirectoryCleanupThreadForCore-collection5) [    ] o.a.s.c.SolrCore Looking for old index directories to cleanup for core collection5 in /home/jenkins/workspace/Lucene-Solr-master-Linux/solr/build/solr-core/test/J1/temp/solr.core.TestLazyCores_86700937836D4776-001/tempDir-001/collection5/data/
   [junit4]   2> 1167311 INFO  (OldIndexDirectoryCleanupThreadForCore-collection2) [    ] o.a.s.c.SolrCore Looking for old index directories to cleanup for core collection2 in /home/jenkins/workspace/Lucene-Solr-master-Linux/solr/build/solr-core/test/J1/temp/solr.core.TestLazyCores_86700937836D4776-001/tempDir-001/collection2/data/
   [junit4]   2> 1167311 WARN  (OldIndexDirectoryCleanupThreadForCore-collection1) [    ] o.a.s.c.DirectoryFactory /home/jenkins/workspace/Lucene-Solr-master-Linux/solr/build/solr-core/test/J1/temp/solr.core.TestLazyCores_86700937836D4776-001/tempDir-001/collection1/data/ does not point to a valid data directory; skipping clean-up of old index directories.
   [junit4]   2> 1167311 WARN  (OldIndexDirectoryCleanupThreadForCore-collection2) [    ] o.a.s.c.DirectoryFactory /home/jenkins/workspace/Lucene-Solr-master-Linux/solr/build/solr-core/test/J1/temp/solr.core.TestLazyCores_86700937836D4776-001/tempDir-001/collection2/data/ does not point to a valid data directory; skipping clean-up of old index directories.
   [junit4]   2> 1167311 WARN  (OldIndexDirectoryCleanupThreadForCore-collection5) [    ] o.a.s.c.DirectoryFactory /home/jenkins/workspace/Lucene-Solr-master-Linux/solr/build/solr-core/test/J1/temp/solr.core.TestLazyCores_86700937836D4776-001/tempDir-001/collection5/data/ does not point to a valid data directory; skipping clean-up of old index directories.
   [junit4]   2> 1167313 INFO  (coreLoadExecutor-3392-thread-2) [    ] o.a.s.c.SolrCore no updateRequestProcessorChain defined as default, creating implicit default
   [junit4]   2> 1167313 INFO  (coreLoadExecutor-3392-thread-3) [    ] o.a.s.c.SolrCore no updateRequestProcessorChain defined as default, creating implicit default
   [junit4]   2> 1167313 INFO  (coreLoadExecutor-3392-thread-1) [    ] o.a.s.c.SolrCore no updateRequestProcessorChain defined as default, creating implicit default
   [junit4]   2> 1167315 INFO  (coreLoadExecutor-3392-thread-2) [    ] o.a.s.h.l.XMLLoader xsltCacheLifetimeSeconds=60
   [junit4]   2> 1167323 INFO  (coreLoadExecutor-3392-thread-3) [    ] o.a.s.h.l.XMLLoader xsltCacheLifetimeSeconds=60
   [junit4]   2> 1167323 INFO  (coreLoadExecutor-3392-thread-1) [    ] o.a.s.h.l.XMLLoader xsltCacheLifetimeSeconds=60
   [junit4]   2> 1167323 INFO  (coreLoadExecutor-3392-thread-2) [    ] o.a.s.h.l.XMLLoader xsltCacheLifetimeSeconds=60
   [junit4]   2> 1167324 INFO  (coreLoadExecutor-3392-thread-1) [    ] o.a.s.h.l.XMLLoader xsltCacheLifetimeSeconds=60
   [junit4]   2> 1167324 INFO  (coreLoadExecutor-3392-thread-2) [    ] o.a.s.h.l.XMLLoader xsltCacheLifetimeSeconds=60
   [junit4]   2> 1167324 INFO  (coreLoadExecutor-3392-thread-3) [    ] o.a.s.h.l.XMLLoader xsltCacheLifetimeSeconds=60
   [junit4]   2> 1167325 INFO  (coreLoadExecutor-3392-thread-1) [    ] o.a.s.h.l.XMLLoader xsltCacheLifetimeSeconds=60
   [junit4]   2> 1167325 INFO  (coreLoadExecutor-3392-thread-2) [    ] o.a.s.h.l.XMLLoader xsltCacheLifetimeSeconds=60
   [junit4]   2> 1167325 INFO  (coreLoadExecutor-3392-thread-3) [    ] o.a.s.h.l.XMLLoader xsltCacheLifetimeSeconds=60
   [junit4]   2> 1167326 INFO  (coreLoadExecutor-3392-thread-2) [    ] o.a.s.c.RequestHandlers Registered paths: /admin/mbeans,/update/csv,/sql,/update/json/docs,/admin/luke,/export,/select,/admin/segments,/get,/admin/system,/replication,/admin/properties,/config,/stream,/schema,/admin/plugins,/admin/logging,/update/json,/admin/ping,/admin/threads,/update,/admin/file
   [junit4]   2> 1167326 INFO  (coreLoadExecutor-3392-thread-2) [    ] o.a.s.c.SolrCore Using default statsCache cache: org.apache.solr.search.stats.LocalStatsCache
   [junit4]   2> 1167326 INFO  (coreLoadExecutor-3392-thread-2) [    ] o.a.s.u.CommitTracker Hard AutoCommit: disabled
   [junit4]   2> 1167326 INFO  (coreLoadExecutor-3392-thread-2) [    ] o.a.s.u.CommitTracker Soft AutoCommit: disabled
   [junit4]   2> 1167327 INFO  (coreLoadExecutor-3392-thread-1) [    ] o.a.s.h.l.XMLLoader xsltCacheLifetimeSeconds=60
   [junit4]   2> 1167327 INFO  (coreLoadExecutor-3392-thread-2) [    ] o.a.s.u.RandomMergePolicy RandomMergePolicy wrapping class org.apache.lucene.index.LogByteSizeMergePolicy: [LogByteSizeMergePolicy: minMergeSize=1677721, mergeFactor=40, maxMergeSize=2147483648, maxMergeSizeForForcedMerge=9223372036854775807, calibrateSizeByDeletes=true, maxMergeDocs=2147483647, maxCFSSegmentSizeMB=8.796093022207999E12, noCFSRatio=0.0]
   [junit4]   2> 1167327 INFO  (coreLoadExecutor-3392-thread-3) [    ] o.a.s.h.l.XMLLoader xsltCacheLifetimeSeconds=60
   [junit4]   2> 1167327 INFO  (coreLoadExecutor-3392-thread-2) [    ] o.a.s.c.SolrDeletionPolicy SolrDeletionPolicy.onInit: commits: num=1
   [junit4]   2> 	commit{dir=MockDirectoryWrapper(RAMDirectory@10fe818 lockFactory=org.apache.lucene.store.SingleInstanceLockFactory@41f2d8),segFN=segments_1,generation=1}
   [junit4]   2> 1167327 INFO  (coreLoadExecutor-3392-thread-2) [    ] o.a.s.c.SolrDeletionPolicy newest commit generation = 1
   [junit4]   2> 1167327 INFO  (coreLoadExecutor-3392-thread-2) [    ] o.a.s.s.SolrIndexSearcher Opening [Searcher@5b8baf[collection2] main]
   [junit4]   2> 1167328 INFO  (coreLoadExecutor-3392-thread-2) [    ] o.a.s.r.ManagedResourceStorage File-based storage initialized to use dir: /home/jenkins/workspace/Lucene-Solr-master-Linux/solr/build/solr-core/test/J1/temp/solr.core.TestLazyCores_86700937836D4776-001/tempDir-001/collection2/conf
   [junit4]   2> 1167328 INFO  (coreLoadExecutor-3392-thread-2) [    ] o.a.s.r.RestManager Initializing RestManager with initArgs: {storageDir=/home/jenkins/workspace/Lucene-Solr-master-Linux/solr/build/solr-core/test/J1/temp/solr.core.TestLazyCores_86700937836D4776-001/tempDir-001/collection2/conf}
   [junit4]   2> 1167328 INFO  (coreLoadExecutor-3392-thread-2) [    ] o.a.s.r.ManagedResourceStorage Reading _rest_managed.json using file:dir=/home/jenkins/workspace/Lucene-Solr-master-Linux/solr/build/solr-core/test/J1/temp/solr.core.TestLazyCores_86700937836D4776-001/tempDir-001/collection2/conf
   [junit4]   2> 1167328 INFO  (coreLoadExecutor-3392-thread-3) [    ] o.a.s.c.RequestHandlers Registered paths: /admin/mbeans,/update/csv,/sql,/update/json/docs,/admin/luke,/export,/select,/admin/segments,/get,/admin/system,/replication,/admin/properties,/config,/stream,/schema,/admin/plugins,/admin/logging,/update/json,/admin/ping,/admin/threads,/update,/admin/file
   [junit4]   2> 1167328 INFO  (coreLoadExecutor-3392-thread-3) [    ] o.a.s.c.SolrCore Using default statsCache cache: org.apache.solr.search.stats.LocalStatsCache
   [junit4]   2> 1167328 INFO  (coreLoadExecutor-3392-thread-2) [    ] o.a.s.r.RestManager Initializing 0 registered ManagedResources
   [junit4]   2> 1167328 INFO  (coreLoadExecutor-3392-thread-2) [    ] o.a.s.h.ReplicationHandler Commits will be reserved for  10000
   [junit4]   2> 1167328 INFO  (coreLoadExecutor-3392-thread-3) [    ] o.a.s.u.CommitTracker Hard AutoCommit: disabled
   [junit4]   2> 1167328 INFO  (coreLoadExecutor-3392-thread-3) [    ] o.a.s.u.CommitTracker Soft AutoCommit: disabled
   [junit4]   2> 1167328 INFO  (searcherExecutor-3394-thread-1) [    ] o.a.s.c.SolrCore [collection2] Registered new searcher Searcher@5b8baf[collection2] main{ExitableDirectoryReader(UninvertingDirectoryReader())}
   [junit4]   2> 1167329 INFO  (coreLoadExecutor-3392-thread-3) [    ] o.a.s.u.RandomMergePolicy RandomMergePolicy wrapping class org.apache.lucene.index.LogByteSizeMergePolicy: [LogByteSizeMergePolicy: minMergeSize=1677721, mergeFactor=40, maxMergeSize=2147483648, maxMergeSizeForForcedMerge=9223372036854775807, calibrateSizeByDeletes=true, maxMergeDocs=2147483647, maxCFSSegmentSizeMB=8.796093022207999E12, noCFSRatio=0.0]
   [junit4]   2> 1167329 INFO  (coreLoadExecutor-3392-thread-2) [    ] o.a.s.c.SolrCores Opening transient core collection2
   [junit4]   2> 1167329 INFO  (coreLoadExecutor-3392-thread-2) [    ] o.a.s.c.CoreContainer registering core: collection2
   [junit4]   2> 1167329 INFO  (coreLoadExecutor-3392-thread-3) [    ] o.a.s.c.SolrDeletionPolicy SolrDeletionPolicy.onInit: commits: num=1
   [junit4]   2> 	commit{dir=MockDirectoryWrapper(RAMDirectory@692217 lockFactory=org.apache.lucene.store.SingleInstanceLockFactory@b123c4),segFN=segments_1,generation=1}
   [junit4]   2> 1167329 INFO  (coreLoadExecutor-3392-thread-3) [    ] o.a.s.c.SolrDeletionPolicy newest commit generation = 1
   [junit4]   2> 1167329 INFO  (coreLoadExecutor-3392-thread-3) [    ] o.a.s.s.SolrIndexSearcher Opening [Searcher@191483d[collection5] main]
   [junit4]   2> 1167329 INFO  (coreLoadExecutor-3392-thread-1) [    ] o.a.s.c.RequestHandlers Registered paths: /admin/mbeans,/update/csv,/sql,/update/json/docs,/admin/luke,/export,/select,/admin/segments,/get,/admin/system,/replication,/admin/properties,/config,/stream,/schema,/admin/plugins,/admin/logging,/update/json,/admin/ping,/admin/threads,/update,/admin/file
   [junit4]   2> 1167329 INFO  (coreLoadExecutor-3392-thread-3) [    ] o.a.s.r.ManagedResourceStorage File-based storage initialized to use dir: /home/jenkins/workspace/Lucene-Solr-master-Linux/solr/build/solr-core/test/J1/temp/solr.core.TestLazyCores_86700937836D4776-001/tempDir-001/collection5/conf
   [junit4]   2> 1167329 INFO  (coreLoadExecutor-3392-thread-1) [    ] o.a.s.c.SolrCore Using default statsCache cache: org.apache.solr.search.stats.LocalStatsCache
   [junit4]   2> 1167329 INFO  (coreLoadExecutor-3392-thread-3) [    ] o.a.s.r.RestManager Initializing RestManager with initArgs: {storageDir=/home/jenkins/workspace/Lucene-Solr-master-Linux/solr/build/solr-core/test/J1/temp/solr.core.TestLazyCores_86700937836D4776-001/tempDir-001/collection5/conf}
   [junit4]   2> 1167329 INFO  (coreLoadExecutor-3392-thread-3) [    ] o.a.s.r.ManagedResourceStorage Reading _rest_managed.json using file:dir=/home/jenkins/workspace/Lucene-Solr-master-Linux/solr/build/solr-core/test/J1/temp/solr.core.TestLazyCores_86700937836D4776-001/tempDir-001/collection5/conf
   [junit4]   2> 1167329 INFO  (coreLoadExecutor-3392-thread-1) [    ] o.a.s.u.CommitTracker Hard AutoCommit: disabled
   [junit4]   2> 1167329 INFO  (coreLoadExecutor-3392-thread-1) [    ] o.a.s.u.CommitTracker Soft AutoCommit: disabled
   [junit4]   2> 1167329 INFO  (coreLoadExecutor-3392-thread-3) [    ] o.a.s.r.RestManager Initializing 0 registered ManagedResources
   [junit4]   2> 1167329 INFO  (coreLoadExecutor-3392-thread-1) [    ] o.a.s.u.RandomMergePolicy RandomMergePolicy wrapping class org.apache.lucene.index.LogByteSizeMergePolicy: [LogByteSizeMergePolicy: minMergeSize=1677721, mergeFactor=40, maxMergeSize=2147483648, maxMergeSizeForForcedMerge=9223372036854775807, calibrateSizeByDeletes=true, maxMergeDocs=2147483647, maxCFSSegmentSizeMB=8.796093022207999E12, noCFSRatio=0.0]
   [junit4]   2> 1167329 INFO  (coreLoadExecutor-3392-thread-3) [    ] o.a.s.h.ReplicationHandler Commits will be reserved for  10000
   [junit4]   2> 1167330 INFO  (searcherExecutor-3393-thread-1) [    ] o.a.s.c.SolrCore [collection5] Registered new searcher Searcher@191483d[collection5] main{ExitableDirectoryReader(UninvertingDirectoryReader())}
   [junit4]   2> 1167330 INFO  (coreLoadExecutor-3392-thread-1) [    ] o.a.s.c.SolrDeletionPolicy SolrDeletionPolicy.onInit: commits: num=1
   [junit4]   2> 	commit{dir=MockDirectoryWrapper(RAMDirectory@132e393 lockFactory=org.apache.lucene.store.SingleInstanceLockFactory@d1b93f),segFN=segments_1,generation=1}
   [junit4]   2> 1167330 INFO  (coreLoadExecutor-3392-thread-1) [    ] o.a.s.c.SolrDeletionPolicy newest commit generation = 1
   [junit4]   2> 1167330 INFO  (coreLoadExecutor-3392-thread-3) [    ] o.a.s.c.CoreContainer registering core: collection5
   [junit4]   2> 1167330 INFO  (coreLoadExecutor-3392-thread-1) [    ] o.a.s.s.SolrIndexSearcher Opening [Searcher@6c62e1[collection1] main]
   [junit4]   2> 1167330 INFO  (coreLoadExecutor-3392-thread-1) [    ] o.a.s.r.ManagedResourceStorage File-based storage initialized to use dir: /home/jenkins/workspace/Lucene-Solr-master-Linux/solr/build/solr-core/test/J1/temp/solr.core.TestLazyCores_86700937836D4776-001/tempDir-001/collection1/conf
   [junit4]   2> 1167330 INFO  (coreLoadExecutor-3392-thread-1) [    ] o.a.s.r.RestManager Initializing RestManager with initArgs: {storageDir=/home/jenkins/workspace/Lucene-Solr-master-Linux/solr/build/solr-core/test/J1/temp/solr.core.TestLazyCores_86700937836D4776-001/tempDir-001/collection1/conf}
   [junit4]   2> 1167330 INFO  (coreLoadExecutor-3392-thread-1) [    ] o.a.s.r.ManagedResourceStorage Reading _rest_managed.json using file:dir=/home/jenkins/workspace/Lucene-Solr-master-Linux/solr/build/solr-core/test/J1/temp/solr.core.TestLazyCores_86700937836D4776-001/tempDir-001/collection1/conf
   [junit4]   2> 1167330 INFO  (coreLoadExecutor-3392-thread-1) [    ] o.a.s.r.RestManager Initializing 0 registered ManagedResources
   [junit4]   2> 1167330 INFO  (coreLoadExecutor-3392-thread-1) [    ] o.a.s.h.ReplicationHandler Commits will be reserved for  10000
   [junit4]   2> 1167330 INFO  (searcherExecutor-3395-thread-1) [    ] o.a.s.c.SolrCore [collection1] Registered new searcher Searcher@6c62e1[collection1] main{ExitableDirectoryReader(UninvertingDirectoryReader())}
   [junit4]   2> 1167330 INFO  (coreLoadExecutor-3392-thread-1) [    ] o.a.s.c.CoreContainer registering core: collection1
   [junit4]   2> 1167339 INFO  (TEST-TestLazyCores.testCreateTransientFromAdmin-seed#[86700937836D4776]) [    ] o.a.s.h.a.CoreAdminOperation core create command loadOnStartup=true&transient=true&name=core1&action=CREATE&wt=xml
   [junit4]   2> 1167339 INFO  (TEST-TestLazyCores.testCreateTransientFromAdmin-seed#[86700937836D4776]) [    ] o.a.s.c.CoreDescriptor Created CoreDescriptor: {name=core1, config=solrconfig.xml, loadOnStartup=true, schema=schema.xml, configSetProperties=configsetprops.json, transient=true, dataDir=data/}
   [junit4]   2> 1167339 INFO  (TEST-TestLazyCores.testCreateTransientFromAdmin-seed#[86700937836D4776]) [    ] o.a.s.c.SolrResourceLoader new SolrResourceLoader for directory: '/home/jenkins/workspace/Lucene-Solr-master-Linux/solr/build/solr-core/test/J1/temp/solr.core.TestLazyCores_86700937836D4776-001/tempDir-001/core1'
   [junit4]   2> 1167339 INFO  (TEST-TestLazyCores.testCreateTransientFromAdmin-seed#[86700937836D4776]) [    ] o.a.s.c.SolrResourceLoader JNDI not configured for solr (NoInitialContextEx)
   [junit4]   2> 1167340 INFO  (TEST-TestLazyCores.testCreateTransientFromAdmin-seed#[86700937836D4776]) [    ] o.a.s.c.SolrResourceLoader solr home defaulted to 'solr/' (could not find system property or JNDI)
   [junit4]   2> 1167344 INFO  (TEST-TestLazyCores.testCreateTransientFromAdmin-seed#[86700937836D4776]) [    ] o.a.s.c.SolrConfig current version of requestparams : -1
   [junit4]   2> 1167346 WARN  (TEST-TestLazyCores.testCreateTransientFromAdmin-seed#[86700937836D4776]) [    ] o.a.s.c.Config Beginning with Solr 5.5, <mergePolicy> is deprecated, use <mergePolicyFactory> instead.
   [junit4]   2> 1167347 INFO  (TEST-TestLazyCores.testCreateTransientFromAdmin-seed#[86700937836D4776]) [    ] o.a.s.c.SolrConfig Using Lucene MatchVersion: 7.0.0
   [junit4]   2> 1167351 INFO  (TEST-TestLazyCores.testCreateTransientFromAdmin-seed#[86700937836D4776]) [    ] o.a.s.c.SolrConfig Loaded SolrConfig: solrconfig.xml
   [junit4]   2> 1167354 INFO  (TEST-TestLazyCores.testCreateTransientFromAdmin-seed#[86700937836D4776]) [    ] o.a.s.s.IndexSchema [core1] Schema name=tiny
   [junit4]   2> 1167356 INFO  (TEST-TestLazyCores.testCreateTransientFromAdmin-seed#[86700937836D4776]) [    ] o.a.s.s.IndexSchema unique key field: id
   [junit4]   2> 1167357 INFO  (TEST-TestLazyCores.testCreateTransientFromAdmin-seed#[86700937836D4776]) [    ] o.a.s.c.ConfigSetProperties Did not find ConfigSet properties, assuming default properties: Can't find resource 'configsetprops.json' in classpath or '/home/jenkins/workspace/Lucene-Solr-master-Linux/solr/build/solr-core/test/J1/temp/solr.core.TestLazyCores_86700937836D4776-001/tempDir-001/core1'
   [junit4]   2> 1167357 INFO  (TEST-TestLazyCores.testCreateTransientFromAdmin-seed#[86700937836D4776]) [    ] o.a.s.c.CoreContainer Creating SolrCore 'core1' using configuration from instancedir /home/jenkins/workspace/Lucene-Solr-master-Linux/solr/build/solr-core/test/J1/temp/solr.core.TestLazyCores_86700937836D4776-001/tempDir-001/core1
   [junit4]   2> 1167357 INFO  (TEST-TestLazyCores.testCreateTransientFromAdmin-seed#[86700937836D4776]) [    ] o.a.s.c.SolrCore org.apache.solr.core.MockDirectoryFactory
   [junit4]   2> 1167357 INFO  (TEST-TestLazyCores.testCreateTransientFromAdmin-seed#[86700937836D4776]) [    ] o.a.s.c.SolrCore [[core1] ] Opening new SolrCore at [/home/jenkins/workspace/Lucene-Solr-master-Linux/solr/build/solr-core/test/J1/temp/solr.core.TestLazyCores_86700937836D4776-001/tempDir-001/core1], dataDir=[/home/jenkins/workspace/Lucene-Solr-master-Linux/solr/build/solr-core/test/J1/temp/solr.core.TestLazyCores_86700937836D4776-001/tempDir-001/core1/data/]
   [junit4]   2> 1167357 INFO  (TEST-TestLazyCores.testCreateTransientFromAdmin-seed#[86700937836D4776]) [    ] o.a.s.c.SolrCore JMX monitoring not detected for core: core1
   [junit4]   2> 1167358 INFO  (TEST-TestLazyCores.testCreateTransientFromAdmin-seed#[86700937836D4776]) [    ] o.a.s.c.CachingDirectoryFactory return new directory for /home/jenkins/workspace/Lucene-Solr-master-Linux/solr/build/solr-core/test/J1/temp/solr.core.TestLazyCores_86700937836D4776-001/tempDir-001/core1/data
   [junit4]   2> 1167358 INFO  (TEST-TestLazyCores.testCreateTransientFromAdmin-seed#[86700937836D4776]) [    ] o.a.s.c.SolrCore New index directory detected: old=null new=/home/jenkins/workspace/Lucene-Solr-master-Linux/solr/build/solr-core/test/J1/temp/solr.core.TestLazyCores_86700937836D4776-001/tempDir-001/core1/data/index/
   [junit4]   2> 1167358 WARN  (TEST-TestLazyCores.testCreateTransientFromAdmin-seed#[86700937836D4776]) [    ] o.a.s.c.SolrCore [core1] Solr index directory '/home/jenkins/workspace/Lucene-Solr-master-Linux/solr/build/solr-core/test/J1/temp/solr.core.TestLazyCores_86700937836D4776-001/tempDir-001/core1/data/index' doesn't exist. Creating new index...
   [junit4]   2> 1167358 INFO  (TEST-TestLazyCores.testCreateTransientFromAdmin-seed#[86700937836D4776]) [    ] o.a.s.c.CachingDirectoryFactory return new directory for /home/jenkins/workspace/Lucene-Solr-master-Linux/solr/build/solr-core/test/J1/temp/solr.core.TestLazyCores_86700937836D4776-001/tempDir-001/core1/data/index
   [junit4]   2> 1167359 INFO  (TEST-TestLazyCores.testCreateTransientFromAdmin-seed#[86700937836D4776]) [    ] o.a.s.u.RandomMergePolicy RandomMergePolicy wrapping class org.apache.lucene.index.TieredMergePolicy: [TieredMergePolicy: maxMergeAtOnce=10, maxMergeAtOnceExplicit=30, maxMergedSegmentMB=62.1435546875, floorSegmentMB=1.0380859375, forceMergeDeletesPctAllowed=17.304195789434242, segmentsPerTier=15.0, maxCFSSegmentSizeMB=8.796093022207999E12, noCFSRatio=0.7984765789230619
   [junit4]   2> 1167359 INFO  (TEST-TestLazyCores.testCreateTransientFromAdmin-seed#[86700937836D4776]) [    ] o.a.s.c.SolrDeletionPolicy SolrDeletionPolicy.onCommit: commits: num=1
   [junit4]   2> 	commit{dir=MockDirectoryWrapper(RAMDirectory@1ac1c03 lockFactory=org.apache.lucene.store.SingleInstanceLockFactory@1034797),segFN=segments_1,generation=1}
   [junit4]   2> 1167359 INFO  (TEST-TestLazyCores.testCreateTransientFromAdmin-seed#[86700937836D4776]) [    ] o.a.s.c.SolrDeletionPolicy newest commit generation = 1
   [junit4]   2> 1167359 INFO  (OldIndexDirectoryCleanupThreadForCore-core1) [    ] o.a.s.c.SolrCore Looking for old index directories to cleanup for core core1 in /home/jenkins/workspace/Lucene-Solr-master-Linux/solr/build/solr-core/test/J1/temp/solr.core.TestLazyCores_86700937836D4776-001/tempDir-001/core1/data/
   [junit4]   2> 1167359 WARN  (OldIndexDirectoryCleanupThreadForCore-core1) [    ] o.a.s.c.DirectoryFactory /home/jenkins/workspace/Lucene-Solr-master-Linux/solr/build/solr-core/test/J1/temp/solr.core.TestLazyCores_86700937836D4776-001/tempDir-001/core1/data/ does not point to a valid data directory; skipping clean-up of old index directories.
   [junit4]   2> 1167361 INFO  (TEST-TestLazyCores.testCreateTransientFromAdmin-seed#[86700937836D4776]) [    ] o.a.s.c.SolrCore no updateRequestProcessorChain defined as default, creating implicit default
   [junit4]   2> 1167362 INFO  (TEST-TestLazyCores.testCreateTransientFromAdmin-seed#[86700937836D4776]) [    ] o.a.s.h.l.XMLLoader xsltCacheLifetimeSeconds=60
   [junit4]   2> 1167363 INFO  (TEST-TestLazyCores.testCreateTransientFromAdmin-seed#[86700937836D4776]) [    ] o.a.s.h.l.XMLLoader xsltCacheLifetimeSeconds=60
   [junit4]   2> 1167364 INFO  (TEST-TestLazyCores.testCreateTransientFromAdmin-seed#[86700937836D4776]) [    ] o.a.s.h.l.XMLLoader xsltCacheLifetimeSeconds=60
   [junit4]   2> 1167365 INFO  (TEST-TestLazyCores.testCreateTransientFromAdmin-seed#[86700937836D4776]) [    ] o.a.s.h.l.XMLLoader xsltCacheLifetimeSeconds=60
   [junit4]   2> 1167366 INFO  (TEST-TestLazyCores.testCreateTransientFromAdmin-seed#[86700937836D4776]) [    ] o.a.s.c.RequestHandlers Registered paths: /admin/mbeans,/update/csv,/sql,/update/json/docs,/admin/luke,/export,/select,/admin/segments,/get,/admin/system,/replication,/admin/properties,/config,/stream,/schema,/admin/plugins,/admin/logging,/update/json,/admin/ping,/admin/threads,/update,/admin/file
   [junit4]   2> 1167366 INFO  (TEST-TestLazyCores.testCreateTransientFromAdmin-seed#[86700937836D4776]) [    ] o.a.s.c.SolrCore Using default statsCache cache: org.apache.solr.search.stats.LocalStatsCache
   [junit4]   2> 1167366 INFO  (TEST-TestLazyCores.testCreateTransientFromAdmin-seed#[86700937836D4776]) [    ] o.a.s.u.CommitTracker Hard AutoCommit: disabled
   [junit4]   2> 1167366 INFO  (TEST-TestLazyCores.testCreateTransientFromAdmin-seed#[86700937836D4776]) [    ] o.a.s.u.CommitTracker Soft AutoCommit: disabled
   [junit4]   2> 1167366 INFO  (TEST-TestLazyCores.testCreateTransientFromAdmin-seed#[86700937836D4776]) [    ] o.a.s.u.RandomMergePolicy RandomMergePolicy wrapping class org.apache.lucene.index.LogByteSizeMergePolicy: [LogByteSizeMergePolicy: minMergeSize=1677721, mergeFactor=33, maxMergeSize=2147483648, maxMergeSizeForForcedMerge=9223372036854775807, calibrateSizeByDeletes=false, maxMergeDocs=2147483647, maxCFSSegmentSizeMB=8.796093022207999E12, noCFSRatio=0.0]
   [junit4]   2> 1167367 INFO  (TEST-TestLazyCores.testCreateTransientFromAdmin-seed#[86700937836D4776]) [    ] o.a.s.c.SolrDeletionPolicy SolrDeletionPolicy.onInit: commits: num=1
   [junit4]   2> 	commit{dir=MockDirectoryWrapper(RAMDirectory@1ac1c03 lockFactory=org.apache.lucene.store.SingleInstanceLockFactory@1034797),segFN=segments_1,generation=1}
   [junit4]   2> 1167367 INFO  (TEST-TestLazyCores.testCreateTransientFromAdmin-seed#[86700937836D4776]) [    ] o.a.s.c.SolrDeletionPolicy newest commit generation = 1
   [junit4]   2> 1167367 INFO  (TEST-TestLazyCores.testCreateTransientFromAdmin-seed#[86700937836D4776]) [    ] o.a.s.s.SolrIndexSearcher Opening [Searcher@b6a0bb[core1] main]
   [junit4]   2> 1167367 INFO  (TEST-TestLazyCores.testCreateTransientFromAdmin-seed#[86700937836D4776]) [    ] o.a.s.r.ManagedResourceStorage File-based storage initialized to use dir: /home/jenkins/workspace/Lucene-Solr-master-Linux/solr/build/solr-core/test/J1/temp/solr.core.TestLazyCores_86700937836D4776-001/tempDir-001/core1/conf
   [junit4]   2> 1167367 INFO  (TEST-TestLazyCores.testCreateTransientFromAdmin-seed#[86700937836D4776]) [    ] o.a.s.r.RestManager Initializing RestManager with initArgs: {storageDir=/home/jenkins/workspace/Lucene-Solr-master-Linux/solr/build/solr-core/test/J1/temp/solr.core.TestLazyCores_86700937836D4776-001/tempDir-001/core1/conf}
   [junit4]   2> 1167367 INFO  (TEST-TestLazyCores.testCreateTransientFromAdmin-seed#[86700937836D4776]) [    ] o.a.s.r.ManagedResourceStorage Reading _rest_managed.json using file:dir=/home/jenkins/workspace/Lucene-Solr-master-Linux/solr/build/solr-core/test/J1/temp/solr.core.TestLazyCores_86700937836D4776-001/tempDir-001/core1/conf
   [junit4]   2> 1167368 INFO  (TEST-TestLazyCores.testCreateTransientFromAdmin-seed#[86700937836D4776]) [    ] o.a.s.r.RestManager Initializing 0 registered ManagedResources
   [junit4]   2> 1167368 INFO  (TEST-TestLazyCores.testCreateTransientFromAdmin-seed#[86700937836D4776]) [    ] o.a.s.h.ReplicationHandler Commits will be reserved for  10000
   [junit4]   2> 1167368 INFO  (searcherExecutor-3406-thread-1) [    ] o.a.s.c.SolrCore [core1] Registered new searcher Searcher@b6a0bb[core1] main{ExitableDirectoryReader(UninvertingDirectoryReader())}
   [junit4]   2> 1167368 INFO  (TEST-TestLazyCores.testCreateTransientFromAdmin-seed#[86700937836D4776]) [    ] o.a.s.c.SolrCores Opening transient core core1
   [junit4]   2> 1167368 INFO  (TEST-TestLazyCores.testCreateTransientFromAdmin-seed#[86700937836D4776]) [    ] o.a.s.c.CoreContainer registering core: core1
   [junit4]   2> 1167368 INFO  (TEST-TestLazyCores.testCreateTransientFromAdmin-seed#[86700937836D4776]) [    ] o.a.s.h.a.CoreAdminOperation core create command loadOnStartup=false&transient=true&name=core2&action=CREATE&wt=xml
   [junit4]   2> 1167369 INFO  (TEST-TestLazyCores.testCreateTransientFromAdmin-seed#[86700937836D4776]) [    ] o.a.s.c.CoreDescriptor Created CoreDescriptor: {name=core2, config=solrconfig.xml, loadOnStartup=false, schema=schema.xml, configSetProperties=configsetprops.json, transient=true, dataDir=data/}
   [junit4]   2> 1167369 INFO  (TEST-TestLazyCores.testCreateTransientFromAdmin-seed#[86700937836D4776]) [    ] o.a.s.c.SolrResourceLoader new SolrResourceLoader for directory: '/home/jenkins/workspace/Lucene-Solr-master-Linux/solr/build/solr-core/test/J1/temp/solr.core.TestLazyCores_86700937836D4776-001/tempDir-001/core2'
   [junit4]   2> 1167369 INFO  (TEST-TestLazyCores.testCreateTransientFromAdmin-seed#[86700937836D4776]) [    ] o.a.s.c.SolrResourceLoader JNDI not configured for solr (NoInitialContextEx)
   [junit4]   2> 1167369 INFO  (TEST-TestLazyCores.testCreateTransientFromAdmin-seed#[86700937836D4776]) [    ] o.a.s.c.SolrResourceLoader solr home defaulted to 'solr/' (could not find system property or JNDI)
   [junit4]   2> 1167373 INFO  (TEST-TestLazyCores.testCreateTransientFromAdmin-seed#[86700937836D4776]) [    ] o.a.s.c.SolrConfig current version of requestparams : -1
   [junit4]   2> 1167375 WARN  (TEST-TestLazyCores.testCreateTransientFromAdmin-seed#[86700937836D4776]) [    ] o.a.s.c.Config Beginning with Solr 5.5, <mergePolicy> is deprecated, use <mergePolicyFactory> instead.
   [junit4]   2> 1167376 INFO  (TEST-TestLazyCores.testCreateTransientFromAdmin-seed#[86700937836D4776]) [    ] o.a.s.c.SolrConfig Using Lucene MatchVersion: 7.0.0
   [junit4]   2> 1167380 INFO  (TEST-TestLazyCores.testCreateTransientFromAdmin-seed#[86700937836D4776]) [    ] o.a.s.c.SolrConfig Loaded SolrConfig: solrconfig.xml
   [junit4]   2> 1167382 INFO  (TEST-TestLazyCores.testCreateTransientFromAdmin-seed#[86700937836D4776]) [    ] o.a.s.s.IndexSchema [core2] Schema name=tiny
   [junit4]   2> 1167384 INFO  (TEST-TestLazyCores.testCreateTransientFromAdmin-seed#[86700937836D4776]) [    ] o.a.s.s.IndexSchema unique key field: id
   [junit4]   2> 1167385 INFO  (TEST-TestLazyCores.testCreateTransientFromAdmin-seed#[86700937836D4776]) [    ] o.a.s.c.ConfigSetProperties Did not find ConfigSet properties, assuming default properties: Can't find resource 'configsetprops.json' in classpath or '/home/jenkins/workspace/Lucene-Solr-master-Linux/solr/build/solr-core/test/J1/temp/solr.core.TestLazyCores_86700937836D4776-001/tempDir-001/core2'
   [junit4]   2> 1167385 INFO  (TEST-TestLazyCores.testCreateTransientFromAdmin-seed#[86700937836D4776]) [    ] o.a.s.c.CoreContainer Creating SolrCore 'core2' using configuration from instancedir /home/jenkins/workspace/Lucene-Solr-master-Linux/solr/build/solr-core/test/J1/temp/solr.core.TestLazyCores_86700937836D4776-001/tempDir-001/core2
   [junit4]   2> 1167386 INFO  (TEST-TestLazyCores.testCreateTransientFromAdmin-seed#[86700937836D4776]) [    ] o.a.s.c.SolrCore org.apache.solr.core.MockDirectoryFactory
   [junit4]   2> 1167386 INFO  (TEST-TestLazyCores.testCreateTransientFromAdmin-seed#[86700937836D4776]) [    ] o.a.s.c.SolrCore [[core2] ] Opening new SolrCore at [/home/jenkins/workspace/Lucene-Solr-master-Linux/solr/build/solr-core/test/J1/temp/solr.core.TestLazyCores_86700937836D4776-001/tempDir-001/core2], dataDir=[/home/jenkins/workspace/Lucene-Solr-master-Linux/solr/build/solr-core/test/J1/temp/solr.core.TestLazyCores_86700937836D4776-001/tempDir-001/core2/data/]
   [junit4]   2> 1167386 INFO  (TEST-TestLazyCores.testCreateTransientFromAdmin-seed#[86700937836D4776]) [    ] o.a.s.c.SolrCore JMX monitoring not detected for core: core2
   [junit4]   2> 1167386 INFO  (TEST-TestLazyCores.testCreateTransientFromAdmin-seed#[86700937836D4776]) [    ] o.a.s.c.CachingDirectoryFactory return new directory for /home/jenkins/workspace/Lucene-Solr-master-Linux/solr/build/solr-core/test/J1/temp/solr.core.TestLazyCores_86700937836D4776-001/tempDir-001/core2/data
   [junit4]   2> 1167387 INFO  (TEST-TestLazyCores.testCreateTransientFromAdmin-seed#[86700937836D4776]) [    ] o.a.s.c.SolrCore New index directory detected: old=null new=/home/jenkins/workspace/Lucene-Solr-master-Linux/solr/build/solr-core/test/J1/temp/solr.core.TestLazyCores_86700937836D4776-001/tempDir-001/core2/data/index/
   [junit4]   2> 1167387 WARN  (TEST-TestLazyCores.testCreateTransientFromAdmin-seed#[86700937836D4776]) [    ] o.a.s.c.SolrCore [core2] Solr index directory '/home/jenkins/workspace/Lucene-Solr-master-Linux/solr/build/solr-core/test/J1/temp/solr.core.TestLazyCores_86700937836D4776-001/tempDir-001/core2/data/index' doesn't exist. Creating new index...
   [junit4]   2> 1167387 INFO  (TEST-TestLazyCores.testCreateTransientFromAdmin-seed#[86700937836D4776]) [    ] o.a.s.c.CachingDirectoryFactory return new directory for /home/jenkins/workspace/Lucene-Solr-master-Linux/solr/build/solr-core/test/J1/temp/solr.core.TestLazyCores_86700937836D4776-001/tempDir-001/core2/data/index
   [junit4]   2> 1167388 INFO  (TEST-TestLazyCores.testCreateTransientFromAdmin-seed#[86700937836D4776]) [    ] o.a.s.u.RandomMergePolicy RandomMergePolicy wrapping class org.apache.lucene.index.TieredMergePolicy: [TieredMergePolicy: maxMergeAtOnce=47, maxMergeAtOnceExplicit=14, maxMergedSegmentMB=28.8681640625, floorSegmentMB=1.916015625, forceMergeDeletesPctAllowed=16.42461829799414, segmentsPerTier=35.0, maxCFSSegmentSizeMB=8.796093022207999E12, noCFSRatio=0.42473091018646925
   [junit4]   2> 1167388 INFO  (TEST-TestLazyCores.testCreateTransientFromAdmin-seed#[86700937836D4776]) [    ] o.a.s.c.SolrDeletionPolicy SolrDeletionPolicy.onCommit: commits: num=1
   [junit4]   2> 	commit{dir=MockDirectoryWrapper(RAMDirectory@1dca7ca lockFactory=org.apache.lucene.store.SingleInstanceLockFactory@19bd5e6),segFN=segments_1,generation=1}
   [junit4]   2> 1167388 INFO  (TEST-TestLazyCores.testCreateTransientFromAdmin-seed#[86700937836D4776]) [    ] o.a.s.c.SolrDeletionPolicy newest commit generation = 1
   [junit4]   2> 1167388 INFO  (OldIndexDirectoryCleanupThreadForCore-core2) [    ] o.a.s.c.SolrCore Looking for old index directories to cleanup for core core2 in /home/jenkins/workspace/Lucene-Solr-master-Linux/solr/build/solr-core/test/J1/temp/solr.core.TestLazyCores_86700937836D4776-001/tempDir-001/core2/data/
   [junit4]   2> 1167389 WARN  (OldIndexDirectoryCleanupThreadForCore-core2) [    ] o.a.s.c.DirectoryFactory /home/jenkins/workspace/Lucene-Solr-master-Linux/solr/build/solr-core/test/J1/temp/solr.core.TestLazyCores_86700937836D4776-001/tempDir-001/core2/data/ does not point to a valid data directory; skipping clean-up of old index directories.
   [junit4]   2> 1167390 INFO  (TEST-TestLazyCores.testCreateTransientFromAdmin-seed#[86700937836D4776]) [    ] o.a.s.c.SolrCore no updateRequestProcessorChain defined as default, creating implicit default
   [junit4]   2> 1167391 INFO  (TEST-TestLazyCores.testCreateTransientFromAdmin-seed#[86700937836D4776]) [    ] o.a.s.h.l.XMLLoader xsltCacheLifetimeSeconds=60
   [junit4]   2> 1167392 INFO  (TEST-TestLazyCores.testCreateTransientFromAdmin-seed#[86700937836D4776]) [    ] o.a.s.h.l.XMLLoader xsltCacheLifetimeSeconds=60
   [junit4]   2> 1167393 INFO  (TEST-TestLazyCores.testCreateTransientFromAdmin-seed#[86700937836D4776]) [    ] o.a.s.h.l.XMLLoader xsltCacheLifetimeSeconds=60
   [junit4]   2> 1167394 INFO  (TEST-TestLazyCores.testCreateTransientFromAdmin-seed#[86700937836D4776]) [    ] o.a.s.h.l.XMLLoader xsltCacheLifetimeSeconds=60
   [junit4]   2> 1167395 INFO  (TEST-TestLazyCores.testCreateTransientFromAdmin-seed#[86700937836D4776]) [    ] o.a.s.c.RequestHandlers Registered paths: /admin/mbeans,/update/csv,/sql,/update/json/docs,/admin/luke,/export,/select,/admin/segments,/get,/admin/system,/replication,/admin/properties,/config,/stream,/schema,/admin/plugins,/admin/logging,/update/json,/admin/ping,/admin/threads,/update,/admin/file
   [junit4]   2> 1167395 INFO  (TEST-TestLazyCores.testCreateTransientFromAdmin-seed#[86700937836D4776]) [    ] o.a.s.c.SolrCore Using default statsCache cache: org.apache.solr.search.stats.LocalStatsCache
   [junit4]   2> 1167395 INFO  (TEST-TestLazyCores.testCreateTransientFromAdmin-seed#[86700937836D4776]) [    ] o.a.s.u.CommitTracker Hard AutoCommit: disabled
   [junit4]   2> 1167395 INFO  (TEST-TestLazyCores.testCreateTransientFromAdmin-seed#[86700937836D4776]) [    ] o.a.s.u.CommitTracker Soft AutoCommit: disabled
   [junit4]   2> 1167395 INFO  (TEST-TestLazyCores.testCreateTransientFromAdmin-seed#[86700937836D4776]) [    ] o.a.s.u.RandomMergePolicy RandomMergePolicy wrapping class org.apache.lucene.index.AlcoholicMergePolicy: [AlcoholicMergePolicy: minMergeSize=0, mergeFactor=10, maxMergeSize=1157878007, maxMergeSizeForForcedMerge=9223372036854775807, calibrateSizeByDeletes=true, maxMergeDocs=2147483647, maxCFSSegmentSizeMB=8.796093022207999E12, noCFSRatio=0.1]
   [junit4]   2> 1167395 INFO  (TEST-TestLazyCores.testCreateTransientFromAdmin-seed#[86700937836D4776]) [    ] o.a.s.c.SolrDeletionPolicy SolrDeletionPolicy.onInit: commits: num=1
   [junit4]   2> 	commit{dir=MockDirectoryWrapper(RAMDirectory@1dca7ca lockFactory=org.apache.lucene.store.SingleInstanceLockFactory@19bd5e6),segFN=segments_1,generation=1}
   [junit4]   2> 1167395 INFO  (TEST-TestLazyCores.testCreateTransientFromAdmin-seed#[86700937836D4776]) [    ] o.a.s.c.SolrDeletionPolicy newest commit generation = 1
   [junit4]   2> 1167396 INFO  (TEST-TestLazyCores.testCreateTransientFromAdmin-seed#[86700937836D4776]) [    ] o.a.s.s.SolrIndexSearcher Opening [Searcher@1d985d8[core2] main]
   [junit4]   2> 1167396 INFO  (TEST-TestLazyCores.testCreateTransientFromAdmin-seed#[86700937836D4776]) [    ] o.a.s.r.ManagedResourceStorage File-based storage initialized to use dir: /home/jenkins/workspace/Lucene-Solr-master-Linux/solr/build/solr-core/test/J1/temp/solr.core.TestLazyCores_86700937836D4776-001/tempDir-001/core2/conf
   [junit4]   2> 1167396 INFO  (TEST-TestLazyCores.testCreateTransientFromAdmin-seed#[86700937836D4776]) [    ] o.a.s.r.RestManager Initializing RestManager with initArgs: {storageDir=/home/jenkins/workspace/Lucene-Solr-master-Linux/solr/build/solr-core/test/J1/temp/solr.core.TestLazyCores_86700937836D4776-001/tempDir-001/core2/conf}
   [junit4]   2> 1167396 INFO  (TEST-TestLazyCores.testCreateTransientFromAdmin-seed#[86700937836D4776]) [    ] o.a.s.r.ManagedResourceStorage Reading _rest_managed.json using file:dir=/home/jenkins/workspace/Lucene-Solr-master-Linux/solr/build/solr-core/test/J1/temp/solr.core.TestLazyCores_86700937836D4776-001/tempDir-001/core2/conf
   [junit4]   2> 1167396 INFO  (TEST-TestLazyCores.testCreateTransientFromAdmin-seed#[86700937836D4776]) [    ] o.a.s.r.RestManager Initializing 0 registered ManagedResources
   [junit4]   2> 1167396 INFO  (TEST-TestLazyCores.testCreateTransientFromAdmin-seed#[86700937836D4776]) [    ] o.a.s.h.ReplicationHandler Commits will be reserved for  10000
   [junit4]   2> 1167396 INFO  (searcherExecutor-3411-thread-1) [    ] o.a.s.c.SolrCore [core2] Registered new searcher Searcher@1d985d8[core2] main{ExitableDirectoryReader(UninvertingDirectoryReader())}
   [junit4]   2> 1167397 INFO  (TEST-TestLazyCores.testCreateTransientFromAdmin-seed#[86700937836D4776]) [    ] o.a.s.c.SolrCores Opening transient core core2
   [junit4]   2> 1167397 INFO  (TEST-TestLazyCores.testCreateTransientFromAdmin-seed#[86700937836D4776]) [    ] o.a.s.c.CoreContainer registering core: core2
   [junit4]   2> 1167397 INFO  (TEST-TestLazyCores.testCreateTransientFromAdmin-seed#[86700937836D4776]) [    ] o.a.s.h.a.CoreAdminOperation core create command loadOnStartup=true&transient=true&name=core3&action=CREATE&wt=xml
   [junit4]   2> 1167397 INFO  (TEST-TestLazyCores.testCreateTransientFromAdmin-seed#[86700937836D4776]) [    ] o.a.s.c.CoreDescriptor Created CoreDescriptor: {name=core3, config=solrconfig.xml, loadOnStartup=true, schema=schema.xml, configSetProperties=configsetprops.json, transient=true, dataDir=data/}
   [junit4]   2> 1167397 INFO  (TEST-TestLazyCores.testCreateTransientFromAdmin-seed#[86700937836D4776]) [    ] o.a.s.c.SolrResourceLoader new SolrResourceLoader for directory: '/home/jenkins/workspace/Lucene-Solr-master-Linux/solr/build/solr-core/test/J1/temp/solr.core.TestLazyCores_86700937836D4776-001/tempDir-001/core3'
   [junit4]   2> 1167397 INFO  (TEST-TestLazyCores.testCreateTransientFromAdmin-seed#[86700937836D4776]) [    ] o.a.s.c.SolrResourceLoader JNDI not configured for solr (NoInitialContextEx)
   [junit4]   2> 1167397 INFO  (TEST-TestLazyCores.testCreateTransientFromAdmin-seed#[86700937836D4776]) [    ] o.a.s.c.SolrResourceLoader solr home defaulted to 'solr/' (could not find system property or JNDI)
   [junit4]   2> 1167402 INFO  (TEST-TestLazyCores.testCreateTransientFromAdmin-seed#[86700937836D4776]) [    ] o.a.s.c.SolrConfig current version of requestparams : -1
   [junit4]   2> 1167404 WARN  (TEST-TestLazyCores.testCreateTransientFromAdmin-seed#[86700937836D4776]) [    ] o.a.s.c.Config Beginning with Solr 5.5, <mergePolicy> is deprecated, use <mergePolicyFactory> instead.
   [junit4]   2> 1167404 INFO  (TEST-TestLazyCores.testCreateTransientFromAdmin-seed#[86700937836D4776]) [    ] o.a.s.c.SolrConfig Using Lucene MatchVersion: 7.0.0
   [junit4]   2> 1167408 INFO  (TEST-TestLazyCores.testCreateTransientFromAdmin-seed#[86700937836D4776]) [    ] o.a.s.c.SolrConfig Loaded SolrConfig: solrconfig.xml
   [junit4]   2> 1167411 INFO  (TEST-TestLazyCores.testCreateTransientFromAdmin-seed#[86700937836D4776]) [    ] o.a.s.s.IndexSchema [core3] Schema name=tiny
   [junit4]   2> 1167413 INFO  (TEST-TestLazyCores.testCreateTransientFromAdmin-seed#[86700937836D4776]) [    ] o.a.s.s.IndexSchema unique key field: id
   [junit4]   2> 1167414 INFO  (TEST-TestLazyCores.testCreateTransientFromAdmin-seed#[86700937836D4776]) [    ] o.a.s.c.ConfigSetProperties Did not find ConfigSet properties, assuming default properties: Can't find resource 'configsetprops.json' in classpath or '/home/jenkins/workspace/Lucene-Solr-master-Linux/solr/build/solr-core/test/J1/temp/solr.core.TestLazyCores_86700937836D4776-001/tempDir-001/core3'
   [junit4]   2> 1167414 INFO  (TEST-TestLazyCores.testCreateTransientFromAdmin-seed#[86700937836D4776]) [    ] o.a.s.c.CoreContainer Creating SolrCore 'core3' using configuration from instancedir /home/jenkins/workspace/Lucene-Solr-master-Linux/solr/build/solr-core/test/J1/temp/solr.core.TestLazyCores_86700937836D4776-001/tempDir-001/core3
   [junit4]   2> 1167414 INFO  (TEST-TestLazyCores.testCreateTransientFromAdmin-seed#[86700937836D4776]) [    ] o.a.s.c.SolrCore org.apache.solr.core.MockDirectoryFactory
   [junit4]   2> 1167414 INFO  (TEST-TestLazyCores.testCreateTransientFromAdmin-seed#[86700937836D4776]) [    ] o.a.s.c.SolrCore [[core3] ] Opening new SolrCore at [/home/jenkins/workspace/Lucene-Solr-master-Linux/solr/build/solr-core/test/J1/temp/solr.core.TestLazyCores_86700937836D4776-001/tempDir-001/core3], dataDir=[/home/jenkins/workspace/Lucene-Solr-master-Linux/solr/build/solr-core/test/J1/temp/solr.core.TestLazyCores_86700937836D4776-001/tempDir-001/core3/data/]
   [junit4]   2> 1167415 INFO  (TEST-TestLazyCores.testCreateTransientFromAdmin-seed#[86700937836D4776]) [    ] o.a.s.c.SolrCore JMX monitoring not detected for core: core3
   [junit4]   2> 1167415 INFO  (TEST-TestLazyCores.testCreateTransientFromAdmin-seed#[86700937836D4776]) [    ] o.a.s.c.CachingDirectoryFactory return new directory for /home/jenkins/workspace/Lucene-Solr-master-Linux/solr/build/solr-core/test/J1/temp/solr.core.TestLazyCores_86700937836D4776-001/tempDir-001/core3/data
   [junit4]   2> 1167415 INFO  (TEST-TestLazyCores.testCreateTransientFromAdmin-seed#[86700937836D4776]) [    ] o.a.s.c.SolrCore New index directory detected: old=null new=/home/jenkins/workspace/Lucene-Solr-master-Linux/solr/build/solr-core/test/J1/temp/solr.core.TestLazyCores_86700937836D4776-001/tempDir-001/core3/data/index/
   [junit4]   2> 1167415 WARN  (TEST-TestLazyCores.testCreateTransientFromAdmin-seed#[86700937836D4776]) [    ] o.a.s.c.SolrCore [core3] Solr index directory '/home/jenkins/workspace/Lucene-Solr-master-Linux/solr/build/solr-core/test/J1/temp/solr.core.TestLazyCores_86700937836D4776-001/tempDir-001/core3/data/index' doesn't exist. Creating new index...
   [junit4]   2> 1167416 INFO  (TEST-TestLazyCores.testCreateTransientFromAdmin-seed#[86700937836D4776]) [    ] o.a.s.c.CachingDirectoryFactory return new directory for /home/jenkins/workspace/Lucene-Solr-master-Linux/solr/build/solr-core/test/J1/temp/solr.core.TestLazyCores_86700937836D4776-001/tempDir-001/core3/data/index
   [junit4]   2> 1167416 INFO  (TEST-TestLazyCores.testCreateTransientFromAdmin-seed#[86700937836D4776]) [    ] o.a.s.u.RandomMergePolicy RandomMergePolicy wrapping class org.apache.lucene.index.TieredMergePolicy: [TieredMergePolicy: maxMergeAtOnce=44, maxMergeAtOnceExplicit=11, maxMergedSegmentMB=96.701171875, floorSegmentMB=1.3583984375, forceMergeDeletesPctAllowed=3.342116346382047, segmentsPerTier=16.0, maxCFSSegmentSizeMB=0.2685546875, noCFSRatio=0.2526981180635872
   [junit4]   2> 1167416 INFO  (TEST-TestLazyCores.testCreateTransientFromAdmin-seed#[86700937836D4776]) [    ] o.a.s.c.SolrDeletionPolicy SolrDeletionPolicy.onCommit: commits: num=1
   [junit4]   2> 	commit{dir=MockDirectoryWrapper(RAMDirectory@1efe0e8 lockFactory=org.apache.lucene.store.SingleInstanceLockFactory@144a385),segFN=segments_1,generation=1}
   [junit4]   2> 1167416 INFO  (TEST-TestLazyCores.testCreateTransientFromAdmin-seed#[86700937836D4776]) [    ] o.a.s.c.SolrDeletionPolicy newest commit generation = 1
   [junit4]   2> 1167417 INFO  (OldIndexDirectoryCleanupThreadForCore-core3) [    ] o.a.s.c.SolrCore Looking for old index directories to cleanup for core core3 in /home/jenkins/workspace/Lucene-Solr-master-Linux/solr/build/solr-core/test/J1/temp/solr.core.TestLazyCores_86700937836D4776-001/tempDir-001/core3/data/
   [junit4]   2> 1167417 WARN  (OldIndexDirectoryCleanupThreadForCore-core3) [    ] o.a.s.c.DirectoryFactory /home/jenkins/workspace/Lucene-Solr-master-Linux/solr/build/solr-core/test/J1/temp/solr.core.TestLazyCores_86700937836D4776-001/tempDir-001/core3/data/ does not point to a valid data directory; skipping clean-up of old index directories.
   [junit4]   2> 1167418 INFO  (TEST-TestLazyCores.testCreateTransientFromAdmin-seed#[86700937836D4776]) [    ] o.a.s.c.SolrCore no updateRequestProcessorChain defined as default, creating implicit default
   [junit4]   2> 1167419 INFO  (TEST-TestLazyCores.testCreateTransientFromAdmin-seed#[86700937836D4776]) [    ] o.a.s.h.l.XMLLoader xsltCacheLifetimeSeconds=60
   [junit4]   2> 1167420 INFO  (TEST-TestLazyCores.testCreateTransientFromAdmin-seed#[86700937836D4776]) [    ] o.a.s.h.l.XMLLoader xsltCacheLifetimeSeconds=60
   [junit4]   2> 1167421 INFO  (TEST-TestLazyCores.testCreateTransientFromAdmin-seed#[86700937836D4776]) [    ] o.a.s.h.l.XMLLoader xsltCacheLifetimeSeconds=60
   [junit4]   2> 1167422 INFO  (TEST-TestLazyCores.testCreateTransientFromAdmin-seed#[86700937836D4776]) [    ] o.a.s.h.l.XMLLoader xsltCacheLifetimeSeconds=60
   [junit4]   2> 1167422 INFO  (TEST-TestLazyCores.testCreateTransientFromAdmin-seed#[86700937836D4776]) [    ] o.a.s.c.RequestHandlers Registered paths: /admin/mbeans,/update/csv,/sql,/update/json/docs,/admin/luke,/export,/select,/admin/segments,/get,/admin/system,/replication,/admin/properties,/config,/stream,/schema,/admin/plugins,/admin/logging,/update/json,/admin/ping,/admin/threads,/update,/admin/file
   [junit4]   2> 1167422 INFO  (TEST-TestLazyCores.testCreateTransientFromAdmin-seed#[86700937836D4776]) [    ] o.a.s.c.SolrCore Using default statsCache cache: org.apache.solr.search.stats.LocalStatsCache
   [junit4]   2> 1167423 INFO  (TEST-TestLazyCores.testCreateTransientFromAdmin-seed#[86700937836D4776]) [    ] o.a.s.u.CommitTracker Hard AutoCommit: disabled
   [junit4]   2> 1167423 INFO  (TEST-TestLazyCores.testCreateTransientFromAdmin-seed#[86700937836D4776]) [    ] o.a.s.u.CommitTracker Soft AutoCommit: disabled
   [junit4]   2> 1167423 INFO  (TEST-TestLazyCores.testCreateTransientFromAdmin-seed#[86700937836D4776]) [    ] o.a.s.u.RandomMergePolicy RandomMergePolicy wrapping class org.apache.lucene.index.TieredMergePolicy: [TieredMergePolicy: maxMergeAtOnce=15, maxMergeAtOnceExplicit=45, maxMergedSegmentMB=19.8896484375, floorSegmentMB=2.0712890625, forceMergeDeletesPctAllowed=4.274495300771809, segmentsPerTier=48.0, maxCFSSegmentSizeMB=8.796093022207999E12, noCFSRatio=1.0
   [junit4]   2> 1167424 INFO  (TEST-TestLazyCores.testCreateTransientFromAdmin-seed#[86700937836D4776]) [    ] o.a.s.c.SolrDeletionPolicy SolrDeletionPolicy.onInit: commits: num=1
   [junit4]   2> 	commit{dir=MockDirectoryWrapper(RAMDirectory@1efe0e8 lockFactory=org.apache.lucene.store.SingleInstanceLockFactory@144a385),segFN=segments_1,generation=1}
   [junit4]   2> 1167424 INFO  (TEST-TestLazyCores.testCreateTransientFromAdmin-seed#[86700937836D4776]) [    ] o.a.s.c.SolrDeletionPolicy newest commit generation = 1
   [junit4]   2> 1167424 INFO  (TEST-TestLazyCores.testCreateTransientFromAdmin-seed#[86700937836D4776]) [    ] o.a.s.s.SolrIndexSearcher Opening [Searcher@1fa95e2[core3] main]
   [junit4]   2> 1167424 INFO  (TEST-TestLazyCores.testCreateTransientFromAdmin-seed#[86700937836D4776]) [    ] o.a.s.r.ManagedResourceStorage File-based storage initialized to use dir: /home/jenkins/workspace/Lucene-Solr-master-Linux/solr/build/solr-core/test/J1/temp/solr.core.TestLazyCores_86700937836D4776-001/tempDir-001/core3/conf
   [junit4]   2> 1167424 INFO  (TEST-TestLazyCores.testCreateTransientFromAdmin-seed#[86700937836D4776]) [    ] o.a.s.r.RestManager Initializing RestManager with initArgs: {storageDir=/home/jenkins/workspace/Lucene-Solr-master-Linux/solr/build/solr-core/test/J1/temp/solr.core.TestLazyCores_86700937836D4776-001/tempDir-001/core3/conf}
   [junit4]   2> 1167424 INFO  (TEST-TestLazyCores.testCreateTransientFromAdmin-seed#[86700937836D4776]) [    ] o.a.s.r.ManagedResourceStorage Reading _rest_managed.json using file:dir=/home/jenkins/workspace/Lucene-Solr-master-Linux/solr/build/solr-core/test/J1/temp/solr.core.TestLazyCores_86700937836D4776-001/tempDir-001/core3/conf
   [junit4]   2> 1167424 INFO  (TEST-TestLazyCores.testCreateTransientFromAdmin-seed#[86700937836D4776]) [    ] o.a.s.r.RestManager Initializing 0 registered ManagedResources
   [junit4]   2> 1167424 INFO  (TEST-TestLazyCores.testCreateTransientFromAdmin-seed#[86700937836D4776]) [    ] o.a.s.h.ReplicationHandler Commits will be reserved for  10000
   [junit4]   2> 1167424 INFO  (searcherExecutor-3416-thread-1) [    ] o.a.s.c.SolrCore [core3] Registered new searcher Searcher@1fa95e2[core3] main{ExitableDirectoryReader(UninvertingDirectoryReader())}
   [junit4]   2> 1167425 INFO  (TEST-TestLazyCores.testCreateTransientFromAdmin-seed#[86700937836D4776]) [    ] o.a.s.c.SolrCores Opening transient core core3
   [junit4]   2> 1167425 INFO  (TEST-TestLazyCores.testCreateTransientFromAdmin-seed#[86700937836D4776]) [    ] o.a.s.c.CoreContainer registering core: core3
   [junit4]   2> 1167425 INFO  (TEST-TestLazyCores.testCreateTransientFromAdmin-seed#[86700937836D4776]) [    ] o.a.s.h.a.CoreAdminOperation core create command loadOnStartup=false&transient=true&name=core4&action=CREATE&wt=xml
   [junit4]   2> 1167425 INFO  (TEST-TestLazyCores.testCreateTransientFromAdmin-seed#[86700937836D4776]) [    ] o.a.s.c.CoreDescriptor Created CoreDescriptor: {name=core4, config=solrconfig.xml, loadOnStartup=false, schema=schema.xml, configSetProperties=configsetprops.json, transient=true, dataDir=data/}
   [junit4]   2> 1167425 INFO  (TEST-TestLazyCores.testCreateTransientFromAdmin-seed#[86700937836D4776]) [    ] o.a.s.c.SolrResourceLoader new SolrResourceLoader for directory: '/home/jenkins/workspace/Lucene-Solr-master-Linux/solr/build/solr-core/test/J1/temp/solr.core.TestLazyCores_86700937836D4776-001/tempDir-001/core4'
   [junit4]   2> 1167425 INFO  (TEST-TestLazyCores.testCreateTransientFromAdmin-seed#[86700937836D4776]) [    ] o.a.s.c.SolrResourceLoader JNDI not configured for solr (NoInitialContextEx)
   [junit4]   2> 1167425 INFO  (TEST-TestLazyCores.testCreateTransientFromAdmin-seed#[86700937836D4776]) [    ] o.a.s.c.SolrResourceLoader solr home defaulted to 'solr/' (could not find system property or JNDI)
   [junit4]   2> 1167431 INFO  (TEST-TestLazyCores.testCreateTransientFromAdmin-seed#[86700937836D4776]) [    ] o.a.s.c.SolrConfig current version of requestparams : -1
   [junit4]   2> 1167432 WARN  (TEST-TestLazyCores.testCreateTransientFromAdmin-seed#[86700937836D4776]) [    ] o.a.s.c.Config Beginning with Solr 5.5, <mergePolicy> is deprecated, use <mergePolicyFactory> instead.
   [junit4]   2> 1167433 INFO  (TEST-TestLazyCores.testCreateTransientFromAdmin-seed#[86700937836D4776]) [    ] o.a.s.c.SolrConfig Using Lucene MatchVersion: 7.0.0
   [junit4]   2> 1167443 INFO  (TEST-TestLazyCores.testCreateTransientFromAdmin-seed#[86700937836D4776]) [    ] o.a.s.c.SolrConfig Loaded SolrConfig: solrconfig.xml
   [junit4]   2> 1167445 INFO  (TEST-TestLazyCores.testCreateTransientFromAdmin-seed#[86700937836D4776]) [    ] o.a.s.s.IndexSchema [core4] Schema name=tiny
   [junit4]   2> 1167447 INFO  (TEST-TestLazyCores.testCreateTransientFromAdmin-seed#[86700937836D4776]) [    ] o.a.s.s.IndexSchema unique key field: id
   [junit4]   2> 1167448 INFO  (TEST-TestLazyCores.testCreateTransientFromAdmin-seed#[86700937836D4776]) [    ] o.a.s.c.ConfigSetProperties Did not find ConfigSet properties, assuming default properties: Can't find resource 'configsetprops.json' in classpath or '/home/jenkins/workspace/Lucene-Solr-master-Linux/solr/build/solr-core/test/J1/temp/solr.core.TestLazyCores_86700937836D4776-001/tempDir-001/core4'
   [junit4]   2> 1167448 INFO  (TEST-TestLazyCores.testCreateTransientFromAdmin-seed#[86700937836D4776]) [    ] o.a.s.c.CoreContainer Creating SolrCore 'core4' using configuration from instancedir /home/jenkins/workspace/Lucene-Solr-master-Linux/solr/build/solr-core/test/J1/temp/solr.core.TestLazyCores_86700937836D4776-001/tempDir-001/core4
   [junit4]   2> 1167449 INFO  (TEST-TestLazyCores.testCreateTransientFromAdmin-seed#[86700937836D4776]) [    ] o.a.s.c.SolrCore org.apache.solr.core.MockDirectoryFactory
   [junit4]   2> 1167449 INFO  (TEST-TestLazyCores.testCreateTransientFromAdmin-seed#[86700937836D4776]) [    ] o.a.s.c.SolrCore [[core4] ] Opening new SolrCore at [/home/jenkins/workspace/Lucene-Solr-master-Linux/solr/build/solr-core/test/J1/temp/solr.core.TestLazyCores_86700937836D4776-001/tempDir-001/core4], dataDir=[/home/jenkins/workspace/Lucene-Solr-master-Linux/solr/build/solr-core/test/J1/temp/solr.core.TestLazyCores_86700937836D4776-001/tempDir-001/core4/data/]
   [junit4]   2> 1167449 INFO  (TEST-TestLazyCores.testCreateTransientFromAdmin-seed#[86700937836D4776]) [    ] o.a.s.c.SolrCore JMX monitoring not detected for core: core4
   [junit4]   2> 1167450 INFO  (TEST-TestLazyCores.testCreateTransientFromAdmin-seed#[86700937836D4776]) [    ] o.a.s.c.CachingDirectoryFactory return new directory for /home/jenkins/workspace/Lucene-Solr-master-Linux/solr/build/solr-core/test/J1/temp/solr.core.TestLazyCores_86700937836D4776-001/tempDir-001/core4/data
   [junit4]   2> 1167450 INFO  (TEST-TestLazyCores.testCreateTransientFromAdmin-seed#[86700937836D4776]) [    ] o.a.s.c.SolrCore New index directory detected: old=null new=/home/jenkins/workspace/Lucene-Solr-master-Linux/solr/build/solr-core/test/J1/temp/solr.core.TestLazyCores_86700937836D4776-001/tempDir-001/core4/data/index/
   [junit4]   2> 1167450 WARN  (TEST-TestLazyCores.testCreateTransientFromAdmin-seed#[86700937836D4776]) [    ] o.a.s.c.SolrCore [core4] Solr index directory '/home/jenkins/workspace/Lucene-Solr-master-Linux/solr/build/solr-core/test/J1/temp/solr.core.TestLazyCores_86700937836D4776-001/tempDir-001/core4/data/index' doesn't exist. Creating new index...
   [junit4]   2> 1167450 INFO  (TEST-TestLazyCores.testCreateTransientFromAdmin-seed#[86700937836D4776]) [    ] o.a.s.c.CachingDirectoryFactory return new directory for /home/jenkins/workspace/Lucene-Solr-master-Linux/solr/build/solr-core/test/J1/temp/solr.core.TestLazyCores_86700937836D4776-001/tempDir-001/core4/data/index
   [junit4]   2> 1167450 INFO  (TEST-TestLazyCores.testCreateTransientFromAdmin-seed#[86700937836D4776]) [    ] o.a.s.u.RandomMergePolicy RandomMergePolicy wrapping class org.apache.lucene.index.TieredMergePolicy: [TieredMergePolicy: maxMergeAtOnce=21, maxMergeAtOnceExplicit=40, maxMergedSegmentMB=94.515625, floorSegmentMB=1.7666015625, forceMergeDeletesPctAllowed=21.71820476878788, segmentsPerTier=15.0, maxCFSSegmentSizeMB=8.796093022207999E12, noCFSRatio=1.0
   [junit4]   2> 1167451 INFO  (TEST-TestLazyCores.testCreateTransientFromAdmin-seed#[86700937836D4776]) [    ] o.a.s.c.SolrDeletionPolicy SolrDeletionPolicy.onCommit: commits: num=1
   [junit4]   2> 	commit{dir=MockDirectoryWrapper(RAMDirectory@c23857 lockFactory=org.apache.lucene.store.SingleInstanceLockFactory@67c47a),segFN=segments_1,generation=1}
   [junit4]   2> 1167451 INFO  (TEST-TestLazyCores.testCreateTransientFromAdmin-seed#[86700937836D4776]) [    ] o.a.s.c.SolrDeletionPolicy newest commit generation = 1
   [junit4]   2> 1167451 INFO  (OldIndexDirectoryCleanupThreadForCore-core4) [    ] o.a.s.c.SolrCore Looking for old index directories to cleanup for core core4 in /home/jenkins/workspace/Lucene-Solr-master-Linux/solr/build/solr-core/test/J1/temp/solr.core.TestLazyCores_86700937836D4776-001/tempDir-001/core4/data/
   [junit4]   2> 1167452 WARN  (OldIndexDirectoryCleanupThreadForCore-core4) [    ] o.a.s.c.DirectoryFactory /home/jenkins/workspace/Lucene-Solr-master-Linux/solr/build/solr-core/test/J1/temp/solr.core.TestLazyCores_86700937836D4776-001/tempDir-001/core4/data/ does not point to a valid data directory; skipping clean-up of old index directories.
   [junit4]   2> 1167453 INFO  (TEST-TestLazyCores.testCreateTransientFromAdmin-seed#[86700937836D4776]) [    ] o.a.s.c.SolrCore no updateRequestProcessorChain defined as default, creating implicit default
   [junit4]   2> 1167454 INFO  (TEST-TestLazyCores.testCreateTransientFromAdmin-seed#[86700937836D4776]) [    ] o.a.s.h.l.XMLLoader xsltCacheLifetimeSeconds=60
   [junit4]   2> 1167455 INFO  (TEST-TestLazyCores.testCreateTransientFromAdmin-seed#[86700937836D4776]) [    ] o.a.s.h.l.XMLLoader xsltCacheLifetimeSeconds=60
   [junit4]   2> 1167456 INFO  (TEST-TestLazyCores.testCreateTransientFromAdmin-seed#[86700937836D4776]) [    ] o.a.s.h.l.XMLLoader xsltCacheLifetimeSeconds=60
   [junit4]   2> 1167457 INFO  (TEST-TestLazyCores.testCreateTransientFromAdmin-seed#[86700937836D4776]) [    ] o.a.s.h.l.XMLLoader xsltCacheLifetimeSeconds=60
   [junit4]   2> 1167457 INFO  (TEST-TestLazyCores.testCreateTransientFromAdmin-seed#[86700937836D4776]) [    ] o.a.s.c.RequestHandlers Registered paths: /admin/mbeans,/update/csv,/sql,/update/json/docs,/admin/luke,/export,/select,/admin/segments,/get,/admin/system,/replication,/admin/properties,/config,/stream,/schema,/admin/plugins,/admin/logging,/update/json,/admin/ping,/admin/threads,/update,/admin/file
   [junit4]   2> 1167457 INFO  (TEST-TestLazyCores.testCreateTransientFromAdmin-seed#[86700937836D4776]) [    ] o.a.s.c.SolrCore Using default statsCache cache: org.apache.solr.search.stats.LocalStatsCache
   [junit4]   2> 1167458 INFO  (TEST-TestLazyCores.testCreateTransientFromAdmin-seed#[86700937836D4776]) [    ] o.a.s.u.CommitTracker Hard AutoCommit: disabled
   [junit4]   2> 1167458 INFO  (TEST-TestLazyCores.testCreateTransientFromAdmin-seed#[86700937836D4776]) [    ] o.a.s.u.CommitTracker Soft AutoCommit: disabled
   [junit4]   2> 1167458 INFO  (TEST-TestLazyCores.testCreateTransientFromAdmin-seed#[86700937836D4776]) [    ] o.a.s.u.RandomMergePolicy RandomMergePolicy wrapping class org.apache.lucene.index.LogByteSizeMergePolicy: [LogByteSizeMergePolicy: minMergeSize=1677721, mergeFactor=10, maxMergeSize=2147483648, maxMergeSizeForForcedMerge=9223372036854775807, calibrateSizeByDeletes=false, maxMergeDocs=2147483647, maxCFSSegmentSizeMB=8.796093022207999E12, noCFSRatio=0.0]
   [junit4]   2> 1167458 INFO  (TEST-TestLazyCores.testCreateTransientFromAdmin-seed#[86700937836D4776]) [    ] o.a.s.c.SolrDeletionPolicy SolrDeletionPolicy.onInit: commits: num=1
   [junit4]   2> 	commit{dir=MockDirectoryWrapper(RAMDirectory@c23857 lockFactory=org.apache.lucene.store.SingleInstanceLockFactory@67c47a),segFN=segments_1,generation=1}
   [junit4]   2> 1167458 INFO  (TEST-TestLazyCores.testCreateTransientFromAdmin-seed#[86700937836D4776]) [    ] o.a.s.c.SolrDeletionPolicy newest commit generation = 1
   [junit4]   2> 1167458 INFO  (TEST-TestLazyCores.testCreateTransientFromAdmin-seed#[86700937836D4776]) [    ] o.a.s.s.SolrIndexSearcher Opening [Searcher@1473078[core4] main]
   [junit4]   2> 1167458 INFO  (TEST-TestLazyCores.testCreateTransientFromAdmin-seed#[86700937836D4776]) [    ] o.a.s.r.ManagedResourceStorage File-based storage initialized to use dir: /home/jenkins/workspace/Lucene-Solr-master-Linux/solr/build/solr-core/test/J1/temp/solr.core.TestLazyCores_86700937836D4776-001/tempDir-001/core4/conf
   [junit4]   2> 1167458 INFO  (TEST-TestLazyCores.testCreateTransientFromAdmin-seed#[86700937836D4776]) [    ] o.a.s.r.RestManager Initializing RestManager with initArgs: {storageDir=/home/jenkins/workspace/Lucene-Solr-master-Linux/solr/build/solr-core/test/J1/temp/solr.core.TestLazyCores_86700937836D4776-001/tempDir-001/core4/conf}
   [junit4]   2> 1167458 INFO  (TEST-TestLazyCores.testCreateTransientFromAdmin-seed#[86700937836D4776]) [    ] o.a.s.r.ManagedResourceStorage Reading _rest_managed.json using file:dir=/home/jenkins/workspace/Lucene-Solr-master-Linux/solr/build/solr-core/test/J1/temp/solr.core.TestLazyCores_86700937836D4776-001/tempDir-001/core4/conf
   [junit4]   2> 1167459 INFO  (TEST-TestLazyCores.testCreateTransientFromAdmin-seed#[86700937836D4776]) [    ] o.a.s.r.RestManager Initializing 0 registered ManagedResources
   [junit4]   2> 1167459 INFO  (TEST-TestLazyCores.testCreateTransientFromAdmin-seed#[86700937836D4776]) [    ] o.a.s.h.ReplicationHandler Commits will be reserved for  10000
   [junit4]   2> 1167459 INFO  (searcherExecutor-3421-thread-1) [    ] o.a.s.c.SolrCore [core4] Registered new searcher Searcher@1473078[core4] main{ExitableDirectoryReader(UninvertingDirectoryReader())}
   [junit4]   2> 1167460 INFO  (TEST-TestLazyCores.testCreateTransientFromAdmin-seed#[86700937836D4776]) [    ] o.a.s.c.SolrCores Opening transient core core4
   [junit4]   2> 1167460 INFO  (TEST-TestLazyCores.testCreateTransientFromAdmin-seed#[86700937836D4776]) [    ] o.a.s.c.SolrCores Closing transient core [collection2]
   [junit4]   2> 1167460 INFO  (TEST-TestLazyCores.testCreateTransientFromAdmin-seed#[86700937836D4776]) [    ] o.a.s.c.CoreContainer registering core: core4
   [junit4]   2> 1167460 INFO  (Thread-2375) [    ] o.a.s.c.SolrCore [collection2]  CLOSING SolrCore org.apache.solr.core.SolrCore@9dc15f
   [junit4]   2> 1167460 INFO  (TEST-TestLazyCores.testCreateTransientFromAdmin-seed#[86700937836D4776]) [    ] o.a.s.h.a.CoreAdminOperation core create command loadOnStartup=false&transient=true&name=core5&action=CREATE&wt=xml
   [junit4]   2> 1167460 INFO  (Thread-2375) [    ] o.a.s.u.DirectUpdateHandler2 closing DirectUpdateHandler2{commits=0,autocommits=0,soft autocommits=0,optimizes=0,rollbacks=0,expungeDeletes=0,docsPending=0,adds=0,deletesById=0,deletesByQuery=0,errors=0,cumulative_adds=0,cumulative_deletesById=0,cumulative_deletesByQuery=0,cumulative_errors=0}
   [ju

[...truncated too long message...]

  2>         at java.util.concurrent.locks.AbstractQueuedSynchronizer$ConditionObject.await(java.base@9-ea/AbstractQueuedSynchronizer.java:2064)
   [junit4]   2>         at java.util.concurrent.LinkedBlockingQueue.take(java.base@9-ea/LinkedBlockingQueue.java:442)
   [junit4]   2>         at java.util.concurrent.ThreadPoolExecutor.getTask(java.base@9-ea/ThreadPoolExecutor.java:1083)
   [junit4]   2>         at java.util.concurrent.ThreadPoolExecutor.runWorker(java.base@9-ea/ThreadPoolExecutor.java:1143)
   [junit4]   2>         at java.util.concurrent.ThreadPoolExecutor$Worker.run(java.base@9-ea/ThreadPoolExecutor.java:632)
   [junit4]   2>         at java.lang.Thread.run(java.base@9-ea/Thread.java:804)
   [junit4]   2> Mar 24, 2016 9:31:06 PM com.carrotsearch.randomizedtesting.ThreadLeakControl tryToInterruptAll
   [junit4]   2> INFO: Starting to interrupt leaked threads:
   [junit4]   2>    1) Thread[id=7229, name=searcherExecutor-3512-thread-1, state=WAITING, group=TGRP-TestLazyCores]
   [junit4]   2> Mar 24, 2016 9:31:09 PM com.carrotsearch.randomizedtesting.ThreadLeakControl tryToInterruptAll
   [junit4]   2> SEVERE: There are still zombie threads that couldn't be terminated:
   [junit4]   2>    1) Thread[id=7229, name=searcherExecutor-3512-thread-1, state=WAITING, group=TGRP-TestLazyCores]
   [junit4]   2>         at jdk.internal.misc.Unsafe.park(java.base@9-ea/Native Method)
   [junit4]   2>         at java.util.concurrent.locks.LockSupport.park(java.base@9-ea/LockSupport.java:190)
   [junit4]   2>         at java.util.concurrent.locks.AbstractQueuedSynchronizer$ConditionObject.await(java.base@9-ea/AbstractQueuedSynchronizer.java:2064)
   [junit4]   2>         at java.util.concurrent.LinkedBlockingQueue.take(java.base@9-ea/LinkedBlockingQueue.java:442)
   [junit4]   2>         at java.util.concurrent.ThreadPoolExecutor.getTask(java.base@9-ea/ThreadPoolExecutor.java:1083)
   [junit4]   2>         at java.util.concurrent.ThreadPoolExecutor.runWorker(java.base@9-ea/ThreadPoolExecutor.java:1143)
   [junit4]   2>         at java.util.concurrent.ThreadPoolExecutor$Worker.run(java.base@9-ea/ThreadPoolExecutor.java:632)
   [junit4]   2>         at java.lang.Thread.run(java.base@9-ea/Thread.java:804)
   [junit4]   2> NOTE: test params are: codec=Asserting(Lucene60): {v_t=BlockTreeOrds(blocksize=128), id=BlockTreeOrds(blocksize=128), v_s=FSTOrd50, v_f=PostingsFormat(name=Memory doPackFST= false)}, docValues:{}, maxPointsInLeafNode=517, maxMBSortInHeap=5.043173495056367, sim=ClassicSimilarity, locale=ar-PS, timezone=Europe/Andorra
   [junit4]   2> NOTE: Linux 4.2.0-34-generic i386/Oracle Corporation 9-ea (32-bit)/cpus=12,threads=2,free=94892408,total=319029248
   [junit4]   2> NOTE: All tests run in this JVM: [TestSurroundQueryParser, TestCloudPivotFacet, TestHighFrequencyDictionaryFactory, TestBM25SimilarityFactory, DistributedFacetPivotWhiteBoxTest, TestHashPartitioner, RollingRestartTest, SimplePostToolTest, TermsComponentTest, OpenExchangeRatesOrgProviderTest, IndexBasedSpellCheckerTest, TestSchemaSimilarityResource, TestNRTOpen, DistribDocExpirationUpdateProcessorTest, UniqFieldsUpdateProcessorFactoryTest, TestRandomRequestDistribution, AnalyticsQueryTest, TestExactSharedStatsCache, DataDrivenBlockJoinTest, TestIntervalFaceting, OverseerStatusTest, TestSearcherReuse, FastVectorHighlighterTest, HdfsRecoveryZkTest, InfoHandlerTest, TestScoreJoinQPNoScore, TestSizeLimitedDistributedMap, TermVectorComponentTest, SortByFunctionTest, PreAnalyzedUpdateProcessorTest, TestSQLHandler, CloudMLTQParserTest, DistributedVersionInfoTest, TestImplicitCoreProperties, TestSystemIdResolver, WordBreakSolrSpellCheckerTest, CSVRequestHandlerTest, TestFieldTypeResource, TestCursorMarkWithoutUniqueKey, SpellingQueryConverterTest, SolrPluginUtilsTest, TestManagedResource, TestCustomSort, TestDocumentBuilder, BufferStoreTest, TestQuerySenderListener, HdfsBasicDistributedZkTest, TestDFISimilarityFactory, TestEmbeddedSolrServerConstructors, TestConfigSetsAPIExclusivity, ClusterStateUpdateTest, LeaderFailoverAfterPartitionTest, SparseHLLTest, TestBinaryResponseWriter, BasicFunctionalityTest, SchemaVersionSpecificBehaviorTest, TestExpandComponent, TestCollationFieldDocValues, ShardRoutingCustomTest, RankQueryTest, CollectionsAPIDistributedZkTest, BigEndianAscendingWordSerializerTest, AddBlockUpdateTest, DistributedDebugComponentTest, SolrInfoMBeanTest, DocExpirationUpdateProcessorFactoryTest, CdcrReplicationHandlerTest, HdfsWriteToMultipleCollectionsTest, DistributedMLTComponentTest, SpatialFilterTest, DistributedIntervalFacetingTest, QueryResultKeyTest, TestCoreContainer, TestDistribDocBasedVersion, OverriddenZkACLAndCredentialsProvidersTest, CoreAdminCreateDiscoverTest, ResponseHeaderTest, DirectoryFactoryTest, OpenCloseCoreStressTest, DOMUtilTest, DistanceUnitsTest, SuggesterFSTTest, TestUpdate, NotRequiredUniqueKeyTest, TestUseDocValuesAsStored, TestStressUserVersions, MultiTermTest, TestJsonFacets, SimpleCollectionCreateDeleteTest, TestQueryUtils, TestQueryWrapperFilter, TestConfigSetProperties, MoreLikeThisHandlerTest, EnumFieldTest, BasicDistributedZkTest, ShardRoutingTest, BasicZkTest, RecoveryZkTest, TestRandomFaceting, LeaderElectionTest, ZkSolrClientTest, TestDistributedGrouping, ZkControllerTest, TestJoin, TestRangeQuery, StatsComponentTest, ConvertedLegacyTest, TestSort, TestFunctionQuery, TestLazyCores]
   [junit4]   2> NOTE: reproduce with: ant test  -Dtestcase=TestLazyCores -Dtests.seed=86700937836D4776 -Dtests.multiplier=3 -Dtests.slow=true -Dtests.locale=ar-PS -Dtests.timezone=Europe/Andorra -Dtests.asserts=true -Dtests.file.encoding=US-ASCII
   [junit4] ERROR   0.00s J1 | TestLazyCores (suite) <<<
   [junit4]    > Throwable #1: java.lang.AssertionError: ObjectTracker found 4 object(s) that were not released!!! [MockDirectoryWrapper, MockDirectoryWrapper, SolrCore, MDCAwareThreadPoolExecutor]
   [junit4]    > 	at __randomizedtesting.SeedInfo.seed([86700937836D4776]:0)
   [junit4]    > 	at org.apache.solr.SolrTestCaseJ4.afterClass(SolrTestCaseJ4.java:238)
   [junit4]    > 	at java.lang.Thread.run(java.base@9-ea/Thread.java:804)Throwable #2: com.carrotsearch.randomizedtesting.ThreadLeakError: 1 thread leaked from SUITE scope at org.apache.solr.core.TestLazyCores: 
   [junit4]    >    1) Thread[id=7229, name=searcherExecutor-3512-thread-1, state=WAITING, group=TGRP-TestLazyCores]
   [junit4]    >         at jdk.internal.misc.Unsafe.park(java.base@9-ea/Native Method)
   [junit4]    >         at java.util.concurrent.locks.LockSupport.park(java.base@9-ea/LockSupport.java:190)
   [junit4]    >         at java.util.concurrent.locks.AbstractQueuedSynchronizer$ConditionObject.await(java.base@9-ea/AbstractQueuedSynchronizer.java:2064)
   [junit4]    >         at java.util.concurrent.LinkedBlockingQueue.take(java.base@9-ea/LinkedBlockingQueue.java:442)
   [junit4]    >         at java.util.concurrent.ThreadPoolExecutor.getTask(java.base@9-ea/ThreadPoolExecutor.java:1083)
   [junit4]    >         at java.util.concurrent.ThreadPoolExecutor.runWorker(java.base@9-ea/ThreadPoolExecutor.java:1143)
   [junit4]    >         at java.util.concurrent.ThreadPoolExecutor$Worker.run(java.base@9-ea/ThreadPoolExecutor.java:632)
   [junit4]    >         at java.lang.Thread.run(java.base@9-ea/Thread.java:804)
   [junit4]    > 	at __randomizedtesting.SeedInfo.seed([86700937836D4776]:0)Throwable #3: com.carrotsearch.randomizedtesting.ThreadLeakError: There are still zombie threads that couldn't be terminated:
   [junit4]    >    1) Thread[id=7229, name=searcherExecutor-3512-thread-1, state=WAITING, group=TGRP-TestLazyCores]
   [junit4]    >         at jdk.internal.misc.Unsafe.park(java.base@9-ea/Native Method)
   [junit4]    >         at java.util.concurrent.locks.LockSupport.park(java.base@9-ea/LockSupport.java:190)
   [junit4]    >         at java.util.concurrent.locks.AbstractQueuedSynchronizer$ConditionObject.await(java.base@9-ea/AbstractQueuedSynchronizer.java:2064)
   [junit4]    >         at java.util.concurrent.LinkedBlockingQueue.take(java.base@9-ea/LinkedBlockingQueue.java:442)
   [junit4]    >         at java.util.concurrent.ThreadPoolExecutor.getTask(java.base@9-ea/ThreadPoolExecutor.java:1083)
   [junit4]    >         at java.util.concurrent.ThreadPoolExecutor.runWorker(java.base@9-ea/ThreadPoolExecutor.java:1143)
   [junit4]    >         at java.util.concurrent.ThreadPoolExecutor$Worker.run(java.base@9-ea/ThreadPoolExecutor.java:632)
   [junit4]    >         at java.lang.Thread.run(java.base@9-ea/Thread.java:804)
   [junit4]    > 	at __randomizedtesting.SeedInfo.seed([86700937836D4776]:0)
   [junit4] Completed [417/581 (1!)] on J1 in 150.33s, 8 tests, 1 failure, 2 errors <<< FAILURES!

[...truncated 559 lines...]
BUILD FAILED
/home/jenkins/workspace/Lucene-Solr-master-Linux/build.xml:740: The following error occurred while executing this line:
/home/jenkins/workspace/Lucene-Solr-master-Linux/build.xml:684: The following error occurred while executing this line:
/home/jenkins/workspace/Lucene-Solr-master-Linux/build.xml:59: The following error occurred while executing this line:
/home/jenkins/workspace/Lucene-Solr-master-Linux/solr/build.xml:233: The following error occurred while executing this line:
/home/jenkins/workspace/Lucene-Solr-master-Linux/solr/common-build.xml:529: The following error occurred while executing this line:
/home/jenkins/workspace/Lucene-Solr-master-Linux/lucene/common-build.xml:1457: The following error occurred while executing this line:
/home/jenkins/workspace/Lucene-Solr-master-Linux/lucene/common-build.xml:1014: There were test failures: 581 suites (10 ignored), 2324 tests, 3 suite-level errors, 432 ignored (66 assumptions) [seed: 86700937836D4776]

Total time: 48 minutes 28 seconds
Build step 'Invoke Ant' marked build as failure
Archiving artifacts
[WARNINGS] Skipping publisher since build result is FAILURE
Recording test results
Email was triggered for: Failure - Any
Sending email for trigger: Failure - Any



Mime
View raw message