lucene-dev mailing list archives

Site index · List index
Message view « Date » · « Thread »
Top « Date » · « Thread »
From Apache Jenkins Server <jenk...@builds.apache.org>
Subject [JENKINS] Lucene-Solr-Tests-trunk-Java8 - Build # 938 - Still Failing
Date Thu, 03 Mar 2016 01:12:19 GMT
Build: https://builds.apache.org/job/Lucene-Solr-Tests-trunk-Java8/938/

1 tests failed.
FAILED:  org.apache.solr.handler.TestReqParamsAPI.test

Error Message:
Could not get expected value  'CY val' for path 'params/c' full output: {   "responseHeader":{     "status":0,     "QTime":0},   "params":{     "a":"A val",     "b":"B val",     "wt":"json",     "useParams":""},   "context":{     "webapp":"",     "path":"/dump1",     "httpMethod":"GET"}}

Stack Trace:
java.lang.AssertionError: Could not get expected value  'CY val' for path 'params/c' full output: {
  "responseHeader":{
    "status":0,
    "QTime":0},
  "params":{
    "a":"A val",
    "b":"B val",
    "wt":"json",
    "useParams":""},
  "context":{
    "webapp":"",
    "path":"/dump1",
    "httpMethod":"GET"}}
	at __randomizedtesting.SeedInfo.seed([3F8DE15F6A060C03:B7D9DE85C4FA61FB]:0)
	at org.junit.Assert.fail(Assert.java:93)
	at org.junit.Assert.assertTrue(Assert.java:43)
	at org.apache.solr.core.TestSolrConfigHandler.testForResponseElement(TestSolrConfigHandler.java:458)
	at org.apache.solr.handler.TestReqParamsAPI.testReqParams(TestReqParamsAPI.java:177)
	at org.apache.solr.handler.TestReqParamsAPI.test(TestReqParamsAPI.java:67)
	at sun.reflect.NativeMethodAccessorImpl.invoke0(Native Method)
	at sun.reflect.NativeMethodAccessorImpl.invoke(NativeMethodAccessorImpl.java:62)
	at sun.reflect.DelegatingMethodAccessorImpl.invoke(DelegatingMethodAccessorImpl.java:43)
	at java.lang.reflect.Method.invoke(Method.java:497)
	at com.carrotsearch.randomizedtesting.RandomizedRunner.invoke(RandomizedRunner.java:1764)
	at com.carrotsearch.randomizedtesting.RandomizedRunner$8.evaluate(RandomizedRunner.java:871)
	at com.carrotsearch.randomizedtesting.RandomizedRunner$9.evaluate(RandomizedRunner.java:907)
	at com.carrotsearch.randomizedtesting.RandomizedRunner$10.evaluate(RandomizedRunner.java:921)
	at org.apache.solr.BaseDistributedSearchTestCase$ShardsRepeatRule$ShardsFixedStatement.callStatement(BaseDistributedSearchTestCase.java:996)
	at org.apache.solr.BaseDistributedSearchTestCase$ShardsRepeatRule$ShardsStatement.evaluate(BaseDistributedSearchTestCase.java:971)
	at com.carrotsearch.randomizedtesting.rules.SystemPropertiesRestoreRule$1.evaluate(SystemPropertiesRestoreRule.java:57)
	at org.apache.lucene.util.TestRuleSetupTeardownChained$1.evaluate(TestRuleSetupTeardownChained.java:49)
	at org.apache.lucene.util.AbstractBeforeAfterRule$1.evaluate(AbstractBeforeAfterRule.java:45)
	at org.apache.lucene.util.TestRuleThreadAndTestName$1.evaluate(TestRuleThreadAndTestName.java:48)
	at org.apache.lucene.util.TestRuleIgnoreAfterMaxFailures$1.evaluate(TestRuleIgnoreAfterMaxFailures.java:64)
	at org.apache.lucene.util.TestRuleMarkFailure$1.evaluate(TestRuleMarkFailure.java:47)
	at com.carrotsearch.randomizedtesting.rules.StatementAdapter.evaluate(StatementAdapter.java:36)
	at com.carrotsearch.randomizedtesting.ThreadLeakControl$StatementRunner.run(ThreadLeakControl.java:367)
	at com.carrotsearch.randomizedtesting.ThreadLeakControl.forkTimeoutingTask(ThreadLeakControl.java:809)
	at com.carrotsearch.randomizedtesting.ThreadLeakControl$3.evaluate(ThreadLeakControl.java:460)
	at com.carrotsearch.randomizedtesting.RandomizedRunner.runSingleTest(RandomizedRunner.java:880)
	at com.carrotsearch.randomizedtesting.RandomizedRunner$5.evaluate(RandomizedRunner.java:781)
	at com.carrotsearch.randomizedtesting.RandomizedRunner$6.evaluate(RandomizedRunner.java:816)
	at com.carrotsearch.randomizedtesting.RandomizedRunner$7.evaluate(RandomizedRunner.java:827)
	at com.carrotsearch.randomizedtesting.rules.StatementAdapter.evaluate(StatementAdapter.java:36)
	at com.carrotsearch.randomizedtesting.rules.SystemPropertiesRestoreRule$1.evaluate(SystemPropertiesRestoreRule.java:57)
	at org.apache.lucene.util.AbstractBeforeAfterRule$1.evaluate(AbstractBeforeAfterRule.java:45)
	at com.carrotsearch.randomizedtesting.rules.StatementAdapter.evaluate(StatementAdapter.java:36)
	at org.apache.lucene.util.TestRuleStoreClassName$1.evaluate(TestRuleStoreClassName.java:41)
	at com.carrotsearch.randomizedtesting.rules.NoShadowingOrOverridesOnMethodsRule$1.evaluate(NoShadowingOrOverridesOnMethodsRule.java:40)
	at com.carrotsearch.randomizedtesting.rules.NoShadowingOrOverridesOnMethodsRule$1.evaluate(NoShadowingOrOverridesOnMethodsRule.java:40)
	at com.carrotsearch.randomizedtesting.rules.StatementAdapter.evaluate(StatementAdapter.java:36)
	at com.carrotsearch.randomizedtesting.rules.StatementAdapter.evaluate(StatementAdapter.java:36)
	at com.carrotsearch.randomizedtesting.rules.StatementAdapter.evaluate(StatementAdapter.java:36)
	at org.apache.lucene.util.TestRuleAssertionsRequired$1.evaluate(TestRuleAssertionsRequired.java:53)
	at org.apache.lucene.util.TestRuleMarkFailure$1.evaluate(TestRuleMarkFailure.java:47)
	at org.apache.lucene.util.TestRuleIgnoreAfterMaxFailures$1.evaluate(TestRuleIgnoreAfterMaxFailures.java:64)
	at org.apache.lucene.util.TestRuleIgnoreTestSuites$1.evaluate(TestRuleIgnoreTestSuites.java:54)
	at com.carrotsearch.randomizedtesting.rules.StatementAdapter.evaluate(StatementAdapter.java:36)
	at com.carrotsearch.randomizedtesting.ThreadLeakControl$StatementRunner.run(ThreadLeakControl.java:367)
	at java.lang.Thread.run(Thread.java:745)




Build Log:
[...truncated 12098 lines...]
   [junit4] Suite: org.apache.solr.handler.TestReqParamsAPI
   [junit4]   2> Creating dataDir: /x1/jenkins/jenkins-slave/workspace/Lucene-Solr-Tests-trunk-Java8/solr/build/solr-core/test/J1/temp/solr.handler.TestReqParamsAPI_3F8DE15F6A060C03-001/init-core-data-001
   [junit4]   2> 1777155 INFO  (SUITE-TestReqParamsAPI-seed#[3F8DE15F6A060C03]-worker) [    ] o.a.s.SolrTestCaseJ4 Randomized ssl (true) and clientAuth (false)
   [junit4]   2> 1777155 INFO  (SUITE-TestReqParamsAPI-seed#[3F8DE15F6A060C03]-worker) [    ] o.a.s.BaseDistributedSearchTestCase Setting hostContext system property: /
   [junit4]   2> 1777158 INFO  (TEST-TestReqParamsAPI.test-seed#[3F8DE15F6A060C03]) [    ] o.a.s.c.ZkTestServer STARTING ZK TEST SERVER
   [junit4]   2> 1777159 INFO  (Thread-7154) [    ] o.a.s.c.ZkTestServer client port:0.0.0.0/0.0.0.0:0
   [junit4]   2> 1777159 INFO  (Thread-7154) [    ] o.a.s.c.ZkTestServer Starting server
   [junit4]   2> 1777259 INFO  (TEST-TestReqParamsAPI.test-seed#[3F8DE15F6A060C03]) [    ] o.a.s.c.ZkTestServer start zk server on port:53355
   [junit4]   2> 1777259 INFO  (TEST-TestReqParamsAPI.test-seed#[3F8DE15F6A060C03]) [    ] o.a.s.c.c.SolrZkClient Using default ZkCredentialsProvider
   [junit4]   2> 1777259 INFO  (TEST-TestReqParamsAPI.test-seed#[3F8DE15F6A060C03]) [    ] o.a.s.c.c.ConnectionManager Waiting for client to connect to ZooKeeper
   [junit4]   2> 1777263 INFO  (zkCallback-2961-thread-1) [    ] o.a.s.c.c.ConnectionManager Watcher org.apache.solr.common.cloud.ConnectionManager@7c4591e2 name:ZooKeeperConnection Watcher:127.0.0.1:53355 got event WatchedEvent state:SyncConnected type:None path:null path:null type:None
   [junit4]   2> 1777263 INFO  (TEST-TestReqParamsAPI.test-seed#[3F8DE15F6A060C03]) [    ] o.a.s.c.c.ConnectionManager Client is connected to ZooKeeper
   [junit4]   2> 1777263 INFO  (TEST-TestReqParamsAPI.test-seed#[3F8DE15F6A060C03]) [    ] o.a.s.c.c.SolrZkClient Using default ZkACLProvider
   [junit4]   2> 1777263 INFO  (TEST-TestReqParamsAPI.test-seed#[3F8DE15F6A060C03]) [    ] o.a.s.c.c.SolrZkClient makePath: /solr
   [junit4]   2> 1777266 INFO  (TEST-TestReqParamsAPI.test-seed#[3F8DE15F6A060C03]) [    ] o.a.s.c.c.SolrZkClient Using default ZkCredentialsProvider
   [junit4]   2> 1777267 INFO  (TEST-TestReqParamsAPI.test-seed#[3F8DE15F6A060C03]) [    ] o.a.s.c.c.ConnectionManager Waiting for client to connect to ZooKeeper
   [junit4]   2> 1777268 INFO  (zkCallback-2962-thread-1) [    ] o.a.s.c.c.ConnectionManager Watcher org.apache.solr.common.cloud.ConnectionManager@24b7b206 name:ZooKeeperConnection Watcher:127.0.0.1:53355/solr got event WatchedEvent state:SyncConnected type:None path:null path:null type:None
   [junit4]   2> 1777268 INFO  (TEST-TestReqParamsAPI.test-seed#[3F8DE15F6A060C03]) [    ] o.a.s.c.c.ConnectionManager Client is connected to ZooKeeper
   [junit4]   2> 1777268 INFO  (TEST-TestReqParamsAPI.test-seed#[3F8DE15F6A060C03]) [    ] o.a.s.c.c.SolrZkClient Using default ZkACLProvider
   [junit4]   2> 1777269 INFO  (TEST-TestReqParamsAPI.test-seed#[3F8DE15F6A060C03]) [    ] o.a.s.c.c.SolrZkClient makePath: /collections/collection1
   [junit4]   2> 1777271 INFO  (TEST-TestReqParamsAPI.test-seed#[3F8DE15F6A060C03]) [    ] o.a.s.c.c.SolrZkClient makePath: /collections/collection1/shards
   [junit4]   2> 1777273 INFO  (TEST-TestReqParamsAPI.test-seed#[3F8DE15F6A060C03]) [    ] o.a.s.c.c.SolrZkClient makePath: /collections/control_collection
   [junit4]   2> 1777274 INFO  (TEST-TestReqParamsAPI.test-seed#[3F8DE15F6A060C03]) [    ] o.a.s.c.c.SolrZkClient makePath: /collections/control_collection/shards
   [junit4]   2> 1777275 INFO  (TEST-TestReqParamsAPI.test-seed#[3F8DE15F6A060C03]) [    ] o.a.s.c.AbstractZkTestCase put /x1/jenkins/jenkins-slave/workspace/Lucene-Solr-Tests-trunk-Java8/solr/core/src/test-files/solr/collection1/conf/solrconfig-tlog.xml to /configs/conf1/solrconfig.xml
   [junit4]   2> 1777276 INFO  (TEST-TestReqParamsAPI.test-seed#[3F8DE15F6A060C03]) [    ] o.a.s.c.c.SolrZkClient makePath: /configs/conf1/solrconfig.xml
   [junit4]   2> 1777278 INFO  (TEST-TestReqParamsAPI.test-seed#[3F8DE15F6A060C03]) [    ] o.a.s.c.AbstractZkTestCase put /x1/jenkins/jenkins-slave/workspace/Lucene-Solr-Tests-trunk-Java8/solr/core/src/test-files/solr/collection1/conf/schema.xml to /configs/conf1/schema.xml
   [junit4]   2> 1777278 INFO  (TEST-TestReqParamsAPI.test-seed#[3F8DE15F6A060C03]) [    ] o.a.s.c.c.SolrZkClient makePath: /configs/conf1/schema.xml
   [junit4]   2> 1777280 INFO  (TEST-TestReqParamsAPI.test-seed#[3F8DE15F6A060C03]) [    ] o.a.s.c.AbstractZkTestCase put /x1/jenkins/jenkins-slave/workspace/Lucene-Solr-Tests-trunk-Java8/solr/core/src/test-files/solr/collection1/conf/solrconfig.snippet.randomindexconfig.xml to /configs/conf1/solrconfig.snippet.randomindexconfig.xml
   [junit4]   2> 1777280 INFO  (TEST-TestReqParamsAPI.test-seed#[3F8DE15F6A060C03]) [    ] o.a.s.c.c.SolrZkClient makePath: /configs/conf1/solrconfig.snippet.randomindexconfig.xml
   [junit4]   2> 1777281 INFO  (TEST-TestReqParamsAPI.test-seed#[3F8DE15F6A060C03]) [    ] o.a.s.c.AbstractZkTestCase put /x1/jenkins/jenkins-slave/workspace/Lucene-Solr-Tests-trunk-Java8/solr/core/src/test-files/solr/collection1/conf/stopwords.txt to /configs/conf1/stopwords.txt
   [junit4]   2> 1777281 INFO  (TEST-TestReqParamsAPI.test-seed#[3F8DE15F6A060C03]) [    ] o.a.s.c.c.SolrZkClient makePath: /configs/conf1/stopwords.txt
   [junit4]   2> 1777283 INFO  (TEST-TestReqParamsAPI.test-seed#[3F8DE15F6A060C03]) [    ] o.a.s.c.AbstractZkTestCase put /x1/jenkins/jenkins-slave/workspace/Lucene-Solr-Tests-trunk-Java8/solr/core/src/test-files/solr/collection1/conf/protwords.txt to /configs/conf1/protwords.txt
   [junit4]   2> 1777283 INFO  (TEST-TestReqParamsAPI.test-seed#[3F8DE15F6A060C03]) [    ] o.a.s.c.c.SolrZkClient makePath: /configs/conf1/protwords.txt
   [junit4]   2> 1777285 INFO  (TEST-TestReqParamsAPI.test-seed#[3F8DE15F6A060C03]) [    ] o.a.s.c.AbstractZkTestCase put /x1/jenkins/jenkins-slave/workspace/Lucene-Solr-Tests-trunk-Java8/solr/core/src/test-files/solr/collection1/conf/currency.xml to /configs/conf1/currency.xml
   [junit4]   2> 1777285 INFO  (TEST-TestReqParamsAPI.test-seed#[3F8DE15F6A060C03]) [    ] o.a.s.c.c.SolrZkClient makePath: /configs/conf1/currency.xml
   [junit4]   2> 1777287 INFO  (TEST-TestReqParamsAPI.test-seed#[3F8DE15F6A060C03]) [    ] o.a.s.c.AbstractZkTestCase put /x1/jenkins/jenkins-slave/workspace/Lucene-Solr-Tests-trunk-Java8/solr/core/src/test-files/solr/collection1/conf/enumsConfig.xml to /configs/conf1/enumsConfig.xml
   [junit4]   2> 1777287 INFO  (TEST-TestReqParamsAPI.test-seed#[3F8DE15F6A060C03]) [    ] o.a.s.c.c.SolrZkClient makePath: /configs/conf1/enumsConfig.xml
   [junit4]   2> 1777289 INFO  (TEST-TestReqParamsAPI.test-seed#[3F8DE15F6A060C03]) [    ] o.a.s.c.AbstractZkTestCase put /x1/jenkins/jenkins-slave/workspace/Lucene-Solr-Tests-trunk-Java8/solr/core/src/test-files/solr/collection1/conf/open-exchange-rates.json to /configs/conf1/open-exchange-rates.json
   [junit4]   2> 1777289 INFO  (TEST-TestReqParamsAPI.test-seed#[3F8DE15F6A060C03]) [    ] o.a.s.c.c.SolrZkClient makePath: /configs/conf1/open-exchange-rates.json
   [junit4]   2> 1777290 INFO  (TEST-TestReqParamsAPI.test-seed#[3F8DE15F6A060C03]) [    ] o.a.s.c.AbstractZkTestCase put /x1/jenkins/jenkins-slave/workspace/Lucene-Solr-Tests-trunk-Java8/solr/core/src/test-files/solr/collection1/conf/mapping-ISOLatin1Accent.txt to /configs/conf1/mapping-ISOLatin1Accent.txt
   [junit4]   2> 1777290 INFO  (TEST-TestReqParamsAPI.test-seed#[3F8DE15F6A060C03]) [    ] o.a.s.c.c.SolrZkClient makePath: /configs/conf1/mapping-ISOLatin1Accent.txt
   [junit4]   2> 1777292 INFO  (TEST-TestReqParamsAPI.test-seed#[3F8DE15F6A060C03]) [    ] o.a.s.c.AbstractZkTestCase put /x1/jenkins/jenkins-slave/workspace/Lucene-Solr-Tests-trunk-Java8/solr/core/src/test-files/solr/collection1/conf/old_synonyms.txt to /configs/conf1/old_synonyms.txt
   [junit4]   2> 1777292 INFO  (TEST-TestReqParamsAPI.test-seed#[3F8DE15F6A060C03]) [    ] o.a.s.c.c.SolrZkClient makePath: /configs/conf1/old_synonyms.txt
   [junit4]   2> 1777294 INFO  (TEST-TestReqParamsAPI.test-seed#[3F8DE15F6A060C03]) [    ] o.a.s.c.AbstractZkTestCase put /x1/jenkins/jenkins-slave/workspace/Lucene-Solr-Tests-trunk-Java8/solr/core/src/test-files/solr/collection1/conf/synonyms.txt to /configs/conf1/synonyms.txt
   [junit4]   2> 1777294 INFO  (TEST-TestReqParamsAPI.test-seed#[3F8DE15F6A060C03]) [    ] o.a.s.c.c.SolrZkClient makePath: /configs/conf1/synonyms.txt
   [junit4]   2> 1777296 WARN  (NIOServerCxn.Factory:0.0.0.0/0.0.0.0:0) [    ] o.a.z.s.NIOServerCnxn caught end of stream exception
   [junit4]   2> EndOfStreamException: Unable to read additional data from client sessionid 0x1533a0363aa0001, likely client has closed socket
   [junit4]   2> 	at org.apache.zookeeper.server.NIOServerCnxn.doIO(NIOServerCnxn.java:228)
   [junit4]   2> 	at org.apache.zookeeper.server.NIOServerCnxnFactory.run(NIOServerCnxnFactory.java:208)
   [junit4]   2> 	at java.lang.Thread.run(Thread.java:745)
   [junit4]   2> 1777296 INFO  (TEST-TestReqParamsAPI.test-seed#[3F8DE15F6A060C03]) [    ] o.a.s.c.c.SolrZkClient Using default ZkCredentialsProvider
   [junit4]   2> 1777296 INFO  (TEST-TestReqParamsAPI.test-seed#[3F8DE15F6A060C03]) [    ] o.a.s.c.c.ConnectionManager Waiting for client to connect to ZooKeeper
   [junit4]   2> 1777297 INFO  (zkCallback-2963-thread-1) [    ] o.a.s.c.c.ConnectionManager Watcher org.apache.solr.common.cloud.ConnectionManager@62b36a4 name:ZooKeeperConnection Watcher:127.0.0.1:53355/solr got event WatchedEvent state:SyncConnected type:None path:null path:null type:None
   [junit4]   2> 1777297 INFO  (TEST-TestReqParamsAPI.test-seed#[3F8DE15F6A060C03]) [    ] o.a.s.c.c.ConnectionManager Client is connected to ZooKeeper
   [junit4]   2> 1777298 INFO  (TEST-TestReqParamsAPI.test-seed#[3F8DE15F6A060C03]) [    ] o.a.s.c.c.SolrZkClient Using default ZkACLProvider
   [junit4]   2> 1777398 INFO  (TEST-TestReqParamsAPI.test-seed#[3F8DE15F6A060C03]) [    ] o.a.s.SolrTestCaseJ4 Writing core.properties file to /x1/jenkins/jenkins-slave/workspace/Lucene-Solr-Tests-trunk-Java8/solr/build/solr-core/test/J1/temp/solr.handler.TestReqParamsAPI_3F8DE15F6A060C03-001/control-001/cores/collection1
   [junit4]   2> 1777401 INFO  (TEST-TestReqParamsAPI.test-seed#[3F8DE15F6A060C03]) [    ] o.e.j.s.Server jetty-9.3.6.v20151106
   [junit4]   2> 1777403 INFO  (TEST-TestReqParamsAPI.test-seed#[3F8DE15F6A060C03]) [    ] o.e.j.s.h.ContextHandler Started o.e.j.s.ServletContextHandler@1fac9103{/,null,AVAILABLE}
   [junit4]   2> 1777404 INFO  (TEST-TestReqParamsAPI.test-seed#[3F8DE15F6A060C03]) [    ] o.e.j.u.s.SslContextFactory x509=X509@25e9ce91(solrtest,h=[],w=[]) for SslContextFactory@205dd11e(file:///x1/jenkins/jenkins-slave/workspace/Lucene-Solr-Tests-trunk-Java8/solr/server/etc/test/solrtest.keystore,file:///x1/jenkins/jenkins-slave/workspace/Lucene-Solr-Tests-trunk-Java8/solr/server/etc/test/solrtest.keystore)
   [junit4]   2> 1777407 INFO  (TEST-TestReqParamsAPI.test-seed#[3F8DE15F6A060C03]) [    ] o.e.j.s.ServerConnector Started ServerConnector@3db65cd2{SSL,[ssl, http/1.1]}{127.0.0.1:49557}
   [junit4]   2> 1777408 INFO  (TEST-TestReqParamsAPI.test-seed#[3F8DE15F6A060C03]) [    ] o.e.j.s.Server Started @1780896ms
   [junit4]   2> 1777408 INFO  (TEST-TestReqParamsAPI.test-seed#[3F8DE15F6A060C03]) [    ] o.a.s.c.s.e.JettySolrRunner Jetty properties: {solr.data.dir=/x1/jenkins/jenkins-slave/workspace/Lucene-Solr-Tests-trunk-Java8/solr/build/solr-core/test/J1/temp/solr.handler.TestReqParamsAPI_3F8DE15F6A060C03-001/tempDir-001/control/data, hostContext=/, hostPort=49557, coreRootDirectory=/x1/jenkins/jenkins-slave/workspace/Lucene-Solr-Tests-trunk-Java8/solr/build/solr-core/test/J1/../../../../../../../../../../x1/jenkins/jenkins-slave/workspace/Lucene-Solr-Tests-trunk-Java8/solr/build/solr-core/test/J1/temp/solr.handler.TestReqParamsAPI_3F8DE15F6A060C03-001/control-001/cores}
   [junit4]   2> 1777408 INFO  (TEST-TestReqParamsAPI.test-seed#[3F8DE15F6A060C03]) [    ] o.a.s.s.SolrDispatchFilter SolrDispatchFilter.init(): sun.misc.Launcher$AppClassLoader@4e0e2f2a
   [junit4]   2> 1777408 INFO  (TEST-TestReqParamsAPI.test-seed#[3F8DE15F6A060C03]) [    ] o.a.s.c.SolrResourceLoader new SolrResourceLoader for directory: '/x1/jenkins/jenkins-slave/workspace/Lucene-Solr-Tests-trunk-Java8/solr/build/solr-core/test/J1/temp/solr.handler.TestReqParamsAPI_3F8DE15F6A060C03-001/control-001'
   [junit4]   2> 1777408 INFO  (TEST-TestReqParamsAPI.test-seed#[3F8DE15F6A060C03]) [    ] o.a.s.c.SolrResourceLoader JNDI not configured for solr (NoInitialContextEx)
   [junit4]   2> 1777408 INFO  (TEST-TestReqParamsAPI.test-seed#[3F8DE15F6A060C03]) [    ] o.a.s.c.SolrResourceLoader solr home defaulted to 'solr/' (could not find system property or JNDI)
   [junit4]   2> 1777409 INFO  (TEST-TestReqParamsAPI.test-seed#[3F8DE15F6A060C03]) [    ] o.a.s.c.c.SolrZkClient Using default ZkCredentialsProvider
   [junit4]   2> 1777409 INFO  (TEST-TestReqParamsAPI.test-seed#[3F8DE15F6A060C03]) [    ] o.a.s.c.c.ConnectionManager Waiting for client to connect to ZooKeeper
   [junit4]   2> 1777414 INFO  (zkCallback-2964-thread-1) [    ] o.a.s.c.c.ConnectionManager Watcher org.apache.solr.common.cloud.ConnectionManager@7f6df74e name:ZooKeeperConnection Watcher:127.0.0.1:53355/solr got event WatchedEvent state:SyncConnected type:None path:null path:null type:None
   [junit4]   2> 1777414 INFO  (TEST-TestReqParamsAPI.test-seed#[3F8DE15F6A060C03]) [    ] o.a.s.c.c.ConnectionManager Client is connected to ZooKeeper
   [junit4]   2> 1777415 INFO  (TEST-TestReqParamsAPI.test-seed#[3F8DE15F6A060C03]) [    ] o.a.s.c.c.SolrZkClient Using default ZkACLProvider
   [junit4]   2> 1777415 INFO  (TEST-TestReqParamsAPI.test-seed#[3F8DE15F6A060C03]) [    ] o.a.s.s.SolrDispatchFilter Loading solr.xml from SolrHome (not found in ZooKeeper)
   [junit4]   2> 1777415 INFO  (TEST-TestReqParamsAPI.test-seed#[3F8DE15F6A060C03]) [    ] o.a.s.c.SolrXmlConfig Loading container configuration from /x1/jenkins/jenkins-slave/workspace/Lucene-Solr-Tests-trunk-Java8/solr/build/solr-core/test/J1/temp/solr.handler.TestReqParamsAPI_3F8DE15F6A060C03-001/control-001/solr.xml
   [junit4]   2> 1777420 INFO  (TEST-TestReqParamsAPI.test-seed#[3F8DE15F6A060C03]) [    ] o.a.s.c.CorePropertiesLocator Config-defined core root directory: /x1/jenkins/jenkins-slave/workspace/Lucene-Solr-Tests-trunk-Java8/solr/build/solr-core/test/J1/../../../../../../../../../../x1/jenkins/jenkins-slave/workspace/Lucene-Solr-Tests-trunk-Java8/solr/build/solr-core/test/J1/temp/solr.handler.TestReqParamsAPI_3F8DE15F6A060C03-001/control-001/cores
   [junit4]   2> 1777420 INFO  (TEST-TestReqParamsAPI.test-seed#[3F8DE15F6A060C03]) [    ] o.a.s.c.CoreContainer New CoreContainer 165772015
   [junit4]   2> 1777420 INFO  (TEST-TestReqParamsAPI.test-seed#[3F8DE15F6A060C03]) [    ] o.a.s.c.CoreContainer Loading cores into CoreContainer [instanceDir=/x1/jenkins/jenkins-slave/workspace/Lucene-Solr-Tests-trunk-Java8/solr/build/solr-core/test/J1/temp/solr.handler.TestReqParamsAPI_3F8DE15F6A060C03-001/control-001]
   [junit4]   2> 1777420 WARN  (TEST-TestReqParamsAPI.test-seed#[3F8DE15F6A060C03]) [    ] o.a.s.c.CoreContainer Couldn't add files from /x1/jenkins/jenkins-slave/workspace/Lucene-Solr-Tests-trunk-Java8/solr/build/solr-core/test/J1/temp/solr.handler.TestReqParamsAPI_3F8DE15F6A060C03-001/control-001/lib to classpath: /x1/jenkins/jenkins-slave/workspace/Lucene-Solr-Tests-trunk-Java8/solr/build/solr-core/test/J1/temp/solr.handler.TestReqParamsAPI_3F8DE15F6A060C03-001/control-001/lib
   [junit4]   2> 1777421 INFO  (TEST-TestReqParamsAPI.test-seed#[3F8DE15F6A060C03]) [    ] o.a.s.h.c.HttpShardHandlerFactory created with socketTimeout : 90000,urlScheme : ,connTimeout : 15000,maxConnectionsPerHost : 20,maxConnections : 10000,corePoolSize : 0,maximumPoolSize : 2147483647,maxThreadIdleTime : 5,sizeOfQueue : -1,fairnessPolicy : false,useRetries : false,
   [junit4]   2> 1777423 INFO  (TEST-TestReqParamsAPI.test-seed#[3F8DE15F6A060C03]) [    ] o.a.s.u.UpdateShardHandler Creating UpdateShardHandler HTTP client with params: socketTimeout=340000&connTimeout=45000&retry=true
   [junit4]   2> 1777424 INFO  (TEST-TestReqParamsAPI.test-seed#[3F8DE15F6A060C03]) [    ] o.a.s.l.LogWatcher SLF4J impl is org.slf4j.impl.Log4jLoggerFactory
   [junit4]   2> 1777424 INFO  (TEST-TestReqParamsAPI.test-seed#[3F8DE15F6A060C03]) [    ] o.a.s.l.LogWatcher Registering Log Listener [Log4j (org.slf4j.impl.Log4jLoggerFactory)]
   [junit4]   2> 1777424 INFO  (TEST-TestReqParamsAPI.test-seed#[3F8DE15F6A060C03]) [    ] o.a.s.c.ZkContainer Zookeeper client=127.0.0.1:53355/solr
   [junit4]   2> 1777424 INFO  (TEST-TestReqParamsAPI.test-seed#[3F8DE15F6A060C03]) [    ] o.a.s.c.ZkController zkHost includes chroot
   [junit4]   2> 1777424 INFO  (TEST-TestReqParamsAPI.test-seed#[3F8DE15F6A060C03]) [    ] o.a.s.c.c.SolrZkClient Using default ZkCredentialsProvider
   [junit4]   2> 1777425 INFO  (TEST-TestReqParamsAPI.test-seed#[3F8DE15F6A060C03]) [    ] o.a.s.c.c.ConnectionManager Waiting for client to connect to ZooKeeper
   [junit4]   2> 1777426 INFO  (zkCallback-2967-thread-1) [    ] o.a.s.c.c.ConnectionManager Watcher org.apache.solr.common.cloud.ConnectionManager@415a6c5c name:ZooKeeperConnection Watcher:127.0.0.1:53355 got event WatchedEvent state:SyncConnected type:None path:null path:null type:None
   [junit4]   2> 1777426 INFO  (TEST-TestReqParamsAPI.test-seed#[3F8DE15F6A060C03]) [    ] o.a.s.c.c.ConnectionManager Client is connected to ZooKeeper
   [junit4]   2> 1777427 INFO  (TEST-TestReqParamsAPI.test-seed#[3F8DE15F6A060C03]) [    ] o.a.s.c.c.SolrZkClient Using default ZkACLProvider
   [junit4]   2> 1777428 INFO  (TEST-TestReqParamsAPI.test-seed#[3F8DE15F6A060C03]) [n:127.0.0.1:49557_    ] o.a.s.c.c.ConnectionManager Waiting for client to connect to ZooKeeper
   [junit4]   2> 1777429 INFO  (zkCallback-2968-thread-1-processing-n:127.0.0.1:49557_) [n:127.0.0.1:49557_    ] o.a.s.c.c.ConnectionManager Watcher org.apache.solr.common.cloud.ConnectionManager@18104a48 name:ZooKeeperConnection Watcher:127.0.0.1:53355/solr got event WatchedEvent state:SyncConnected type:None path:null path:null type:None
   [junit4]   2> 1777429 INFO  (TEST-TestReqParamsAPI.test-seed#[3F8DE15F6A060C03]) [n:127.0.0.1:49557_    ] o.a.s.c.c.ConnectionManager Client is connected to ZooKeeper
   [junit4]   2> 1777430 INFO  (TEST-TestReqParamsAPI.test-seed#[3F8DE15F6A060C03]) [n:127.0.0.1:49557_    ] o.a.s.c.c.SolrZkClient makePath: /overseer/queue
   [junit4]   2> 1777431 INFO  (TEST-TestReqParamsAPI.test-seed#[3F8DE15F6A060C03]) [n:127.0.0.1:49557_    ] o.a.s.c.c.SolrZkClient makePath: /overseer/collection-queue-work
   [junit4]   2> 1777434 INFO  (TEST-TestReqParamsAPI.test-seed#[3F8DE15F6A060C03]) [n:127.0.0.1:49557_    ] o.a.s.c.c.SolrZkClient makePath: /overseer/collection-map-running
   [junit4]   2> 1777436 INFO  (TEST-TestReqParamsAPI.test-seed#[3F8DE15F6A060C03]) [n:127.0.0.1:49557_    ] o.a.s.c.c.SolrZkClient makePath: /overseer/collection-map-completed
   [junit4]   2> 1777437 INFO  (TEST-TestReqParamsAPI.test-seed#[3F8DE15F6A060C03]) [n:127.0.0.1:49557_    ] o.a.s.c.c.SolrZkClient makePath: /overseer/collection-map-failure
   [junit4]   2> 1777439 INFO  (TEST-TestReqParamsAPI.test-seed#[3F8DE15F6A060C03]) [n:127.0.0.1:49557_    ] o.a.s.c.c.SolrZkClient makePath: /live_nodes
   [junit4]   2> 1777440 INFO  (TEST-TestReqParamsAPI.test-seed#[3F8DE15F6A060C03]) [n:127.0.0.1:49557_    ] o.a.s.c.c.SolrZkClient makePath: /aliases.json
   [junit4]   2> 1777442 INFO  (TEST-TestReqParamsAPI.test-seed#[3F8DE15F6A060C03]) [n:127.0.0.1:49557_    ] o.a.s.c.c.SolrZkClient makePath: /clusterstate.json
   [junit4]   2> 1777443 INFO  (TEST-TestReqParamsAPI.test-seed#[3F8DE15F6A060C03]) [n:127.0.0.1:49557_    ] o.a.s.c.c.SolrZkClient makePath: /security.json
   [junit4]   2> 1777443 INFO  (TEST-TestReqParamsAPI.test-seed#[3F8DE15F6A060C03]) [n:127.0.0.1:49557_    ] o.a.s.c.c.ZkStateReader Updating cluster state from ZooKeeper... 
   [junit4]   2> 1777444 INFO  (TEST-TestReqParamsAPI.test-seed#[3F8DE15F6A060C03]) [n:127.0.0.1:49557_    ] o.a.s.c.c.ZkStateReader Updated live nodes from ZooKeeper... (0) -> (0)
   [junit4]   2> 1777446 INFO  (TEST-TestReqParamsAPI.test-seed#[3F8DE15F6A060C03]) [n:127.0.0.1:49557_    ] o.a.s.c.c.SolrZkClient makePath: /overseer_elect
   [junit4]   2> 1777447 INFO  (TEST-TestReqParamsAPI.test-seed#[3F8DE15F6A060C03]) [n:127.0.0.1:49557_    ] o.a.s.c.c.SolrZkClient makePath: /overseer_elect/election
   [junit4]   2> 1777448 INFO  (TEST-TestReqParamsAPI.test-seed#[3F8DE15F6A060C03]) [n:127.0.0.1:49557_    ] o.a.s.c.Overseer Overseer (id=null) closing
   [junit4]   2> 1777449 INFO  (TEST-TestReqParamsAPI.test-seed#[3F8DE15F6A060C03]) [n:127.0.0.1:49557_    ] o.a.s.c.LeaderElector Joined leadership election with path: /overseer_elect/election/95483803336310789-127.0.0.1:49557_-n_0000000000
   [junit4]   2> 1777449 INFO  (TEST-TestReqParamsAPI.test-seed#[3F8DE15F6A060C03]) [n:127.0.0.1:49557_    ] o.a.s.c.OverseerElectionContext I am going to be the leader 127.0.0.1:49557_
   [junit4]   2> 1777449 INFO  (TEST-TestReqParamsAPI.test-seed#[3F8DE15F6A060C03]) [n:127.0.0.1:49557_    ] o.a.s.c.c.SolrZkClient makePath: /overseer_elect/leader
   [junit4]   2> 1777450 INFO  (TEST-TestReqParamsAPI.test-seed#[3F8DE15F6A060C03]) [n:127.0.0.1:49557_    ] o.a.s.c.Overseer Overseer (id=95483803336310789-127.0.0.1:49557_-n_0000000000) starting
   [junit4]   2> 1777452 INFO  (TEST-TestReqParamsAPI.test-seed#[3F8DE15F6A060C03]) [n:127.0.0.1:49557_    ] o.a.s.c.c.SolrZkClient makePath: /overseer/queue-work
   [junit4]   2> 1777458 INFO  (TEST-TestReqParamsAPI.test-seed#[3F8DE15F6A060C03]) [n:127.0.0.1:49557_    ] o.a.s.c.OverseerAutoReplicaFailoverThread Starting OverseerAutoReplicaFailoverThread autoReplicaFailoverWorkLoopDelay=10000 autoReplicaFailoverWaitAfterExpiration=30000 autoReplicaFailoverBadNodeExpiration=60000
   [junit4]   2> 1777459 INFO  (OverseerCollectionConfigSetProcessor-95483803336310789-127.0.0.1:49557_-n_0000000000) [n:127.0.0.1:49557_    ] o.a.s.c.OverseerTaskProcessor Process current queue of overseer operations
   [junit4]   2> 1777460 INFO  (OverseerStateUpdate-95483803336310789-127.0.0.1:49557_-n_0000000000) [n:127.0.0.1:49557_    ] o.a.s.c.Overseer Starting to work on the main queue
   [junit4]   2> 1777460 INFO  (TEST-TestReqParamsAPI.test-seed#[3F8DE15F6A060C03]) [n:127.0.0.1:49557_    ] o.a.s.c.ZkController Register node as live in ZooKeeper:/live_nodes/127.0.0.1:49557_
   [junit4]   2> 1777461 INFO  (TEST-TestReqParamsAPI.test-seed#[3F8DE15F6A060C03]) [n:127.0.0.1:49557_    ] o.a.s.c.c.SolrZkClient makePath: /live_nodes/127.0.0.1:49557_
   [junit4]   2> 1777463 INFO  (zkCallback-2968-thread-1-processing-n:127.0.0.1:49557_) [n:127.0.0.1:49557_    ] o.a.s.c.c.ZkStateReader A live node change: [WatchedEvent state:SyncConnected type:NodeChildrenChanged path:/live_nodes], has occurred - updating... (live nodes size: [0])
   [junit4]   2> 1777464 INFO  (OverseerStateUpdate-95483803336310789-127.0.0.1:49557_-n_0000000000) [n:127.0.0.1:49557_    ] o.a.s.c.c.ZkStateReader Updated live nodes from ZooKeeper... (0) -> (1)
   [junit4]   2> 1777464 INFO  (zkCallback-2968-thread-1-processing-n:127.0.0.1:49557_) [n:127.0.0.1:49557_    ] o.a.s.c.c.ZkStateReader Updated live nodes from ZooKeeper... (1) -> (1)
   [junit4]   2> 1777476 INFO  (TEST-TestReqParamsAPI.test-seed#[3F8DE15F6A060C03]) [n:127.0.0.1:49557_    ] o.a.s.c.CoreContainer Security conf doesn't exist. Skipping setup for authorization module.
   [junit4]   2> 1777476 INFO  (TEST-TestReqParamsAPI.test-seed#[3F8DE15F6A060C03]) [n:127.0.0.1:49557_    ] o.a.s.c.CoreContainer No authentication plugin used.
   [junit4]   2> 1777477 INFO  (TEST-TestReqParamsAPI.test-seed#[3F8DE15F6A060C03]) [n:127.0.0.1:49557_    ] o.a.s.c.CorePropertiesLocator Looking for core definitions underneath /x1/jenkins/jenkins-slave/workspace/Lucene-Solr-Tests-trunk-Java8/solr/build/solr-core/test/J1/../../../../../../../../../../x1/jenkins/jenkins-slave/workspace/Lucene-Solr-Tests-trunk-Java8/solr/build/solr-core/test/J1/temp/solr.handler.TestReqParamsAPI_3F8DE15F6A060C03-001/control-001/cores
   [junit4]   2> 1777478 INFO  (TEST-TestReqParamsAPI.test-seed#[3F8DE15F6A060C03]) [n:127.0.0.1:49557_    ] o.a.s.c.CoreDescriptor Created CoreDescriptor: {name=collection1, config=solrconfig.xml, transient=false, schema=schema.xml, loadOnStartup=true, configSetProperties=configsetprops.json, collection=control_collection, coreNodeName=, dataDir=data/, shard=}
   [junit4]   2> 1777478 INFO  (TEST-TestReqParamsAPI.test-seed#[3F8DE15F6A060C03]) [n:127.0.0.1:49557_    ] o.a.s.c.CorePropertiesLocator Found core collection1 in /x1/jenkins/jenkins-slave/workspace/Lucene-Solr-Tests-trunk-Java8/solr/build/solr-core/test/J1/../../../../../../../../../../x1/jenkins/jenkins-slave/workspace/Lucene-Solr-Tests-trunk-Java8/solr/build/solr-core/test/J1/temp/solr.handler.TestReqParamsAPI_3F8DE15F6A060C03-001/control-001/cores/collection1
   [junit4]   2> 1777478 INFO  (TEST-TestReqParamsAPI.test-seed#[3F8DE15F6A060C03]) [n:127.0.0.1:49557_    ] o.a.s.c.CorePropertiesLocator Found 1 core definitions
   [junit4]   2> 1777479 INFO  (TEST-TestReqParamsAPI.test-seed#[3F8DE15F6A060C03]) [n:127.0.0.1:49557_    ] o.a.s.s.SolrDispatchFilter user.dir=/x1/jenkins/jenkins-slave/workspace/Lucene-Solr-Tests-trunk-Java8/solr/build/solr-core/test/J1
   [junit4]   2> 1777479 INFO  (TEST-TestReqParamsAPI.test-seed#[3F8DE15F6A060C03]) [n:127.0.0.1:49557_    ] o.a.s.s.SolrDispatchFilter SolrDispatchFilter.init() done
   [junit4]   2> 1777479 INFO  (coreLoadExecutor-5499-thread-1-processing-n:127.0.0.1:49557_) [n:127.0.0.1:49557_ c:control_collection   x:collection1] o.a.s.c.ZkController publishing state=down
   [junit4]   2> 1777479 INFO  (coreLoadExecutor-5499-thread-1-processing-n:127.0.0.1:49557_) [n:127.0.0.1:49557_ c:control_collection   x:collection1] o.a.s.c.ZkController numShards not found on descriptor - reading it from system property
   [junit4]   2> 1777481 INFO  (OverseerStateUpdate-95483803336310789-127.0.0.1:49557_-n_0000000000) [n:127.0.0.1:49557_    ] o.a.s.c.Overseer processMessage: queueSize: 1, message = {
   [junit4]   2>   "core":"collection1",
   [junit4]   2>   "roles":null,
   [junit4]   2>   "base_url":"https://127.0.0.1:49557",
   [junit4]   2>   "node_name":"127.0.0.1:49557_",
   [junit4]   2>   "numShards":"1",
   [junit4]   2>   "state":"down",
   [junit4]   2>   "shard":null,
   [junit4]   2>   "collection":"control_collection",
   [junit4]   2>   "operation":"state"} current state version: 0
   [junit4]   2> 1777481 INFO  (coreLoadExecutor-5499-thread-1-processing-n:127.0.0.1:49557_) [n:127.0.0.1:49557_ c:control_collection   x:collection1] o.a.s.c.ZkController look for our core node name
   [junit4]   2> 1777482 INFO  (OverseerStateUpdate-95483803336310789-127.0.0.1:49557_-n_0000000000) [n:127.0.0.1:49557_    ] o.a.s.c.o.ReplicaMutator Update state numShards=1 message={
   [junit4]   2>   "core":"collection1",
   [junit4]   2>   "roles":null,
   [junit4]   2>   "base_url":"https://127.0.0.1:49557",
   [junit4]   2>   "node_name":"127.0.0.1:49557_",
   [junit4]   2>   "numShards":"1",
   [junit4]   2>   "state":"down",
   [junit4]   2>   "shard":null,
   [junit4]   2>   "collection":"control_collection",
   [junit4]   2>   "operation":"state"}
   [junit4]   2> 1777482 INFO  (OverseerStateUpdate-95483803336310789-127.0.0.1:49557_-n_0000000000) [n:127.0.0.1:49557_    ] o.a.s.c.o.ClusterStateMutator building a new cName: control_collection
   [junit4]   2> 1777483 INFO  (OverseerStateUpdate-95483803336310789-127.0.0.1:49557_-n_0000000000) [n:127.0.0.1:49557_    ] o.a.s.c.o.ReplicaMutator Assigning new node to shard shard=shard1
   [junit4]   2> 1777484 INFO  (zkCallback-2968-thread-1-processing-n:127.0.0.1:49557_) [n:127.0.0.1:49557_    ] o.a.s.c.c.ZkStateReader A cluster state change: [WatchedEvent state:SyncConnected type:NodeDataChanged path:/clusterstate.json], has occurred - updating... (live nodes size: [1])
   [junit4]   2> 1778482 INFO  (coreLoadExecutor-5499-thread-1-processing-n:127.0.0.1:49557_) [n:127.0.0.1:49557_ c:control_collection   x:collection1] o.a.s.c.ZkController waiting to find shard id in clusterstate for collection1
   [junit4]   2> 1778482 INFO  (coreLoadExecutor-5499-thread-1-processing-n:127.0.0.1:49557_) [n:127.0.0.1:49557_ c:control_collection   x:collection1] o.a.s.c.ZkController Check for collection zkNode:control_collection
   [junit4]   2> 1778482 INFO  (coreLoadExecutor-5499-thread-1-processing-n:127.0.0.1:49557_) [n:127.0.0.1:49557_ c:control_collection   x:collection1] o.a.s.c.ZkController Collection zkNode exists
   [junit4]   2> 1778483 INFO  (coreLoadExecutor-5499-thread-1-processing-n:127.0.0.1:49557_) [n:127.0.0.1:49557_ c:control_collection   x:collection1] o.a.s.c.c.ZkStateReader Load collection config from: [/collections/control_collection]
   [junit4]   2> 1778483 INFO  (coreLoadExecutor-5499-thread-1-processing-n:127.0.0.1:49557_) [n:127.0.0.1:49557_ c:control_collection   x:collection1] o.a.s.c.c.ZkStateReader path=[/collections/control_collection] [configName]=[conf1] specified config exists in ZooKeeper
   [junit4]   2> 1778483 INFO  (coreLoadExecutor-5499-thread-1-processing-n:127.0.0.1:49557_) [n:127.0.0.1:49557_ c:control_collection   x:collection1] o.a.s.c.SolrResourceLoader new SolrResourceLoader for directory: '/x1/jenkins/jenkins-slave/workspace/Lucene-Solr-Tests-trunk-Java8/solr/build/solr-core/test/J1/temp/solr.handler.TestReqParamsAPI_3F8DE15F6A060C03-001/control-001/cores/collection1'
   [junit4]   2> 1778484 INFO  (coreLoadExecutor-5499-thread-1-processing-n:127.0.0.1:49557_) [n:127.0.0.1:49557_ c:control_collection   x:collection1] o.a.s.c.SolrResourceLoader JNDI not configured for solr (NoInitialContextEx)
   [junit4]   2> 1778484 INFO  (coreLoadExecutor-5499-thread-1-processing-n:127.0.0.1:49557_) [n:127.0.0.1:49557_ c:control_collection   x:collection1] o.a.s.c.SolrResourceLoader solr home defaulted to 'solr/' (could not find system property or JNDI)
   [junit4]   2> 1778486 INFO  (coreLoadExecutor-5499-thread-1-processing-n:127.0.0.1:49557_) [n:127.0.0.1:49557_ c:control_collection   x:collection1] o.a.s.c.Config loaded config solrconfig.xml with version 0 
   [junit4]   2> 1778493 INFO  (coreLoadExecutor-5499-thread-1-processing-n:127.0.0.1:49557_) [n:127.0.0.1:49557_ c:control_collection   x:collection1] o.a.s.c.SolrConfig current version of requestparams : -1
   [junit4]   2> 1778498 WARN  (coreLoadExecutor-5499-thread-1-processing-n:127.0.0.1:49557_) [n:127.0.0.1:49557_ c:control_collection   x:collection1] o.a.s.c.Config Beginning with Solr 5.5, <mergePolicy> is deprecated, use <mergePolicyFactory> instead.
   [junit4]   2> 1778499 INFO  (coreLoadExecutor-5499-thread-1-processing-n:127.0.0.1:49557_) [n:127.0.0.1:49557_ c:control_collection   x:collection1] o.a.s.c.SolrConfig Using Lucene MatchVersion: 7.0.0
   [junit4]   2> 1778513 INFO  (coreLoadExecutor-5499-thread-1-processing-n:127.0.0.1:49557_) [n:127.0.0.1:49557_ c:control_collection   x:collection1] o.a.s.c.SolrConfig Loaded SolrConfig: solrconfig.xml
   [junit4]   2> 1778518 INFO  (coreLoadExecutor-5499-thread-1-processing-n:127.0.0.1:49557_) [n:127.0.0.1:49557_ c:control_collection   x:collection1] o.a.s.s.IndexSchema [collection1] Schema name=test
   [junit4]   2> 1778641 INFO  (coreLoadExecutor-5499-thread-1-processing-n:127.0.0.1:49557_) [n:127.0.0.1:49557_ c:control_collection   x:collection1] o.a.s.s.OpenExchangeRatesOrgProvider Initialized with rates=open-exchange-rates.json, refreshInterval=1440.
   [junit4]   2> 1778646 INFO  (coreLoadExecutor-5499-thread-1-processing-n:127.0.0.1:49557_) [n:127.0.0.1:49557_ c:control_collection   x:collection1] o.a.s.s.IndexSchema default search field in schema is text
   [junit4]   2> 1778647 INFO  (coreLoadExecutor-5499-thread-1-processing-n:127.0.0.1:49557_) [n:127.0.0.1:49557_ c:control_collection   x:collection1] o.a.s.s.IndexSchema unique key field: id
   [junit4]   2> 1778656 INFO  (coreLoadExecutor-5499-thread-1-processing-n:127.0.0.1:49557_) [n:127.0.0.1:49557_ c:control_collection   x:collection1] o.a.s.s.FileExchangeRateProvider Reloading exchange rates from file currency.xml
   [junit4]   2> 1778659 INFO  (coreLoadExecutor-5499-thread-1-processing-n:127.0.0.1:49557_) [n:127.0.0.1:49557_ c:control_collection   x:collection1] o.a.s.s.FileExchangeRateProvider Reloading exchange rates from file currency.xml
   [junit4]   2> 1778661 INFO  (coreLoadExecutor-5499-thread-1-processing-n:127.0.0.1:49557_) [n:127.0.0.1:49557_ c:control_collection   x:collection1] o.a.s.s.OpenExchangeRatesOrgProvider Reloading exchange rates from open-exchange-rates.json
   [junit4]   2> 1778662 INFO  (coreLoadExecutor-5499-thread-1-processing-n:127.0.0.1:49557_) [n:127.0.0.1:49557_ c:control_collection   x:collection1] o.a.s.s.OpenExchangeRatesOrgProvider Reloading exchange rates from open-exchange-rates.json
   [junit4]   2> 1778663 INFO  (coreLoadExecutor-5499-thread-1-processing-n:127.0.0.1:49557_) [n:127.0.0.1:49557_ c:control_collection   x:collection1] o.a.s.c.ConfigSetProperties Did not find ConfigSet properties, assuming default properties: Can't find resource 'configsetprops.json' in classpath or '/configs/conf1', cwd=/x1/jenkins/jenkins-slave/workspace/Lucene-Solr-Tests-trunk-Java8/solr/build/solr-core/test/J1
   [junit4]   2> 1778663 INFO  (coreLoadExecutor-5499-thread-1-processing-n:127.0.0.1:49557_) [n:127.0.0.1:49557_ c:control_collection   x:collection1] o.a.s.c.CoreContainer Creating SolrCore 'collection1' using configuration from collection control_collection
   [junit4]   2> 1778664 INFO  (coreLoadExecutor-5499-thread-1-processing-n:127.0.0.1:49557_) [n:127.0.0.1:49557_ c:control_collection s:shard1 r:core_node1 x:collection1] o.a.s.c.SolrCore org.apache.solr.core.MockDirectoryFactory
   [junit4]   2> 1778664 INFO  (coreLoadExecutor-5499-thread-1-processing-n:127.0.0.1:49557_) [n:127.0.0.1:49557_ c:control_collection s:shard1 r:core_node1 x:collection1] o.a.s.c.SolrCore [[collection1] ] Opening new SolrCore at [/x1/jenkins/jenkins-slave/workspace/Lucene-Solr-Tests-trunk-Java8/solr/build/solr-core/test/J1/temp/solr.handler.TestReqParamsAPI_3F8DE15F6A060C03-001/control-001/cores/collection1], dataDir=[/x1/jenkins/jenkins-slave/workspace/Lucene-Solr-Tests-trunk-Java8/solr/build/solr-core/test/J1/../../../../../../../../../../x1/jenkins/jenkins-slave/workspace/Lucene-Solr-Tests-trunk-Java8/solr/build/solr-core/test/J1/temp/solr.handler.TestReqParamsAPI_3F8DE15F6A060C03-001/control-001/cores/collection1/data/]
   [junit4]   2> 1778664 INFO  (coreLoadExecutor-5499-thread-1-processing-n:127.0.0.1:49557_) [n:127.0.0.1:49557_ c:control_collection s:shard1 r:core_node1 x:collection1] o.a.s.c.JmxMonitoredMap JMX monitoring is enabled. Adding Solr mbeans to JMX Server: com.sun.jmx.mbeanserver.JmxMBeanServer@747154a
   [junit4]   2> 1778664 INFO  (coreLoadExecutor-5499-thread-1-processing-n:127.0.0.1:49557_) [n:127.0.0.1:49557_ c:control_collection s:shard1 r:core_node1 x:collection1] o.a.s.c.CachingDirectoryFactory return new directory for /x1/jenkins/jenkins-slave/workspace/Lucene-Solr-Tests-trunk-Java8/solr/build/solr-core/test/J1/../../../../../../../../../../x1/jenkins/jenkins-slave/workspace/Lucene-Solr-Tests-trunk-Java8/solr/build/solr-core/test/J1/temp/solr.handler.TestReqParamsAPI_3F8DE15F6A060C03-001/control-001/cores/collection1/data
   [junit4]   2> 1778664 INFO  (coreLoadExecutor-5499-thread-1-processing-n:127.0.0.1:49557_) [n:127.0.0.1:49557_ c:control_collection s:shard1 r:core_node1 x:collection1] o.a.s.c.SolrCore New index directory detected: old=null new=/x1/jenkins/jenkins-slave/workspace/Lucene-Solr-Tests-trunk-Java8/solr/build/solr-core/test/J1/../../../../../../../../../../x1/jenkins/jenkins-slave/workspace/Lucene-Solr-Tests-trunk-Java8/solr/build/solr-core/test/J1/temp/solr.handler.TestReqParamsAPI_3F8DE15F6A060C03-001/control-001/cores/collection1/data/index/
   [junit4]   2> 1778665 WARN  (coreLoadExecutor-5499-thread-1-processing-n:127.0.0.1:49557_) [n:127.0.0.1:49557_ c:control_collection s:shard1 r:core_node1 x:collection1] o.a.s.c.SolrCore [collection1] Solr index directory '/x1/jenkins/jenkins-slave/workspace/Lucene-Solr-Tests-trunk-Java8/solr/build/solr-core/test/J1/../../../../../../../../../../x1/jenkins/jenkins-slave/workspace/Lucene-Solr-Tests-trunk-Java8/solr/build/solr-core/test/J1/temp/solr.handler.TestReqParamsAPI_3F8DE15F6A060C03-001/control-001/cores/collection1/data/index' doesn't exist. Creating new index...
   [junit4]   2> 1778665 INFO  (coreLoadExecutor-5499-thread-1-processing-n:127.0.0.1:49557_) [n:127.0.0.1:49557_ c:control_collection s:shard1 r:core_node1 x:collection1] o.a.s.c.CachingDirectoryFactory return new directory for /x1/jenkins/jenkins-slave/workspace/Lucene-Solr-Tests-trunk-Java8/solr/build/solr-core/test/J1/../../../../../../../../../../x1/jenkins/jenkins-slave/workspace/Lucene-Solr-Tests-trunk-Java8/solr/build/solr-core/test/J1/temp/solr.handler.TestReqParamsAPI_3F8DE15F6A060C03-001/control-001/cores/collection1/data/index
   [junit4]   2> 1778665 INFO  (coreLoadExecutor-5499-thread-1-processing-n:127.0.0.1:49557_) [n:127.0.0.1:49557_ c:control_collection s:shard1 r:core_node1 x:collection1] o.a.s.u.RandomMergePolicy RandomMergePolicy wrapping class org.apache.lucene.index.AlcoholicMergePolicy: [AlcoholicMergePolicy: minMergeSize=0, mergeFactor=10, maxMergeSize=1624835800, maxMergeSizeForForcedMerge=9223372036854775807, calibrateSizeByDeletes=true, maxMergeDocs=2147483647, maxCFSSegmentSizeMB=8.796093022207999E12, noCFSRatio=0.1]
   [junit4]   2> 1778666 INFO  (coreLoadExecutor-5499-thread-1-processing-n:127.0.0.1:49557_) [n:127.0.0.1:49557_ c:control_collection s:shard1 r:core_node1 x:collection1] o.a.s.c.SolrDeletionPolicy SolrDeletionPolicy.onCommit: commits: num=1
   [junit4]   2> 	commit{dir=MockDirectoryWrapper(RAMDirectory@56d30193 lockFactory=org.apache.lucene.store.SingleInstanceLockFactory@3dd6aa0f),segFN=segments_1,generation=1}
   [junit4]   2> 1778666 INFO  (coreLoadExecutor-5499-thread-1-processing-n:127.0.0.1:49557_) [n:127.0.0.1:49557_ c:control_collection s:shard1 r:core_node1 x:collection1] o.a.s.c.SolrDeletionPolicy newest commit generation = 1
   [junit4]   2> 1778666 INFO  (OldIndexDirectoryCleanupThreadForCore-collection1) [n:127.0.0.1:49557_ c:control_collection s:shard1 r:core_node1 x:collection1] o.a.s.c.SolrCore Looking for old index directories to cleanup for core collection1 in /x1/jenkins/jenkins-slave/workspace/Lucene-Solr-Tests-trunk-Java8/solr/build/solr-core/test/J1/../../../../../../../../../../x1/jenkins/jenkins-slave/workspace/Lucene-Solr-Tests-trunk-Java8/solr/build/solr-core/test/J1/temp/solr.handler.TestReqParamsAPI_3F8DE15F6A060C03-001/control-001/cores/collection1/data/
   [junit4]   2> 1778666 WARN  (OldIndexDirectoryCleanupThreadForCore-collection1) [n:127.0.0.1:49557_ c:control_collection s:shard1 r:core_node1 x:collection1] o.a.s.c.DirectoryFactory /x1/jenkins/jenkins-slave/workspace/Lucene-Solr-Tests-trunk-Java8/solr/build/solr-core/test/J1/../../../../../../../../../../x1/jenkins/jenkins-slave/workspace/Lucene-Solr-Tests-trunk-Java8/solr/build/solr-core/test/J1/temp/solr.handler.TestReqParamsAPI_3F8DE15F6A060C03-001/control-001/cores/collection1/data/ does not point to a valid data directory; skipping clean-up of old index directories.
   [junit4]   2> 1778669 INFO  (coreLoadExecutor-5499-thread-1-processing-n:127.0.0.1:49557_) [n:127.0.0.1:49557_ c:control_collection s:shard1 r:core_node1 x:collection1] o.a.s.u.p.UpdateRequestProcessorChain creating updateRequestProcessorChain "nodistrib"
   [junit4]   2> 1778669 INFO  (coreLoadExecutor-5499-thread-1-processing-n:127.0.0.1:49557_) [n:127.0.0.1:49557_ c:control_collection s:shard1 r:core_node1 x:collection1] o.a.s.u.p.UpdateRequestProcessorChain creating updateRequestProcessorChain "dedupe"
   [junit4]   2> 1778669 INFO  (coreLoadExecutor-5499-thread-1-processing-n:127.0.0.1:49557_) [n:127.0.0.1:49557_ c:control_collection s:shard1 r:core_node1 x:collection1] o.a.s.u.p.UpdateRequestProcessorChain inserting DistributedUpdateProcessorFactory into updateRequestProcessorChain "dedupe"
   [junit4]   2> 1778669 INFO  (coreLoadExecutor-5499-thread-1-processing-n:127.0.0.1:49557_) [n:127.0.0.1:49557_ c:control_collection s:shard1 r:core_node1 x:collection1] o.a.s.u.p.UpdateRequestProcessorChain creating updateRequestProcessorChain "stored_sig"
   [junit4]   2> 1778669 INFO  (coreLoadExecutor-5499-thread-1-processing-n:127.0.0.1:49557_) [n:127.0.0.1:49557_ c:control_collection s:shard1 r:core_node1 x:collection1] o.a.s.u.p.UpdateRequestProcessorChain inserting DistributedUpdateProcessorFactory into updateRequestProcessorChain "stored_sig"
   [junit4]   2> 1778669 INFO  (coreLoadExecutor-5499-thread-1-processing-n:127.0.0.1:49557_) [n:127.0.0.1:49557_ c:control_collection s:shard1 r:core_node1 x:collection1] o.a.s.u.p.UpdateRequestProcessorChain creating updateRequestProcessorChain "distrib-dup-test-chain-explicit"
   [junit4]   2> 1778669 INFO  (coreLoadExecutor-5499-thread-1-processing-n:127.0.0.1:49557_) [n:127.0.0.1:49557_ c:control_collection s:shard1 r:core_node1 x:collection1] o.a.s.u.p.UpdateRequestProcessorChain creating updateRequestProcessorChain "distrib-dup-test-chain-implicit"
   [junit4]   2> 1778670 INFO  (coreLoadExecutor-5499-thread-1-processing-n:127.0.0.1:49557_) [n:127.0.0.1:49557_ c:control_collection s:shard1 r:core_node1 x:collection1] o.a.s.u.p.UpdateRequestProcessorChain inserting DistributedUpdateProcessorFactory into updateRequestProcessorChain "distrib-dup-test-chain-implicit"
   [junit4]   2> 1778670 INFO  (coreLoadExecutor-5499-thread-1-processing-n:127.0.0.1:49557_) [n:127.0.0.1:49557_ c:control_collection s:shard1 r:core_node1 x:collection1] o.a.s.c.SolrCore no updateRequestProcessorChain defined as default, creating implicit default
   [junit4]   2> 1778670 WARN  (coreLoadExecutor-5499-thread-1-processing-n:127.0.0.1:49557_) [n:127.0.0.1:49557_ c:control_collection s:shard1 r:core_node1 x:collection1] o.a.s.c.RequestHandlers INVALID paramSet a in requestHandler {type = requestHandler,name = /dump,class = DumpRequestHandler,args = {defaults={a=A,b=B}}}
   [junit4]   2> 1778672 INFO  (coreLoadExecutor-5499-thread-1-processing-n:127.0.0.1:49557_) [n:127.0.0.1:49557_ c:control_collection s:shard1 r:core_node1 x:collection1] o.a.s.h.l.XMLLoader xsltCacheLifetimeSeconds=60
   [junit4]   2> 1778673 INFO  (coreLoadExecutor-5499-thread-1-processing-n:127.0.0.1:49557_) [n:127.0.0.1:49557_ c:control_collection s:shard1 r:core_node1 x:collection1] o.a.s.h.l.XMLLoader xsltCacheLifetimeSeconds=60
   [junit4]   2> 1778673 INFO  (coreLoadExecutor-5499-thread-1-processing-n:127.0.0.1:49557_) [n:127.0.0.1:49557_ c:control_collection s:shard1 r:core_node1 x:collection1] o.a.s.h.l.XMLLoader xsltCacheLifetimeSeconds=60
   [junit4]   2> 1778674 INFO  (coreLoadExecutor-5499-thread-1-processing-n:127.0.0.1:49557_) [n:127.0.0.1:49557_ c:control_collection s:shard1 r:core_node1 x:collection1] o.a.s.h.l.XMLLoader xsltCacheLifetimeSeconds=60
   [junit4]   2> 1778677 INFO  (coreLoadExecutor-5499-thread-1-processing-n:127.0.0.1:49557_) [n:127.0.0.1:49557_ c:control_collection s:shard1 r:core_node1 x:collection1] o.a.s.c.RequestHandlers Registered paths: /admin/mbeans,standard,/dump,/update/csv,/sql,/update/json/docs,/admin/luke,/export,/admin/segments,/get,/admin/system,/replication,/admin/properties,/config,/stream,/schema,/admin/plugins,/admin/logging,/update/json,/admin/ping,/admin/threads,/update,/admin/file
   [junit4]   2> 1778678 INFO  (coreLoadExecutor-5499-thread-1-processing-n:127.0.0.1:49557_) [n:127.0.0.1:49557_ c:control_collection s:shard1 r:core_node1 x:collection1] o.a.s.c.SolrCore Using default statsCache cache: org.apache.solr.search.stats.LocalStatsCache
   [junit4]   2> 1778678 INFO  (coreLoadExecutor-5499-thread-1-processing-n:127.0.0.1:49557_) [n:127.0.0.1:49557_ c:control_collection s:shard1 r:core_node1 x:collection1] o.a.s.u.UpdateHandler Using UpdateLog implementation: org.apache.solr.update.UpdateLog
   [junit4]   2> 1778679 INFO  (coreLoadExecutor-5499-thread-1-processing-n:127.0.0.1:49557_) [n:127.0.0.1:49557_ c:control_collection s:shard1 r:core_node1 x:collection1] o.a.s.u.UpdateLog Initializing UpdateLog: dataDir= defaultSyncLevel=FLUSH numRecordsToKeep=100 maxNumLogsToKeep=10 numVersionBuckets=65536
   [junit4]   2> 1778679 INFO  (coreLoadExecutor-5499-thread-1-processing-n:127.0.0.1:49557_) [n:127.0.0.1:49557_ c:control_collection s:shard1 r:core_node1 x:collection1] o.a.s.u.CommitTracker Hard AutoCommit: disabled
   [junit4]   2> 1778679 INFO  (coreLoadExecutor-5499-thread-1-processing-n:127.0.0.1:49557_) [n:127.0.0.1:49557_ c:control_collection s:shard1 r:core_node1 x:collection1] o.a.s.u.CommitTracker Soft AutoCommit: disabled
   [junit4]   2> 1778680 INFO  (coreLoadExecutor-5499-thread-1-processing-n:127.0.0.1:49557_) [n:127.0.0.1:49557_ c:control_collection s:shard1 r:core_node1 x:collection1] o.a.s.u.RandomMergePolicy RandomMergePolicy wrapping class org.apache.lucene.index.TieredMergePolicy: [TieredMergePolicy: maxMergeAtOnce=28, maxMergeAtOnceExplicit=26, maxMergedSegmentMB=37.908203125, floorSegmentMB=0.4619140625, forceMergeDeletesPctAllowed=23.72829713735878, segmentsPerTier=39.0, maxCFSSegmentSizeMB=8.796093022207999E12, noCFSRatio=0.2960795904963015
   [junit4]   2> 1778680 INFO  (coreLoadExecutor-5499-thread-1-processing-n:127.0.0.1:49557_) [n:127.0.0.1:49557_ c:control_collection s:shard1 r:core_node1 x:collection1] o.a.s.c.SolrDeletionPolicy SolrDeletionPolicy.onInit: commits: num=1
   [junit4]   2> 	commit{dir=MockDirectoryWrapper(RAMDirectory@56d30193 lockFactory=org.apache.lucene.store.SingleInstanceLockFactory@3dd6aa0f),segFN=segments_1,generation=1}
   [junit4]   2> 1778680 INFO  (coreLoadExecutor-5499-thread-1-processing-n:127.0.0.1:49557_) [n:127.0.0.1:49557_ c:control_collection s:shard1 r:core_node1 x:collection1] o.a.s.c.SolrDeletionPolicy newest commit generation = 1
   [junit4]   2> 1778680 INFO  (coreLoadExecutor-5499-thread-1-processing-n:127.0.0.1:49557_) [n:127.0.0.1:49557_ c:control_collection s:shard1 r:core_node1 x:collection1] o.a.s.s.SolrIndexSearcher Opening [Searcher@7c2ffd4c[collection1] main]
   [junit4]   2> 1778680 INFO  (coreLoadExecutor-5499-thread-1-processing-n:127.0.0.1:49557_) [n:127.0.0.1:49557_ c:control_collection s:shard1 r:core_node1 x:collection1] o.a.s.c.c.ZkStateReader Load collection config from: [/collections/control_collection]
   [junit4]   2> 1778681 INFO  (coreLoadExecutor-5499-thread-1-processing-n:127.0.0.1:49557_) [n:127.0.0.1:49557_ c:control_collection s:shard1 r:core_node1 x:collection1] o.a.s.c.c.ZkStateReader path=[/collections/control_collection] [configName]=[conf1] specified config exists in ZooKeeper
   [junit4]   2> 1778681 INFO  (coreLoadExecutor-5499-thread-1-processing-n:127.0.0.1:49557_) [n:127.0.0.1:49557_ c:control_collection s:shard1 r:core_node1 x:collection1] o.a.s.r.ManagedResourceStorage Setting up ZooKeeper-based storage for the RestManager with znodeBase: /configs/conf1
   [junit4]   2> 1778682 INFO  (coreLoadExecutor-5499-thread-1-processing-n:127.0.0.1:49557_) [n:127.0.0.1:49557_ c:control_collection s:shard1 r:core_node1 x:collection1] o.a.s.r.ManagedResourceStorage Configured ZooKeeperStorageIO with znodeBase: /configs/conf1
   [junit4]   2> 1778682 INFO  (coreLoadExecutor-5499-thread-1-processing-n:127.0.0.1:49557_) [n:127.0.0.1:49557_ c:control_collection s:shard1 r:core_node1 x:collection1] o.a.s.r.RestManager Initializing RestManager with initArgs: {}
   [junit4]   2> 1778682 INFO  (coreLoadExecutor-5499-thread-1-processing-n:127.0.0.1:49557_) [n:127.0.0.1:49557_ c:control_collection s:shard1 r:core_node1 x:collection1] o.a.s.r.ManagedResourceStorage Reading _rest_managed.json using ZooKeeperStorageIO:path=/configs/conf1
   [junit4]   2> 1778682 INFO  (coreLoadExecutor-5499-thread-1-processing-n:127.0.0.1:49557_) [n:127.0.0.1:49557_ c:control_collection s:shard1 r:core_node1 x:collection1] o.a.s.r.ManagedResourceStorage No data found for znode /configs/conf1/_rest_managed.json
   [junit4]   2> 1778682 INFO  (coreLoadExecutor-5499-thread-1-processing-n:127.0.0.1:49557_) [n:127.0.0.1:49557_ c:control_collection s:shard1 r:core_node1 x:collection1] o.a.s.r.ManagedResourceStorage Loaded null at path _rest_managed.json using ZooKeeperStorageIO:path=/configs/conf1
   [junit4]   2> 1778682 INFO  (coreLoadExecutor-5499-thread-1-processing-n:127.0.0.1:49557_) [n:127.0.0.1:49557_ c:control_collection s:shard1 r:core_node1 x:collection1] o.a.s.r.RestManager Initializing 0 registered ManagedResources
   [junit4]   2> 1778682 INFO  (coreLoadExecutor-5499-thread-1-processing-n:127.0.0.1:49557_) [n:127.0.0.1:49557_ c:control_collection s:shard1 r:core_node1 x:collection1] o.a.s.h.ReplicationHandler Commits will be reserved for  10000
   [junit4]   2> 1778683 INFO  (searcherExecutor-5500-thread-1-processing-n:127.0.0.1:49557_ x:collection1 s:shard1 c:control_collection r:core_node1) [n:127.0.0.1:49557_ c:control_collection s:shard1 r:core_node1 x:collection1] o.a.s.c.SolrCore [collection1] Registered new searcher Searcher@7c2ffd4c[collection1] main{ExitableDirectoryReader(UninvertingDirectoryReader())}
   [junit4]   2> 1778683 INFO  (coreLoadExecutor-5499-thread-1-processing-n:127.0.0.1:49557_) [n:127.0.0.1:49557_ c:control_collection s:shard1 r:core_node1 x:collection1] o.a.s.u.UpdateLog Looking up max value of version field to seed version buckets
   [junit4]   2> 1778683 INFO  (coreLoadExecutor-5499-thread-1-processing-n:127.0.0.1:49557_) [n:127.0.0.1:49557_ c:control_collection s:shard1 r:core_node1 x:collection1] o.a.s.u.VersionInfo Refreshing highest value of _version_ for 65536 version buckets from index
   [junit4]   2> 1778683 INFO  (coreLoadExecutor-5499-thread-1-processing-n:127.0.0.1:49557_) [n:127.0.0.1:49557_ c:control_collection s:shard1 r:core_node1 x:collection1] o.a.s.u.VersionInfo No terms found for _version_, cannot seed version bucket highest value from index
   [junit4]   2> 1778683 INFO  (coreLoadExecutor-5499-thread-1-processing-n:127.0.0.1:49557_) [n:127.0.0.1:49557_ c:control_collection s:shard1 r:core_node1 x:collection1] o.a.s.u.UpdateLog Could not find max version in index or recent updates, using new clock 1527740854977953792
   [junit4]   2> 1778686 INFO  (coreLoadExecutor-5499-thread-1-processing-n:127.0.0.1:49557_) [n:127.0.0.1:49557_ c:control_collection s:shard1 r:core_node1 x:collection1] o.a.s.u.UpdateLog Took 2.0ms to seed version buckets with highest version 1527740854977953792
   [junit4]   2> 1778686 INFO  (coreLoadExecutor-5499-thread-1-processing-n:127.0.0.1:49557_) [n:127.0.0.1:49557_ c:control_collection s:shard1 r:core_node1 x:collection1] o.a.s.c.ZkController watch zkdir /configs/conf1
   [junit4]   2> 1778686 INFO  (coreLoadExecutor-5499-thread-1-processing-n:127.0.0.1:49557_) [n:127.0.0.1:49557_ c:control_collection s:shard1 r:core_node1 x:collection1] o.a.s.c.CoreContainer registering core: collection1
   [junit4]   2> 1778687 INFO  (coreZkRegister-5493-thread-1-processing-n:127.0.0.1:49557_ x:collection1 s:shard1 c:control_collection r:core_node1) [n:127.0.0.1:49557_ c:control_collection s:shard1 r:core_node1 x:collection1] o.a.s.c.ZkController Register replica - core:collection1 address:https://127.0.0.1:49557 collection:control_collection shard:shard1
   [junit4]   2> 1778688 INFO  (coreZkRegister-5493-thread-1-processing-n:127.0.0.1:49557_ x:collection1 s:shard1 c:control_collection r:core_node1) [n:127.0.0.1:49557_ c:control_collection s:shard1 r:core_node1 x:collection1] o.a.s.c.c.SolrZkClient makePath: /collections/control_collection/leader_elect/shard1/election
   [junit4]   2> 1778691 INFO  (coreZkRegister-5493-thread-1-processing-n:127.0.0.1:49557_ x:collection1 s:shard1 c:control_collection r:core_node1) [n:127.0.0.1:49557_ c:control_collection s:shard1 r:core_node1 x:collection1] o.a.s.c.LeaderElector Joined leadership election with path: /collections/control_collection/leader_elect/shard1/election/95483803336310789-core_node1-n_0000000000
   [junit4]   2> 1778691 INFO  (coreZkRegister-5493-thread-1-processing-n:127.0.0.1:49557_ x:collection1 s:shard1 c:control_collection r:core_node1) [n:127.0.0.1:49557_ c:control_collection s:shard1 r:core_node1 x:collection1] o.a.s.c.ShardLeaderElectionContext Running the leader process for shard=shard1 and weAreReplacement=false and leaderVoteWait=10000
   [junit4]   2> 1778692 INFO  (coreZkRegister-5493-thread-1-processing-n:127.0.0.1:49557_ x:collection1 s:shard1 c:control_collection r:core_node1) [n:127.0.0.1:49557_ c:control_collection s:shard1 r:core_node1 x:collection1] o.a.s.c.ShardLeaderElectionContext Enough replicas found to continue.
   [junit4]   2> 1778692 INFO  (OverseerStateUpdate-95483803336310789-127.0.0.1:49557_-n_0000000000) [n:127.0.0.1:49557_    ] o.a.s.c.Overseer processMessage: queueSize: 1, message = {
   [junit4]   2>   "operation":"leader",
   [junit4]   2>   "shard":"shard1",
   [junit4]   2>   "collection":"control_collection"} current state version: 1
   [junit4]   2> 1778693 INFO  (coreZkRegister-5493-thread-1-processing-n:127.0.0.1:49557_ x:collection1 s:shard1 c:control_collection r:core_node1) [n:127.0.0.1:49557_ c:control_collection s:shard1 r:core_node1 x:collection1] o.a.s.c.ShardLeaderElectionContext I may be the new leader - try and sync
   [junit4]   2> 1778693 INFO  (coreZkRegister-5493-thread-1-processing-n:127.0.0.1:49557_ x:collection1 s:shard1 c:control_collection r:core_node1) [n:127.0.0.1:49557_ c:control_collection s:shard1 r:core_node1 x:collection1] o.a.s.c.SyncStrategy Sync replicas to https://127.0.0.1:49557/collection1/
   [junit4]   2> 1778693 INFO  (coreZkRegister-5493-thread-1-processing-n:127.0.0.1:49557_ x:collection1 s:shard1 c:control_collection r:core_node1) [n:127.0.0.1:49557_ c:control_collection s:shard1 r:core_node1 x:collection1] o.a.s.c.SyncStrategy Sync Success - now sync replicas to me
   [junit4]   2> 1778693 INFO  (coreZkRegister-5493-thread-1-processing-n:127.0.0.1:49557_ x:collection1 s:shard1 c:control_collection r:core_node1) [n:127.0.0.1:49557_ c:control_collection s:shard1 r:core_node1 x:collection1] o.a.s.c.SyncStrategy https://127.0.0.1:49557/collection1/ has no replicas
   [junit4]   2> 1778694 INFO  (coreZkRegister-5493-thread-1-processing-n:127.0.0.1:49557_ x:collection1 s:shard1 c:control_collection r:core_node1) [n:127.0.0.1:49557_ c:control_collection s:shard1 r:core_node1 x:collection1] o.a.s.c.c.SolrZkClient makePath: /collections/control_collection/leaders/shard1
   [junit4]   2> 1778696 INFO  (coreZkRegister-5493-thread-1-processing-n:127.0.0.1:49557_ x:collection1 s:shard1 c:control_collection r:core_node1) [n:127.0.0.1:49557_ c:control_collection s:shard1 r:core_node1 x:collection1] o.a.s.c.ShardLeaderElectionContextBase Creating leader registration node /collections/control_collection/leaders/shard1/leader after winning as /collections/control_collection/leader_elect/shard1/election/95483803336310789-core_node1-n_0000000000
   [junit4]   2> 1778697 INFO  (coreZkRegister-5493-thread-1-processing-n:127.0.0.1:49557_ x:collection1 s:shard1 c:control_collection r:core_node1) [n:127.0.0.1:49557_ c:control_collection s:shard1 r:core_node1 x:collection1] o.a.s.c.ShardLeaderElectionContext I am the new leader: https://127.0.0.1:49557/collection1/ shard1
   [junit4]   2> 1778698 INFO  (OverseerStateUpdate-95483803336310789-127.0.0.1:49557_-n_0000000000) [n:127.0.0.1:49557_    ] o.a.s.c.Overseer processMessage: queueSize: 1, message = {
   [junit4]   2>   "operation":"leader",
   [junit4]   2>   "shard":"shard1",
   [junit4]   2>   "collection":"control_collection",
   [junit4]   2>   "base_url":"https://127.0.0.1:49557",
   [junit4]   2>   "core":"collection1",
   [junit4]   2>   "state":"active"} current state version: 1
   [junit4]   2> 1778800 INFO  (zkCallback-2968-thread-1-processing-n:127.0.0.1:49557_) [n:127.0.0.1:49557_    ] o.a.s.c.c.ZkStateReader A cluster state change: [WatchedEvent state:SyncConnected type:NodeDataChanged path:/clusterstate.json], has occurred - updating... (live nodes size: [1])
   [junit4]   2> 1778848 INFO  (coreZkRegister-5493-thread-1-processing-n:127.0.0.1:49557_ x:collection1 s:shard1 c:control_collection r:core_node1) [n:127.0.0.1:49557_ c:control_collection s:shard1 r:core_node1 x:collection1] o.a.s.c.ZkController We are https://127.0.0.1:49557/collection1/ and leader is https://127.0.0.1:49557/collection1/
   [junit4]   2> 1778848 INFO  (coreZkRegister-5493-thread-1-processing-n:127.0.0.1:49557_ x:collection1 s:shard1 c:control_collection r:core_node1) [n:127.0.0.1:49557_ c:control_collection s:shard1 r:core_node1 x:collection1] o.a.s.c.ZkController No LogReplay needed for core=collection1 baseURL=https://127.0.0.1:49557
   [junit4]   2> 1778848 INFO  (coreZkRegister-5493-thread-1-processing-n:127.0.0.1:49557_ x:collection1 s:shard1 c:control_collection r:core_node1) [n:127.0.0.1:49557_ c:control_collection s:shard1 r:core_node1 x:collection1] o.a.s.c.ZkController I am the leader, no recovery necessary
   [junit4]   2> 1778848 INFO  (coreZkRegister-5493-thread-1-processing-n:127.0.0.1:49557_ x:collection1 s:shard1 c:control_collection r:core_node1) [n:127.0.0.1:49557_ c:control_collection s:shard1 r:core_node1 x:collection1] o.a.s.c.ZkController publishing state=active
   [junit4]   2> 1778849 INFO  (coreZkRegister-5493-thread-1-processing-n:127.0.0.1:49557_ x:collection1 s:shard1 c:control_collection r:core_node1) [n:127.0.0.1:49557_ c:control_collection s:shard1 r:core_node1 x:collection1] o.a.s.c.ZkController numShards not found on descriptor - reading it from system property
   [junit4]   2> 1778850 INFO  (OverseerStateUpdate-95483803336310789-127.0.0.1:49557_-n_0000000000) [n:127.0.0.1:49557_    ] o.a.s.c.Overseer processMessage: queueSize: 1, message = {
   [junit4]   2>   "core":"collection1",
   [junit4]   2>   "core_node_name":"core_node1",
   [junit4]   2>   "roles":null,
   [junit4]   2>   "base_url":"https://127.0.0.1:49557",
   [junit4]   2>   "node_name":"127.0.0.1:49557_",
   [junit4]   2>   "numShards":"1",
   [junit4]   2>   "state":"active",
   [junit4]   2>   "shard":"shard1",
   [junit4]   2>   "collection":"control_collection",
   [junit4]   2>   "operation":"state"} current state version: 2
   [junit4]   2> 1778851 INFO  (coreZkRegister-5493-thread-1-processing-n:127.0.0.1:49557_ x:collection1 s:shard1 c:control_collection r:core_node1) [n:127.0.0.1:49557_ c:control_collection s:shard1 r:core_node1 x:collection1] o.a.s.c.c.ZkStateReader Updated live nodes from ZooKeeper... (1) -> (1)
   [junit4]   2> 1778851 INFO  (OverseerStateUpdate-95483803336310789-127.0.0.1:49557_-n_0000000000) [n:127.0.0.1:49557_    ] o.a.s.c.o.ReplicaMutator Update state numShards=1 message={
   [junit4]   2>   "core":"collection1",
   [junit4]   2>   "core_node_name":"core_node1",
   [junit4]   2>   "roles":null,
   [junit4]   2>   "base_url":"https://127.0.0.1:49557",
   [junit4]   2>   "node_name":"127.0.0.1:49557_",
   [junit4]   2>   "numShards":"1",
   [junit4]   2>   "state":"active",
   [junit4]   2>   "shard":"shard1",
   [junit4]   2>   "collection":"control_collection",
   [junit4]   2>   "operation":"state"}
   [junit4]   2> 1778954 INFO  (zkCallback-2968-thread-1-processing-n:127.0.0.1:49557_) [n:127.0.0.1:49557_    ] o.a.s.c.c.ZkStateReader A cluster state change: [WatchedEvent state:SyncConnected type:NodeDataChanged path:/clusterstate.json], has occurred - updating... (live nodes size: [1])
   [junit4]   2> 1778982 INFO  (TEST-TestReqParamsAPI.test-seed#[3F8DE15F6A060C03]) [    ] o.a.s.c.c.SolrZkClient Using default ZkCredentialsProvider
   [junit4]   2> 1778983 INFO  (TEST-TestReqParamsAPI.test-seed#[3F8DE15F6A060C03]) [    ] o.a.s.c.c.ConnectionManager Waiting for client to connect to ZooKeeper
   [junit4]   2> 1778984 INFO  (zkCallback-2970-thread-1) [    ] o.a.s.c.c.ConnectionManager Watcher org.apache.solr.common.cloud.ConnectionManager@2549cf93 name:ZooKeeperConnection Watcher:127.0.0.1:53355/solr got event WatchedEvent state:SyncConnected type:None path:null path:null type:None
   [junit4]   2> 1778984 INFO  (TEST-TestReqParamsAPI.test-seed#[3F8DE15F6A060C03]) [    ] o.a.s.c.c.ConnectionManager Client is connected to ZooKeeper
   [junit4]   2> 1778984 INFO  (TEST-TestReqParamsAPI.test-seed#[3F8DE15F6A060C03]) [    ] o.a.s.c.c.SolrZkClient Using default ZkACLProvider
   [junit4]   2> 1778984 INFO  (TEST-TestReqParamsAPI.test-seed#[3F8DE15F6A060C03]) [    ] o.a.s.c.c.ZkStateReader Updating cluster state from ZooKeeper... 
   [junit4]   2> 1778985 INFO  (TEST-TestReqParamsAPI.test-seed#[3F8DE15F6A060C03]) [    ] o.a.s.c.c.ZkStateReader Updated live nodes from ZooKeeper... (0) -> (1)
   [junit4]   2> 1778986 INFO  (TEST-TestReqParamsAPI.test-seed#[3F8DE15F6A060C03]) [    ] o.a.s.c.ChaosMonkey monkey: init - expire sessions:false cause connection loss:false
   [junit4]   2> 1779080 INFO  (TEST-TestReqParamsAPI.test-seed#[3F8DE15F6A060C03]) [    ] o.a.s.SolrTestCaseJ4 Writing core.properties file to /x1/jenkins/jenkins-slave/workspace/Lucene-Solr-Tests-trunk-Java8/solr/build/solr-core/test/J1/temp/solr.handler.TestReqParamsAPI_3F8DE15F6A060C03-001/shard-1-001/cores/collection1
   [junit4]   2> 1779081 INFO  (TEST-TestReqParamsAPI.test-seed#[3F8DE15F6A060C03]) [    ] o.a.s.c.AbstractFullDistribZkTestBase create jetty 1 in directory /x1/jenkins/jenkins-slave/workspace/Lucene-Solr-Tests-trunk-Java8/solr/build/solr-core/test/J1/temp/solr.handler.TestReqParamsAPI_3F8DE15F6A060C03-001/shard-1-001
   [junit4]   2> 1779082 INFO  (TEST-TestReqParamsAPI.test-seed#[3F8DE15F6A060C03]) [    ] o.e.j.s.Server jetty-9.3.6.v20151106
   [junit4]   2> 1779084 INFO  (TEST-TestReqParamsAPI.test-seed#[3F8DE15F6A060C03]) [    ] o.e.j.s.h.ContextHandler Started o.e.j.s.ServletContextHandler@7e933675{/,null,AVAILABLE}
   [junit4]   2> 1779084 INFO  (TEST-TestReqParamsAPI.test-seed#[3F8DE15F6A060C03]) [    ] o.e.j.u.s.SslContextFactory x509=X509@3e9e7845(solrtest,h=[],w=[]) for SslContextFactory@33c57a75(file:///x1/jenkins/jenkins-slave/workspace/Lucene-Solr-Tests-trunk-Java8/solr/server/etc/test/solrtest.keystore,file:///x1/jenkins/jenkins-slave/workspace/Lucene-Solr-Tests-trunk-Java8/solr/server/etc/test/solrtest.keystore)
   [junit4]   2> 1779087 INFO  (TEST-TestReqParamsAPI.test-seed#[3F8DE15F6A060C03]) [    ] o.e.j.s.ServerConnector Started ServerConnector@5e26df61{SSL,[ssl, http/1.1]}{127.0.0.1:40113}
   [junit4]   2> 1779087 INFO  (TEST-TestReqParamsAPI.test-seed#[3F8DE15F6A060C03]) [    ] o.e.j.s.Server Started @1782576ms
   [junit4]   2> 1779088 INFO  (TEST-TestReqParamsAPI.test-seed#[3F8DE15F6A060C03]) [    ] o.a.s.c.s.e.JettySolrRunner Jetty properties: {solr.data.dir=/x1/jenkins/jenkins-slave/workspace/Lucene-Solr-Tests-trunk-Java8/solr/build/solr-core/test/J1/temp/solr.handler.TestReqParamsAPI_3F8DE15F6A060C03-001/tempDir-001/jetty1, solrconfig=solrconfig.xml, hostContext=/, hostPort=40113, coreRootDirectory=/x1/jenkins/jenkins-slave/workspace/Lucene-Solr-Tests-trunk-Java8/solr/build/solr-core/test/J1/../../../../../../../../../../x1/jenkins/jenkins-slave/workspace/Lucene-Solr-Tests-trunk-Java8/solr/build/solr-core/test/J1/temp/solr.handler.TestReqParamsAPI_3F8DE15F6A060C03-001/shard-1-001/cores}
   [junit4]   2> 1779088 INFO  (TEST-TestReqParamsAPI.test-seed#[3F8DE15F6A060C03]) [    ] o.a.s.s.SolrDispatchFilter SolrDispatchFilter.init(): sun.misc.Launcher$AppClassLoader@4e0e2f2a
   [junit4]   2> 1779088 INFO  (TEST-TestReqParamsAPI.test-seed#[3F8DE15F6A060C03]) [    ] o.a.s.c.SolrResourceLoader new SolrResourceLoader for directory: '/x1/jenkins/jenkins-slave/workspace/Lucene-Solr-Tests-trunk-Java8/solr/build/solr-core/test/J1/temp/solr.handler.TestReqParamsAPI_3F8DE15F6A060C03-001/shard-1-001'
   [junit4]   2> 1779088 INFO  (TEST-TestReqParamsAPI.test-seed#[3F8DE15F6A060C03]) [    ] o.a.s.c.SolrResourceLoader JNDI not configured for solr (NoInitialContextEx)
   [junit4]   2> 1779088 INFO  (TEST-TestReqParamsAPI.test-seed#[3F8DE15F6A060C03]) [    ] o.a.s.c.SolrResourceLoader solr home defaulted to 'solr/' (could not find system property or JNDI)
   [junit4]   2> 1779088 INFO  (TEST-TestReqParamsAPI.test-seed#[3F8DE15F6A060C03]) [    ] o.a.s.c.c.SolrZkClient Using default ZkCredentialsProvider
   [junit4]   2> 1779089 INFO  (TEST-TestReqParamsAPI.test-seed#[3F8DE15F6A060C03]) [    ] o.a.s.c.c.ConnectionManager Waiting for client to connect to ZooKeeper
   [junit4]   2> 1779090 INFO  (zkCallback-2971-thread-1) [    ] o.a.s.c.c.ConnectionManager Watcher org.apache.solr.common.cloud.ConnectionManager@1212a8dd name:ZooKeeperConnection Watcher:127.0.0.1:53355/solr got event WatchedEvent state:SyncConnected type:None path:null path:null type:None
   [junit4]   2> 1779090 INFO  (TEST-TestReqParamsAPI.test-seed#[3F8DE15F6A060C03]) [    ] o.a.s.c.c.ConnectionManager Client is connected to ZooKeeper
   [junit4]   2> 1779091 INFO  (TEST-TestReqParamsAPI.test-seed#[3F8DE15F6A060C03]) [    ] o.a.s.c.c.SolrZkClient Using default ZkACLProvider
   [junit4]   2> 1779091 INFO  (TEST-TestReqParamsAPI.test-seed#[3F8DE15F6A060C03]) [    ] o.a.s.s.SolrDispatchFilter Loading solr.xml from SolrHome (not found in ZooKeeper)
   [junit4]   2> 1779091 INFO  (TEST-TestReqParamsAPI.test-seed#[3F8DE15F6A060C03]) [    ] o.a.s.c.SolrXmlConfig Loading container configuration from /x1/jenkins/jenkins-slave/workspace/Lucene-Solr-Tests-trunk-Java8/solr/build/solr-core/test/J1/temp/solr.handler.TestReqParamsAPI_3F8DE15F6A060C03-001/shard-1-001/solr.xml
   [junit4]   2> 1779096 INFO  (TEST-TestReqParamsAPI.test-seed#[3F8DE15F6A060C03]) [    ] o.a.s.c.CorePropertiesLocator Config-defined core root directory: /x1/jenkins/jenkins-slave/workspace/Lucene-Solr-Tests-trunk-Java8/solr/build/solr-core/test/J1/../../../../../../../../../../x1/jenkins/jenkins-slave/workspace/Lucene-Solr-Tests-trunk-Java8/solr/build/solr-core/test/J1/temp/solr.handler.TestReqParamsAPI_3F8DE15F6A060C03-001/shard-1-001/cores
   [junit4]   2> 1779096 INFO  (TEST-TestReqParamsAPI.test-seed#[3F8DE15F6A060C03]) [    ] o.a.s.c.CoreContainer New CoreContainer 140228692
   [junit4]   2> 1779097 INFO  (TEST-TestReqParamsAPI.test-seed#[3F8DE15F6A060C03]) [    ] o.a.s.c.CoreContainer Loading cores into CoreContainer [instanceDir=/x1/jenkins/jenkins-slave/workspace/Lucene-Solr-Tests-trunk-Java8/solr/build/solr-core/test/J1/temp/solr.handler.TestReqParamsAPI_3F8DE15F6A060C03-001/shard-1-001]
   [junit4]   2> 1779097 WARN  (TEST-TestReqParamsAPI.test-seed#[3F8DE15F6A060C03]) [    ] o.a.s.c.CoreContainer Couldn't add files from /x1/jenkins/jenkins-slave/workspace/Lucene-Solr-Tests-trunk-Java8/solr/build/solr-core/test/J1/temp/solr.handler.TestReqParamsAPI_3F8DE15F6A060C03-001/shard-1-001/lib to classpath: /x1/jenkins/jenkins-slave/workspace/Lucene-Solr-Tests-trunk-Java8/solr/build/solr-core/test/J1/temp/solr.handler.TestReqParamsAPI_3F8DE15F6A060C03-001/shard-1-001/lib
   [junit4]   2> 1779097 INFO  (TEST-TestReqParamsAPI.test-seed#[3F8DE15F6A060C03]) [    ] o.a.s.h.c.HttpShardHandlerFactory created with socketTimeout : 90000,urlScheme : ,connTimeout : 15000,maxConnectionsPerHost : 20,maxConnections : 10000,corePoolSize : 0,maximumPoolSize : 2147483647,maxThreadIdleTime : 5,sizeOfQueue : -1,fairnessPolicy : false,useRetries : false,
   [junit4]   2> 1779099 INFO  (TEST-TestReqParamsAPI.test-seed#[3F8DE15F6A060C03]) [    ] o.a.s.u.UpdateShardHandler Creating UpdateShardHandler HTTP client with params: socketTimeout=340000&connTimeout=45000&retry=true
   [junit4]   2> 1779101 INFO  (TEST-TestReqParamsAPI.test-seed#[3F8DE15F6A060C03]) [    ] o.a.s.l.LogWatcher SLF4J impl is org.slf4j.impl.Log4jLoggerFactory
   [junit4]   2> 1779101 INFO  (TEST-TestReqParamsAPI.test-seed#[3F8DE15F6A060C03]) [    ] o.a.s.l.LogWatcher Registering Log Listener [Log4j (org.slf4j.impl.Log4jLoggerFactory)]
   [junit4]   2> 1779101 INFO  (TEST-TestReqParamsAPI.test-seed#[3F8DE15F6A060C03]) [    ] o.a.s.c.ZkContainer Zookeeper client=127.0.0.1:53355/solr
   [junit4]   2> 1779101 INFO  (TEST-TestReqParamsAPI.test-seed#[3F8DE15F6A060C03]) [    ] o.a.s.c.ZkController zkHost includes chroot
   [junit4]   2> 1779101 INFO  (TEST-TestReqParamsAPI.test-seed#[3F8DE15F6A060C03]) [    ] o.a.s.c.c.SolrZkClient Using default ZkCredentialsProvider
   [junit4]   2> 1779101 INFO  (TEST-TestReqParamsAPI.test-seed#[3F8DE15F6A060C03]) [    ] o.a.s.c.c.ConnectionManager Waiting for client to connect to ZooKeeper
   [junit4]   2> 1779104 INFO  (zkCallback-2974-thread-1) [    ] o.a.s.c.c.ConnectionManager Watcher org.apache.solr.common.cloud.ConnectionManager@3fff7be1 name:ZooKeeperConnection Watcher:127.0.0.1:53355 got event WatchedEvent state:SyncConnected type:None path:null path:null type:None
   [junit4]   2> 1779104 INFO  (TEST-TestReqParamsAPI.test-seed#[3F8DE15F6A060C03]) [    ] o.a.s.c.c.ConnectionManager Client is connected to ZooKeeper
   [junit4]   2> 1779104 INFO  (TEST-TestReqParamsAPI.test-seed#[3F8DE15F6A060C03]) [    ] o.a.s.c.c.SolrZkClient Using default ZkACLProvider
   [junit4]   2> 1779111 INFO  (TEST-TestReqParamsAPI.test-seed#[3F8DE15F6A060C03]) [n:127.0.0.1:40113_    ] o.a.s.c.c.ConnectionManager Waiting for client to connect to ZooKeeper
   [junit4]   2> 1779112 INFO  (zkCallback-2975-thread-1-processing-n:127.0.0.1:40113_) [n:127.0.0.1:40113_    ] o.a.s.c.c.ConnectionManager Watcher org.apache.solr.common.cloud.ConnectionManager@44d90d0b name:ZooKeeperConnection Watcher:127.0.0.1:53355/solr got event WatchedEvent state:SyncConnected type:None path:null path:null type:None
   [junit4]   2> 1779112 INFO  (TEST-TestReqParamsAPI.test-seed#[3F8DE15F6A060C03]) [n:127.0.0.1:40113_    ] o.a.s.c.c.ConnectionManager Client is connected to ZooKeeper
   [junit4]   2> 1779117 INFO  (TEST-TestReqParamsAPI.test-seed#[3F8DE15F6A060C03]) [n:127.0.0.1:40113_    ] o.a.s.c.c.ZkStateReader Updating cluster state from ZooKeeper... 
   [junit4]   2> 1779118 INFO  (TEST-TestReqParamsAPI.test-seed#[3F8DE15F6A060C03]) [n:127.0.0.1:40113_    ] o.a.s.c.c.ZkStateReader Updated live nodes from ZooKeeper... (0) -> (1)
   [junit4]   2> 1779120 INFO  (TEST-TestReqParamsAPI.test-seed#[3F8DE15F6A060C03]) [n:127.0.0.1:40113_    ] o.a.s.c.Overseer Overseer (id=null) closing
   [junit4]   2> 1779120 INFO  (TEST-TestReqParamsAPI.test-seed#[3F8DE15F6A060C03]) [n:127.0.0.1:40113_    ] o.a.s.c.LeaderElector Joined leadership election with path: /overseer_elect/election/95483803336310793-127.0.0.1:40113_-n_0000000001
   [junit4]   2> 1779121 INFO  (TEST-TestReqParamsAPI.test-seed#[3F8DE15F6A060C03]) [n:127.0.0.1:40113_    ] o.a.s.c.LeaderElector Watching path /overseer_elect/election/95483803336310789-127.0.0.1:49557_-n_0000000000 to know if I could be the leader
   [junit4]   2> 1779121 INFO  (TEST-TestReqParamsAPI.test-seed#[3F8DE15F6A060C03]) [n:127.0.0.1:40113_    ] o.a.s.c.ZkController Publish node=127.0.0.1:40113_ as DOWN
   [junit4]   2> 1779124 INFO  (OverseerStateUpdate-95483803336310789-127.0.0.1:49557_-n_0000000000) [n:127.0.0.1:49557_    ] o.a.s.c.Overseer processMessage: queueSize: 1, message = {
   [junit4]   2>   "operation":"downnode",
   [junit4]   2>   "node_name":"127.0.0.1:40113_"} current state version: 3
   [junit4]   2> 1779124 INFO  (OverseerStateUpdate-95483803336310789-127.0.0.1:49557_-n_0000000000) [n:127.0.0.1:49557_    ] o.a.s.c.o.NodeMutator DownNode state invoked for node: 127.0.0.1:40113_
   [junit4]   2> 1779226 INFO  (zkCallback-2970-thread-1) [    ] o.a.s.c.c.ZkStateReader A cluster state change: [WatchedEvent state:SyncConnected type:NodeDataChanged path:/clusterstate.json], has occurred - updating... (live nodes size: [1])
   [junit4]   2> 1779226 INFO  (zkCallback-2968-thread-1-processing-n:127.0.0.1:49557_) [n:127.0.0.1:49557_    ] o.a.s.c.c.ZkStateReader A cluster state change: [WatchedEvent state:SyncConnected type:NodeDataChanged path:/clusterstate.json], has occurred - updating... (live nodes size: [1])
   [junit4]   2> 1779227 INFO  (zkCallback-2975-thread-1-processing-n:127.0.0.1:40113_) [n:127.0.0.1:40113_    ] o.a.s.c.c.ZkStateReader A cluster state change: [WatchedEvent state:SyncConnected type:NodeDataChanged path:/clusterstate.json], has occurred - updating... (live nodes size: [1])
   [junit4]   2> 1780124 INFO  (TEST-TestReqParamsAPI.test-seed#[3F8DE15F6A060C03]) [n:127.0.0.1:40113_    ] o.a.s.c.ZkController Register node as live in ZooKeeper:/live_nodes/127.0.0.1:40113_
   [junit4]   2> 1780125 INFO  (TEST-TestReqParamsAPI.test-seed#[3F8DE15F6A060C03]) [n:127.0.0.1:40113_    ] o.a.s.c.c.SolrZkClient makePath: /live_nodes/127.0.0.1:40113_
   [junit4]   2> 1780126 INFO  (zkCallback-2970-thread-1) [    ] o.a.s.c.c.ZkStateReader A live node change: [WatchedEvent state:SyncConnected type:NodeChildrenChanged path:/live_nodes], has occurred - updating... (live nodes size: [1])
   [junit4]   2> 1780126 INFO  (zkCallback-2975-thread-1-processing-n:127.0.0.1:40113_) [n:127.0.0.1:40113_    ] o.a.s.c.c.ZkStateReader A live node change: [WatchedEvent state:SyncConnected type:NodeChildrenChanged path:/live_nodes], has occurred - updating... (live nodes size: [1])
   [junit4]   2> 1780126 INFO  (zkCallback-2968-thread-1-processing-n:127.0.0.1:49557_) [n:127.0.0.1:49557_    ] o.a.s.c.c.ZkStateReader A live node change: [WatchedEvent state:SyncConnected type:NodeChildrenChanged path:/live_nodes], has occurred - updating... (live nodes size: [1])
   [junit4]   2> 1780127 INFO  (zkCallback-2970-thread-1) [    ] o.a.s.c.c.ZkStateReader Updated live nodes from ZooKeeper... (1) -> (2)
   [junit4]   2> 1780127 INFO  (zkCallback-2975-thread-1-processing-n:127.0.0.1:40113_) [n:127.0.0.1:40113_    ] o.a.s.c.c.ZkStateReader Updated live nodes from ZooKeeper... (1) -> (2)
   [junit4]   2> 1780127 INFO  (zkCallback-2968-thread-1-processing-n:127.0.0.1:49557_) [n:127.0.0.1:49557_    ] o.a.s.c.c.ZkStateReader Updated live nodes from ZooKeeper... (1) -> (2)
   [junit4]   2> 1780139 INFO  (TEST-TestReqParamsAPI.test-seed#[3F8DE15F6A060C03]) [n:127.0.0.1:40113_    ] o.a.s.c.CoreContainer Security conf doesn't exist. Skipping setup for authorization module.
   [junit4]   2> 1780139 INFO  (TEST-TestReqParamsAPI.test-seed#[3F8DE15F6A060C03]) [n:127.0.0.1:40113_    ] o.a.s.c.CoreContainer No authentication plugin used.
   [junit4]   2> 1780140 INFO  (TEST-TestReqParamsAPI.test-seed#[3F8DE15F6A060C03]) [n:127.0.0.1:40113_    ] o.a.s.c.CorePropertiesLocator Looking for core definitions underneath /x1/jenkins/jenkins-slave/workspace/Lucene-Solr-Tests-trunk-Java8/solr/build/solr-core/test/J1/../../../../../../../../../../x1/jenkins/jenkins-slave/workspace/Lucene-Solr-Tests-trunk-Java8/solr/build/solr-core/test/J1/temp/solr.handler.TestReqParamsAPI_3F8DE15F6A060C03-001/shard-1-001/cores
   [junit4]   2> 1780140 INFO  (TEST-TestReqParamsAPI.test-seed#[3F8DE15F6A060C03]) [n:127.0.0.1:40113_    ] o.a.s.c.CoreDescriptor Created CoreDescriptor: {name=collection1, config=solrconfig.xml, transient=false, schema=schema.xml, loadOnStartup=true, configSetProperties=configsetprops.json, collection=collection1, coreNodeName=, dataDir=data/, shard=}
   [junit4]   2> 1780141 INFO  (TEST-TestReqParamsAPI.test-seed#[3F8DE15F6A060C03]) [n:127.0.0.1:40113_    ] o.a.s.c.CorePropertiesLocator Found core collection1 in /x1/jenkins/jenkins-slave/workspace/Lucene-Solr-Tests-trunk-Java8/solr/build/solr-core/test/J1/../../../../../../../../../../x1/jenkins/jenkins-slave/workspace/Lucene-Solr-Tests-trunk-Java8/solr/build/solr-core/test/J1/temp/solr.handler.TestReqParamsAPI_3F8DE15F6A060C03-001/shard-1-001/cores/collection1
   [junit4]   2> 1780141 INFO  (TEST-TestReqParamsAPI.test-seed#[3F8DE15F6A060C03]) [n:127.0.0.1:40113_    ] o.a.s.c.CorePropertiesLocator Found 1 core definitions
   [junit4]   2> 1780142 INFO  (TEST-TestReqParamsAPI.test-seed#[3F8DE15F6A060C03]) [n:127.0.0.1:40113_    ] o.a.s.s.SolrDispatchFilter user.dir=/x1/jenkins/jenkins-slave/workspace/Lucene-Solr-Tests-trunk-Java8/solr/build/solr-core/test/J1
   [junit4]   2> 1780142 INFO  (TEST-TestReqParamsAPI.test-seed#[3F8DE15F6A060C03]) [n:127.0.0.1:40113_    ] o.a.s.s.SolrDispatchFilter SolrDispatchFilter.init() done
   [junit4]   2> 1780142 INFO  (coreLoadExecutor-5510-thread-1-processing-n:127.0.0.1:40113_) [n:127.0.0.1:40113_ c:collection1   x:collection1] o.a.s.c.ZkController publishing state=down
   [junit4]   2> 1780142 INFO  (coreLoadExecutor-5510-thread-1-processing-n:127.0.0.1:40113_) [n:127.0.0.1:40113_ c:collection1   x:collection1] o.a.s.c.ZkController numShards not found on descriptor - reading it from system property
   [junit4]   2> 1780143 INFO  (OverseerStateUpdate-95483803336310789-127.0.0.1:49557_-n_0000000000) [n:127.0.0.1:49557_    ] o.a.s.c.Overseer processMessage: queueSize: 1, message = {
   [junit4]   2>   "core":"collection1",
   [junit4]   2>   "roles":null,
   [junit4]   2>   "base_url":"https://127.0.0.1:40113",
   [junit4]   2>   "node_name":"127.0.0.1:40113_",
   [junit4]   2>   "numShards":"2",
   [junit4]   2>   "state":"down",
   [junit4]   2>   "shard":null,
   [junit4]   2>   "collection":"collection1",
   [junit4]   2>   "operation":"state"} current state version: 4
   [junit4]   2> 1780144 INFO  (coreLoadExecutor-5510-thread-1-processing-n:127.0.0.1:40113_) [n:127.0.0.1:40113_ c:collection1   x:collection1] o.a.s.c.ZkController look for our core node name
   [junit4]   2> 1780144 INFO  (OverseerStateUpdate-95483803336310789-127.0.0.1:49557_-n_0000000000) [n:127.0.0.1:49557_    ] o.a.s.c.o.ReplicaMutator Update state numShards=2 message={
   [junit4]   2>   "core":"collection1",
   [junit4]   2>   "roles":null,
   [junit4]   2>   "base_url":"https://127.0.0.1:40113",
   [junit4]   2>   "node_name":"127.0.0.1:40113_",
   [junit4]   2>   "numShards":"2",
   [junit4]   2>   "state":"down",
   [junit4]   2>   "shard":null,
   [junit4]   2>   "collection":"collection1",
   [junit4]   2>   "operation":"state"}
   [junit4]   2> 1780144 INFO  (OverseerStateUpdate-95483803336310789-127.0.0.1:49557_-n_0000000000) [n:127.0.0.1:49557_    ] o.a.s.c.o.ClusterStateMutator building a new cName: collection1
   [junit4]   2> 1780144 INFO  (OverseerStateUpdate-95483803336310789-127.0.0.1:49557_-n_0000000000) [n:127.0.0.1:49557_    ] o.a.s.c.o.ReplicaMutator Assigning new node to shard shard=shard2
   [junit4]   2> 1780246 INFO  (zkCallback-2968-thread-1-processing-n:127.0.0.1:49557_) [n:127.0.0.1:49557_    ] o.a.s.c.c.ZkStateReader A cluster state change: [WatchedEvent state:SyncConnected type:NodeDataChanged path:/clusterstate.json], has occurred - updating... (live nodes size: [2])
   [junit4]   2> 1780246 INFO  (zkCallback-2970-thread-1) [    ] o.a.s.c.c.ZkStateReader A cluster state change: [WatchedEvent state:SyncConnected type:NodeDataChanged path:/clusterstate.json], has occurred - updating... (live nodes size: [2])
   [junit4]   2> 1780246 INFO  (zkCallback-2975-thread-1-processing-n:127.0.0.1:40113_) [n:127.0.0.1:40113_    ] o.a.s.c.c.ZkStateReader A cluster state change: [WatchedEvent state:SyncConnected type:NodeDataChanged path:/clusterstate.json], has occurred - updating... (live nodes size: [2])
   [junit4]   2> 1781144 INFO  (coreLoadExecutor-5510-thread-1-processing-n:127.0.0.1:40113_) [n:127.0.0.1:40113_ c:collection1   x:collection1] o.a.s.c.ZkController waiting to find shard id in clusterstate for collection1
   [junit4]   2> 1781144 INFO  (coreLoadExecutor-5510-thread-1-processing-n:127.0.0.1:40113_) [n:127.0.0.1:40113_ c:collection1   x:collection1] o.a.s.c.ZkController Check for collection zkNode:collection1
   [junit4]   2> 1781145 INFO  (coreLoadExecutor-5510-thread-1-processing-n:127.0.0.1:40113_) [n:127.0.0.1:40113_ c:collection1   x:collection1] o.a.s.c.ZkController Collection zkNode exists
   [junit4]   2> 1781145 INFO  (coreLoadExecutor-5510-thread-1-processing-n:127.0.0.1:40113_) [n:127.0.0.1:40113_ c:collection1   x:collection1] o.a.s.c.c.ZkStateReader Load collection config from: [/collections/collection1]
   [junit4]   2> 1781145 INFO  (coreLoadExecutor-5510-thread-1-processing-n:127.0.0.1:40113_) [n:127.0.0.1:40113_ c:collection1   x:collection1] o.a.s.c.c.ZkStateReader path=[/collections/collection1] [configName]=[conf1] specified config exists in ZooKeeper
   [junit4]   2> 1781145 INFO  (coreLoadExecutor-5510-thread-1-processing-n:127.0.0.1:40113_) [n:127.0.0.1:40113_ c:collection1   x:collection1] o.a.s.c.SolrResourceLoader new SolrResourceLoader for directory: '/x1/jenkins/jenkins-slave/workspace/Lucene-Solr-Tests-trunk-Java8/solr/build/solr-core/test/J1/temp/solr.handler.TestReqParamsAPI_3F8DE15F6A060C03-001/shard-1-001/cores/collection1'
   [junit4]   2> 1781146 INFO  (coreLoadExecutor-5510-thread-1-processing-n:127.0.0.1:40113_) [n:127.0.0.1:40113_ c:collection1   x:collection1] o.a.s.c.SolrResourceLoader JNDI not configured for solr (NoInitialContextEx)
   [junit4]   2> 1781146 INFO  (coreLoadExecutor-5510-thread-1-processing-n:127.0.0.1:40113_) [n:127.0.0.1:40113_ c:collection1   x:collection1] o.a.s.c.SolrResourceLoader solr home defaulted to 'solr/' (could not find system property or JNDI)
   [junit4]   2> 1781147 INFO  (coreLoadExecutor-5510-thread-1-processing-n:127.0.0.1:40113_) [n:127.0.0.1:40113_ c:collection1   x:collection1] o.a.s.c.Config loaded config solrconfig.xml with version 0 
   [junit4]   2> 1781153 INFO  (coreLoadExecutor-5510-thread-1-processing-n:127.0.0.1:40113_) [n:127.0.0.1:40113_ c:collection1   x:collection1] o.a.s.c.SolrConfig current version of requestparams : -1
   [junit4]   2> 1781157 WARN  (coreLoadExecutor-5510-thread-1-processing-n:127.0.0.1:40113_) [n:127.0.0.1:40113_ c:collection1   x:collection1] o.a.s.c.Config Beginning with Solr 5.5, <mergePolicy> is deprecated, use <mergePolicyFactory> instead.
   [junit4]   2> 1781157 INFO  (coreLoadExecutor-5510-thread-1-processing-n:127.0.0.1:40113_) [n:127.0.0.1:40113_ c:collection1   x:collection1] o.a.s.c.SolrConfig Using Lucene MatchVersion: 7.0.0
   [junit4]   2> 1781166 INFO  (coreLoadExecutor-5510-thread-1-processing-n:127.0.0.1:40113_) [n:127.0.0.1:40113_ c:collection1   x:collection1] o.a.s.c.SolrConfig Loaded SolrConfig: solrconfig.xml
   [junit4]   2> 1781171 INFO  (coreLoadExecutor-5510-thread-1-processing-n:127.0.0.1:40113_) [n:127.0.0.1:40113_ c:collection1   x:collection1] o.a.s.s.IndexSchema [collection1] Schema name=test
   [junit4]   2> 1781264 INFO  (coreLoadExecutor-5510-thread-1-processing-n:127.0.0.1:40113_) [n:127.0.0.1:40113_ c:collection1   x:collection1] o.a.s.s.OpenExchangeRatesOrgProvider Initialized with rates=open-exchange-rates.json, refreshInterval=1440.
   [junit4]   2> 1781269 INFO  (coreLoadExecutor-5510-thread-1-processing-n:127.0.0.1:40113_) [n:127.0.0.1:40113_ c:collection1   x:collection1] o.a.s.s.IndexSchema default search field in schema is text
   [junit4]   2> 1781270 INFO  (coreLoadExecutor-5510-thread-1-processing-n:127.0.0.1:40113_) [n:127.0.0.1:40113_ c:collection1   x:collection1] o.a.s.s.IndexSchema unique key field: id
   [junit4]   2> 1781278 INFO  (coreLoadExecutor-5510-thread-1-processing-n:127.0.0.1:40113_) [n:127.0.0.1:40113_ c:collection1   x:collection1] o.a.s.s.FileExchangeRateProvider Reloading exchange rates from file currency.xml
   [junit4]   2> 1781281 INFO  (coreLoadExecutor-5510-thread-1-processing-n:127.0.0.1:40113_) [n:127.0.0.1:40113_ c:collection1   x:collection1] o.a.s.s.FileExchangeRateProvider Reloading exchange rates from file currency.xml
   [junit4]   2> 1781282 INFO  (coreLoadExecutor-5510-thread-1-processing-n:127.0.0.1:40113_) [n:127.0.0.1:40113_ c:collection1   x:collection1] o.a.s.s.OpenExchangeRatesOrgProvider Reloading exchange rates from open-exchange-rates.json
   [junit4]   2> 1781283 INFO  (coreLoadExecutor-5510-thread-1-processing-n:127.0.0.1:40113_) [n:127.0.0.1:40113_ c:collection1   x:collection1] o.a.s.s.OpenExchangeRatesOrgProvider Reloading exchange rates from open-exchange-rates.json
   [junit4]   2> 1781285 INFO  (coreLoadExecutor-5510-thread-1-processing-n:127.0.0.1:40113_) [n:127.0.0.1:40113_ c:collection1   x:collection1] o.a.s.c.ConfigSetProperties Did not find ConfigSet properties, assuming default properties: Can't find resource 'configsetprops.json' in classpath or '/configs/conf1', cwd=/x1/jenkins/jenkins-slave/workspace/Lucene-Solr-Tests-trunk-Java8/solr/build/solr-core/test/J1
   [junit4]   2> 1781285 INFO  (coreLoadExecutor-

[...truncated too long message...]

xecute(SolrZkClient.java:241)
   [junit4]   2> 	at org.apache.solr.common.cloud.ZkCmdExecutor.retryOperation(ZkCmdExecutor.java:60)
   [junit4]   2> 	at org.apache.solr.common.cloud.SolrZkClient.delete(SolrZkClient.java:241)
   [junit4]   2> 	at org.apache.solr.cloud.ElectionContext.cancelElection(ElectionContext.java:86)
   [junit4]   2> 	at org.apache.solr.cloud.ShardLeaderElectionContextBase.cancelElection(ElectionContext.java:143)
   [junit4]   2> 	at org.apache.solr.cloud.ShardLeaderElectionContext.cancelElection(ElectionContext.java:279)
   [junit4]   2> 	at org.apache.solr.cloud.ShardLeaderElectionContext.runLeaderProcess(ElectionContext.java:455)
   [junit4]   2> 	at org.apache.solr.cloud.LeaderElector.runIamLeaderProcess(LeaderElector.java:173)
   [junit4]   2> 	at org.apache.solr.cloud.LeaderElector.checkIfIamLeader(LeaderElector.java:138)
   [junit4]   2> 	at org.apache.solr.cloud.LeaderElector.access$200(LeaderElector.java:59)
   [junit4]   2> 	at org.apache.solr.cloud.LeaderElector$ElectionWatcher.process(LeaderElector.java:351)
   [junit4]   2> 	at org.apache.solr.common.cloud.SolrZkClient$3$1.run(SolrZkClient.java:269)
   [junit4]   2> 	at java.util.concurrent.Executors$RunnableAdapter.call(Executors.java:511)
   [junit4]   2> 	at java.util.concurrent.FutureTask.run(FutureTask.java:266)
   [junit4]   2> 	at org.apache.solr.common.util.ExecutorUtil$MDCAwareThreadPoolExecutor$1.run(ExecutorUtil.java:231)
   [junit4]   2> 	at java.util.concurrent.ThreadPoolExecutor.runWorker(ThreadPoolExecutor.java:1142)
   [junit4]   2> 	at java.util.concurrent.ThreadPoolExecutor$Worker.run(ThreadPoolExecutor.java:617)
   [junit4]   2> 	at java.lang.Thread.run(Thread.java:745)
   [junit4]   2> 1803572 INFO  (TEST-TestReqParamsAPI.test-seed#[3F8DE15F6A060C03]) [    ] o.e.j.s.ServerConnector Stopped ServerConnector@48c7b097{SSL,[ssl, http/1.1]}{127.0.0.1:0}
   [junit4]   2> 1803572 INFO  (TEST-TestReqParamsAPI.test-seed#[3F8DE15F6A060C03]) [    ] o.e.j.s.h.ContextHandler Stopped o.e.j.s.ServletContextHandler@5a73390e{/,null,UNAVAILABLE}
   [junit4]   2> 1803574 INFO  (TEST-TestReqParamsAPI.test-seed#[3F8DE15F6A060C03]) [    ] o.a.s.c.ZkTestServer connecting to 127.0.0.1:53355 53355
   [junit4]   2> 1803777 INFO  (Thread-7154) [    ] o.a.s.c.ZkTestServer connecting to 127.0.0.1:53355 53355
   [junit4]   2> 1803778 WARN  (Thread-7154) [    ] o.a.s.c.ZkTestServer Watch limit violations: 
   [junit4]   2> Maximum concurrent create/delete watches above limit:
   [junit4]   2> 
   [junit4]   2> 	25	/solr/configs/conf1
   [junit4]   2> 	6	/solr/aliases.json
   [junit4]   2> 	5	/solr/security.json
   [junit4]   2> 
   [junit4]   2> Maximum concurrent data watches above limit:
   [junit4]   2> 
   [junit4]   2> 	6	/solr/clusterstate.json
   [junit4]   2> 
   [junit4]   2> Maximum concurrent children watches above limit:
   [junit4]   2> 
   [junit4]   2> 	6	/solr/live_nodes
   [junit4]   2> 	6	/solr/collections
   [junit4]   2> 	4	/solr/overseer/queue
   [junit4]   2> 	4	/solr/overseer/collection-queue-work
   [junit4]   2> 
   [junit4]   2> NOTE: reproduce with: ant test  -Dtestcase=TestReqParamsAPI -Dtests.method=test -Dtests.seed=3F8DE15F6A060C03 -Dtests.multiplier=2 -Dtests.slow=true -Dtests.locale=lt -Dtests.timezone=Africa/Malabo -Dtests.asserts=true -Dtests.file.encoding=ISO-8859-1
   [junit4] FAILURE 26.6s J1 | TestReqParamsAPI.test <<<
   [junit4]    > Throwable #1: java.lang.AssertionError: Could not get expected value  'CY val' for path 'params/c' full output: {
   [junit4]    >   "responseHeader":{
   [junit4]    >     "status":0,
   [junit4]    >     "QTime":0},
   [junit4]    >   "params":{
   [junit4]    >     "a":"A val",
   [junit4]    >     "b":"B val",
   [junit4]    >     "wt":"json",
   [junit4]    >     "useParams":""},
   [junit4]    >   "context":{
   [junit4]    >     "webapp":"",
   [junit4]    >     "path":"/dump1",
   [junit4]    >     "httpMethod":"GET"}}
   [junit4]    > 	at __randomizedtesting.SeedInfo.seed([3F8DE15F6A060C03:B7D9DE85C4FA61FB]:0)
   [junit4]    > 	at org.apache.solr.core.TestSolrConfigHandler.testForResponseElement(TestSolrConfigHandler.java:458)
   [junit4]    > 	at org.apache.solr.handler.TestReqParamsAPI.testReqParams(TestReqParamsAPI.java:177)
   [junit4]    > 	at org.apache.solr.handler.TestReqParamsAPI.test(TestReqParamsAPI.java:67)
   [junit4]    > 	at org.apache.solr.BaseDistributedSearchTestCase$ShardsRepeatRule$ShardsFixedStatement.callStatement(BaseDistributedSearchTestCase.java:996)
   [junit4]    > 	at org.apache.solr.BaseDistributedSearchTestCase$ShardsRepeatRule$ShardsStatement.evaluate(BaseDistributedSearchTestCase.java:971)
   [junit4]    > 	at java.lang.Thread.run(Thread.java:745)
   [junit4]   2> 1803782 INFO  (SUITE-TestReqParamsAPI-seed#[3F8DE15F6A060C03]-worker) [    ] o.a.s.SolrTestCaseJ4 ###deleteCore
   [junit4]   2> NOTE: leaving temporary files on disk at: /x1/jenkins/jenkins-slave/workspace/Lucene-Solr-Tests-trunk-Java8/solr/build/solr-core/test/J1/temp/solr.handler.TestReqParamsAPI_3F8DE15F6A060C03-001
   [junit4]   2> Mar 03, 2016 1:07:20 AM com.carrotsearch.randomizedtesting.ThreadLeakControl checkThreadLeaks
   [junit4]   2> WARNING: Will linger awaiting termination of 1 leaked thread(s).
   [junit4]   2> NOTE: test params are: codec=Asserting(Lucene60): {}, docValues:{}, maxPointsInLeafNode=1089, maxMBSortInHeap=4.203881443224783, sim=RandomSimilarity(queryNorm=true,coord=yes): {}, locale=lt, timezone=Africa/Malabo
   [junit4]   2> NOTE: Linux 3.13.0-52-generic amd64/Oracle Corporation 1.8.0_66 (64-bit)/cpus=4,threads=1,free=235394496,total=532152320
   [junit4]   2> NOTE: All tests run in this JVM: [TestJsonRequest, TestRawResponseWriter, OpenCloseCoreStressTest, TimeZoneUtilsTest, NotRequiredUniqueKeyTest, BlockJoinFacetDistribTest, TestEmbeddedSolrServerConstructors, DistanceFunctionTest, UniqFieldsUpdateProcessorFactoryTest, TestFastLRUCache, TestFieldTypeCollectionResource, SpellPossibilityIteratorTest, SolrInfoMBeanTest, ZkCLITest, FacetPivotSmallTest, TestConfigSets, TestSimpleQParserPlugin, ExitableDirectoryReaderTest, MBeansHandlerTest, SparseHLLTest, BigEndianAscendingWordSerializerTest, TestRestManager, TestBinaryResponseWriter, PreAnalyzedUpdateProcessorTest, OpenExchangeRatesOrgProviderTest, CursorMarkTest, DirectSolrSpellCheckerTest, OverseerCollectionConfigSetProcessorTest, GraphQueryTest, SolrIndexSplitterTest, ZkStateWriterTest, DistributedMLTComponentTest, ChaosMonkeySafeLeaderTest, HighlighterTest, TestFreeTextSuggestions, CdcrUpdateLogTest, RulesTest, SuggesterFSTTest, CSVRequestHandlerTest, SimplePostToolTest, TestSchemaNameResource, CoreAdminRequestStatusTest, HdfsChaosMonkeyNothingIsSafeTest, ForceLeaderTest, TestCollapseQParserPlugin, SpellingQueryConverterTest, DistributedIntervalFacetingTest, TestCollectionAPI, AsyncMigrateRouteKeyTest, ZkSolrClientTest, OverseerTaskQueueTest, FileUtilsTest, TestCoreContainer, ConnectionManagerTest, SpellCheckCollatorTest, SpellCheckComponentTest, TestRequestStatusCollectionAPI, TestSolrQueryParserResource, DistributedFacetPivotSmallAdvancedTest, HighlighterMaxOffsetTest, SpatialFilterTest, TestBM25SimilarityFactory, SharedFSAutoReplicaFailoverTest, HdfsTlogReplayBufferedWhileIndexingTest, LeaderInitiatedRecoveryOnCommitTest, TestBlobHandler, ConvertedLegacyTest, MultiThreadedOCPTest, TestQueryTypes, TestSolrConfigHandlerCloud, ShardRoutingTest, TestSimpleTrackingShardHandler, AddSchemaFieldsUpdateProcessorFactoryTest, TestDistribIDF, SecurityConfHandlerTest, TestCloudDeleteByQuery, TestWordDelimiterFilterFactory, TestUseDocValuesAsStored2, TestCloudManagedSchemaConcurrent, TestHashPartitioner, HdfsLockFactoryTest, ReplicationFactorTest, SolrPluginUtilsTest, TestSha256AuthenticationProvider, ChaosMonkeyNothingIsSafeTest, TestOrdValues, TestCodecSupport, SoftAutoCommitTest, DocValuesTest, TestAuthorizationFramework, TestDocumentBuilder, TestQuerySenderNoQuery, TestRecoveryHdfs, ShardRoutingCustomTest, AssignTest, AsyncCallRequestStatusResponseTest, CdcrReplicationDistributedZkTest, CdcrReplicationHandlerTest, CdcrRequestHandlerTest, CdcrVersionReplicationTest, CollectionTooManyReplicasTest, DeleteReplicaTest, DistribDocExpirationUpdateProcessorTest, LeaderInitiatedRecoveryOnShardRestartTest, OverseerRolesTest, RestartWhileUpdatingTest, RollingRestartTest, TestCloudInspectUtil, TestConfigSetsAPIZkFailure, TestDistribDocBasedVersion, TestExclusionRuleCollectionAccess, TestMiniSolrCloudCluster, TestSizeLimitedDistributedMap, HdfsRecoveryZkTest, HdfsRestartWhileUpdatingTest, StressHdfsTest, TestReqParamsAPI]
   [junit4] Completed [494/581 (1!)] on J1 in 27.17s, 1 test, 1 failure <<< FAILURES!

[...truncated 278 lines...]
BUILD FAILED
/x1/jenkins/jenkins-slave/workspace/Lucene-Solr-Tests-trunk-Java8/build.xml:740: The following error occurred while executing this line:
/x1/jenkins/jenkins-slave/workspace/Lucene-Solr-Tests-trunk-Java8/build.xml:684: The following error occurred while executing this line:
/x1/jenkins/jenkins-slave/workspace/Lucene-Solr-Tests-trunk-Java8/build.xml:59: The following error occurred while executing this line:
/x1/jenkins/jenkins-slave/workspace/Lucene-Solr-Tests-trunk-Java8/solr/build.xml:233: The following error occurred while executing this line:
/x1/jenkins/jenkins-slave/workspace/Lucene-Solr-Tests-trunk-Java8/solr/common-build.xml:524: The following error occurred while executing this line:
/x1/jenkins/jenkins-slave/workspace/Lucene-Solr-Tests-trunk-Java8/lucene/common-build.xml:1457: The following error occurred while executing this line:
/x1/jenkins/jenkins-slave/workspace/Lucene-Solr-Tests-trunk-Java8/lucene/common-build.xml:1014: There were test failures: 581 suites (8 ignored), 2345 tests, 1 failure, 87 ignored (71 assumptions) [seed: 3F8DE15F6A060C03]

Total time: 59 minutes 21 seconds
Build step 'Invoke Ant' marked build as failure
Archiving artifacts
Recording test results
Email was triggered for: Failure - Any
Sending email for trigger: Failure - Any



Mime
View raw message