lucene-dev mailing list archives

Site index · List index
Message view « Date » · « Thread »
Top « Date » · « Thread »
From Policeman Jenkins Server <jenk...@thetaphi.de>
Subject [JENKINS] Lucene-Solr-master-Linux (32bit/jdk1.8.0_72) - Build # 16233 - Failure!
Date Thu, 17 Mar 2016 07:55:48 GMT
Build: http://jenkins.thetaphi.de/job/Lucene-Solr-master-Linux/16233/
Java: 32bit/jdk1.8.0_72 -client -XX:+UseSerialGC

2 tests failed.
FAILED:  org.apache.solr.handler.TestReplicationHandler.doTestStressReplication

Error Message:
timed out waiting for collection1 startAt time to exceed: Thu Mar 17 07:42:23 GMT 2016

Stack Trace:
java.lang.AssertionError: timed out waiting for collection1 startAt time to exceed: Thu Mar 17 07:42:23 GMT 2016
	at __randomizedtesting.SeedInfo.seed([E7047B72BBDEF85:D5DB47712E958636]:0)
	at org.junit.Assert.fail(Assert.java:93)
	at org.apache.solr.handler.TestReplicationHandler.watchCoreStartAt(TestReplicationHandler.java:1422)
	at org.apache.solr.handler.TestReplicationHandler.doTestStressReplication(TestReplicationHandler.java:774)
	at sun.reflect.NativeMethodAccessorImpl.invoke0(Native Method)
	at sun.reflect.NativeMethodAccessorImpl.invoke(NativeMethodAccessorImpl.java:62)
	at sun.reflect.DelegatingMethodAccessorImpl.invoke(DelegatingMethodAccessorImpl.java:43)
	at java.lang.reflect.Method.invoke(Method.java:498)
	at com.carrotsearch.randomizedtesting.RandomizedRunner.invoke(RandomizedRunner.java:1764)
	at com.carrotsearch.randomizedtesting.RandomizedRunner$8.evaluate(RandomizedRunner.java:871)
	at com.carrotsearch.randomizedtesting.RandomizedRunner$9.evaluate(RandomizedRunner.java:907)
	at com.carrotsearch.randomizedtesting.RandomizedRunner$10.evaluate(RandomizedRunner.java:921)
	at com.carrotsearch.randomizedtesting.rules.SystemPropertiesRestoreRule$1.evaluate(SystemPropertiesRestoreRule.java:57)
	at org.apache.lucene.util.TestRuleSetupTeardownChained$1.evaluate(TestRuleSetupTeardownChained.java:49)
	at org.apache.lucene.util.AbstractBeforeAfterRule$1.evaluate(AbstractBeforeAfterRule.java:45)
	at org.apache.lucene.util.TestRuleThreadAndTestName$1.evaluate(TestRuleThreadAndTestName.java:48)
	at org.apache.lucene.util.TestRuleIgnoreAfterMaxFailures$1.evaluate(TestRuleIgnoreAfterMaxFailures.java:64)
	at org.apache.lucene.util.TestRuleMarkFailure$1.evaluate(TestRuleMarkFailure.java:47)
	at com.carrotsearch.randomizedtesting.rules.StatementAdapter.evaluate(StatementAdapter.java:36)
	at com.carrotsearch.randomizedtesting.ThreadLeakControl$StatementRunner.run(ThreadLeakControl.java:367)
	at com.carrotsearch.randomizedtesting.ThreadLeakControl.forkTimeoutingTask(ThreadLeakControl.java:809)
	at com.carrotsearch.randomizedtesting.ThreadLeakControl$3.evaluate(ThreadLeakControl.java:460)
	at com.carrotsearch.randomizedtesting.RandomizedRunner.runSingleTest(RandomizedRunner.java:880)
	at com.carrotsearch.randomizedtesting.RandomizedRunner$5.evaluate(RandomizedRunner.java:781)
	at com.carrotsearch.randomizedtesting.RandomizedRunner$6.evaluate(RandomizedRunner.java:816)
	at com.carrotsearch.randomizedtesting.RandomizedRunner$7.evaluate(RandomizedRunner.java:827)
	at com.carrotsearch.randomizedtesting.rules.StatementAdapter.evaluate(StatementAdapter.java:36)
	at com.carrotsearch.randomizedtesting.rules.SystemPropertiesRestoreRule$1.evaluate(SystemPropertiesRestoreRule.java:57)
	at org.apache.lucene.util.AbstractBeforeAfterRule$1.evaluate(AbstractBeforeAfterRule.java:45)
	at com.carrotsearch.randomizedtesting.rules.StatementAdapter.evaluate(StatementAdapter.java:36)
	at org.apache.lucene.util.TestRuleStoreClassName$1.evaluate(TestRuleStoreClassName.java:41)
	at com.carrotsearch.randomizedtesting.rules.NoShadowingOrOverridesOnMethodsRule$1.evaluate(NoShadowingOrOverridesOnMethodsRule.java:40)
	at com.carrotsearch.randomizedtesting.rules.NoShadowingOrOverridesOnMethodsRule$1.evaluate(NoShadowingOrOverridesOnMethodsRule.java:40)
	at com.carrotsearch.randomizedtesting.rules.StatementAdapter.evaluate(StatementAdapter.java:36)
	at com.carrotsearch.randomizedtesting.rules.StatementAdapter.evaluate(StatementAdapter.java:36)
	at com.carrotsearch.randomizedtesting.rules.StatementAdapter.evaluate(StatementAdapter.java:36)
	at org.apache.lucene.util.TestRuleAssertionsRequired$1.evaluate(TestRuleAssertionsRequired.java:53)
	at org.apache.lucene.util.TestRuleMarkFailure$1.evaluate(TestRuleMarkFailure.java:47)
	at org.apache.lucene.util.TestRuleIgnoreAfterMaxFailures$1.evaluate(TestRuleIgnoreAfterMaxFailures.java:64)
	at org.apache.lucene.util.TestRuleIgnoreTestSuites$1.evaluate(TestRuleIgnoreTestSuites.java:54)
	at com.carrotsearch.randomizedtesting.rules.StatementAdapter.evaluate(StatementAdapter.java:36)
	at com.carrotsearch.randomizedtesting.ThreadLeakControl$StatementRunner.run(ThreadLeakControl.java:367)
	at java.lang.Thread.run(Thread.java:745)


FAILED:  org.apache.solr.handler.TestReqParamsAPI.test

Error Message:
Could not get expected value  'first' for path 'response/params/x/_appends_/add' full output: {   "responseHeader":{     "status":0,     "QTime":0},   "response":{     "znodeVersion":3,     "params":{       "x":{         "a":"A val",         "b":"B val",         "":{"v":0}},       "y":{         "p":"P val",         "q":"Q val",         "":{"v":2}}}}}

Stack Trace:
java.lang.AssertionError: Could not get expected value  'first' for path 'response/params/x/_appends_/add' full output: {
  "responseHeader":{
    "status":0,
    "QTime":0},
  "response":{
    "znodeVersion":3,
    "params":{
      "x":{
        "a":"A val",
        "b":"B val",
        "":{"v":0}},
      "y":{
        "p":"P val",
        "q":"Q val",
        "":{"v":2}}}}}
	at __randomizedtesting.SeedInfo.seed([E7047B72BBDEF85:8624786D8541827D]:0)
	at org.junit.Assert.fail(Assert.java:93)
	at org.junit.Assert.assertTrue(Assert.java:43)
	at org.apache.solr.core.TestSolrConfigHandler.testForResponseElement(TestSolrConfigHandler.java:458)
	at org.apache.solr.handler.TestReqParamsAPI.testReqParams(TestReqParamsAPI.java:236)
	at org.apache.solr.handler.TestReqParamsAPI.test(TestReqParamsAPI.java:67)
	at sun.reflect.NativeMethodAccessorImpl.invoke0(Native Method)
	at sun.reflect.NativeMethodAccessorImpl.invoke(NativeMethodAccessorImpl.java:62)
	at sun.reflect.DelegatingMethodAccessorImpl.invoke(DelegatingMethodAccessorImpl.java:43)
	at java.lang.reflect.Method.invoke(Method.java:498)
	at com.carrotsearch.randomizedtesting.RandomizedRunner.invoke(RandomizedRunner.java:1764)
	at com.carrotsearch.randomizedtesting.RandomizedRunner$8.evaluate(RandomizedRunner.java:871)
	at com.carrotsearch.randomizedtesting.RandomizedRunner$9.evaluate(RandomizedRunner.java:907)
	at com.carrotsearch.randomizedtesting.RandomizedRunner$10.evaluate(RandomizedRunner.java:921)
	at org.apache.solr.BaseDistributedSearchTestCase$ShardsRepeatRule$ShardsFixedStatement.callStatement(BaseDistributedSearchTestCase.java:996)
	at org.apache.solr.BaseDistributedSearchTestCase$ShardsRepeatRule$ShardsStatement.evaluate(BaseDistributedSearchTestCase.java:971)
	at com.carrotsearch.randomizedtesting.rules.SystemPropertiesRestoreRule$1.evaluate(SystemPropertiesRestoreRule.java:57)
	at org.apache.lucene.util.TestRuleSetupTeardownChained$1.evaluate(TestRuleSetupTeardownChained.java:49)
	at org.apache.lucene.util.AbstractBeforeAfterRule$1.evaluate(AbstractBeforeAfterRule.java:45)
	at org.apache.lucene.util.TestRuleThreadAndTestName$1.evaluate(TestRuleThreadAndTestName.java:48)
	at org.apache.lucene.util.TestRuleIgnoreAfterMaxFailures$1.evaluate(TestRuleIgnoreAfterMaxFailures.java:64)
	at org.apache.lucene.util.TestRuleMarkFailure$1.evaluate(TestRuleMarkFailure.java:47)
	at com.carrotsearch.randomizedtesting.rules.StatementAdapter.evaluate(StatementAdapter.java:36)
	at com.carrotsearch.randomizedtesting.ThreadLeakControl$StatementRunner.run(ThreadLeakControl.java:367)
	at com.carrotsearch.randomizedtesting.ThreadLeakControl.forkTimeoutingTask(ThreadLeakControl.java:809)
	at com.carrotsearch.randomizedtesting.ThreadLeakControl$3.evaluate(ThreadLeakControl.java:460)
	at com.carrotsearch.randomizedtesting.RandomizedRunner.runSingleTest(RandomizedRunner.java:880)
	at com.carrotsearch.randomizedtesting.RandomizedRunner$5.evaluate(RandomizedRunner.java:781)
	at com.carrotsearch.randomizedtesting.RandomizedRunner$6.evaluate(RandomizedRunner.java:816)
	at com.carrotsearch.randomizedtesting.RandomizedRunner$7.evaluate(RandomizedRunner.java:827)
	at com.carrotsearch.randomizedtesting.rules.StatementAdapter.evaluate(StatementAdapter.java:36)
	at com.carrotsearch.randomizedtesting.rules.SystemPropertiesRestoreRule$1.evaluate(SystemPropertiesRestoreRule.java:57)
	at org.apache.lucene.util.AbstractBeforeAfterRule$1.evaluate(AbstractBeforeAfterRule.java:45)
	at com.carrotsearch.randomizedtesting.rules.StatementAdapter.evaluate(StatementAdapter.java:36)
	at org.apache.lucene.util.TestRuleStoreClassName$1.evaluate(TestRuleStoreClassName.java:41)
	at com.carrotsearch.randomizedtesting.rules.NoShadowingOrOverridesOnMethodsRule$1.evaluate(NoShadowingOrOverridesOnMethodsRule.java:40)
	at com.carrotsearch.randomizedtesting.rules.NoShadowingOrOverridesOnMethodsRule$1.evaluate(NoShadowingOrOverridesOnMethodsRule.java:40)
	at com.carrotsearch.randomizedtesting.rules.StatementAdapter.evaluate(StatementAdapter.java:36)
	at com.carrotsearch.randomizedtesting.rules.StatementAdapter.evaluate(StatementAdapter.java:36)
	at com.carrotsearch.randomizedtesting.rules.StatementAdapter.evaluate(StatementAdapter.java:36)
	at org.apache.lucene.util.TestRuleAssertionsRequired$1.evaluate(TestRuleAssertionsRequired.java:53)
	at org.apache.lucene.util.TestRuleMarkFailure$1.evaluate(TestRuleMarkFailure.java:47)
	at org.apache.lucene.util.TestRuleIgnoreAfterMaxFailures$1.evaluate(TestRuleIgnoreAfterMaxFailures.java:64)
	at org.apache.lucene.util.TestRuleIgnoreTestSuites$1.evaluate(TestRuleIgnoreTestSuites.java:54)
	at com.carrotsearch.randomizedtesting.rules.StatementAdapter.evaluate(StatementAdapter.java:36)
	at com.carrotsearch.randomizedtesting.ThreadLeakControl$StatementRunner.run(ThreadLeakControl.java:367)
	at java.lang.Thread.run(Thread.java:745)




Build Log:
[...truncated 11047 lines...]
   [junit4] Suite: org.apache.solr.handler.TestReqParamsAPI
   [junit4]   2> Creating dataDir: /home/jenkins/workspace/Lucene-Solr-master-Linux/solr/build/solr-core/test/J2/temp/solr.handler.TestReqParamsAPI_E7047B72BBDEF85-001/init-core-data-001
   [junit4]   2> 502662 INFO  (SUITE-TestReqParamsAPI-seed#[E7047B72BBDEF85]-worker) [    ] o.a.s.SolrTestCaseJ4 Randomized ssl (false) and clientAuth (false)
   [junit4]   2> 502662 INFO  (SUITE-TestReqParamsAPI-seed#[E7047B72BBDEF85]-worker) [    ] o.a.s.BaseDistributedSearchTestCase Setting hostContext system property: /uihr/t
   [junit4]   2> 502664 INFO  (TEST-TestReqParamsAPI.test-seed#[E7047B72BBDEF85]) [    ] o.a.s.c.ZkTestServer STARTING ZK TEST SERVER
   [junit4]   2> 502664 INFO  (Thread-934) [    ] o.a.s.c.ZkTestServer client port:0.0.0.0/0.0.0.0:0
   [junit4]   2> 502664 INFO  (Thread-934) [    ] o.a.s.c.ZkTestServer Starting server
   [junit4]   2> 502764 INFO  (TEST-TestReqParamsAPI.test-seed#[E7047B72BBDEF85]) [    ] o.a.s.c.ZkTestServer start zk server on port:44243
   [junit4]   2> 502764 INFO  (TEST-TestReqParamsAPI.test-seed#[E7047B72BBDEF85]) [    ] o.a.s.c.c.SolrZkClient Using default ZkCredentialsProvider
   [junit4]   2> 502765 INFO  (TEST-TestReqParamsAPI.test-seed#[E7047B72BBDEF85]) [    ] o.a.s.c.c.ConnectionManager Waiting for client to connect to ZooKeeper
   [junit4]   2> 502771 INFO  (zkCallback-383-thread-1) [    ] o.a.s.c.c.ConnectionManager Watcher org.apache.solr.common.cloud.ConnectionManager@109ba61 name:ZooKeeperConnection Watcher:127.0.0.1:44243 got event WatchedEvent state:SyncConnected type:None path:null path:null type:None
   [junit4]   2> 502771 INFO  (TEST-TestReqParamsAPI.test-seed#[E7047B72BBDEF85]) [    ] o.a.s.c.c.ConnectionManager Client is connected to ZooKeeper
   [junit4]   2> 502772 INFO  (TEST-TestReqParamsAPI.test-seed#[E7047B72BBDEF85]) [    ] o.a.s.c.c.SolrZkClient Using default ZkACLProvider
   [junit4]   2> 502772 INFO  (TEST-TestReqParamsAPI.test-seed#[E7047B72BBDEF85]) [    ] o.a.s.c.c.SolrZkClient makePath: /solr
   [junit4]   2> 502774 INFO  (TEST-TestReqParamsAPI.test-seed#[E7047B72BBDEF85]) [    ] o.a.s.c.c.SolrZkClient Using default ZkCredentialsProvider
   [junit4]   2> 502774 INFO  (TEST-TestReqParamsAPI.test-seed#[E7047B72BBDEF85]) [    ] o.a.s.c.c.ConnectionManager Waiting for client to connect to ZooKeeper
   [junit4]   2> 502775 INFO  (zkCallback-384-thread-1) [    ] o.a.s.c.c.ConnectionManager Watcher org.apache.solr.common.cloud.ConnectionManager@71933d name:ZooKeeperConnection Watcher:127.0.0.1:44243/solr got event WatchedEvent state:SyncConnected type:None path:null path:null type:None
   [junit4]   2> 502775 INFO  (TEST-TestReqParamsAPI.test-seed#[E7047B72BBDEF85]) [    ] o.a.s.c.c.ConnectionManager Client is connected to ZooKeeper
   [junit4]   2> 502776 INFO  (TEST-TestReqParamsAPI.test-seed#[E7047B72BBDEF85]) [    ] o.a.s.c.c.SolrZkClient Using default ZkACLProvider
   [junit4]   2> 502776 INFO  (TEST-TestReqParamsAPI.test-seed#[E7047B72BBDEF85]) [    ] o.a.s.c.c.SolrZkClient makePath: /collections/collection1
   [junit4]   2> 502778 INFO  (TEST-TestReqParamsAPI.test-seed#[E7047B72BBDEF85]) [    ] o.a.s.c.c.SolrZkClient makePath: /collections/collection1/shards
   [junit4]   2> 502780 INFO  (TEST-TestReqParamsAPI.test-seed#[E7047B72BBDEF85]) [    ] o.a.s.c.c.SolrZkClient makePath: /collections/control_collection
   [junit4]   2> 502782 INFO  (TEST-TestReqParamsAPI.test-seed#[E7047B72BBDEF85]) [    ] o.a.s.c.c.SolrZkClient makePath: /collections/control_collection/shards
   [junit4]   2> 502784 INFO  (TEST-TestReqParamsAPI.test-seed#[E7047B72BBDEF85]) [    ] o.a.s.c.AbstractZkTestCase put /home/jenkins/workspace/Lucene-Solr-master-Linux/solr/core/src/test-files/solr/collection1/conf/solrconfig-tlog.xml to /configs/conf1/solrconfig.xml
   [junit4]   2> 502784 INFO  (TEST-TestReqParamsAPI.test-seed#[E7047B72BBDEF85]) [    ] o.a.s.c.c.SolrZkClient makePath: /configs/conf1/solrconfig.xml
   [junit4]   2> 502787 INFO  (TEST-TestReqParamsAPI.test-seed#[E7047B72BBDEF85]) [    ] o.a.s.c.AbstractZkTestCase put /home/jenkins/workspace/Lucene-Solr-master-Linux/solr/core/src/test-files/solr/collection1/conf/schema.xml to /configs/conf1/schema.xml
   [junit4]   2> 502787 INFO  (TEST-TestReqParamsAPI.test-seed#[E7047B72BBDEF85]) [    ] o.a.s.c.c.SolrZkClient makePath: /configs/conf1/schema.xml
   [junit4]   2> 502789 INFO  (TEST-TestReqParamsAPI.test-seed#[E7047B72BBDEF85]) [    ] o.a.s.c.AbstractZkTestCase put /home/jenkins/workspace/Lucene-Solr-master-Linux/solr/core/src/test-files/solr/collection1/conf/solrconfig.snippet.randomindexconfig.xml to /configs/conf1/solrconfig.snippet.randomindexconfig.xml
   [junit4]   2> 502789 INFO  (TEST-TestReqParamsAPI.test-seed#[E7047B72BBDEF85]) [    ] o.a.s.c.c.SolrZkClient makePath: /configs/conf1/solrconfig.snippet.randomindexconfig.xml
   [junit4]   2> 502791 INFO  (TEST-TestReqParamsAPI.test-seed#[E7047B72BBDEF85]) [    ] o.a.s.c.AbstractZkTestCase put /home/jenkins/workspace/Lucene-Solr-master-Linux/solr/core/src/test-files/solr/collection1/conf/stopwords.txt to /configs/conf1/stopwords.txt
   [junit4]   2> 502791 INFO  (TEST-TestReqParamsAPI.test-seed#[E7047B72BBDEF85]) [    ] o.a.s.c.c.SolrZkClient makePath: /configs/conf1/stopwords.txt
   [junit4]   2> 502793 INFO  (TEST-TestReqParamsAPI.test-seed#[E7047B72BBDEF85]) [    ] o.a.s.c.AbstractZkTestCase put /home/jenkins/workspace/Lucene-Solr-master-Linux/solr/core/src/test-files/solr/collection1/conf/protwords.txt to /configs/conf1/protwords.txt
   [junit4]   2> 502793 INFO  (TEST-TestReqParamsAPI.test-seed#[E7047B72BBDEF85]) [    ] o.a.s.c.c.SolrZkClient makePath: /configs/conf1/protwords.txt
   [junit4]   2> 502795 INFO  (TEST-TestReqParamsAPI.test-seed#[E7047B72BBDEF85]) [    ] o.a.s.c.AbstractZkTestCase put /home/jenkins/workspace/Lucene-Solr-master-Linux/solr/core/src/test-files/solr/collection1/conf/currency.xml to /configs/conf1/currency.xml
   [junit4]   2> 502795 INFO  (TEST-TestReqParamsAPI.test-seed#[E7047B72BBDEF85]) [    ] o.a.s.c.c.SolrZkClient makePath: /configs/conf1/currency.xml
   [junit4]   2> 502797 INFO  (TEST-TestReqParamsAPI.test-seed#[E7047B72BBDEF85]) [    ] o.a.s.c.AbstractZkTestCase put /home/jenkins/workspace/Lucene-Solr-master-Linux/solr/core/src/test-files/solr/collection1/conf/enumsConfig.xml to /configs/conf1/enumsConfig.xml
   [junit4]   2> 502797 INFO  (TEST-TestReqParamsAPI.test-seed#[E7047B72BBDEF85]) [    ] o.a.s.c.c.SolrZkClient makePath: /configs/conf1/enumsConfig.xml
   [junit4]   2> 502799 INFO  (TEST-TestReqParamsAPI.test-seed#[E7047B72BBDEF85]) [    ] o.a.s.c.AbstractZkTestCase put /home/jenkins/workspace/Lucene-Solr-master-Linux/solr/core/src/test-files/solr/collection1/conf/open-exchange-rates.json to /configs/conf1/open-exchange-rates.json
   [junit4]   2> 502799 INFO  (TEST-TestReqParamsAPI.test-seed#[E7047B72BBDEF85]) [    ] o.a.s.c.c.SolrZkClient makePath: /configs/conf1/open-exchange-rates.json
   [junit4]   2> 502800 INFO  (TEST-TestReqParamsAPI.test-seed#[E7047B72BBDEF85]) [    ] o.a.s.c.AbstractZkTestCase put /home/jenkins/workspace/Lucene-Solr-master-Linux/solr/core/src/test-files/solr/collection1/conf/mapping-ISOLatin1Accent.txt to /configs/conf1/mapping-ISOLatin1Accent.txt
   [junit4]   2> 502800 INFO  (TEST-TestReqParamsAPI.test-seed#[E7047B72BBDEF85]) [    ] o.a.s.c.c.SolrZkClient makePath: /configs/conf1/mapping-ISOLatin1Accent.txt
   [junit4]   2> 502802 INFO  (TEST-TestReqParamsAPI.test-seed#[E7047B72BBDEF85]) [    ] o.a.s.c.AbstractZkTestCase put /home/jenkins/workspace/Lucene-Solr-master-Linux/solr/core/src/test-files/solr/collection1/conf/old_synonyms.txt to /configs/conf1/old_synonyms.txt
   [junit4]   2> 502802 INFO  (TEST-TestReqParamsAPI.test-seed#[E7047B72BBDEF85]) [    ] o.a.s.c.c.SolrZkClient makePath: /configs/conf1/old_synonyms.txt
   [junit4]   2> 502804 INFO  (TEST-TestReqParamsAPI.test-seed#[E7047B72BBDEF85]) [    ] o.a.s.c.AbstractZkTestCase put /home/jenkins/workspace/Lucene-Solr-master-Linux/solr/core/src/test-files/solr/collection1/conf/synonyms.txt to /configs/conf1/synonyms.txt
   [junit4]   2> 502804 INFO  (TEST-TestReqParamsAPI.test-seed#[E7047B72BBDEF85]) [    ] o.a.s.c.c.SolrZkClient makePath: /configs/conf1/synonyms.txt
   [junit4]   2> 502883 INFO  (TEST-TestReqParamsAPI.test-seed#[E7047B72BBDEF85]) [    ] o.a.s.SolrTestCaseJ4 Writing core.properties file to /home/jenkins/workspace/Lucene-Solr-master-Linux/solr/build/solr-core/test/J2/temp/solr.handler.TestReqParamsAPI_E7047B72BBDEF85-001/control-001/cores/collection1
   [junit4]   2> 502884 INFO  (TEST-TestReqParamsAPI.test-seed#[E7047B72BBDEF85]) [    ] o.e.j.s.Server jetty-9.3.8.v20160314
   [junit4]   2> 502885 INFO  (TEST-TestReqParamsAPI.test-seed#[E7047B72BBDEF85]) [    ] o.e.j.s.h.ContextHandler Started o.e.j.s.ServletContextHandler@1444a28{/uihr/t,null,AVAILABLE}
   [junit4]   2> 502887 INFO  (TEST-TestReqParamsAPI.test-seed#[E7047B72BBDEF85]) [    ] o.e.j.s.ServerConnector Started ServerConnector@5b5947{HTTP/1.1,[http/1.1]}{127.0.0.1:41218}
   [junit4]   2> 502887 INFO  (TEST-TestReqParamsAPI.test-seed#[E7047B72BBDEF85]) [    ] o.e.j.s.Server Started @504293ms
   [junit4]   2> 502887 INFO  (TEST-TestReqParamsAPI.test-seed#[E7047B72BBDEF85]) [    ] o.a.s.c.s.e.JettySolrRunner Jetty properties: {solr.data.dir=/home/jenkins/workspace/Lucene-Solr-master-Linux/solr/build/solr-core/test/J2/temp/solr.handler.TestReqParamsAPI_E7047B72BBDEF85-001/tempDir-001/control/data, hostContext=/uihr/t, hostPort=41218, coreRootDirectory=/home/jenkins/workspace/Lucene-Solr-master-Linux/solr/build/solr-core/test/J2/temp/solr.handler.TestReqParamsAPI_E7047B72BBDEF85-001/control-001/cores}
   [junit4]   2> 502888 INFO  (TEST-TestReqParamsAPI.test-seed#[E7047B72BBDEF85]) [    ] o.a.s.s.SolrDispatchFilter SolrDispatchFilter.init(): sun.misc.Launcher$AppClassLoader@1d16e93
   [junit4]   2> 502888 INFO  (TEST-TestReqParamsAPI.test-seed#[E7047B72BBDEF85]) [    ] o.a.s.c.SolrResourceLoader new SolrResourceLoader for directory: '/home/jenkins/workspace/Lucene-Solr-master-Linux/solr/build/solr-core/test/J2/temp/solr.handler.TestReqParamsAPI_E7047B72BBDEF85-001/control-001'
   [junit4]   2> 502888 INFO  (TEST-TestReqParamsAPI.test-seed#[E7047B72BBDEF85]) [    ] o.a.s.c.SolrResourceLoader JNDI not configured for solr (NoInitialContextEx)
   [junit4]   2> 502888 INFO  (TEST-TestReqParamsAPI.test-seed#[E7047B72BBDEF85]) [    ] o.a.s.c.SolrResourceLoader solr home defaulted to 'solr/' (could not find system property or JNDI)
   [junit4]   2> 502888 INFO  (TEST-TestReqParamsAPI.test-seed#[E7047B72BBDEF85]) [    ] o.a.s.c.c.SolrZkClient Using default ZkCredentialsProvider
   [junit4]   2> 502888 INFO  (TEST-TestReqParamsAPI.test-seed#[E7047B72BBDEF85]) [    ] o.a.s.c.c.ConnectionManager Waiting for client to connect to ZooKeeper
   [junit4]   2> 502890 INFO  (zkCallback-385-thread-1) [    ] o.a.s.c.c.ConnectionManager Watcher org.apache.solr.common.cloud.ConnectionManager@197ed43 name:ZooKeeperConnection Watcher:127.0.0.1:44243/solr got event WatchedEvent state:SyncConnected type:None path:null path:null type:None
   [junit4]   2> 502890 INFO  (TEST-TestReqParamsAPI.test-seed#[E7047B72BBDEF85]) [    ] o.a.s.c.c.ConnectionManager Client is connected to ZooKeeper
   [junit4]   2> 502891 INFO  (TEST-TestReqParamsAPI.test-seed#[E7047B72BBDEF85]) [    ] o.a.s.c.c.SolrZkClient Using default ZkACLProvider
   [junit4]   2> 502892 INFO  (TEST-TestReqParamsAPI.test-seed#[E7047B72BBDEF85]) [    ] o.a.s.s.SolrDispatchFilter Loading solr.xml from SolrHome (not found in ZooKeeper)
   [junit4]   2> 502892 INFO  (TEST-TestReqParamsAPI.test-seed#[E7047B72BBDEF85]) [    ] o.a.s.c.SolrXmlConfig Loading container configuration from /home/jenkins/workspace/Lucene-Solr-master-Linux/solr/build/solr-core/test/J2/temp/solr.handler.TestReqParamsAPI_E7047B72BBDEF85-001/control-001/solr.xml
   [junit4]   2> 502898 INFO  (TEST-TestReqParamsAPI.test-seed#[E7047B72BBDEF85]) [    ] o.a.s.c.CorePropertiesLocator Config-defined core root directory: /home/jenkins/workspace/Lucene-Solr-master-Linux/solr/build/solr-core/test/J2/temp/solr.handler.TestReqParamsAPI_E7047B72BBDEF85-001/control-001/cores
   [junit4]   2> 502898 INFO  (TEST-TestReqParamsAPI.test-seed#[E7047B72BBDEF85]) [    ] o.a.s.c.CoreContainer New CoreContainer 8734128
   [junit4]   2> 502898 INFO  (TEST-TestReqParamsAPI.test-seed#[E7047B72BBDEF85]) [    ] o.a.s.c.CoreContainer Loading cores into CoreContainer [instanceDir=/home/jenkins/workspace/Lucene-Solr-master-Linux/solr/build/solr-core/test/J2/temp/solr.handler.TestReqParamsAPI_E7047B72BBDEF85-001/control-001]
   [junit4]   2> 502899 WARN  (TEST-TestReqParamsAPI.test-seed#[E7047B72BBDEF85]) [    ] o.a.s.c.CoreContainer Couldn't add files from /home/jenkins/workspace/Lucene-Solr-master-Linux/solr/build/solr-core/test/J2/temp/solr.handler.TestReqParamsAPI_E7047B72BBDEF85-001/control-001/lib to classpath: /home/jenkins/workspace/Lucene-Solr-master-Linux/solr/build/solr-core/test/J2/temp/solr.handler.TestReqParamsAPI_E7047B72BBDEF85-001/control-001/lib
   [junit4]   2> 502899 INFO  (TEST-TestReqParamsAPI.test-seed#[E7047B72BBDEF85]) [    ] o.a.s.h.c.HttpShardHandlerFactory created with socketTimeout : 90000,urlScheme : ,connTimeout : 15000,maxConnectionsPerHost : 20,maxConnections : 10000,corePoolSize : 0,maximumPoolSize : 2147483647,maxThreadIdleTime : 5,sizeOfQueue : -1,fairnessPolicy : false,useRetries : false,
   [junit4]   2> 502901 INFO  (TEST-TestReqParamsAPI.test-seed#[E7047B72BBDEF85]) [    ] o.a.s.u.UpdateShardHandler Creating UpdateShardHandler HTTP client with params: socketTimeout=340000&connTimeout=45000&retry=true
   [junit4]   2> 502901 INFO  (TEST-TestReqParamsAPI.test-seed#[E7047B72BBDEF85]) [    ] o.a.s.l.LogWatcher SLF4J impl is org.slf4j.impl.Log4jLoggerFactory
   [junit4]   2> 502901 INFO  (TEST-TestReqParamsAPI.test-seed#[E7047B72BBDEF85]) [    ] o.a.s.l.LogWatcher Registering Log Listener [Log4j (org.slf4j.impl.Log4jLoggerFactory)]
   [junit4]   2> 502901 INFO  (TEST-TestReqParamsAPI.test-seed#[E7047B72BBDEF85]) [    ] o.a.s.c.ZkContainer Zookeeper client=127.0.0.1:44243/solr
   [junit4]   2> 502901 INFO  (TEST-TestReqParamsAPI.test-seed#[E7047B72BBDEF85]) [    ] o.a.s.c.ZkController zkHost includes chroot
   [junit4]   2> 502901 INFO  (TEST-TestReqParamsAPI.test-seed#[E7047B72BBDEF85]) [    ] o.a.s.c.c.SolrZkClient Using default ZkCredentialsProvider
   [junit4]   2> 502902 INFO  (TEST-TestReqParamsAPI.test-seed#[E7047B72BBDEF85]) [    ] o.a.s.c.c.ConnectionManager Waiting for client to connect to ZooKeeper
   [junit4]   2> 502904 INFO  (zkCallback-388-thread-1) [    ] o.a.s.c.c.ConnectionManager Watcher org.apache.solr.common.cloud.ConnectionManager@96ef10 name:ZooKeeperConnection Watcher:127.0.0.1:44243 got event WatchedEvent state:SyncConnected type:None path:null path:null type:None
   [junit4]   2> 502904 INFO  (TEST-TestReqParamsAPI.test-seed#[E7047B72BBDEF85]) [    ] o.a.s.c.c.ConnectionManager Client is connected to ZooKeeper
   [junit4]   2> 502905 INFO  (TEST-TestReqParamsAPI.test-seed#[E7047B72BBDEF85]) [    ] o.a.s.c.c.SolrZkClient Using default ZkACLProvider
   [junit4]   2> 502906 INFO  (TEST-TestReqParamsAPI.test-seed#[E7047B72BBDEF85]) [n:127.0.0.1:41218_uihr%2Ft    ] o.a.s.c.c.ConnectionManager Waiting for client to connect to ZooKeeper
   [junit4]   2> 502907 INFO  (zkCallback-389-thread-1-processing-n:127.0.0.1:41218_uihr%2Ft) [n:127.0.0.1:41218_uihr%2Ft    ] o.a.s.c.c.ConnectionManager Watcher org.apache.solr.common.cloud.ConnectionManager@1ba573a name:ZooKeeperConnection Watcher:127.0.0.1:44243/solr got event WatchedEvent state:SyncConnected type:None path:null path:null type:None
   [junit4]   2> 502907 INFO  (TEST-TestReqParamsAPI.test-seed#[E7047B72BBDEF85]) [n:127.0.0.1:41218_uihr%2Ft    ] o.a.s.c.c.ConnectionManager Client is connected to ZooKeeper
   [junit4]   2> 502908 INFO  (TEST-TestReqParamsAPI.test-seed#[E7047B72BBDEF85]) [n:127.0.0.1:41218_uihr%2Ft    ] o.a.s.c.c.SolrZkClient makePath: /overseer/queue
   [junit4]   2> 502910 INFO  (TEST-TestReqParamsAPI.test-seed#[E7047B72BBDEF85]) [n:127.0.0.1:41218_uihr%2Ft    ] o.a.s.c.c.SolrZkClient makePath: /overseer/collection-queue-work
   [junit4]   2> 502913 INFO  (TEST-TestReqParamsAPI.test-seed#[E7047B72BBDEF85]) [n:127.0.0.1:41218_uihr%2Ft    ] o.a.s.c.c.SolrZkClient makePath: /overseer/collection-map-running
   [junit4]   2> 502916 INFO  (TEST-TestReqParamsAPI.test-seed#[E7047B72BBDEF85]) [n:127.0.0.1:41218_uihr%2Ft    ] o.a.s.c.c.SolrZkClient makePath: /overseer/collection-map-completed
   [junit4]   2> 502918 INFO  (TEST-TestReqParamsAPI.test-seed#[E7047B72BBDEF85]) [n:127.0.0.1:41218_uihr%2Ft    ] o.a.s.c.c.SolrZkClient makePath: /overseer/collection-map-failure
   [junit4]   2> 502920 INFO  (TEST-TestReqParamsAPI.test-seed#[E7047B72BBDEF85]) [n:127.0.0.1:41218_uihr%2Ft    ] o.a.s.c.c.SolrZkClient makePath: /live_nodes
   [junit4]   2> 502921 INFO  (TEST-TestReqParamsAPI.test-seed#[E7047B72BBDEF85]) [n:127.0.0.1:41218_uihr%2Ft    ] o.a.s.c.c.SolrZkClient makePath: /aliases.json
   [junit4]   2> 502922 INFO  (TEST-TestReqParamsAPI.test-seed#[E7047B72BBDEF85]) [n:127.0.0.1:41218_uihr%2Ft    ] o.a.s.c.c.SolrZkClient makePath: /clusterstate.json
   [junit4]   2> 502923 INFO  (TEST-TestReqParamsAPI.test-seed#[E7047B72BBDEF85]) [n:127.0.0.1:41218_uihr%2Ft    ] o.a.s.c.c.SolrZkClient makePath: /security.json
   [junit4]   2> 502924 INFO  (TEST-TestReqParamsAPI.test-seed#[E7047B72BBDEF85]) [n:127.0.0.1:41218_uihr%2Ft    ] o.a.s.c.c.ZkStateReader Updating cluster state from ZooKeeper... 
   [junit4]   2> 502925 INFO  (TEST-TestReqParamsAPI.test-seed#[E7047B72BBDEF85]) [n:127.0.0.1:41218_uihr%2Ft    ] o.a.s.c.c.ZkStateReader Updated live nodes from ZooKeeper... (0) -> (0)
   [junit4]   2> 502928 INFO  (TEST-TestReqParamsAPI.test-seed#[E7047B72BBDEF85]) [n:127.0.0.1:41218_uihr%2Ft    ] o.a.s.c.c.SolrZkClient makePath: /overseer_elect
   [junit4]   2> 502929 INFO  (TEST-TestReqParamsAPI.test-seed#[E7047B72BBDEF85]) [n:127.0.0.1:41218_uihr%2Ft    ] o.a.s.c.c.SolrZkClient makePath: /overseer_elect/election
   [junit4]   2> 502930 INFO  (TEST-TestReqParamsAPI.test-seed#[E7047B72BBDEF85]) [n:127.0.0.1:41218_uihr%2Ft    ] o.a.s.c.Overseer Overseer (id=null) closing
   [junit4]   2> 502931 INFO  (TEST-TestReqParamsAPI.test-seed#[E7047B72BBDEF85]) [n:127.0.0.1:41218_uihr%2Ft    ] o.a.s.c.LeaderElector Joined leadership election with path: /overseer_elect/election/95564575663390724-127.0.0.1:41218_uihr%2Ft-n_0000000000
   [junit4]   2> 502931 INFO  (TEST-TestReqParamsAPI.test-seed#[E7047B72BBDEF85]) [n:127.0.0.1:41218_uihr%2Ft    ] o.a.s.c.OverseerElectionContext I am going to be the leader 127.0.0.1:41218_uihr%2Ft
   [junit4]   2> 502931 INFO  (TEST-TestReqParamsAPI.test-seed#[E7047B72BBDEF85]) [n:127.0.0.1:41218_uihr%2Ft    ] o.a.s.c.c.SolrZkClient makePath: /overseer_elect/leader
   [junit4]   2> 502932 INFO  (TEST-TestReqParamsAPI.test-seed#[E7047B72BBDEF85]) [n:127.0.0.1:41218_uihr%2Ft    ] o.a.s.c.Overseer Overseer (id=95564575663390724-127.0.0.1:41218_uihr%2Ft-n_0000000000) starting
   [junit4]   2> 502934 INFO  (TEST-TestReqParamsAPI.test-seed#[E7047B72BBDEF85]) [n:127.0.0.1:41218_uihr%2Ft    ] o.a.s.c.c.SolrZkClient makePath: /overseer/queue-work
   [junit4]   2> 502940 INFO  (TEST-TestReqParamsAPI.test-seed#[E7047B72BBDEF85]) [n:127.0.0.1:41218_uihr%2Ft    ] o.a.s.c.OverseerAutoReplicaFailoverThread Starting OverseerAutoReplicaFailoverThread autoReplicaFailoverWorkLoopDelay=10000 autoReplicaFailoverWaitAfterExpiration=30000 autoReplicaFailoverBadNodeExpiration=60000
   [junit4]   2> 502941 INFO  (OverseerCollectionConfigSetProcessor-95564575663390724-127.0.0.1:41218_uihr%2Ft-n_0000000000) [n:127.0.0.1:41218_uihr%2Ft    ] o.a.s.c.OverseerTaskProcessor Process current queue of overseer operations
   [junit4]   2> 502941 INFO  (OverseerStateUpdate-95564575663390724-127.0.0.1:41218_uihr%2Ft-n_0000000000) [n:127.0.0.1:41218_uihr%2Ft    ] o.a.s.c.Overseer Starting to work on the main queue
   [junit4]   2> 502941 INFO  (TEST-TestReqParamsAPI.test-seed#[E7047B72BBDEF85]) [n:127.0.0.1:41218_uihr%2Ft    ] o.a.s.c.ZkController Register node as live in ZooKeeper:/live_nodes/127.0.0.1:41218_uihr%2Ft
   [junit4]   2> 502943 INFO  (TEST-TestReqParamsAPI.test-seed#[E7047B72BBDEF85]) [n:127.0.0.1:41218_uihr%2Ft    ] o.a.s.c.c.SolrZkClient makePath: /live_nodes/127.0.0.1:41218_uihr%2Ft
   [junit4]   2> 502944 INFO  (OverseerStateUpdate-95564575663390724-127.0.0.1:41218_uihr%2Ft-n_0000000000) [n:127.0.0.1:41218_uihr%2Ft    ] o.a.s.c.c.ZkStateReader Updated live nodes from ZooKeeper... (0) -> (0)
   [junit4]   2> 502944 INFO  (zkCallback-389-thread-1-processing-n:127.0.0.1:41218_uihr%2Ft) [n:127.0.0.1:41218_uihr%2Ft    ] o.a.s.c.c.ZkStateReader A live node change: [WatchedEvent state:SyncConnected type:NodeChildrenChanged path:/live_nodes], has occurred - updating... (live nodes size: [0])
   [junit4]   2> 502945 INFO  (zkCallback-389-thread-1-processing-n:127.0.0.1:41218_uihr%2Ft) [n:127.0.0.1:41218_uihr%2Ft    ] o.a.s.c.c.ZkStateReader Updated live nodes from ZooKeeper... (0) -> (1)
   [junit4]   2> 502989 INFO  (TEST-TestReqParamsAPI.test-seed#[E7047B72BBDEF85]) [n:127.0.0.1:41218_uihr%2Ft    ] o.a.s.c.CoreContainer Security conf doesn't exist. Skipping setup for authorization module.
   [junit4]   2> 502989 INFO  (TEST-TestReqParamsAPI.test-seed#[E7047B72BBDEF85]) [n:127.0.0.1:41218_uihr%2Ft    ] o.a.s.c.CoreContainer No authentication plugin used.
   [junit4]   2> 502990 INFO  (TEST-TestReqParamsAPI.test-seed#[E7047B72BBDEF85]) [n:127.0.0.1:41218_uihr%2Ft    ] o.a.s.c.CorePropertiesLocator Looking for core definitions underneath /home/jenkins/workspace/Lucene-Solr-master-Linux/solr/build/solr-core/test/J2/temp/solr.handler.TestReqParamsAPI_E7047B72BBDEF85-001/control-001/cores
   [junit4]   2> 502991 INFO  (TEST-TestReqParamsAPI.test-seed#[E7047B72BBDEF85]) [n:127.0.0.1:41218_uihr%2Ft    ] o.a.s.c.CoreDescriptor Created CoreDescriptor: {name=collection1, config=solrconfig.xml, transient=false, schema=schema.xml, loadOnStartup=true, configSetProperties=configsetprops.json, collection=control_collection, coreNodeName=, dataDir=data/, shard=}
   [junit4]   2> 502991 INFO  (TEST-TestReqParamsAPI.test-seed#[E7047B72BBDEF85]) [n:127.0.0.1:41218_uihr%2Ft    ] o.a.s.c.CorePropertiesLocator Found core collection1 in /home/jenkins/workspace/Lucene-Solr-master-Linux/solr/build/solr-core/test/J2/temp/solr.handler.TestReqParamsAPI_E7047B72BBDEF85-001/control-001/cores/collection1
   [junit4]   2> 502991 INFO  (TEST-TestReqParamsAPI.test-seed#[E7047B72BBDEF85]) [n:127.0.0.1:41218_uihr%2Ft    ] o.a.s.c.CorePropertiesLocator Found 1 core definitions
   [junit4]   2> 502992 INFO  (TEST-TestReqParamsAPI.test-seed#[E7047B72BBDEF85]) [n:127.0.0.1:41218_uihr%2Ft    ] o.a.s.s.SolrDispatchFilter user.dir=/home/jenkins/workspace/Lucene-Solr-master-Linux/solr/build/solr-core/test/J2
   [junit4]   2> 502992 INFO  (TEST-TestReqParamsAPI.test-seed#[E7047B72BBDEF85]) [n:127.0.0.1:41218_uihr%2Ft    ] o.a.s.s.SolrDispatchFilter SolrDispatchFilter.init() done
   [junit4]   2> 502992 INFO  (coreLoadExecutor-1554-thread-1-processing-n:127.0.0.1:41218_uihr%2Ft) [n:127.0.0.1:41218_uihr%2Ft c:control_collection   x:collection1] o.a.s.c.ZkController publishing state=down
   [junit4]   2> 502992 INFO  (coreLoadExecutor-1554-thread-1-processing-n:127.0.0.1:41218_uihr%2Ft) [n:127.0.0.1:41218_uihr%2Ft c:control_collection   x:collection1] o.a.s.c.ZkController numShards not found on descriptor - reading it from system property
   [junit4]   2> 502994 INFO  (coreLoadExecutor-1554-thread-1-processing-n:127.0.0.1:41218_uihr%2Ft) [n:127.0.0.1:41218_uihr%2Ft c:control_collection   x:collection1] o.a.s.c.ZkController look for our core node name
   [junit4]   2> 502995 INFO  (OverseerStateUpdate-95564575663390724-127.0.0.1:41218_uihr%2Ft-n_0000000000) [n:127.0.0.1:41218_uihr%2Ft    ] o.a.s.c.Overseer processMessage: queueSize: 1, message = {
   [junit4]   2>   "core":"collection1",
   [junit4]   2>   "roles":null,
   [junit4]   2>   "base_url":"http://127.0.0.1:41218/uihr/t",
   [junit4]   2>   "node_name":"127.0.0.1:41218_uihr%2Ft",
   [junit4]   2>   "numShards":"1",
   [junit4]   2>   "state":"down",
   [junit4]   2>   "shard":null,
   [junit4]   2>   "collection":"control_collection",
   [junit4]   2>   "operation":"state"} current state version: 0
   [junit4]   2> 502995 INFO  (OverseerStateUpdate-95564575663390724-127.0.0.1:41218_uihr%2Ft-n_0000000000) [n:127.0.0.1:41218_uihr%2Ft    ] o.a.s.c.o.ReplicaMutator Update state numShards=1 message={
   [junit4]   2>   "core":"collection1",
   [junit4]   2>   "roles":null,
   [junit4]   2>   "base_url":"http://127.0.0.1:41218/uihr/t",
   [junit4]   2>   "node_name":"127.0.0.1:41218_uihr%2Ft",
   [junit4]   2>   "numShards":"1",
   [junit4]   2>   "state":"down",
   [junit4]   2>   "shard":null,
   [junit4]   2>   "collection":"control_collection",
   [junit4]   2>   "operation":"state"}
   [junit4]   2> 502995 INFO  (OverseerStateUpdate-95564575663390724-127.0.0.1:41218_uihr%2Ft-n_0000000000) [n:127.0.0.1:41218_uihr%2Ft    ] o.a.s.c.o.ClusterStateMutator building a new cName: control_collection
   [junit4]   2> 502996 INFO  (OverseerStateUpdate-95564575663390724-127.0.0.1:41218_uihr%2Ft-n_0000000000) [n:127.0.0.1:41218_uihr%2Ft    ] o.a.s.c.o.ReplicaMutator Assigning new node to shard shard=shard1
   [junit4]   2> 502997 INFO  (zkCallback-389-thread-1-processing-n:127.0.0.1:41218_uihr%2Ft) [n:127.0.0.1:41218_uihr%2Ft    ] o.a.s.c.c.ZkStateReader A cluster state change: [WatchedEvent state:SyncConnected type:NodeDataChanged path:/clusterstate.json], has occurred - updating... (live nodes size: [1])
   [junit4]   2> 503995 INFO  (coreLoadExecutor-1554-thread-1-processing-n:127.0.0.1:41218_uihr%2Ft) [n:127.0.0.1:41218_uihr%2Ft c:control_collection   x:collection1] o.a.s.c.ZkController waiting to find shard id in clusterstate for collection1
   [junit4]   2> 503995 INFO  (coreLoadExecutor-1554-thread-1-processing-n:127.0.0.1:41218_uihr%2Ft) [n:127.0.0.1:41218_uihr%2Ft c:control_collection   x:collection1] o.a.s.c.ZkController Check for collection zkNode:control_collection
   [junit4]   2> 503996 INFO  (coreLoadExecutor-1554-thread-1-processing-n:127.0.0.1:41218_uihr%2Ft) [n:127.0.0.1:41218_uihr%2Ft c:control_collection   x:collection1] o.a.s.c.ZkController Collection zkNode exists
   [junit4]   2> 503996 INFO  (coreLoadExecutor-1554-thread-1-processing-n:127.0.0.1:41218_uihr%2Ft) [n:127.0.0.1:41218_uihr%2Ft c:control_collection   x:collection1] o.a.s.c.c.ZkStateReader Load collection config from: [/collections/control_collection]
   [junit4]   2> 503996 INFO  (coreLoadExecutor-1554-thread-1-processing-n:127.0.0.1:41218_uihr%2Ft) [n:127.0.0.1:41218_uihr%2Ft c:control_collection   x:collection1] o.a.s.c.c.ZkStateReader path=[/collections/control_collection] [configName]=[conf1] specified config exists in ZooKeeper
   [junit4]   2> 503996 INFO  (coreLoadExecutor-1554-thread-1-processing-n:127.0.0.1:41218_uihr%2Ft) [n:127.0.0.1:41218_uihr%2Ft c:control_collection   x:collection1] o.a.s.c.SolrResourceLoader new SolrResourceLoader for directory: '/home/jenkins/workspace/Lucene-Solr-master-Linux/solr/build/solr-core/test/J2/temp/solr.handler.TestReqParamsAPI_E7047B72BBDEF85-001/control-001/cores/collection1'
   [junit4]   2> 503996 INFO  (coreLoadExecutor-1554-thread-1-processing-n:127.0.0.1:41218_uihr%2Ft) [n:127.0.0.1:41218_uihr%2Ft c:control_collection   x:collection1] o.a.s.c.SolrResourceLoader JNDI not configured for solr (NoInitialContextEx)
   [junit4]   2> 503996 INFO  (coreLoadExecutor-1554-thread-1-processing-n:127.0.0.1:41218_uihr%2Ft) [n:127.0.0.1:41218_uihr%2Ft c:control_collection   x:collection1] o.a.s.c.SolrResourceLoader solr home defaulted to 'solr/' (could not find system property or JNDI)
   [junit4]   2> 503998 INFO  (coreLoadExecutor-1554-thread-1-processing-n:127.0.0.1:41218_uihr%2Ft) [n:127.0.0.1:41218_uihr%2Ft c:control_collection   x:collection1] o.a.s.c.Config loaded config solrconfig.xml with version 0 
   [junit4]   2> 504009 INFO  (coreLoadExecutor-1554-thread-1-processing-n:127.0.0.1:41218_uihr%2Ft) [n:127.0.0.1:41218_uihr%2Ft c:control_collection   x:collection1] o.a.s.c.SolrConfig current version of requestparams : -1
   [junit4]   2> 504013 WARN  (coreLoadExecutor-1554-thread-1-processing-n:127.0.0.1:41218_uihr%2Ft) [n:127.0.0.1:41218_uihr%2Ft c:control_collection   x:collection1] o.a.s.c.Config Beginning with Solr 5.5, <mergePolicy> is deprecated, use <mergePolicyFactory> instead.
   [junit4]   2> 504014 INFO  (coreLoadExecutor-1554-thread-1-processing-n:127.0.0.1:41218_uihr%2Ft) [n:127.0.0.1:41218_uihr%2Ft c:control_collection   x:collection1] o.a.s.c.SolrConfig Using Lucene MatchVersion: 7.0.0
   [junit4]   2> 504025 INFO  (coreLoadExecutor-1554-thread-1-processing-n:127.0.0.1:41218_uihr%2Ft) [n:127.0.0.1:41218_uihr%2Ft c:control_collection   x:collection1] o.a.s.c.SolrConfig Loaded SolrConfig: solrconfig.xml
   [junit4]   2> 504050 INFO  (coreLoadExecutor-1554-thread-1-processing-n:127.0.0.1:41218_uihr%2Ft) [n:127.0.0.1:41218_uihr%2Ft c:control_collection   x:collection1] o.a.s.s.IndexSchema [collection1] Schema name=test
   [junit4]   2> 504150 INFO  (coreLoadExecutor-1554-thread-1-processing-n:127.0.0.1:41218_uihr%2Ft) [n:127.0.0.1:41218_uihr%2Ft c:control_collection   x:collection1] o.a.s.s.OpenExchangeRatesOrgProvider Initialized with rates=open-exchange-rates.json, refreshInterval=1440.
   [junit4]   2> 504158 INFO  (coreLoadExecutor-1554-thread-1-processing-n:127.0.0.1:41218_uihr%2Ft) [n:127.0.0.1:41218_uihr%2Ft c:control_collection   x:collection1] o.a.s.s.IndexSchema default search field in schema is text
   [junit4]   2> 504159 INFO  (coreLoadExecutor-1554-thread-1-processing-n:127.0.0.1:41218_uihr%2Ft) [n:127.0.0.1:41218_uihr%2Ft c:control_collection   x:collection1] o.a.s.s.IndexSchema unique key field: id
   [junit4]   2> 504175 INFO  (coreLoadExecutor-1554-thread-1-processing-n:127.0.0.1:41218_uihr%2Ft) [n:127.0.0.1:41218_uihr%2Ft c:control_collection   x:collection1] o.a.s.s.FileExchangeRateProvider Reloading exchange rates from file currency.xml
   [junit4]   2> 504177 INFO  (coreLoadExecutor-1554-thread-1-processing-n:127.0.0.1:41218_uihr%2Ft) [n:127.0.0.1:41218_uihr%2Ft c:control_collection   x:collection1] o.a.s.s.FileExchangeRateProvider Reloading exchange rates from file currency.xml
   [junit4]   2> 504180 INFO  (coreLoadExecutor-1554-thread-1-processing-n:127.0.0.1:41218_uihr%2Ft) [n:127.0.0.1:41218_uihr%2Ft c:control_collection   x:collection1] o.a.s.s.OpenExchangeRatesOrgProvider Reloading exchange rates from open-exchange-rates.json
   [junit4]   2> 504180 INFO  (coreLoadExecutor-1554-thread-1-processing-n:127.0.0.1:41218_uihr%2Ft) [n:127.0.0.1:41218_uihr%2Ft c:control_collection   x:collection1] o.a.s.s.OpenExchangeRatesOrgProvider Reloading exchange rates from open-exchange-rates.json
   [junit4]   2> 504182 INFO  (coreLoadExecutor-1554-thread-1-processing-n:127.0.0.1:41218_uihr%2Ft) [n:127.0.0.1:41218_uihr%2Ft c:control_collection   x:collection1] o.a.s.c.ConfigSetProperties Did not find ConfigSet properties, assuming default properties: Can't find resource 'configsetprops.json' in classpath or '/configs/conf1', cwd=/home/jenkins/workspace/Lucene-Solr-master-Linux/solr/build/solr-core/test/J2
   [junit4]   2> 504182 INFO  (coreLoadExecutor-1554-thread-1-processing-n:127.0.0.1:41218_uihr%2Ft) [n:127.0.0.1:41218_uihr%2Ft c:control_collection   x:collection1] o.a.s.c.CoreContainer Creating SolrCore 'collection1' using configuration from collection control_collection
   [junit4]   2> 504182 INFO  (coreLoadExecutor-1554-thread-1-processing-n:127.0.0.1:41218_uihr%2Ft) [n:127.0.0.1:41218_uihr%2Ft c:control_collection s:shard1 r:core_node1 x:collection1] o.a.s.c.SolrCore org.apache.solr.core.MockDirectoryFactory
   [junit4]   2> 504182 INFO  (coreLoadExecutor-1554-thread-1-processing-n:127.0.0.1:41218_uihr%2Ft) [n:127.0.0.1:41218_uihr%2Ft c:control_collection s:shard1 r:core_node1 x:collection1] o.a.s.c.SolrCore [[collection1] ] Opening new SolrCore at [/home/jenkins/workspace/Lucene-Solr-master-Linux/solr/build/solr-core/test/J2/temp/solr.handler.TestReqParamsAPI_E7047B72BBDEF85-001/control-001/cores/collection1], dataDir=[/home/jenkins/workspace/Lucene-Solr-master-Linux/solr/build/solr-core/test/J2/temp/solr.handler.TestReqParamsAPI_E7047B72BBDEF85-001/control-001/cores/collection1/data/]
   [junit4]   2> 504182 INFO  (coreLoadExecutor-1554-thread-1-processing-n:127.0.0.1:41218_uihr%2Ft) [n:127.0.0.1:41218_uihr%2Ft c:control_collection s:shard1 r:core_node1 x:collection1] o.a.s.c.JmxMonitoredMap JMX monitoring is enabled. Adding Solr mbeans to JMX Server: com.sun.jmx.mbeanserver.JmxMBeanServer@1d7a207
   [junit4]   2> 504183 INFO  (coreLoadExecutor-1554-thread-1-processing-n:127.0.0.1:41218_uihr%2Ft) [n:127.0.0.1:41218_uihr%2Ft c:control_collection s:shard1 r:core_node1 x:collection1] o.a.s.c.CachingDirectoryFactory return new directory for /home/jenkins/workspace/Lucene-Solr-master-Linux/solr/build/solr-core/test/J2/temp/solr.handler.TestReqParamsAPI_E7047B72BBDEF85-001/control-001/cores/collection1/data
   [junit4]   2> 504183 INFO  (coreLoadExecutor-1554-thread-1-processing-n:127.0.0.1:41218_uihr%2Ft) [n:127.0.0.1:41218_uihr%2Ft c:control_collection s:shard1 r:core_node1 x:collection1] o.a.s.c.SolrCore New index directory detected: old=null new=/home/jenkins/workspace/Lucene-Solr-master-Linux/solr/build/solr-core/test/J2/temp/solr.handler.TestReqParamsAPI_E7047B72BBDEF85-001/control-001/cores/collection1/data/index/
   [junit4]   2> 504183 WARN  (coreLoadExecutor-1554-thread-1-processing-n:127.0.0.1:41218_uihr%2Ft) [n:127.0.0.1:41218_uihr%2Ft c:control_collection s:shard1 r:core_node1 x:collection1] o.a.s.c.SolrCore [collection1] Solr index directory '/home/jenkins/workspace/Lucene-Solr-master-Linux/solr/build/solr-core/test/J2/temp/solr.handler.TestReqParamsAPI_E7047B72BBDEF85-001/control-001/cores/collection1/data/index' doesn't exist. Creating new index...
   [junit4]   2> 504183 INFO  (coreLoadExecutor-1554-thread-1-processing-n:127.0.0.1:41218_uihr%2Ft) [n:127.0.0.1:41218_uihr%2Ft c:control_collection s:shard1 r:core_node1 x:collection1] o.a.s.c.CachingDirectoryFactory return new directory for /home/jenkins/workspace/Lucene-Solr-master-Linux/solr/build/solr-core/test/J2/temp/solr.handler.TestReqParamsAPI_E7047B72BBDEF85-001/control-001/cores/collection1/data/index
   [junit4]   2> 504184 INFO  (coreLoadExecutor-1554-thread-1-processing-n:127.0.0.1:41218_uihr%2Ft) [n:127.0.0.1:41218_uihr%2Ft c:control_collection s:shard1 r:core_node1 x:collection1] o.a.s.u.RandomMergePolicy RandomMergePolicy wrapping class org.apache.lucene.index.LogByteSizeMergePolicy: [LogByteSizeMergePolicy: minMergeSize=1677721, mergeFactor=25, maxMergeSize=2147483648, maxMergeSizeForForcedMerge=9223372036854775807, calibrateSizeByDeletes=false, maxMergeDocs=2147483647, maxCFSSegmentSizeMB=8.796093022207999E12, noCFSRatio=0.7533836875392352]
   [junit4]   2> 504184 INFO  (coreLoadExecutor-1554-thread-1-processing-n:127.0.0.1:41218_uihr%2Ft) [n:127.0.0.1:41218_uihr%2Ft c:control_collection s:shard1 r:core_node1 x:collection1] o.a.s.c.SolrDeletionPolicy SolrDeletionPolicy.onCommit: commits: num=1
   [junit4]   2> 	commit{dir=MockDirectoryWrapper(RAMDirectory@631327 lockFactory=org.apache.lucene.store.SingleInstanceLockFactory@12546ca),segFN=segments_1,generation=1}
   [junit4]   2> 504184 INFO  (coreLoadExecutor-1554-thread-1-processing-n:127.0.0.1:41218_uihr%2Ft) [n:127.0.0.1:41218_uihr%2Ft c:control_collection s:shard1 r:core_node1 x:collection1] o.a.s.c.SolrDeletionPolicy newest commit generation = 1
   [junit4]   2> 504184 INFO  (OldIndexDirectoryCleanupThreadForCore-collection1) [n:127.0.0.1:41218_uihr%2Ft c:control_collection s:shard1 r:core_node1 x:collection1] o.a.s.c.SolrCore Looking for old index directories to cleanup for core collection1 in /home/jenkins/workspace/Lucene-Solr-master-Linux/solr/build/solr-core/test/J2/temp/solr.handler.TestReqParamsAPI_E7047B72BBDEF85-001/control-001/cores/collection1/data/
   [junit4]   2> 504185 WARN  (OldIndexDirectoryCleanupThreadForCore-collection1) [n:127.0.0.1:41218_uihr%2Ft c:control_collection s:shard1 r:core_node1 x:collection1] o.a.s.c.DirectoryFactory /home/jenkins/workspace/Lucene-Solr-master-Linux/solr/build/solr-core/test/J2/temp/solr.handler.TestReqParamsAPI_E7047B72BBDEF85-001/control-001/cores/collection1/data/ does not point to a valid data directory; skipping clean-up of old index directories.
   [junit4]   2> 504189 INFO  (coreLoadExecutor-1554-thread-1-processing-n:127.0.0.1:41218_uihr%2Ft) [n:127.0.0.1:41218_uihr%2Ft c:control_collection s:shard1 r:core_node1 x:collection1] o.a.s.u.p.UpdateRequestProcessorChain creating updateRequestProcessorChain "nodistrib"
   [junit4]   2> 504190 INFO  (coreLoadExecutor-1554-thread-1-processing-n:127.0.0.1:41218_uihr%2Ft) [n:127.0.0.1:41218_uihr%2Ft c:control_collection s:shard1 r:core_node1 x:collection1] o.a.s.u.p.UpdateRequestProcessorChain creating updateRequestProcessorChain "dedupe"
   [junit4]   2> 504190 INFO  (coreLoadExecutor-1554-thread-1-processing-n:127.0.0.1:41218_uihr%2Ft) [n:127.0.0.1:41218_uihr%2Ft c:control_collection s:shard1 r:core_node1 x:collection1] o.a.s.u.p.UpdateRequestProcessorChain inserting DistributedUpdateProcessorFactory into updateRequestProcessorChain "dedupe"
   [junit4]   2> 504190 INFO  (coreLoadExecutor-1554-thread-1-processing-n:127.0.0.1:41218_uihr%2Ft) [n:127.0.0.1:41218_uihr%2Ft c:control_collection s:shard1 r:core_node1 x:collection1] o.a.s.u.p.UpdateRequestProcessorChain creating updateRequestProcessorChain "stored_sig"
   [junit4]   2> 504190 INFO  (coreLoadExecutor-1554-thread-1-processing-n:127.0.0.1:41218_uihr%2Ft) [n:127.0.0.1:41218_uihr%2Ft c:control_collection s:shard1 r:core_node1 x:collection1] o.a.s.u.p.UpdateRequestProcessorChain inserting DistributedUpdateProcessorFactory into updateRequestProcessorChain "stored_sig"
   [junit4]   2> 504190 INFO  (coreLoadExecutor-1554-thread-1-processing-n:127.0.0.1:41218_uihr%2Ft) [n:127.0.0.1:41218_uihr%2Ft c:control_collection s:shard1 r:core_node1 x:collection1] o.a.s.u.p.UpdateRequestProcessorChain creating updateRequestProcessorChain "distrib-dup-test-chain-explicit"
   [junit4]   2> 504190 INFO  (coreLoadExecutor-1554-thread-1-processing-n:127.0.0.1:41218_uihr%2Ft) [n:127.0.0.1:41218_uihr%2Ft c:control_collection s:shard1 r:core_node1 x:collection1] o.a.s.u.p.UpdateRequestProcessorChain creating updateRequestProcessorChain "distrib-dup-test-chain-implicit"
   [junit4]   2> 504190 INFO  (coreLoadExecutor-1554-thread-1-processing-n:127.0.0.1:41218_uihr%2Ft) [n:127.0.0.1:41218_uihr%2Ft c:control_collection s:shard1 r:core_node1 x:collection1] o.a.s.u.p.UpdateRequestProcessorChain inserting DistributedUpdateProcessorFactory into updateRequestProcessorChain "distrib-dup-test-chain-implicit"
   [junit4]   2> 504191 INFO  (coreLoadExecutor-1554-thread-1-processing-n:127.0.0.1:41218_uihr%2Ft) [n:127.0.0.1:41218_uihr%2Ft c:control_collection s:shard1 r:core_node1 x:collection1] o.a.s.c.SolrCore no updateRequestProcessorChain defined as default, creating implicit default
   [junit4]   2> 504191 WARN  (coreLoadExecutor-1554-thread-1-processing-n:127.0.0.1:41218_uihr%2Ft) [n:127.0.0.1:41218_uihr%2Ft c:control_collection s:shard1 r:core_node1 x:collection1] o.a.s.c.RequestHandlers INVALID paramSet a in requestHandler {type = requestHandler,name = /dump,class = DumpRequestHandler,args = {defaults={a=A,b=B}}}
   [junit4]   2> 504192 INFO  (coreLoadExecutor-1554-thread-1-processing-n:127.0.0.1:41218_uihr%2Ft) [n:127.0.0.1:41218_uihr%2Ft c:control_collection s:shard1 r:core_node1 x:collection1] o.a.s.h.l.XMLLoader xsltCacheLifetimeSeconds=60
   [junit4]   2> 504193 INFO  (coreLoadExecutor-1554-thread-1-processing-n:127.0.0.1:41218_uihr%2Ft) [n:127.0.0.1:41218_uihr%2Ft c:control_collection s:shard1 r:core_node1 x:collection1] o.a.s.h.l.XMLLoader xsltCacheLifetimeSeconds=60
   [junit4]   2> 504195 INFO  (coreLoadExecutor-1554-thread-1-processing-n:127.0.0.1:41218_uihr%2Ft) [n:127.0.0.1:41218_uihr%2Ft c:control_collection s:shard1 r:core_node1 x:collection1] o.a.s.h.l.XMLLoader xsltCacheLifetimeSeconds=60
   [junit4]   2> 504195 INFO  (coreLoadExecutor-1554-thread-1-processing-n:127.0.0.1:41218_uihr%2Ft) [n:127.0.0.1:41218_uihr%2Ft c:control_collection s:shard1 r:core_node1 x:collection1] o.a.s.h.l.XMLLoader xsltCacheLifetimeSeconds=60
   [junit4]   2> 504202 INFO  (coreLoadExecutor-1554-thread-1-processing-n:127.0.0.1:41218_uihr%2Ft) [n:127.0.0.1:41218_uihr%2Ft c:control_collection s:shard1 r:core_node1 x:collection1] o.a.s.c.RequestHandlers Registered paths: /admin/mbeans,standard,/dump,/update/csv,/sql,/update/json/docs,/admin/luke,/export,/admin/segments,/get,/admin/system,/replication,/admin/properties,/config,/stream,/schema,/admin/plugins,/admin/logging,/update/json,/admin/ping,/admin/threads,/update,/admin/file
   [junit4]   2> 504202 INFO  (coreLoadExecutor-1554-thread-1-processing-n:127.0.0.1:41218_uihr%2Ft) [n:127.0.0.1:41218_uihr%2Ft c:control_collection s:shard1 r:core_node1 x:collection1] o.a.s.c.SolrCore Using default statsCache cache: org.apache.solr.search.stats.LocalStatsCache
   [junit4]   2> 504202 INFO  (coreLoadExecutor-1554-thread-1-processing-n:127.0.0.1:41218_uihr%2Ft) [n:127.0.0.1:41218_uihr%2Ft c:control_collection s:shard1 r:core_node1 x:collection1] o.a.s.u.UpdateHandler Using UpdateLog implementation: org.apache.solr.update.UpdateLog
   [junit4]   2> 504202 INFO  (coreLoadExecutor-1554-thread-1-processing-n:127.0.0.1:41218_uihr%2Ft) [n:127.0.0.1:41218_uihr%2Ft c:control_collection s:shard1 r:core_node1 x:collection1] o.a.s.u.UpdateLog Initializing UpdateLog: dataDir= defaultSyncLevel=FLUSH numRecordsToKeep=100 maxNumLogsToKeep=10 numVersionBuckets=65536
   [junit4]   2> 504204 INFO  (coreLoadExecutor-1554-thread-1-processing-n:127.0.0.1:41218_uihr%2Ft) [n:127.0.0.1:41218_uihr%2Ft c:control_collection s:shard1 r:core_node1 x:collection1] o.a.s.u.CommitTracker Hard AutoCommit: disabled
   [junit4]   2> 504204 INFO  (coreLoadExecutor-1554-thread-1-processing-n:127.0.0.1:41218_uihr%2Ft) [n:127.0.0.1:41218_uihr%2Ft c:control_collection s:shard1 r:core_node1 x:collection1] o.a.s.u.CommitTracker Soft AutoCommit: disabled
   [junit4]   2> 504204 INFO  (coreLoadExecutor-1554-thread-1-processing-n:127.0.0.1:41218_uihr%2Ft) [n:127.0.0.1:41218_uihr%2Ft c:control_collection s:shard1 r:core_node1 x:collection1] o.a.s.u.RandomMergePolicy RandomMergePolicy wrapping class org.apache.lucene.index.TieredMergePolicy: [TieredMergePolicy: maxMergeAtOnce=28, maxMergeAtOnceExplicit=21, maxMergedSegmentMB=18.951171875, floorSegmentMB=2.044921875, forceMergeDeletesPctAllowed=25.6651573794213, segmentsPerTier=32.0, maxCFSSegmentSizeMB=8.796093022207999E12, noCFSRatio=1.0
   [junit4]   2> 504205 INFO  (coreLoadExecutor-1554-thread-1-processing-n:127.0.0.1:41218_uihr%2Ft) [n:127.0.0.1:41218_uihr%2Ft c:control_collection s:shard1 r:core_node1 x:collection1] o.a.s.c.SolrDeletionPolicy SolrDeletionPolicy.onInit: commits: num=1
   [junit4]   2> 	commit{dir=MockDirectoryWrapper(RAMDirectory@631327 lockFactory=org.apache.lucene.store.SingleInstanceLockFactory@12546ca),segFN=segments_1,generation=1}
   [junit4]   2> 504205 INFO  (coreLoadExecutor-1554-thread-1-processing-n:127.0.0.1:41218_uihr%2Ft) [n:127.0.0.1:41218_uihr%2Ft c:control_collection s:shard1 r:core_node1 x:collection1] o.a.s.c.SolrDeletionPolicy newest commit generation = 1
   [junit4]   2> 504205 INFO  (coreLoadExecutor-1554-thread-1-processing-n:127.0.0.1:41218_uihr%2Ft) [n:127.0.0.1:41218_uihr%2Ft c:control_collection s:shard1 r:core_node1 x:collection1] o.a.s.s.SolrIndexSearcher Opening [Searcher@161116c[collection1] main]
   [junit4]   2> 504205 INFO  (coreLoadExecutor-1554-thread-1-processing-n:127.0.0.1:41218_uihr%2Ft) [n:127.0.0.1:41218_uihr%2Ft c:control_collection s:shard1 r:core_node1 x:collection1] o.a.s.c.c.ZkStateReader Load collection config from: [/collections/control_collection]
   [junit4]   2> 504206 INFO  (coreLoadExecutor-1554-thread-1-processing-n:127.0.0.1:41218_uihr%2Ft) [n:127.0.0.1:41218_uihr%2Ft c:control_collection s:shard1 r:core_node1 x:collection1] o.a.s.c.c.ZkStateReader path=[/collections/control_collection] [configName]=[conf1] specified config exists in ZooKeeper
   [junit4]   2> 504206 INFO  (coreLoadExecutor-1554-thread-1-processing-n:127.0.0.1:41218_uihr%2Ft) [n:127.0.0.1:41218_uihr%2Ft c:control_collection s:shard1 r:core_node1 x:collection1] o.a.s.r.ManagedResourceStorage Setting up ZooKeeper-based storage for the RestManager with znodeBase: /configs/conf1
   [junit4]   2> 504206 INFO  (coreLoadExecutor-1554-thread-1-processing-n:127.0.0.1:41218_uihr%2Ft) [n:127.0.0.1:41218_uihr%2Ft c:control_collection s:shard1 r:core_node1 x:collection1] o.a.s.r.ManagedResourceStorage Configured ZooKeeperStorageIO with znodeBase: /configs/conf1
   [junit4]   2> 504206 INFO  (coreLoadExecutor-1554-thread-1-processing-n:127.0.0.1:41218_uihr%2Ft) [n:127.0.0.1:41218_uihr%2Ft c:control_collection s:shard1 r:core_node1 x:collection1] o.a.s.r.RestManager Initializing RestManager with initArgs: {}
   [junit4]   2> 504206 INFO  (coreLoadExecutor-1554-thread-1-processing-n:127.0.0.1:41218_uihr%2Ft) [n:127.0.0.1:41218_uihr%2Ft c:control_collection s:shard1 r:core_node1 x:collection1] o.a.s.r.ManagedResourceStorage Reading _rest_managed.json using ZooKeeperStorageIO:path=/configs/conf1
   [junit4]   2> 504207 INFO  (coreLoadExecutor-1554-thread-1-processing-n:127.0.0.1:41218_uihr%2Ft) [n:127.0.0.1:41218_uihr%2Ft c:control_collection s:shard1 r:core_node1 x:collection1] o.a.s.r.ManagedResourceStorage No data found for znode /configs/conf1/_rest_managed.json
   [junit4]   2> 504207 INFO  (coreLoadExecutor-1554-thread-1-processing-n:127.0.0.1:41218_uihr%2Ft) [n:127.0.0.1:41218_uihr%2Ft c:control_collection s:shard1 r:core_node1 x:collection1] o.a.s.r.ManagedResourceStorage Loaded null at path _rest_managed.json using ZooKeeperStorageIO:path=/configs/conf1
   [junit4]   2> 504207 INFO  (coreLoadExecutor-1554-thread-1-processing-n:127.0.0.1:41218_uihr%2Ft) [n:127.0.0.1:41218_uihr%2Ft c:control_collection s:shard1 r:core_node1 x:collection1] o.a.s.r.RestManager Initializing 0 registered ManagedResources
   [junit4]   2> 504207 INFO  (coreLoadExecutor-1554-thread-1-processing-n:127.0.0.1:41218_uihr%2Ft) [n:127.0.0.1:41218_uihr%2Ft c:control_collection s:shard1 r:core_node1 x:collection1] o.a.s.h.ReplicationHandler Commits will be reserved for  10000
   [junit4]   2> 504208 INFO  (searcherExecutor-1555-thread-1-processing-n:127.0.0.1:41218_uihr%2Ft x:collection1 s:shard1 c:control_collection r:core_node1) [n:127.0.0.1:41218_uihr%2Ft c:control_collection s:shard1 r:core_node1 x:collection1] o.a.s.c.SolrCore [collection1] Registered new searcher Searcher@161116c[collection1] main{ExitableDirectoryReader(UninvertingDirectoryReader())}
   [junit4]   2> 504208 INFO  (coreLoadExecutor-1554-thread-1-processing-n:127.0.0.1:41218_uihr%2Ft) [n:127.0.0.1:41218_uihr%2Ft c:control_collection s:shard1 r:core_node1 x:collection1] o.a.s.u.UpdateLog Looking up max value of version field to seed version buckets
   [junit4]   2> 504209 INFO  (coreLoadExecutor-1554-thread-1-processing-n:127.0.0.1:41218_uihr%2Ft) [n:127.0.0.1:41218_uihr%2Ft c:control_collection s:shard1 r:core_node1 x:collection1] o.a.s.u.VersionInfo Refreshing highest value of _version_ for 65536 version buckets from index
   [junit4]   2> 504209 INFO  (coreLoadExecutor-1554-thread-1-processing-n:127.0.0.1:41218_uihr%2Ft) [n:127.0.0.1:41218_uihr%2Ft c:control_collection s:shard1 r:core_node1 x:collection1] o.a.s.u.VersionInfo No terms found for _version_, cannot seed version bucket highest value from index
   [junit4]   2> 504209 INFO  (coreLoadExecutor-1554-thread-1-processing-n:127.0.0.1:41218_uihr%2Ft) [n:127.0.0.1:41218_uihr%2Ft c:control_collection s:shard1 r:core_node1 x:collection1] o.a.s.u.UpdateLog Could not find max version in index or recent updates, using new clock 1529033212233252864
   [junit4]   2> 504211 INFO  (coreLoadExecutor-1554-thread-1-processing-n:127.0.0.1:41218_uihr%2Ft) [n:127.0.0.1:41218_uihr%2Ft c:control_collection s:shard1 r:core_node1 x:collection1] o.a.s.u.UpdateLog Took 2.0ms to seed version buckets with highest version 1529033212233252864
   [junit4]   2> 504211 INFO  (coreLoadExecutor-1554-thread-1-processing-n:127.0.0.1:41218_uihr%2Ft) [n:127.0.0.1:41218_uihr%2Ft c:control_collection s:shard1 r:core_node1 x:collection1] o.a.s.c.ZkController watch zkdir /configs/conf1
   [junit4]   2> 504212 INFO  (coreLoadExecutor-1554-thread-1-processing-n:127.0.0.1:41218_uihr%2Ft) [n:127.0.0.1:41218_uihr%2Ft c:control_collection s:shard1 r:core_node1 x:collection1] o.a.s.c.CoreContainer registering core: collection1
   [junit4]   2> 504212 INFO  (coreZkRegister-1548-thread-1-processing-n:127.0.0.1:41218_uihr%2Ft x:collection1 s:shard1 c:control_collection r:core_node1) [n:127.0.0.1:41218_uihr%2Ft c:control_collection s:shard1 r:core_node1 x:collection1] o.a.s.c.ZkController Register replica - core:collection1 address:http://127.0.0.1:41218/uihr/t collection:control_collection shard:shard1
   [junit4]   2> 504213 INFO  (coreZkRegister-1548-thread-1-processing-n:127.0.0.1:41218_uihr%2Ft x:collection1 s:shard1 c:control_collection r:core_node1) [n:127.0.0.1:41218_uihr%2Ft c:control_collection s:shard1 r:core_node1 x:collection1] o.a.s.c.c.SolrZkClient makePath: /collections/control_collection/leader_elect/shard1/election
   [junit4]   2> 504215 INFO  (coreZkRegister-1548-thread-1-processing-n:127.0.0.1:41218_uihr%2Ft x:collection1 s:shard1 c:control_collection r:core_node1) [n:127.0.0.1:41218_uihr%2Ft c:control_collection s:shard1 r:core_node1 x:collection1] o.a.s.c.LeaderElector Joined leadership election with path: /collections/control_collection/leader_elect/shard1/election/95564575663390724-core_node1-n_0000000000
   [junit4]   2> 504215 INFO  (coreZkRegister-1548-thread-1-processing-n:127.0.0.1:41218_uihr%2Ft x:collection1 s:shard1 c:control_collection r:core_node1) [n:127.0.0.1:41218_uihr%2Ft c:control_collection s:shard1 r:core_node1 x:collection1] o.a.s.c.ShardLeaderElectionContext Running the leader process for shard=shard1 and weAreReplacement=false and leaderVoteWait=10000
   [junit4]   2> 504217 INFO  (coreZkRegister-1548-thread-1-processing-n:127.0.0.1:41218_uihr%2Ft x:collection1 s:shard1 c:control_collection r:core_node1) [n:127.0.0.1:41218_uihr%2Ft c:control_collection s:shard1 r:core_node1 x:collection1] o.a.s.c.ShardLeaderElectionContext Enough replicas found to continue.
   [junit4]   2> 504217 INFO  (coreZkRegister-1548-thread-1-processing-n:127.0.0.1:41218_uihr%2Ft x:collection1 s:shard1 c:control_collection r:core_node1) [n:127.0.0.1:41218_uihr%2Ft c:control_collection s:shard1 r:core_node1 x:collection1] o.a.s.c.ShardLeaderElectionContext I may be the new leader - try and sync
   [junit4]   2> 504217 INFO  (coreZkRegister-1548-thread-1-processing-n:127.0.0.1:41218_uihr%2Ft x:collection1 s:shard1 c:control_collection r:core_node1) [n:127.0.0.1:41218_uihr%2Ft c:control_collection s:shard1 r:core_node1 x:collection1] o.a.s.c.SyncStrategy Sync replicas to http://127.0.0.1:41218/uihr/t/collection1/
   [junit4]   2> 504217 INFO  (coreZkRegister-1548-thread-1-processing-n:127.0.0.1:41218_uihr%2Ft x:collection1 s:shard1 c:control_collection r:core_node1) [n:127.0.0.1:41218_uihr%2Ft c:control_collection s:shard1 r:core_node1 x:collection1] o.a.s.c.SyncStrategy Sync Success - now sync replicas to me
   [junit4]   2> 504217 INFO  (coreZkRegister-1548-thread-1-processing-n:127.0.0.1:41218_uihr%2Ft x:collection1 s:shard1 c:control_collection r:core_node1) [n:127.0.0.1:41218_uihr%2Ft c:control_collection s:shard1 r:core_node1 x:collection1] o.a.s.c.SyncStrategy http://127.0.0.1:41218/uihr/t/collection1/ has no replicas
   [junit4]   2> 504217 INFO  (OverseerStateUpdate-95564575663390724-127.0.0.1:41218_uihr%2Ft-n_0000000000) [n:127.0.0.1:41218_uihr%2Ft    ] o.a.s.c.Overseer processMessage: queueSize: 1, message = {
   [junit4]   2>   "operation":"leader",
   [junit4]   2>   "shard":"shard1",
   [junit4]   2>   "collection":"control_collection"} current state version: 1
   [junit4]   2> 504218 INFO  (coreZkRegister-1548-thread-1-processing-n:127.0.0.1:41218_uihr%2Ft x:collection1 s:shard1 c:control_collection r:core_node1) [n:127.0.0.1:41218_uihr%2Ft c:control_collection s:shard1 r:core_node1 x:collection1] o.a.s.c.c.SolrZkClient makePath: /collections/control_collection/leaders/shard1
   [junit4]   2> 504220 INFO  (coreZkRegister-1548-thread-1-processing-n:127.0.0.1:41218_uihr%2Ft x:collection1 s:shard1 c:control_collection r:core_node1) [n:127.0.0.1:41218_uihr%2Ft c:control_collection s:shard1 r:core_node1 x:collection1] o.a.s.c.ShardLeaderElectionContextBase Creating leader registration node /collections/control_collection/leaders/shard1/leader after winning as /collections/control_collection/leader_elect/shard1/election/95564575663390724-core_node1-n_0000000000
   [junit4]   2> 504221 INFO  (coreZkRegister-1548-thread-1-processing-n:127.0.0.1:41218_uihr%2Ft x:collection1 s:shard1 c:control_collection r:core_node1) [n:127.0.0.1:41218_uihr%2Ft c:control_collection s:shard1 r:core_node1 x:collection1] o.a.s.c.ShardLeaderElectionContext I am the new leader: http://127.0.0.1:41218/uihr/t/collection1/ shard1
   [junit4]   2> 504222 INFO  (OverseerStateUpdate-95564575663390724-127.0.0.1:41218_uihr%2Ft-n_0000000000) [n:127.0.0.1:41218_uihr%2Ft    ] o.a.s.c.Overseer processMessage: queueSize: 1, message = {
   [junit4]   2>   "operation":"leader",
   [junit4]   2>   "shard":"shard1",
   [junit4]   2>   "collection":"control_collection",
   [junit4]   2>   "base_url":"http://127.0.0.1:41218/uihr/t",
   [junit4]   2>   "core":"collection1",
   [junit4]   2>   "state":"active"} current state version: 1
   [junit4]   2> 504325 INFO  (zkCallback-389-thread-1-processing-n:127.0.0.1:41218_uihr%2Ft) [n:127.0.0.1:41218_uihr%2Ft    ] o.a.s.c.c.ZkStateReader A cluster state change: [WatchedEvent state:SyncConnected type:NodeDataChanged path:/clusterstate.json], has occurred - updating... (live nodes size: [1])
   [junit4]   2> 504372 INFO  (coreZkRegister-1548-thread-1-processing-n:127.0.0.1:41218_uihr%2Ft x:collection1 s:shard1 c:control_collection r:core_node1) [n:127.0.0.1:41218_uihr%2Ft c:control_collection s:shard1 r:core_node1 x:collection1] o.a.s.c.ZkController We are http://127.0.0.1:41218/uihr/t/collection1/ and leader is http://127.0.0.1:41218/uihr/t/collection1/
   [junit4]   2> 504372 INFO  (coreZkRegister-1548-thread-1-processing-n:127.0.0.1:41218_uihr%2Ft x:collection1 s:shard1 c:control_collection r:core_node1) [n:127.0.0.1:41218_uihr%2Ft c:control_collection s:shard1 r:core_node1 x:collection1] o.a.s.c.ZkController No LogReplay needed for core=collection1 baseURL=http://127.0.0.1:41218/uihr/t
   [junit4]   2> 504372 INFO  (coreZkRegister-1548-thread-1-processing-n:127.0.0.1:41218_uihr%2Ft x:collection1 s:shard1 c:control_collection r:core_node1) [n:127.0.0.1:41218_uihr%2Ft c:control_collection s:shard1 r:core_node1 x:collection1] o.a.s.c.ZkController I am the leader, no recovery necessary
   [junit4]   2> 504373 INFO  (coreZkRegister-1548-thread-1-processing-n:127.0.0.1:41218_uihr%2Ft x:collection1 s:shard1 c:control_collection r:core_node1) [n:127.0.0.1:41218_uihr%2Ft c:control_collection s:shard1 r:core_node1 x:collection1] o.a.s.c.ZkController publishing state=active
   [junit4]   2> 504373 INFO  (coreZkRegister-1548-thread-1-processing-n:127.0.0.1:41218_uihr%2Ft x:collection1 s:shard1 c:control_collection r:core_node1) [n:127.0.0.1:41218_uihr%2Ft c:control_collection s:shard1 r:core_node1 x:collection1] o.a.s.c.ZkController numShards not found on descriptor - reading it from system property
   [junit4]   2> 504374 INFO  (OverseerStateUpdate-95564575663390724-127.0.0.1:41218_uihr%2Ft-n_0000000000) [n:127.0.0.1:41218_uihr%2Ft    ] o.a.s.c.Overseer processMessage: queueSize: 1, message = {
   [junit4]   2>   "core":"collection1",
   [junit4]   2>   "core_node_name":"core_node1",
   [junit4]   2>   "roles":null,
   [junit4]   2>   "base_url":"http://127.0.0.1:41218/uihr/t",
   [junit4]   2>   "node_name":"127.0.0.1:41218_uihr%2Ft",
   [junit4]   2>   "numShards":"1",
   [junit4]   2>   "state":"active",
   [junit4]   2>   "shard":"shard1",
   [junit4]   2>   "collection":"control_collection",
   [junit4]   2>   "operation":"state"} current state version: 2
   [junit4]   2> 504375 INFO  (OverseerStateUpdate-95564575663390724-127.0.0.1:41218_uihr%2Ft-n_0000000000) [n:127.0.0.1:41218_uihr%2Ft    ] o.a.s.c.o.ReplicaMutator Update state numShards=1 message={
   [junit4]   2>   "core":"collection1",
   [junit4]   2>   "core_node_name":"core_node1",
   [junit4]   2>   "roles":null,
   [junit4]   2>   "base_url":"http://127.0.0.1:41218/uihr/t",
   [junit4]   2>   "node_name":"127.0.0.1:41218_uihr%2Ft",
   [junit4]   2>   "numShards":"1",
   [junit4]   2>   "state":"active",
   [junit4]   2>   "shard":"shard1",
   [junit4]   2>   "collection":"control_collection",
   [junit4]   2>   "operation":"state"}
   [junit4]   2> 504477 INFO  (zkCallback-389-thread-1-processing-n:127.0.0.1:41218_uihr%2Ft) [n:127.0.0.1:41218_uihr%2Ft    ] o.a.s.c.c.ZkStateReader A cluster state change: [WatchedEvent state:SyncConnected type:NodeDataChanged path:/clusterstate.json], has occurred - updating... (live nodes size: [1])
   [junit4]   2> 504495 INFO  (TEST-TestReqParamsAPI.test-seed#[E7047B72BBDEF85]) [    ] o.a.s.c.c.SolrZkClient Using default ZkCredentialsProvider
   [junit4]   2> 504495 INFO  (TEST-TestReqParamsAPI.test-seed#[E7047B72BBDEF85]) [    ] o.a.s.c.c.ConnectionManager Waiting for client to connect to ZooKeeper
   [junit4]   2> 504497 INFO  (zkCallback-391-thread-1) [    ] o.a.s.c.c.ConnectionManager Watcher org.apache.solr.common.cloud.ConnectionManager@15547f9 name:ZooKeeperConnection Watcher:127.0.0.1:44243/solr got event WatchedEvent state:SyncConnected type:None path:null path:null type:None
   [junit4]   2> 504497 INFO  (TEST-TestReqParamsAPI.test-seed#[E7047B72BBDEF85]) [    ] o.a.s.c.c.ConnectionManager Client is connected to ZooKeeper
   [junit4]   2> 504497 INFO  (TEST-TestReqParamsAPI.test-seed#[E7047B72BBDEF85]) [    ] o.a.s.c.c.SolrZkClient Using default ZkACLProvider
   [junit4]   2> 504497 INFO  (TEST-TestReqParamsAPI.test-seed#[E7047B72BBDEF85]) [    ] o.a.s.c.c.ZkStateReader Updating cluster state from ZooKeeper... 
   [junit4]   2> 504499 INFO  (TEST-TestReqParamsAPI.test-seed#[E7047B72BBDEF85]) [    ] o.a.s.c.c.ZkStateReader Updated live nodes from ZooKeeper... (0) -> (1)
   [junit4]   2> 504500 INFO  (TEST-TestReqParamsAPI.test-seed#[E7047B72BBDEF85]) [    ] o.a.s.c.ChaosMonkey monkey: init - expire sessions:false cause connection loss:false
   [junit4]   2> 504500 INFO  (TEST-TestReqParamsAPI.test-seed#[E7047B72BBDEF85]) [    ] o.a.s.c.AbstractFullDistribZkTestBase Creating collection1 with stateFormat=2
   [junit4]   2> 504500 INFO  (TEST-TestReqParamsAPI.test-seed#[E7047B72BBDEF85]) [    ] o.a.s.c.c.SolrZkClient Using default ZkCredentialsProvider
   [junit4]   2> 504500 INFO  (TEST-TestReqParamsAPI.test-seed#[E7047B72BBDEF85]) [    ] o.a.s.c.c.ConnectionManager Waiting for client to connect to ZooKeeper
   [junit4]   2> 504501 INFO  (zkCallback-392-thread-1) [    ] o.a.s.c.c.ConnectionManager Watcher org.apache.solr.common.cloud.ConnectionManager@99cf93 name:ZooKeeperConnection Watcher:127.0.0.1:44243/solr got event WatchedEvent state:SyncConnected type:None path:null path:null type:None
   [junit4]   2> 504501 INFO  (TEST-TestReqParamsAPI.test-seed#[E7047B72BBDEF85]) [    ] o.a.s.c.c.ConnectionManager Client is connected to ZooKeeper
   [junit4]   2> 504502 INFO  (TEST-TestReqParamsAPI.test-seed#[E7047B72BBDEF85]) [    ] o.a.s.c.c.SolrZkClient Using default ZkACLProvider
   [junit4]   2> 504504 INFO  (OverseerStateUpdate-95564575663390724-127.0.0.1:41218_uihr%2Ft-n_0000000000) [n:127.0.0.1:41218_uihr%2Ft    ] o.a.s.c.Overseer processMessage: queueSize: 1, message = {
   [junit4]   2>   "operation":"create",
   [junit4]   2>   "name":"collection1",
   [junit4]   2>   "numShards":"2",
   [junit4]   2>   "stateFormat":"2"} current state version: 3
   [junit4]   2> 504504 INFO  (OverseerStateUpdate-95564575663390724-127.0.0.1:41218_uihr%2Ft-n_0000000000) [n:127.0.0.1:41218_uihr%2Ft    ] o.a.s.c.o.ClusterStateMutator building a new cName: collection1
   [junit4]   2> 504606 INFO  (OverseerStateUpdate-95564575663390724-127.0.0.1:41218_uihr%2Ft-n_0000000000) [n:127.0.0.1:41218_uihr%2Ft    ] o.a.s.c.o.ZkStateWriter going to create_collection /collections/collection1/state.json
   [junit4]   2> 504613 INFO  (TEST-TestReqParamsAPI.test-seed#[E7047B72BBDEF85]) [    ] o.a.s.SolrTestCaseJ4 Writing core.properties file to /home/jenkins/workspace/Lucene-Solr-master-Linux/solr/build/solr-core/test/J2/temp/solr.handler.TestReqParamsAPI_E7047B72BBDEF85-001/shard-1-001/cores/collection1
   [junit4]   2> 504614 INFO  (TEST-TestReqParamsAPI.test-seed#[E7047B72BBDEF85]) [    ] o.a.s.c.AbstractFullDistribZkTestBase create jetty 1 in directory /home/jenkins/workspace/Lucene-Solr-master-Linux/solr/build/solr-core/test/J2/temp/solr.handler.TestReqParamsAPI_E7047B72BBDEF85-001/shard-1-001
   [junit4]   2> 504615 INFO  (TEST-TestReqParamsAPI.test-seed#[E7047B72BBDEF85]) [    ] o.e.j.s.Server jetty-9.3.8.v20160314
   [junit4]   2> 504616 INFO  (TEST-TestReqParamsAPI.test-seed#[E7047B72BBDEF85]) [    ] o.e.j.s.h.ContextHandler Started o.e.j.s.ServletContextHandler@17b6ac1{/uihr/t,null,AVAILABLE}
   [junit4]   2> 504617 INFO  (TEST-TestReqParamsAPI.test-seed#[E7047B72BBDEF85]) [    ] o.e.j.s.ServerConnector Started ServerConnector@1cd1cb9{HTTP/1.1,[http/1.1]}{127.0.0.1:44880}
   [junit4]   2> 504617 INFO  (TEST-TestReqParamsAPI.test-seed#[E7047B72BBDEF85]) [    ] o.e.j.s.Server Started @506023ms
   [junit4]   2> 504617 INFO  (TEST-TestReqParamsAPI.test-seed#[E7047B72BBDEF85]) [    ] o.a.s.c.s.e.JettySolrRunner Jetty properties: {solr.data.dir=/home/jenkins/workspace/Lucene-Solr-master-Linux/solr/build/solr-core/test/J2/temp/solr.handler.TestReqParamsAPI_E7047B72BBDEF85-001/tempDir-001/jetty1, solrconfig=solrconfig.xml, hostContext=/uihr/t, hostPort=44880, coreRootDirectory=/home/jenkins/workspace/Lucene-Solr-master-Linux/solr/build/solr-core/test/J2/temp/solr.handler.TestReqParamsAPI_E7047B72BBDEF85-001/shard-1-001/cores}
   [junit4]   2> 504618 INFO  (TEST-TestReqParamsAPI.test-seed#[E7047B72BBDEF85]) [    ] o.a.s.s.SolrDispatchFilter SolrDispatchFilter.init(): sun.misc.Launcher$AppClassLoader@1d16e93
   [junit4]   2> 504618 INFO  (TEST-TestReqParamsAPI.test-seed#[E7047B72BBDEF85]) [    ] o.a.s.c.SolrResourceLoader new SolrResourceLoader for directory: '/home/jenkins/workspace/Lucene-Solr-master-Linux/solr/build/solr-core/test/J2/temp/solr.handler.TestReqParamsAPI_E7047B72BBDEF85-001/shard-1-001'
   [junit4]   2> 504618 INFO  (TEST-TestReqParamsAPI.test-seed#[E7047B72BBDEF85]) [    ] o.a.s.c.SolrResourceLoader JNDI not configured for solr (NoInitialContextEx)
   [junit4]   2> 504618 INFO  (TEST-TestReqParamsAPI.test-seed#[E7047B72BBDEF85]) [    ] o.a.s.c.SolrResourceLoader solr home defaulted to 'solr/' (could not find system property or JNDI)
   [junit4]   2> 504619 INFO  (TEST-TestReqParamsAPI.test-seed#[E7047B72BBDEF85]) [    ] o.a.s.c.c.SolrZkClient Using default ZkCredentialsProvider
   [junit4]   2> 504619 INFO  (TEST-TestReqParamsAPI.test-seed#[E7047B72BBDEF85]) [    ] o.a.s.c.c.ConnectionManager Waiting for client to connect to ZooKeeper
   [junit4]   2> 504620 INFO  (zkCallback-393-thread-1) [    ] o.a.s.c.c.ConnectionManager Watcher org.apache.solr.common.cloud.ConnectionManager@3c12fd name:ZooKeeperConnection Watcher:127.0.0.1:44243/solr got event WatchedEvent state:SyncConnected type:None path:null path:null type:None
   [junit4]   2> 504620 INFO  (TEST-TestReqParamsAPI.test-seed#[E7047B72BBDEF85]) [    ] o.a.s.c.c.ConnectionManager Client is connected to ZooKeeper
   [junit4]   2> 504621 INFO  (TEST-TestReqParamsAPI.test-seed#[E7047B72BBDEF85]) [    ] o.a.s.c.c.SolrZkClient Using default ZkACLProvider
   [junit4]   2> 504622 INFO  (TEST-TestReqParamsAPI.test-seed#[E7047B72BBDEF85]) [    ] o.a.s.s.SolrDispatchFilter Loading solr.xml from SolrHome (not found in ZooKeeper)
   [junit4]   2> 504622 INFO  (TEST-TestReqParamsAPI.test-seed#[E7047B72BBDEF85]) [    ] o.a.s.c.SolrXmlConfig Loading container configuration from /home/jenkins/workspace/Lucene-Solr-master-Linux/solr/build/solr-core/test/J2/temp/solr.handler.TestReqParamsAPI_E7047B72BBDEF85-001/shard-1-001/solr.xml
   [junit4]   2> 504630 INFO  (TEST-TestReqParamsAPI.test-seed#[E7047B72BBDEF85]) [    ] o.a.s.c.CorePropertiesLocator Config-defined core root directory: /home/jenkins/workspace/Lucene-Solr-master-Linux/solr/build/solr-core/test/J2/temp/solr.handler.TestReqParamsAPI_E7047B72BBDEF85-001/shard-1-001/cores
   [junit4]   2> 504630 INFO  (TEST-TestReqParamsAPI.test-seed#[E7047B72BBDEF85]) [    ] o.a.s.c.CoreContainer New CoreContainer 10972948
   [junit4]   2> 504630 INFO  (TEST-TestReqParamsAPI.test-seed#[E7047B72BBDEF85]) [    ] o.a.s.c.CoreContainer Loading cores into CoreContainer [instanceDir=/home/jenkins/workspace/Lucene-Solr-master-Linux/solr/build/solr-core/test/J2/temp/solr.handler.TestReqParamsAPI_E7047B72BBDEF85-001/shard-1-001]
   [junit4]   2> 504630 WARN  (TEST-TestReqParamsAPI.test-seed#[E7047B72BBDEF85]) [    ] o.a.s.c.CoreContainer Couldn't add files from /home/jenkins/workspace/Lucene-Solr-master-Linux/solr/build/solr-core/test/J2/temp/solr.handler.TestReqParamsAPI_E7047B72BBDEF85-001/shard-1-001/lib to classpath: /home/jenkins/workspace/Lucene-Solr-master-Linux/solr/build/solr-core/test/J2/temp/solr.handler.TestReqParamsAPI_E7047B72BBDEF85-001/shard-1-001/lib
   [junit4]   2> 504630 INFO  (TEST-TestReqParamsAPI.test-seed#[E7047B72BBDEF85]) [    ] o.a.s.h.c.HttpShardHandlerFactory created with socketTimeout : 90000,urlScheme : ,connTimeout : 15000,maxConnectionsPerHost : 20,maxConnections : 10000,corePoolSize : 0,maximumPoolSize : 2147483647,maxThreadIdleTime : 5,sizeOfQueue : -1,fairnessPolicy : false,useRetries : false,
   [junit4]   2> 504631 INFO  (TEST-TestReqParamsAPI.test-seed#[E7047B72BBDEF85]) [    ] o.a.s.u.UpdateShardHandler Creating UpdateShardHandler HTTP client with params: socketTimeout=340000&connTimeout=45000&retry=true
   [junit4]   2> 504632 INFO  (TEST-TestReqParamsAPI.test-seed#[E7047B72BBDEF85]) [    ] o.a.s.l.LogWatcher SLF4J impl is org.slf4j.impl.Log4jLoggerFactory
   [junit4]   2> 504632 INFO  (TEST-TestReqParamsAPI.test-seed#[E7047B72BBDEF85]) [    ] o.a.s.l.LogWatcher Registering Log Listener [Log4j (org.slf4j.impl.Log4jLoggerFactory)]
   [junit4]   2> 504632 INFO  (TEST-TestReqParamsAPI.test-seed#[E7047B72BBDEF85]) [    ] o.a.s.c.ZkContainer Zookeeper client=127.0.0.1:44243/solr
   [junit4]   2> 504632 INFO  (TEST-TestReqParamsAPI.test-seed#[E7047B72BBDEF85]) [    ] o.a.s.c.ZkController zkHost includes chroot
   [junit4]   2> 504632 INFO  (TEST-TestReqParamsAPI.test-seed#[E7047B72BBDEF85]) [    ] o.a.s.c.c.SolrZkClient Using default ZkCredentialsProvider
   [junit4]   2> 504632 INFO  (TEST-TestReqParamsAPI.test-seed#[E7047B72BBDEF85]) [    ] o.a.s.c.c.ConnectionManager Waiting for client to connect to ZooKeeper
   [junit4]   2> 504633 INFO  (zkCallback-396-thread-1) [    ] o.a.s.c.c.ConnectionManager Watcher org.apache.solr.common.cloud.ConnectionManager@15c2d18 name:ZooKeeperConnection Watcher:127.0.0.1:44243 got event WatchedEvent state:SyncConnected type:None path:null path:null type:None
   [junit4]   2> 504634 INFO  (TEST-TestReqParamsAPI.test-seed#[E7047B72BBDEF85]) [    ] o.a.s.c.c.ConnectionManager Client is connected to ZooKeeper
   [junit4]   2> 504635 INFO  (TEST-TestReqParamsAPI.test-seed#[E7047B72BBDEF85]) [    ] o.a.s.c.c.SolrZkClient Using default ZkACLProvider
   [junit4]   2> 504636 INFO  (TEST-TestReqParamsAPI.test-seed#[E7047B72BBDEF85]) [n:127.0.0.1:44880_uihr%2Ft    ] o.a.s.c.c.ConnectionManager Waiting for client to connect to ZooKeeper
   [junit4]   2> 504636 INFO  (zkCallback-397-thread-1-processing-n:127.0.0.1:44880_uihr%2Ft) [n:127.0.0.1:44880_uihr%2Ft    ] o.a.s.c.c.ConnectionManager Watcher org.apache.solr.common.cloud.ConnectionManager@139d58c name:ZooKeeperConnection Watcher:127.0.0.1:44243/solr got event WatchedEvent state:SyncConnected type:None path:null path:null type:None
   [junit4]   2> 504636 INFO  (TEST-TestReqParamsAPI.test-seed#[E7047B72BBDEF85]) [n:127.0.0.1:44880_uihr%2Ft    ] o.a.s.c.c.ConnectionManager Client is connected to ZooKeeper
   [junit4]   2> 504641 INFO  (TEST-TestReqParamsAPI.test-seed#[E7047B72BBDEF85]) [n:127.0.0.1:44880_uihr%2Ft    ] o.a.s.c.c.ZkStateReader Updating cluster state from ZooKeeper... 
   [junit4]   2> 504642 INFO  (TEST-TestReqParamsAPI.test-seed#[E7047B72BBDEF85]) [n:127.0.0.1:44880_uihr%2Ft    ] o.a.s.c.c.ZkStateReader Updated live nodes from ZooKeeper... (0) -> (1)
   [junit4]   2> 504644 INFO  (TEST-TestReqParamsAPI.test-seed#[E7047B72BBDEF85]) [n:127.0.0.1:44880_uihr%2Ft    ] o.a.s.c.Overseer Overseer (id=null) closing
   [junit4]   2> 504644 INFO  (TEST-TestReqParamsAPI.test-seed#[E7047B72BBDEF85]) [n:127.0.0.1:44880_uihr%2Ft    ] o.a.s.c.LeaderElector Joined leadership election with path: /overseer_elect/election/95564575663390729-127.0.0.1:44880_uihr%2Ft-n_0000000001
   [junit4]   2> 504644 INFO  (TEST-TestReqParamsAPI.test-seed#[E7047B72BBDEF85]) [n:127.0.0.1:44880_uihr%2Ft    ] o.a.s.c.LeaderElector Watching path /overseer_elect/election/95564575663390724-127.0.0.1:41218_uihr%2Ft-n_0000000000 to know if I could be the leader
   [junit4]   2> 504645 INFO  (TEST-TestReqParamsAPI.test-seed#[E7047B72BBDEF85]) [n:127.0.0.1:44880_uihr%2Ft    ] o.a.s.c.ZkController Publish node=127.0.0.1:44880_uihr%2Ft as DOWN
   [junit4]   2> 504646 INFO  (OverseerStateUpdate-95564575663390724-127.0.0.1:41218_uihr%2Ft-n_0000000000) [n:127.0.0.1:41218_uihr%2Ft    ] o.a.s.c.Overseer processMessage: queueSize: 1, message = {
   [junit4]   2>   "operation":"downnode",
   [junit4]   2>   "node_name":"127.0.0.1:44880_uihr%2Ft"} current state version: 3
   [junit4]   2> 504647 INFO  (OverseerStateUpdate-95564575663390724-127.0.0.1:41218_uihr%2Ft-n_0000000000) [n:127.0.0.1:41218_uihr%2Ft    ] o.a.s.c.o.NodeMutator DownNode state invoked for node: 127.0.0.1:44880_uihr%2Ft
   [junit4]   2> 504647 INFO  (OverseerStateUpdate-95564575663390724-127.0.0.1:41218_uihr%2Ft-n_0000000000) [n:127.0.0.1:41218_uihr%2Ft    ] o.a.s.c.o.ZkStateWriter going to update_collection /collections/collection1/state.json version: 0
   [junit4]   2> 504751 INFO  (zkCallback-389-thread-1-processing-n:127.0.0.1:41218_uihr%2Ft) [n:127.0.0.1:41218_uihr%2Ft    ] o.a.s.c.c.ZkStateReader A cluster state change: [WatchedEvent state:SyncConnected type:NodeDataChanged path:/clusterstate.json], has occurred - updating... (live nodes size: [1])
   [junit4]   2> 504751 INFO  (zkCallback-397-thread-1-processing-n:127.0.0.1:44880_uihr%2Ft) [n:127.0.0.1:44880_uihr%2Ft    ] o.a.s.c.c.ZkStateReader A cluster state change: [WatchedEvent state:SyncConnected type:NodeDataChanged path:/clusterstate.json], has occurred - updating... (live nodes size: [1])
   [junit4]   2> 504751 INFO  (zkCallback-391-thread-1) [    ] o.a.s.c.c.ZkStateReader A cluster state change: [WatchedEvent state:SyncConnected type:NodeDataChanged path:/clusterstate.json], has occurred - updating... (live nodes size: [1])
   [junit4]   2> 505647 INFO  (TEST-TestReqParamsAPI.test-seed#[E7047B72BBDEF85]) [n:127.0.0.1:44880_uihr%2Ft    ] o.a.s.c.ZkController Register node as live in ZooKeeper:/live_nodes/127.0.0.1:44880_uihr%2Ft
   [junit4]   2> 505647 INFO  (TEST-TestReqParamsAPI.test-seed#[E7047B72BBDEF85]) [n:127.0.0.1:44880_uihr%2Ft    ] o.a.s.c.c.SolrZkClient makePath: /live_nodes/127.0.0.1:44880_uihr%2Ft
   [junit4]   2> 505648 INFO  (zkCallback-391-thread-1) [    ] o.a.s.c.c.ZkStateReader A live node change: [WatchedEvent state:SyncConnected type:NodeChildrenChanged path:/live_nodes], has occurred - updating... (live nodes size: [1])
   [junit4]   2> 505648 INFO  (zkCallback-389-thread-1-processing-n:127.0.0.1:41218_uihr%2Ft) [n:127.0.0.1:41218_uihr%2Ft    ] o.a.s.c.c.ZkStateReader A live node change: [WatchedEvent state:SyncConnected type:NodeChildrenChanged path:/live_nodes], has occurred - updating... (live nodes size: [1])
   [junit4]   2> 505648 INFO  (zkCallback-397-thread-1-processing-n:127.0.0.1:44880_uihr%2Ft) [n:127.0.0.1:44880_uihr%2Ft    ] o.a.s.c.c.ZkStateReader A live node change: [WatchedEvent state:SyncConnected type:NodeChildrenChanged path:/live_nodes], has occurred - updating... (live nodes size: [1])
   [junit4]   2> 505649 INFO  (zkCallback-391-thread-1) [    ] o.a.s.c.c.ZkStateReader Updated live nodes from ZooKeeper... (1) -> (2)
   [junit4]   2> 505649 INFO  (zkCallback-389-thread-1-processing-n:127.0.0.1:41218_uihr%2Ft) [n:127.0.0.1:41218_uihr%2Ft    ] o.a.s.c.c.ZkStateReader Updated live nodes from ZooKeeper... (1) -> (2)
   [junit4]   2> 505649 INFO  (zkCallback-397-thread-1-processing-n:127.0.0.1:44880_uihr%2Ft) [n:127.0.0.1:44880_uihr%2Ft    ] o.a.s.c.c.ZkStateReader Updated live nodes from ZooKeeper... (1) -> (2)
   [junit4]   2> 505671 INFO  (TEST-TestReqParamsAPI.test-seed#[E7047B72BBDEF85]) [n:127.0.0.1:44880_uihr%2Ft    ] o.a.s.c.CoreContainer Security conf doesn't exist. Skipping setup for authorization module.
   [junit4]   2> 505671 INFO  (TEST-TestReqParamsAPI.test-seed#[E7047B72BBDEF85]) [n:127.0.0.1:44880_uihr%2Ft    ] o.a.s.c.CoreContainer No authentication plugin used.
   [junit4]   2> 505671 INFO  (TEST-TestReqParamsAPI.test-seed#[E7047B72BBDEF85]) [n:127.0.0.1:44880_uihr%2Ft    ] o.a.s.c.CorePropertiesLocator Looking for core definitions underneath /home/jenkins/workspace/Lucene-Solr-master-Linux/solr/build/solr-core/test/J2/temp/solr.handler.TestReqParamsAPI_E7047B72BBDEF85-001/shard-1-001/cores
   [junit4]   2> 505673 INFO  (TEST-TestReqParamsAPI.test-seed#[E7047B72BBDEF85]) [n:127.0.0.1:44880_uihr%2Ft    ] o.a.s.c.CoreDescriptor Created CoreDescriptor: {name=collection1, config=solrconfig.xml, transient=false, schema=schema.xml, loadOnStartup=true, configSetProperties=configsetprops.json, collection=collection1, coreNodeName=, dataDir=data/, shard=}
   [junit4]   2> 505673 INFO  (TEST-TestReqParamsAPI.test-seed#[E7047B72BBDEF85]) [n:127.0.0.1:44880_uihr%2Ft    ] o.a.s.c.CorePropertiesLocator Found core collection1 in /home/jenkins/workspace/Lucene-Solr-master-Linux/solr/build/solr-core/test/J2/temp/solr.handler.TestReqParamsAPI_E7047B72BBDEF85-001/shard-1-001/cores/collection1
   [junit4]   2> 505673 INFO  (TEST-TestReqParamsAPI.test-seed#[E7047B72BBDEF85]) [n:127.0.0.1:44880_uihr%2Ft    ] o.a.s.c.CorePropertiesLocator Found 1 core definitions
   [junit4]   2> 505674 INFO  (TEST-TestReqParamsAPI.test-seed#[E7047B72BBDEF85]) [n:127.0.0.1:44880_uihr%2Ft    ] o.a.s.s.SolrDispatchFilter user.dir=/home/jenkins/workspace/Lucene-Solr-master-Linux/solr/build/solr-core/test/J2
   [junit4]   2> 505674 INFO  (TEST-TestReqParamsAPI.test-seed#[E7047B72BBDEF85]) [n:127.0.0.1:44880_uihr%2Ft    ] o.a.s.s.SolrDispatchFilter SolrDispatchFilter.init() done
   [junit4]   2> 505674 INFO  (coreLoadExecutor-1565-thread-1-processing-n:127.0.0.1:44880_uihr%2Ft) [n:127.0.0.1:44880_uihr%2Ft c:collection1   x:collection1] o.a.s.c.ZkController publishing state=down
   [junit4]   2> 505674 INFO  (coreLoadExecutor-1565-thread-1-processing-n:127.0.0.1:44880_uihr%2Ft) [n:127.0.0.1:44880_uihr%2Ft c:collection1   x:collection1] o.a.s.c.ZkController numShards not found on descriptor - reading it from system property
   [junit4]   2> 505675 INFO  (coreLoadExecutor-1565-thread-1-processing-n:127.0.0.1:44880_uihr%2Ft) [n:127.0.0.1:44880_uihr%2Ft c:collection1   x:collection1] o.a.s.c.ZkController Registering watch for collection collection1
   [junit4]   2> 505676 INFO  (coreLoadExecutor-1565-thread-1-processing-n:127.0.0.1:44880_uihr%2Ft) [n:127.0.0.1:44880_uihr%2Ft c:collection1   x:collection1] o.a.s.c.c.ZkStateReader addZkWatch [collection1]
   [junit4]   2> 505676 INFO  (OverseerStateUpdate-95564575663390724-127.0.0.1:41218_uihr%2Ft-n_0000000000) [n:127.0.0.1:41218_uihr%2Ft    ] o.a.s.c.Overseer processMessage: queueSize: 1, message = {
   [junit4]   2>   "core":"collection1",
   [junit4]   2>   "roles":null,
   [junit4]   2>   "base_url":"http://127.0.0.1:44880/uihr/t",
   [junit4]   2>   "node_name":"127.0.0.1:44880_uihr%2Ft",
   [junit4]   2>   "numShards":"2",
   [junit4]   2>   "state":"down",
   [junit4]   2>   "shard":null,
   [junit4]   2>   "collection":"collection1",
   [junit4]   2>   "operation":"state"} current state version: 4
   [junit4]   2> 505676 INFO  (coreLoadExecutor-1565-thread-1-processing-n:127.0.0.1:44880_uihr%2Ft) [n:127.0.0.1:44880_uihr%2Ft c:collection1   x:collection1] o.a.s.c.c.ZkStateReader Add data for [collection1] ver [1]
   [junit4]   2> 505676 INFO  (coreLoadExecutor-1565-thread-1-processing-n:127.0.0.1:44880_uihr%2Ft) [n:127.0.0.1:44880_uihr%2Ft c:collection1   x:collection1] o.a.s.c.ZkController look for our core node name
   [junit4]   2> 505676 INFO  (OverseerStateUpdate-95564575663390724-127.0.0.1:41218_uihr%2Ft-n_0000000000) [n:127.0.0.1:41218_uihr%2Ft    ] o.a.s.c.o.ReplicaMutator Update state numShards=2 message={
   [junit4]   2>   "core":"collection1",
   [junit4]   2>   "roles":null,
   [junit4]   2>   "base_url":"http://127.0.0.1:44880/uihr/t",
   [junit4]   2>   "node_name":"127.0.0.1:44880_uihr%2Ft",
   [junit4]   2>   "numShards":"2",
   [junit4]   2>   "state":"down",
   [junit4]   2>   "shard":null,
   [junit4]   2>   "collection":"collection1",
   [junit4]   2>   "operation":"state"}
   [junit4]   2> 505676 INFO  (OverseerStateUpdate-95564575663390724-127.0.0.1:41218_uihr%2Ft-n_0000000000) [n:127.0.0.1:41218_uihr%2Ft    ] o.a.s.c.o.ReplicaMutator Collection already exists with numShards=2
   [junit4]   2> 505676 INFO  (OverseerStateUpdate-95564575663390724-127.0.0.1:41218_uihr%2Ft-n_0000000000) [n:127.0.0.1:41218_uihr%2Ft    ] o.a.s.c.o.ReplicaMutator Assigning new node to shard shard=shard2
   [junit4]   2> 505778 INFO  (OverseerStateUpdate-95564575663390724-127.0.0.1:41218_uihr%2Ft-n_0000000000) [n:127.0.0.1:41218_uihr%2Ft    ] o.a.s.c.o.ZkStateWriter going to update_collection /collections/collection1/state.json version: 1
   [junit4]   2> 505779 INFO  (zkCallback-397-thread-1-processing-n:127.0.0.1:44880_uihr%2Ft) [n:127.0.0.1:44880_uihr%2Ft    ] o.a.s.c.c.ZkStateReader A cluster state change: [WatchedEvent state:SyncConnected type:NodeDataChanged path:/collections/collection1/state.json] for collection [collection1] has occurred - updating... (live nodes size: [2])
   [junit4]   2> 505779 INFO  (zkCallback-397-thread-1-processing-n:127.0.0.1:44880_uihr%2Ft) [n:127.0.0.1:44880_uihr%2Ft    ] o.a.s.c.c.ZkStateReader Updating data for [collection1] from [1] to [2]
   [junit4]   2> 506676 INFO  (coreLoadExecutor-1565-thread-1-processing-n:127.0.0.1:44880_uihr%2Ft) [n:127.0.0.1:44880_uihr%2Ft c:collection1   x:collection1] o.a.s.c.ZkController waiting to find shard id in clusterstate for collection1
   [junit4]   2> 506676 INFO  (coreLoadExecutor-1565-thread-1-processing-n:127.0.0.1:44880_uihr%2Ft) [n:127.0.0.1:44880_uihr%2Ft c:collection1   x:collection1] o.a.s.c.ZkController Check for collection zkNode:collection1
   [junit4]   2> 506677 INFO  (coreLoadExecutor-1565-thread-1-processing-n:127.0.0.1:44880_uihr%2Ft) [n:127.0.0.1:44880_uihr%2Ft c:collection1   x:collection1] o.a.s.c.ZkController Collection zkNode exists
   [junit4]   2> 506677 INFO  (coreLoadExecutor-1565-thread-1-processing-n:127.0.0.1:44880_uihr%2Ft) [n:127.0.0.1:44880_uihr%2Ft c:collection1   x:collection1] o.a.s.c.c.ZkStateReader Load collection config from: [/collections/collection1]
   [junit4]   2> 506677 INFO  (coreLoadExecutor-156

[...truncated too long message...]

ooking to close /home/jenkins/workspace/Lucene-Solr-master-Linux/solr/build/solr-core/test/J1/temp/solr.handler.TestReplicationHandler_E7047B72BBDEF85-001/solr-instance-027/./collection1/data [CachedDir<<refCount=0;path=/home/jenkins/workspace/Lucene-Solr-master-Linux/solr/build/solr-core/test/J1/temp/solr.handler.TestReplicationHandler_E7047B72BBDEF85-001/solr-instance-027/./collection1/data;done=false>>]
   [junit4]   2> 1425324 INFO  (coreCloseExecutor-4453-thread-1) [    x:collection1] o.a.s.c.CachingDirectoryFactory Closing directory: /home/jenkins/workspace/Lucene-Solr-master-Linux/solr/build/solr-core/test/J1/temp/solr.handler.TestReplicationHandler_E7047B72BBDEF85-001/solr-instance-027/./collection1/data
   [junit4]   2> 1425325 INFO  (coreCloseExecutor-4453-thread-1) [    x:collection1] o.a.s.c.CachingDirectoryFactory looking to close /home/jenkins/workspace/Lucene-Solr-master-Linux/solr/build/solr-core/test/J1/temp/solr.handler.TestReplicationHandler_E7047B72BBDEF85-001/solr-instance-027/./collection1/data/index [CachedDir<<refCount=0;path=/home/jenkins/workspace/Lucene-Solr-master-Linux/solr/build/solr-core/test/J1/temp/solr.handler.TestReplicationHandler_E7047B72BBDEF85-001/solr-instance-027/./collection1/data/index;done=false>>]
   [junit4]   2> 1425325 INFO  (coreCloseExecutor-4453-thread-1) [    x:collection1] o.a.s.c.CachingDirectoryFactory Closing directory: /home/jenkins/workspace/Lucene-Solr-master-Linux/solr/build/solr-core/test/J1/temp/solr.handler.TestReplicationHandler_E7047B72BBDEF85-001/solr-instance-027/./collection1/data/index
   [junit4]   2> 1425325 INFO  (TEST-TestReplicationHandler.doTestIndexAndConfigReplication-seed#[E7047B72BBDEF85]) [    ] o.e.j.s.h.ContextHandler Stopped o.e.j.s.ServletContextHandler@d17f3d{/solr,null,UNAVAILABLE}
   [junit4]   2> 1425326 INFO  (TEST-TestReplicationHandler.doTestIndexAndConfigReplication-seed#[E7047B72BBDEF85]) [    ] o.e.j.s.ServerConnector Stopped ServerConnector@1941011{HTTP/1.1,[http/1.1]}{127.0.0.1:0}
   [junit4]   2> 1425326 INFO  (TEST-TestReplicationHandler.doTestIndexAndConfigReplication-seed#[E7047B72BBDEF85]) [    ] o.a.s.c.CoreContainer Shutting down CoreContainer instance=7588519
   [junit4]   2> 1425327 INFO  (coreCloseExecutor-4455-thread-1) [    x:collection1] o.a.s.c.SolrCore [collection1]  CLOSING SolrCore org.apache.solr.core.SolrCore@129716f
   [junit4]   2> 1425327 INFO  (coreCloseExecutor-4455-thread-1) [    x:collection1] o.a.s.u.DirectUpdateHandler2 closing DirectUpdateHandler2{commits=0,autocommits=0,soft autocommits=0,optimizes=0,rollbacks=0,expungeDeletes=0,docsPending=0,adds=0,deletesById=0,deletesByQuery=0,errors=0,cumulative_adds=0,cumulative_deletesById=0,cumulative_deletesByQuery=0,cumulative_errors=0}
   [junit4]   2> 1425327 INFO  (coreCloseExecutor-4455-thread-1) [    x:collection1] o.a.s.u.SolrCoreState Closing SolrCoreState
   [junit4]   2> 1425327 INFO  (coreCloseExecutor-4455-thread-1) [    x:collection1] o.a.s.u.DefaultSolrCoreState SolrCoreState ref count has reached 0 - closing IndexWriter
   [junit4]   2> 1425327 INFO  (coreCloseExecutor-4455-thread-1) [    x:collection1] o.a.s.u.DefaultSolrCoreState closing IndexWriter with IndexWriterCloser
   [junit4]   2> 1425327 INFO  (coreCloseExecutor-4455-thread-1) [    x:collection1] o.a.s.c.SolrCore [collection1] Closing main searcher on request.
   [junit4]   2> 1425328 INFO  (coreCloseExecutor-4455-thread-1) [    x:collection1] o.a.s.c.CachingDirectoryFactory Closing MockDirectoryFactory - 2 directories currently being tracked
   [junit4]   2> 1425328 INFO  (coreCloseExecutor-4455-thread-1) [    x:collection1] o.a.s.c.CachingDirectoryFactory looking to close /home/jenkins/workspace/Lucene-Solr-master-Linux/solr/build/solr-core/test/J1/temp/solr.handler.TestReplicationHandler_E7047B72BBDEF85-001/solr-instance-028/./collection1/data [CachedDir<<refCount=0;path=/home/jenkins/workspace/Lucene-Solr-master-Linux/solr/build/solr-core/test/J1/temp/solr.handler.TestReplicationHandler_E7047B72BBDEF85-001/solr-instance-028/./collection1/data;done=false>>]
   [junit4]   2> 1425328 INFO  (coreCloseExecutor-4455-thread-1) [    x:collection1] o.a.s.c.CachingDirectoryFactory Closing directory: /home/jenkins/workspace/Lucene-Solr-master-Linux/solr/build/solr-core/test/J1/temp/solr.handler.TestReplicationHandler_E7047B72BBDEF85-001/solr-instance-028/./collection1/data
   [junit4]   2> 1425328 INFO  (coreCloseExecutor-4455-thread-1) [    x:collection1] o.a.s.c.CachingDirectoryFactory looking to close /home/jenkins/workspace/Lucene-Solr-master-Linux/solr/build/solr-core/test/J1/temp/solr.handler.TestReplicationHandler_E7047B72BBDEF85-001/solr-instance-028/./collection1/data/index [CachedDir<<refCount=0;path=/home/jenkins/workspace/Lucene-Solr-master-Linux/solr/build/solr-core/test/J1/temp/solr.handler.TestReplicationHandler_E7047B72BBDEF85-001/solr-instance-028/./collection1/data/index;done=false>>]
   [junit4]   2> 1425328 INFO  (coreCloseExecutor-4455-thread-1) [    x:collection1] o.a.s.c.CachingDirectoryFactory Closing directory: /home/jenkins/workspace/Lucene-Solr-master-Linux/solr/build/solr-core/test/J1/temp/solr.handler.TestReplicationHandler_E7047B72BBDEF85-001/solr-instance-028/./collection1/data/index
   [junit4]   2> 1425328 INFO  (TEST-TestReplicationHandler.doTestIndexAndConfigReplication-seed#[E7047B72BBDEF85]) [    ] o.e.j.s.h.ContextHandler Stopped o.e.j.s.ServletContextHandler@12a99e3{/solr,null,UNAVAILABLE}
   [junit4]   2> 1425331 INFO  (SUITE-TestReplicationHandler-seed#[E7047B72BBDEF85]-worker) [    ] o.a.s.SolrTestCaseJ4 ###deleteCore
   [junit4]   2> NOTE: leaving temporary files on disk at: /home/jenkins/workspace/Lucene-Solr-master-Linux/solr/build/solr-core/test/J1/temp/solr.handler.TestReplicationHandler_E7047B72BBDEF85-001
   [junit4]   2> NOTE: test params are: codec=Asserting(Lucene60): {name=PostingsFormat(name=MockRandom), id=PostingsFormat(name=MockRandom), newname=PostingsFormat(name=MockRandom)}, docValues:{}, maxPointsInLeafNode=998, maxMBSortInHeap=4.012088311706071, sim=RandomSimilarity(queryNorm=false,coord=crazy): {}, locale=pl, timezone=Africa/Conakry
   [junit4]   2> NOTE: Linux 4.2.0-34-generic i386/Oracle Corporation 1.8.0_72 (32-bit)/cpus=12,threads=1,free=102977448,total=271462400
   [junit4]   2> NOTE: All tests run in this JVM: [ChaosMonkeySafeLeaderTest, DirectoryFactoryTest, ConvertedLegacyTest, HLLSerializationTest, HighlighterTest, TestDistributedGrouping, TestSolrCoreProperties, TestCoreContainer, ChangedSchemaMergeTest, TestQueryUtils, TestMinMaxOnMultiValuedField, DocValuesTest, TestPartialUpdateDeduplication, DistributedDebugComponentTest, TestCodecSupport, TestDocumentBuilder, QueryResultKeyTest, TestManagedResource, TestFileDictionaryLookup, DeleteInactiveReplicaTest, TestCursorMarkWithoutUniqueKey, UpdateRequestProcessorFactoryTest, ClusterStateUpdateTest, TestSimpleTrackingShardHandler, DirectSolrSpellCheckerTest, TestSurroundQueryParser, DeleteShardTest, TestReplicationHandlerBackup, TestFastLRUCache, TestExactStatsCache, SimpleCollectionCreateDeleteTest, TestUseDocValuesAsStored, RemoteQueryErrorTest, DistanceFunctionTest, ConfigSetsAPITest, CollectionReloadTest, TestHashPartitioner, SpellCheckComponentTest, TestQueryWrapperFilter, CSVRequestHandlerTest, LoggingHandlerTest, TestTrie, SuggesterFSTTest, ShardSplitTest, DistributedSuggestComponentTest, SchemaVersionSpecificBehaviorTest, TestRuleBasedAuthorizationPlugin, TestNRTOpen, TestImplicitCoreProperties, CheckHdfsIndexTest, ShardRoutingTest, TestQuerySenderListener, PKIAuthenticationIntegrationTest, TestBulkSchemaAPI, TestDocBasedVersionConstraints, TestReRankQParserPlugin, DistributedMLTComponentTest, TestBM25SimilarityFactory, TestCloudPivotFacet, RankQueryTest, TestBinaryResponseWriter, HdfsWriteToMultipleCollectionsTest, DistributedTermsComponentTest, TestNamedUpdateProcessors, TestSQLHandler, TestQueryTypes, TimeZoneUtilsTest, ChaosMonkeyNothingIsSafeTest, CollectionsAPIAsyncDistributedZkTest, SpellPossibilityIteratorTest, SpatialFilterTest, HdfsDirectoryTest, TestRandomRequestDistribution, SimplePostToolTest, ConjunctionSolrSpellCheckerTest, TestFieldCollectionResource, TestManagedStopFilterFactory, TestExpandComponent, RollingRestartTest, TermsComponentTest, TriLevelCompositeIdRoutingTest, EnumFieldTest, DistributedFacetPivotLongTailTest, MultiTermTest, CdcrReplicationHandlerTest, TestSearcherReuse, DistributedVersionInfoTest, IgnoreCommitOptimizeUpdateProcessorFactoryTest, ShardRoutingCustomTest, TestLeaderElectionZkExpiry, HdfsBasicDistributedZkTest, InfoHandlerTest, LeaderElectionIntegrationTest, TestReplicationHandler]
   [junit4] Completed [303/580 (2!)] on J1 in 98.78s, 13 tests, 1 failure <<< FAILURES!

[...truncated 922 lines...]
BUILD FAILED
/home/jenkins/workspace/Lucene-Solr-master-Linux/build.xml:740: The following error occurred while executing this line:
/home/jenkins/workspace/Lucene-Solr-master-Linux/build.xml:684: The following error occurred while executing this line:
/home/jenkins/workspace/Lucene-Solr-master-Linux/build.xml:59: The following error occurred while executing this line:
/home/jenkins/workspace/Lucene-Solr-master-Linux/solr/build.xml:233: The following error occurred while executing this line:
/home/jenkins/workspace/Lucene-Solr-master-Linux/solr/common-build.xml:526: The following error occurred while executing this line:
/home/jenkins/workspace/Lucene-Solr-master-Linux/lucene/common-build.xml:1457: The following error occurred while executing this line:
/home/jenkins/workspace/Lucene-Solr-master-Linux/lucene/common-build.xml:1014: There were test failures: 580 suites (10 ignored), 2318 tests, 2 failures, 115 ignored (70 assumptions) [seed: E7047B72BBDEF85]

Total time: 61 minutes 45 seconds
Build step 'Invoke Ant' marked build as failure
Archiving artifacts
[WARNINGS] Skipping publisher since build result is FAILURE
Recording test results
Email was triggered for: Failure - Any
Sending email for trigger: Failure - Any



Mime
View raw message