lucene-dev mailing list archives

Site index · List index
Message view « Date » · « Thread »
Top « Date » · « Thread »
From Policeman Jenkins Server <jenk...@thetaphi.de>
Subject [JENKINS] Lucene-Solr-6.x-Linux (32bit/jdk1.8.0_72) - Build # 197 - Still Failing!
Date Mon, 21 Mar 2016 13:24:13 GMT
Build: http://jenkins.thetaphi.de/job/Lucene-Solr-6.x-Linux/197/
Java: 32bit/jdk1.8.0_72 -client -XX:+UseG1GC

1 tests failed.
FAILED:  org.apache.solr.cloud.UnloadDistributedZkTest.test

Error Message:
Captured an uncaught exception in thread: Thread[id=4989, name=testExecutor-2380-thread-12, state=RUNNABLE, group=TGRP-UnloadDistributedZkTest]

Stack Trace:
com.carrotsearch.randomizedtesting.UncaughtExceptionError: Captured an uncaught exception in thread: Thread[id=4989, name=testExecutor-2380-thread-12, state=RUNNABLE, group=TGRP-UnloadDistributedZkTest]
	at __randomizedtesting.SeedInfo.seed([8F8FE54A34F992D8:7DBDA909A05FF20]:0)
Caused by: java.lang.RuntimeException: org.apache.solr.client.solrj.SolrServerException: Timeout occured while waiting response from server at: http://127.0.0.1:34497/_xz/xv
	at __randomizedtesting.SeedInfo.seed([8F8FE54A34F992D8]:0)
	at org.apache.solr.cloud.BasicDistributedZkTest.lambda$createCores$0(BasicDistributedZkTest.java:583)
	at org.apache.solr.common.util.ExecutorUtil$MDCAwareThreadPoolExecutor.lambda$execute$0(ExecutorUtil.java:229)
	at java.util.concurrent.ThreadPoolExecutor.runWorker(ThreadPoolExecutor.java:1142)
	at java.util.concurrent.ThreadPoolExecutor$Worker.run(ThreadPoolExecutor.java:617)
	at java.lang.Thread.run(Thread.java:745)
Caused by: org.apache.solr.client.solrj.SolrServerException: Timeout occured while waiting response from server at: http://127.0.0.1:34497/_xz/xv
	at org.apache.solr.client.solrj.impl.HttpSolrClient.executeMethod(HttpSolrClient.java:588)
	at org.apache.solr.client.solrj.impl.HttpSolrClient.request(HttpSolrClient.java:241)
	at org.apache.solr.client.solrj.impl.HttpSolrClient.request(HttpSolrClient.java:230)
	at org.apache.solr.client.solrj.SolrClient.request(SolrClient.java:1219)
	at org.apache.solr.cloud.BasicDistributedZkTest.lambda$createCores$0(BasicDistributedZkTest.java:581)
	... 4 more
Caused by: java.net.SocketTimeoutException: Read timed out
	at java.net.SocketInputStream.socketRead0(Native Method)
	at java.net.SocketInputStream.socketRead(SocketInputStream.java:116)
	at java.net.SocketInputStream.read(SocketInputStream.java:170)
	at java.net.SocketInputStream.read(SocketInputStream.java:141)
	at org.apache.http.impl.io.AbstractSessionInputBuffer.fillBuffer(AbstractSessionInputBuffer.java:160)
	at org.apache.http.impl.io.SocketInputBuffer.fillBuffer(SocketInputBuffer.java:84)
	at org.apache.http.impl.io.AbstractSessionInputBuffer.readLine(AbstractSessionInputBuffer.java:273)
	at org.apache.http.impl.conn.DefaultHttpResponseParser.parseHead(DefaultHttpResponseParser.java:140)
	at org.apache.http.impl.conn.DefaultHttpResponseParser.parseHead(DefaultHttpResponseParser.java:57)
	at org.apache.http.impl.io.AbstractMessageParser.parse(AbstractMessageParser.java:261)
	at org.apache.http.impl.AbstractHttpClientConnection.receiveResponseHeader(AbstractHttpClientConnection.java:283)
	at org.apache.http.impl.conn.DefaultClientConnection.receiveResponseHeader(DefaultClientConnection.java:251)
	at org.apache.http.impl.conn.ManagedClientConnectionImpl.receiveResponseHeader(ManagedClientConnectionImpl.java:197)
	at org.apache.http.protocol.HttpRequestExecutor.doReceiveResponse(HttpRequestExecutor.java:272)
	at org.apache.http.protocol.HttpRequestExecutor.execute(HttpRequestExecutor.java:124)
	at org.apache.http.impl.client.DefaultRequestDirector.tryExecute(DefaultRequestDirector.java:685)
	at org.apache.http.impl.client.DefaultRequestDirector.execute(DefaultRequestDirector.java:487)
	at org.apache.http.impl.client.AbstractHttpClient.doExecute(AbstractHttpClient.java:882)
	at org.apache.http.impl.client.CloseableHttpClient.execute(CloseableHttpClient.java:82)
	at org.apache.http.impl.client.CloseableHttpClient.execute(CloseableHttpClient.java:107)
	at org.apache.http.impl.client.CloseableHttpClient.execute(CloseableHttpClient.java:55)
	at org.apache.solr.client.solrj.impl.HttpSolrClient.executeMethod(HttpSolrClient.java:482)
	... 8 more




Build Log:
[...truncated 11305 lines...]
   [junit4] Suite: org.apache.solr.cloud.UnloadDistributedZkTest
   [junit4]   2> Creating dataDir: /home/jenkins/workspace/Lucene-Solr-6.x-Linux/solr/build/solr-core/test/J2/temp/solr.cloud.UnloadDistributedZkTest_8F8FE54A34F992D8-001/init-core-data-001
   [junit4]   2> 632167 INFO  (SUITE-UnloadDistributedZkTest-seed#[8F8FE54A34F992D8]-worker) [    ] o.a.s.BaseDistributedSearchTestCase Setting hostContext system property: /_xz/xv
   [junit4]   2> 632169 INFO  (TEST-UnloadDistributedZkTest.test-seed#[8F8FE54A34F992D8]) [    ] o.a.s.c.ZkTestServer STARTING ZK TEST SERVER
   [junit4]   2> 632169 INFO  (Thread-1556) [    ] o.a.s.c.ZkTestServer client port:0.0.0.0/0.0.0.0:0
   [junit4]   2> 632169 INFO  (Thread-1556) [    ] o.a.s.c.ZkTestServer Starting server
   [junit4]   2> 632269 INFO  (TEST-UnloadDistributedZkTest.test-seed#[8F8FE54A34F992D8]) [    ] o.a.s.c.ZkTestServer start zk server on port:37429
   [junit4]   2> 632269 INFO  (TEST-UnloadDistributedZkTest.test-seed#[8F8FE54A34F992D8]) [    ] o.a.s.c.c.SolrZkClient Using default ZkCredentialsProvider
   [junit4]   2> 632270 INFO  (TEST-UnloadDistributedZkTest.test-seed#[8F8FE54A34F992D8]) [    ] o.a.s.c.c.ConnectionManager Waiting for client to connect to ZooKeeper
   [junit4]   2> 632272 INFO  (zkCallback-686-thread-1) [    ] o.a.s.c.c.ConnectionManager Watcher org.apache.solr.common.cloud.ConnectionManager@15f239c name:ZooKeeperConnection Watcher:127.0.0.1:37429 got event WatchedEvent state:SyncConnected type:None path:null path:null type:None
   [junit4]   2> 632272 INFO  (TEST-UnloadDistributedZkTest.test-seed#[8F8FE54A34F992D8]) [    ] o.a.s.c.c.ConnectionManager Client is connected to ZooKeeper
   [junit4]   2> 632272 INFO  (TEST-UnloadDistributedZkTest.test-seed#[8F8FE54A34F992D8]) [    ] o.a.s.c.c.SolrZkClient Using default ZkACLProvider
   [junit4]   2> 632272 INFO  (TEST-UnloadDistributedZkTest.test-seed#[8F8FE54A34F992D8]) [    ] o.a.s.c.c.SolrZkClient makePath: /solr
   [junit4]   2> 632274 INFO  (TEST-UnloadDistributedZkTest.test-seed#[8F8FE54A34F992D8]) [    ] o.a.s.c.c.SolrZkClient Using default ZkCredentialsProvider
   [junit4]   2> 632275 INFO  (TEST-UnloadDistributedZkTest.test-seed#[8F8FE54A34F992D8]) [    ] o.a.s.c.c.ConnectionManager Waiting for client to connect to ZooKeeper
   [junit4]   2> 632276 INFO  (zkCallback-687-thread-1) [    ] o.a.s.c.c.ConnectionManager Watcher org.apache.solr.common.cloud.ConnectionManager@1a538dc name:ZooKeeperConnection Watcher:127.0.0.1:37429/solr got event WatchedEvent state:SyncConnected type:None path:null path:null type:None
   [junit4]   2> 632276 INFO  (TEST-UnloadDistributedZkTest.test-seed#[8F8FE54A34F992D8]) [    ] o.a.s.c.c.ConnectionManager Client is connected to ZooKeeper
   [junit4]   2> 632276 INFO  (TEST-UnloadDistributedZkTest.test-seed#[8F8FE54A34F992D8]) [    ] o.a.s.c.c.SolrZkClient Using default ZkACLProvider
   [junit4]   2> 632276 INFO  (TEST-UnloadDistributedZkTest.test-seed#[8F8FE54A34F992D8]) [    ] o.a.s.c.c.SolrZkClient makePath: /collections/collection1
   [junit4]   2> 632277 INFO  (TEST-UnloadDistributedZkTest.test-seed#[8F8FE54A34F992D8]) [    ] o.a.s.c.c.SolrZkClient makePath: /collections/collection1/shards
   [junit4]   2> 632279 INFO  (TEST-UnloadDistributedZkTest.test-seed#[8F8FE54A34F992D8]) [    ] o.a.s.c.c.SolrZkClient makePath: /collections/control_collection
   [junit4]   2> 632279 INFO  (TEST-UnloadDistributedZkTest.test-seed#[8F8FE54A34F992D8]) [    ] o.a.s.c.c.SolrZkClient makePath: /collections/control_collection/shards
   [junit4]   2> 632280 INFO  (TEST-UnloadDistributedZkTest.test-seed#[8F8FE54A34F992D8]) [    ] o.a.s.c.AbstractZkTestCase put /home/jenkins/workspace/Lucene-Solr-6.x-Linux/solr/core/src/test-files/solr/collection1/conf/solrconfig-tlog.xml to /configs/conf1/solrconfig.xml
   [junit4]   2> 632281 INFO  (TEST-UnloadDistributedZkTest.test-seed#[8F8FE54A34F992D8]) [    ] o.a.s.c.c.SolrZkClient makePath: /configs/conf1/solrconfig.xml
   [junit4]   2> 632282 INFO  (TEST-UnloadDistributedZkTest.test-seed#[8F8FE54A34F992D8]) [    ] o.a.s.c.AbstractZkTestCase put /home/jenkins/workspace/Lucene-Solr-6.x-Linux/solr/core/src/test-files/solr/collection1/conf/schema.xml to /configs/conf1/schema.xml
   [junit4]   2> 632283 INFO  (TEST-UnloadDistributedZkTest.test-seed#[8F8FE54A34F992D8]) [    ] o.a.s.c.c.SolrZkClient makePath: /configs/conf1/schema.xml
   [junit4]   2> 632284 INFO  (TEST-UnloadDistributedZkTest.test-seed#[8F8FE54A34F992D8]) [    ] o.a.s.c.AbstractZkTestCase put /home/jenkins/workspace/Lucene-Solr-6.x-Linux/solr/core/src/test-files/solr/collection1/conf/solrconfig.snippet.randomindexconfig.xml to /configs/conf1/solrconfig.snippet.randomindexconfig.xml
   [junit4]   2> 632284 INFO  (TEST-UnloadDistributedZkTest.test-seed#[8F8FE54A34F992D8]) [    ] o.a.s.c.c.SolrZkClient makePath: /configs/conf1/solrconfig.snippet.randomindexconfig.xml
   [junit4]   2> 632285 INFO  (TEST-UnloadDistributedZkTest.test-seed#[8F8FE54A34F992D8]) [    ] o.a.s.c.AbstractZkTestCase put /home/jenkins/workspace/Lucene-Solr-6.x-Linux/solr/core/src/test-files/solr/collection1/conf/stopwords.txt to /configs/conf1/stopwords.txt
   [junit4]   2> 632285 INFO  (TEST-UnloadDistributedZkTest.test-seed#[8F8FE54A34F992D8]) [    ] o.a.s.c.c.SolrZkClient makePath: /configs/conf1/stopwords.txt
   [junit4]   2> 632286 INFO  (TEST-UnloadDistributedZkTest.test-seed#[8F8FE54A34F992D8]) [    ] o.a.s.c.AbstractZkTestCase put /home/jenkins/workspace/Lucene-Solr-6.x-Linux/solr/core/src/test-files/solr/collection1/conf/protwords.txt to /configs/conf1/protwords.txt
   [junit4]   2> 632286 INFO  (TEST-UnloadDistributedZkTest.test-seed#[8F8FE54A34F992D8]) [    ] o.a.s.c.c.SolrZkClient makePath: /configs/conf1/protwords.txt
   [junit4]   2> 632287 INFO  (TEST-UnloadDistributedZkTest.test-seed#[8F8FE54A34F992D8]) [    ] o.a.s.c.AbstractZkTestCase put /home/jenkins/workspace/Lucene-Solr-6.x-Linux/solr/core/src/test-files/solr/collection1/conf/currency.xml to /configs/conf1/currency.xml
   [junit4]   2> 632288 INFO  (TEST-UnloadDistributedZkTest.test-seed#[8F8FE54A34F992D8]) [    ] o.a.s.c.c.SolrZkClient makePath: /configs/conf1/currency.xml
   [junit4]   2> 632289 INFO  (TEST-UnloadDistributedZkTest.test-seed#[8F8FE54A34F992D8]) [    ] o.a.s.c.AbstractZkTestCase put /home/jenkins/workspace/Lucene-Solr-6.x-Linux/solr/core/src/test-files/solr/collection1/conf/enumsConfig.xml to /configs/conf1/enumsConfig.xml
   [junit4]   2> 632289 INFO  (TEST-UnloadDistributedZkTest.test-seed#[8F8FE54A34F992D8]) [    ] o.a.s.c.c.SolrZkClient makePath: /configs/conf1/enumsConfig.xml
   [junit4]   2> 632290 INFO  (TEST-UnloadDistributedZkTest.test-seed#[8F8FE54A34F992D8]) [    ] o.a.s.c.AbstractZkTestCase put /home/jenkins/workspace/Lucene-Solr-6.x-Linux/solr/core/src/test-files/solr/collection1/conf/open-exchange-rates.json to /configs/conf1/open-exchange-rates.json
   [junit4]   2> 632290 INFO  (TEST-UnloadDistributedZkTest.test-seed#[8F8FE54A34F992D8]) [    ] o.a.s.c.c.SolrZkClient makePath: /configs/conf1/open-exchange-rates.json
   [junit4]   2> 632291 INFO  (TEST-UnloadDistributedZkTest.test-seed#[8F8FE54A34F992D8]) [    ] o.a.s.c.AbstractZkTestCase put /home/jenkins/workspace/Lucene-Solr-6.x-Linux/solr/core/src/test-files/solr/collection1/conf/mapping-ISOLatin1Accent.txt to /configs/conf1/mapping-ISOLatin1Accent.txt
   [junit4]   2> 632291 INFO  (TEST-UnloadDistributedZkTest.test-seed#[8F8FE54A34F992D8]) [    ] o.a.s.c.c.SolrZkClient makePath: /configs/conf1/mapping-ISOLatin1Accent.txt
   [junit4]   2> 632292 INFO  (TEST-UnloadDistributedZkTest.test-seed#[8F8FE54A34F992D8]) [    ] o.a.s.c.AbstractZkTestCase put /home/jenkins/workspace/Lucene-Solr-6.x-Linux/solr/core/src/test-files/solr/collection1/conf/old_synonyms.txt to /configs/conf1/old_synonyms.txt
   [junit4]   2> 632293 INFO  (TEST-UnloadDistributedZkTest.test-seed#[8F8FE54A34F992D8]) [    ] o.a.s.c.c.SolrZkClient makePath: /configs/conf1/old_synonyms.txt
   [junit4]   2> 632294 INFO  (TEST-UnloadDistributedZkTest.test-seed#[8F8FE54A34F992D8]) [    ] o.a.s.c.AbstractZkTestCase put /home/jenkins/workspace/Lucene-Solr-6.x-Linux/solr/core/src/test-files/solr/collection1/conf/synonyms.txt to /configs/conf1/synonyms.txt
   [junit4]   2> 632294 INFO  (TEST-UnloadDistributedZkTest.test-seed#[8F8FE54A34F992D8]) [    ] o.a.s.c.c.SolrZkClient makePath: /configs/conf1/synonyms.txt
   [junit4]   2> 632389 INFO  (TEST-UnloadDistributedZkTest.test-seed#[8F8FE54A34F992D8]) [    ] o.a.s.SolrTestCaseJ4 Writing core.properties file to /home/jenkins/workspace/Lucene-Solr-6.x-Linux/solr/build/solr-core/test/J2/temp/solr.cloud.UnloadDistributedZkTest_8F8FE54A34F992D8-001/control-001/cores/collection1
   [junit4]   2> 632391 INFO  (TEST-UnloadDistributedZkTest.test-seed#[8F8FE54A34F992D8]) [    ] o.e.j.s.Server jetty-9.3.8.v20160314
   [junit4]   2> 632392 INFO  (TEST-UnloadDistributedZkTest.test-seed#[8F8FE54A34F992D8]) [    ] o.e.j.s.h.ContextHandler Started o.e.j.s.ServletContextHandler@18547e9{/_xz/xv,null,AVAILABLE}
   [junit4]   2> 632396 INFO  (TEST-UnloadDistributedZkTest.test-seed#[8F8FE54A34F992D8]) [    ] o.e.j.s.ServerConnector Started ServerConnector@1c27e8f{HTTP/1.1,[http/1.1]}{127.0.0.1:41043}
   [junit4]   2> 632396 INFO  (TEST-UnloadDistributedZkTest.test-seed#[8F8FE54A34F992D8]) [    ] o.e.j.s.Server Started @633974ms
   [junit4]   2> 632396 INFO  (TEST-UnloadDistributedZkTest.test-seed#[8F8FE54A34F992D8]) [    ] o.a.s.c.s.e.JettySolrRunner Jetty properties: {solr.data.dir=/home/jenkins/workspace/Lucene-Solr-6.x-Linux/solr/build/solr-core/test/J2/temp/solr.cloud.UnloadDistributedZkTest_8F8FE54A34F992D8-001/tempDir-001/control/data, hostContext=/_xz/xv, hostPort=41043, coreRootDirectory=/home/jenkins/workspace/Lucene-Solr-6.x-Linux/solr/build/solr-core/test/J2/temp/solr.cloud.UnloadDistributedZkTest_8F8FE54A34F992D8-001/control-001/cores}
   [junit4]   2> 632396 INFO  (TEST-UnloadDistributedZkTest.test-seed#[8F8FE54A34F992D8]) [    ] o.a.s.s.SolrDispatchFilter SolrDispatchFilter.init(): sun.misc.Launcher$AppClassLoader@1d16e93
   [junit4]   2> 632396 INFO  (TEST-UnloadDistributedZkTest.test-seed#[8F8FE54A34F992D8]) [    ] o.a.s.c.SolrResourceLoader new SolrResourceLoader for directory: '/home/jenkins/workspace/Lucene-Solr-6.x-Linux/solr/build/solr-core/test/J2/temp/solr.cloud.UnloadDistributedZkTest_8F8FE54A34F992D8-001/control-001'
   [junit4]   2> 632397 INFO  (TEST-UnloadDistributedZkTest.test-seed#[8F8FE54A34F992D8]) [    ] o.a.s.c.SolrResourceLoader JNDI not configured for solr (NoInitialContextEx)
   [junit4]   2> 632397 INFO  (TEST-UnloadDistributedZkTest.test-seed#[8F8FE54A34F992D8]) [    ] o.a.s.c.SolrResourceLoader solr home defaulted to 'solr/' (could not find system property or JNDI)
   [junit4]   2> 632397 INFO  (TEST-UnloadDistributedZkTest.test-seed#[8F8FE54A34F992D8]) [    ] o.a.s.c.c.SolrZkClient Using default ZkCredentialsProvider
   [junit4]   2> 632397 INFO  (TEST-UnloadDistributedZkTest.test-seed#[8F8FE54A34F992D8]) [    ] o.a.s.c.c.ConnectionManager Waiting for client to connect to ZooKeeper
   [junit4]   2> 632399 INFO  (zkCallback-688-thread-1) [    ] o.a.s.c.c.ConnectionManager Watcher org.apache.solr.common.cloud.ConnectionManager@1bf5637 name:ZooKeeperConnection Watcher:127.0.0.1:37429/solr got event WatchedEvent state:SyncConnected type:None path:null path:null type:None
   [junit4]   2> 632399 INFO  (TEST-UnloadDistributedZkTest.test-seed#[8F8FE54A34F992D8]) [    ] o.a.s.c.c.ConnectionManager Client is connected to ZooKeeper
   [junit4]   2> 632399 INFO  (TEST-UnloadDistributedZkTest.test-seed#[8F8FE54A34F992D8]) [    ] o.a.s.c.c.SolrZkClient Using default ZkACLProvider
   [junit4]   2> 632400 INFO  (TEST-UnloadDistributedZkTest.test-seed#[8F8FE54A34F992D8]) [    ] o.a.s.s.SolrDispatchFilter Loading solr.xml from SolrHome (not found in ZooKeeper)
   [junit4]   2> 632400 INFO  (TEST-UnloadDistributedZkTest.test-seed#[8F8FE54A34F992D8]) [    ] o.a.s.c.SolrXmlConfig Loading container configuration from /home/jenkins/workspace/Lucene-Solr-6.x-Linux/solr/build/solr-core/test/J2/temp/solr.cloud.UnloadDistributedZkTest_8F8FE54A34F992D8-001/control-001/solr.xml
   [junit4]   2> 632409 INFO  (TEST-UnloadDistributedZkTest.test-seed#[8F8FE54A34F992D8]) [    ] o.a.s.c.CorePropertiesLocator Config-defined core root directory: /home/jenkins/workspace/Lucene-Solr-6.x-Linux/solr/build/solr-core/test/J2/temp/solr.cloud.UnloadDistributedZkTest_8F8FE54A34F992D8-001/control-001/cores
   [junit4]   2> 632409 INFO  (TEST-UnloadDistributedZkTest.test-seed#[8F8FE54A34F992D8]) [    ] o.a.s.c.CoreContainer New CoreContainer 5392842
   [junit4]   2> 632409 INFO  (TEST-UnloadDistributedZkTest.test-seed#[8F8FE54A34F992D8]) [    ] o.a.s.c.CoreContainer Loading cores into CoreContainer [instanceDir=/home/jenkins/workspace/Lucene-Solr-6.x-Linux/solr/build/solr-core/test/J2/temp/solr.cloud.UnloadDistributedZkTest_8F8FE54A34F992D8-001/control-001]
   [junit4]   2> 632409 WARN  (TEST-UnloadDistributedZkTest.test-seed#[8F8FE54A34F992D8]) [    ] o.a.s.c.CoreContainer Couldn't add files from /home/jenkins/workspace/Lucene-Solr-6.x-Linux/solr/build/solr-core/test/J2/temp/solr.cloud.UnloadDistributedZkTest_8F8FE54A34F992D8-001/control-001/lib to classpath: /home/jenkins/workspace/Lucene-Solr-6.x-Linux/solr/build/solr-core/test/J2/temp/solr.cloud.UnloadDistributedZkTest_8F8FE54A34F992D8-001/control-001/lib
   [junit4]   2> 632410 INFO  (TEST-UnloadDistributedZkTest.test-seed#[8F8FE54A34F992D8]) [    ] o.a.s.h.c.HttpShardHandlerFactory created with socketTimeout : 90000,urlScheme : ,connTimeout : 15000,maxConnectionsPerHost : 20,maxConnections : 10000,corePoolSize : 0,maximumPoolSize : 2147483647,maxThreadIdleTime : 5,sizeOfQueue : -1,fairnessPolicy : false,useRetries : false,
   [junit4]   2> 632411 INFO  (TEST-UnloadDistributedZkTest.test-seed#[8F8FE54A34F992D8]) [    ] o.a.s.u.UpdateShardHandler Creating UpdateShardHandler HTTP client with params: socketTimeout=340000&connTimeout=45000&retry=true
   [junit4]   2> 632412 INFO  (TEST-UnloadDistributedZkTest.test-seed#[8F8FE54A34F992D8]) [    ] o.a.s.l.LogWatcher SLF4J impl is org.slf4j.impl.Log4jLoggerFactory
   [junit4]   2> 632412 INFO  (TEST-UnloadDistributedZkTest.test-seed#[8F8FE54A34F992D8]) [    ] o.a.s.l.LogWatcher Registering Log Listener [Log4j (org.slf4j.impl.Log4jLoggerFactory)]
   [junit4]   2> 632412 INFO  (TEST-UnloadDistributedZkTest.test-seed#[8F8FE54A34F992D8]) [    ] o.a.s.c.ZkContainer Zookeeper client=127.0.0.1:37429/solr
   [junit4]   2> 632412 INFO  (TEST-UnloadDistributedZkTest.test-seed#[8F8FE54A34F992D8]) [    ] o.a.s.c.ZkController zkHost includes chroot
   [junit4]   2> 632412 INFO  (TEST-UnloadDistributedZkTest.test-seed#[8F8FE54A34F992D8]) [    ] o.a.s.c.c.SolrZkClient Using default ZkCredentialsProvider
   [junit4]   2> 632413 INFO  (TEST-UnloadDistributedZkTest.test-seed#[8F8FE54A34F992D8]) [    ] o.a.s.c.c.ConnectionManager Waiting for client to connect to ZooKeeper
   [junit4]   2> 632414 INFO  (zkCallback-691-thread-1) [    ] o.a.s.c.c.ConnectionManager Watcher org.apache.solr.common.cloud.ConnectionManager@129295b name:ZooKeeperConnection Watcher:127.0.0.1:37429 got event WatchedEvent state:SyncConnected type:None path:null path:null type:None
   [junit4]   2> 632415 INFO  (TEST-UnloadDistributedZkTest.test-seed#[8F8FE54A34F992D8]) [    ] o.a.s.c.c.ConnectionManager Client is connected to ZooKeeper
   [junit4]   2> 632415 INFO  (TEST-UnloadDistributedZkTest.test-seed#[8F8FE54A34F992D8]) [    ] o.a.s.c.c.SolrZkClient Using default ZkACLProvider
   [junit4]   2> 632417 INFO  (TEST-UnloadDistributedZkTest.test-seed#[8F8FE54A34F992D8]) [n:127.0.0.1:41043__xz%2Fxv    ] o.a.s.c.c.ConnectionManager Waiting for client to connect to ZooKeeper
   [junit4]   2> 632418 INFO  (zkCallback-692-thread-1-processing-n:127.0.0.1:41043__xz%2Fxv) [n:127.0.0.1:41043__xz%2Fxv    ] o.a.s.c.c.ConnectionManager Watcher org.apache.solr.common.cloud.ConnectionManager@c56027 name:ZooKeeperConnection Watcher:127.0.0.1:37429/solr got event WatchedEvent state:SyncConnected type:None path:null path:null type:None
   [junit4]   2> 632418 INFO  (TEST-UnloadDistributedZkTest.test-seed#[8F8FE54A34F992D8]) [n:127.0.0.1:41043__xz%2Fxv    ] o.a.s.c.c.ConnectionManager Client is connected to ZooKeeper
   [junit4]   2> 632419 INFO  (TEST-UnloadDistributedZkTest.test-seed#[8F8FE54A34F992D8]) [n:127.0.0.1:41043__xz%2Fxv    ] o.a.s.c.c.SolrZkClient makePath: /overseer/queue
   [junit4]   2> 632421 INFO  (TEST-UnloadDistributedZkTest.test-seed#[8F8FE54A34F992D8]) [n:127.0.0.1:41043__xz%2Fxv    ] o.a.s.c.c.SolrZkClient makePath: /overseer/collection-queue-work
   [junit4]   2> 632423 INFO  (TEST-UnloadDistributedZkTest.test-seed#[8F8FE54A34F992D8]) [n:127.0.0.1:41043__xz%2Fxv    ] o.a.s.c.c.SolrZkClient makePath: /overseer/collection-map-running
   [junit4]   2> 632424 INFO  (TEST-UnloadDistributedZkTest.test-seed#[8F8FE54A34F992D8]) [n:127.0.0.1:41043__xz%2Fxv    ] o.a.s.c.c.SolrZkClient makePath: /overseer/collection-map-completed
   [junit4]   2> 632426 INFO  (TEST-UnloadDistributedZkTest.test-seed#[8F8FE54A34F992D8]) [n:127.0.0.1:41043__xz%2Fxv    ] o.a.s.c.c.SolrZkClient makePath: /overseer/collection-map-failure
   [junit4]   2> 632427 INFO  (TEST-UnloadDistributedZkTest.test-seed#[8F8FE54A34F992D8]) [n:127.0.0.1:41043__xz%2Fxv    ] o.a.s.c.c.SolrZkClient makePath: /live_nodes
   [junit4]   2> 632428 INFO  (TEST-UnloadDistributedZkTest.test-seed#[8F8FE54A34F992D8]) [n:127.0.0.1:41043__xz%2Fxv    ] o.a.s.c.c.SolrZkClient makePath: /aliases.json
   [junit4]   2> 632429 INFO  (TEST-UnloadDistributedZkTest.test-seed#[8F8FE54A34F992D8]) [n:127.0.0.1:41043__xz%2Fxv    ] o.a.s.c.c.SolrZkClient makePath: /clusterstate.json
   [junit4]   2> 632429 INFO  (TEST-UnloadDistributedZkTest.test-seed#[8F8FE54A34F992D8]) [n:127.0.0.1:41043__xz%2Fxv    ] o.a.s.c.c.SolrZkClient makePath: /security.json
   [junit4]   2> 632430 INFO  (TEST-UnloadDistributedZkTest.test-seed#[8F8FE54A34F992D8]) [n:127.0.0.1:41043__xz%2Fxv    ] o.a.s.c.c.ZkStateReader Updating cluster state from ZooKeeper... 
   [junit4]   2> 632431 INFO  (TEST-UnloadDistributedZkTest.test-seed#[8F8FE54A34F992D8]) [n:127.0.0.1:41043__xz%2Fxv    ] o.a.s.c.c.ZkStateReader Updated live nodes from ZooKeeper... (0) -> (0)
   [junit4]   2> 632432 INFO  (TEST-UnloadDistributedZkTest.test-seed#[8F8FE54A34F992D8]) [n:127.0.0.1:41043__xz%2Fxv    ] o.a.s.c.c.SolrZkClient makePath: /overseer_elect
   [junit4]   2> 632433 INFO  (TEST-UnloadDistributedZkTest.test-seed#[8F8FE54A34F992D8]) [n:127.0.0.1:41043__xz%2Fxv    ] o.a.s.c.c.SolrZkClient makePath: /overseer_elect/election
   [junit4]   2> 632434 INFO  (TEST-UnloadDistributedZkTest.test-seed#[8F8FE54A34F992D8]) [n:127.0.0.1:41043__xz%2Fxv    ] o.a.s.c.Overseer Overseer (id=null) closing
   [junit4]   2> 632434 INFO  (TEST-UnloadDistributedZkTest.test-seed#[8F8FE54A34F992D8]) [n:127.0.0.1:41043__xz%2Fxv    ] o.a.s.c.LeaderElector Joined leadership election with path: /overseer_elect/election/95588524344737796-127.0.0.1:41043__xz%2Fxv-n_0000000000
   [junit4]   2> 632435 INFO  (TEST-UnloadDistributedZkTest.test-seed#[8F8FE54A34F992D8]) [n:127.0.0.1:41043__xz%2Fxv    ] o.a.s.c.OverseerElectionContext I am going to be the leader 127.0.0.1:41043__xz%2Fxv
   [junit4]   2> 632435 INFO  (TEST-UnloadDistributedZkTest.test-seed#[8F8FE54A34F992D8]) [n:127.0.0.1:41043__xz%2Fxv    ] o.a.s.c.c.SolrZkClient makePath: /overseer_elect/leader
   [junit4]   2> 632435 INFO  (TEST-UnloadDistributedZkTest.test-seed#[8F8FE54A34F992D8]) [n:127.0.0.1:41043__xz%2Fxv    ] o.a.s.c.Overseer Overseer (id=95588524344737796-127.0.0.1:41043__xz%2Fxv-n_0000000000) starting
   [junit4]   2> 632436 INFO  (TEST-UnloadDistributedZkTest.test-seed#[8F8FE54A34F992D8]) [n:127.0.0.1:41043__xz%2Fxv    ] o.a.s.c.c.SolrZkClient makePath: /overseer/queue-work
   [junit4]   2> 632440 INFO  (TEST-UnloadDistributedZkTest.test-seed#[8F8FE54A34F992D8]) [n:127.0.0.1:41043__xz%2Fxv    ] o.a.s.c.OverseerAutoReplicaFailoverThread Starting OverseerAutoReplicaFailoverThread autoReplicaFailoverWorkLoopDelay=10000 autoReplicaFailoverWaitAfterExpiration=10000 autoReplicaFailoverBadNodeExpiration=60000
   [junit4]   2> 632441 INFO  (OverseerStateUpdate-95588524344737796-127.0.0.1:41043__xz%2Fxv-n_0000000000) [n:127.0.0.1:41043__xz%2Fxv    ] o.a.s.c.Overseer Starting to work on the main queue
   [junit4]   2> 632442 INFO  (OverseerCollectionConfigSetProcessor-95588524344737796-127.0.0.1:41043__xz%2Fxv-n_0000000000) [n:127.0.0.1:41043__xz%2Fxv    ] o.a.s.c.OverseerTaskProcessor Process current queue of overseer operations
   [junit4]   2> 632443 INFO  (TEST-UnloadDistributedZkTest.test-seed#[8F8FE54A34F992D8]) [n:127.0.0.1:41043__xz%2Fxv    ] o.a.s.c.ZkController Register node as live in ZooKeeper:/live_nodes/127.0.0.1:41043__xz%2Fxv
   [junit4]   2> 632443 INFO  (TEST-UnloadDistributedZkTest.test-seed#[8F8FE54A34F992D8]) [n:127.0.0.1:41043__xz%2Fxv    ] o.a.s.c.c.SolrZkClient makePath: /live_nodes/127.0.0.1:41043__xz%2Fxv
   [junit4]   2> 632444 INFO  (zkCallback-692-thread-1-processing-n:127.0.0.1:41043__xz%2Fxv) [n:127.0.0.1:41043__xz%2Fxv    ] o.a.s.c.c.ZkStateReader A live node change: [WatchedEvent state:SyncConnected type:NodeChildrenChanged path:/live_nodes], has occurred - updating... (live nodes size: [0])
   [junit4]   2> 632445 INFO  (OverseerStateUpdate-95588524344737796-127.0.0.1:41043__xz%2Fxv-n_0000000000) [n:127.0.0.1:41043__xz%2Fxv    ] o.a.s.c.c.ZkStateReader Updated live nodes from ZooKeeper... (0) -> (1)
   [junit4]   2> 632445 INFO  (zkCallback-692-thread-1-processing-n:127.0.0.1:41043__xz%2Fxv) [n:127.0.0.1:41043__xz%2Fxv    ] o.a.s.c.c.ZkStateReader Updated live nodes from ZooKeeper... (1) -> (1)
   [junit4]   2> 632528 INFO  (TEST-UnloadDistributedZkTest.test-seed#[8F8FE54A34F992D8]) [n:127.0.0.1:41043__xz%2Fxv    ] o.a.s.c.CoreContainer Security conf doesn't exist. Skipping setup for authorization module.
   [junit4]   2> 632528 INFO  (TEST-UnloadDistributedZkTest.test-seed#[8F8FE54A34F992D8]) [n:127.0.0.1:41043__xz%2Fxv    ] o.a.s.c.CoreContainer No authentication plugin used.
   [junit4]   2> 632529 INFO  (TEST-UnloadDistributedZkTest.test-seed#[8F8FE54A34F992D8]) [n:127.0.0.1:41043__xz%2Fxv    ] o.a.s.c.CorePropertiesLocator Looking for core definitions underneath /home/jenkins/workspace/Lucene-Solr-6.x-Linux/solr/build/solr-core/test/J2/temp/solr.cloud.UnloadDistributedZkTest_8F8FE54A34F992D8-001/control-001/cores
   [junit4]   2> 632530 INFO  (TEST-UnloadDistributedZkTest.test-seed#[8F8FE54A34F992D8]) [n:127.0.0.1:41043__xz%2Fxv    ] o.a.s.c.CoreDescriptor Created CoreDescriptor: {name=collection1, config=solrconfig.xml, transient=false, schema=schema.xml, loadOnStartup=true, configSetProperties=configsetprops.json, collection=control_collection, coreNodeName=, dataDir=data/, shard=}
   [junit4]   2> 632530 INFO  (TEST-UnloadDistributedZkTest.test-seed#[8F8FE54A34F992D8]) [n:127.0.0.1:41043__xz%2Fxv    ] o.a.s.c.CorePropertiesLocator Found core collection1 in /home/jenkins/workspace/Lucene-Solr-6.x-Linux/solr/build/solr-core/test/J2/temp/solr.cloud.UnloadDistributedZkTest_8F8FE54A34F992D8-001/control-001/cores/collection1
   [junit4]   2> 632530 INFO  (TEST-UnloadDistributedZkTest.test-seed#[8F8FE54A34F992D8]) [n:127.0.0.1:41043__xz%2Fxv    ] o.a.s.c.CorePropertiesLocator Found 1 core definitions
   [junit4]   2> 632531 INFO  (coreLoadExecutor-2301-thread-1-processing-n:127.0.0.1:41043__xz%2Fxv) [n:127.0.0.1:41043__xz%2Fxv c:control_collection   x:collection1] o.a.s.c.ZkController publishing state=down
   [junit4]   2> 632531 INFO  (coreLoadExecutor-2301-thread-1-processing-n:127.0.0.1:41043__xz%2Fxv) [n:127.0.0.1:41043__xz%2Fxv c:control_collection   x:collection1] o.a.s.c.ZkController numShards not found on descriptor - reading it from system property
   [junit4]   2> 632532 INFO  (TEST-UnloadDistributedZkTest.test-seed#[8F8FE54A34F992D8]) [n:127.0.0.1:41043__xz%2Fxv    ] o.a.s.s.SolrDispatchFilter user.dir=/home/jenkins/workspace/Lucene-Solr-6.x-Linux/solr/build/solr-core/test/J2
   [junit4]   2> 632532 INFO  (TEST-UnloadDistributedZkTest.test-seed#[8F8FE54A34F992D8]) [n:127.0.0.1:41043__xz%2Fxv    ] o.a.s.s.SolrDispatchFilter SolrDispatchFilter.init() done
   [junit4]   2> 632533 INFO  (OverseerStateUpdate-95588524344737796-127.0.0.1:41043__xz%2Fxv-n_0000000000) [n:127.0.0.1:41043__xz%2Fxv    ] o.a.s.c.Overseer processMessage: queueSize: 1, message = {
   [junit4]   2>   "core":"collection1",
   [junit4]   2>   "roles":null,
   [junit4]   2>   "base_url":"http://127.0.0.1:41043/_xz/xv",
   [junit4]   2>   "node_name":"127.0.0.1:41043__xz%2Fxv",
   [junit4]   2>   "numShards":"1",
   [junit4]   2>   "state":"down",
   [junit4]   2>   "shard":null,
   [junit4]   2>   "collection":"control_collection",
   [junit4]   2>   "operation":"state"} current state version: 0
   [junit4]   2> 632533 INFO  (coreLoadExecutor-2301-thread-1-processing-n:127.0.0.1:41043__xz%2Fxv) [n:127.0.0.1:41043__xz%2Fxv c:control_collection   x:collection1] o.a.s.c.ZkController look for our core node name
   [junit4]   2> 632536 INFO  (OverseerStateUpdate-95588524344737796-127.0.0.1:41043__xz%2Fxv-n_0000000000) [n:127.0.0.1:41043__xz%2Fxv    ] o.a.s.c.o.ReplicaMutator Update state numShards=1 message={
   [junit4]   2>   "core":"collection1",
   [junit4]   2>   "roles":null,
   [junit4]   2>   "base_url":"http://127.0.0.1:41043/_xz/xv",
   [junit4]   2>   "node_name":"127.0.0.1:41043__xz%2Fxv",
   [junit4]   2>   "numShards":"1",
   [junit4]   2>   "state":"down",
   [junit4]   2>   "shard":null,
   [junit4]   2>   "collection":"control_collection",
   [junit4]   2>   "operation":"state"}
   [junit4]   2> 632537 INFO  (OverseerStateUpdate-95588524344737796-127.0.0.1:41043__xz%2Fxv-n_0000000000) [n:127.0.0.1:41043__xz%2Fxv    ] o.a.s.c.o.ClusterStateMutator building a new cName: control_collection
   [junit4]   2> 632537 INFO  (OverseerStateUpdate-95588524344737796-127.0.0.1:41043__xz%2Fxv-n_0000000000) [n:127.0.0.1:41043__xz%2Fxv    ] o.a.s.c.o.ReplicaMutator Assigning new node to shard shard=shard1
   [junit4]   2> 632540 INFO  (zkCallback-692-thread-1-processing-n:127.0.0.1:41043__xz%2Fxv) [n:127.0.0.1:41043__xz%2Fxv    ] o.a.s.c.c.ZkStateReader A cluster state change: [WatchedEvent state:SyncConnected type:NodeDataChanged path:/clusterstate.json], has occurred - updating... (live nodes size: [1])
   [junit4]   2> 633537 INFO  (coreLoadExecutor-2301-thread-1-processing-n:127.0.0.1:41043__xz%2Fxv) [n:127.0.0.1:41043__xz%2Fxv c:control_collection   x:collection1] o.a.s.c.ZkController waiting to find shard id in clusterstate for collection1
   [junit4]   2> 633537 INFO  (coreLoadExecutor-2301-thread-1-processing-n:127.0.0.1:41043__xz%2Fxv) [n:127.0.0.1:41043__xz%2Fxv c:control_collection   x:collection1] o.a.s.c.ZkController Check for collection zkNode:control_collection
   [junit4]   2> 633537 INFO  (coreLoadExecutor-2301-thread-1-processing-n:127.0.0.1:41043__xz%2Fxv) [n:127.0.0.1:41043__xz%2Fxv c:control_collection   x:collection1] o.a.s.c.ZkController Collection zkNode exists
   [junit4]   2> 633537 INFO  (coreLoadExecutor-2301-thread-1-processing-n:127.0.0.1:41043__xz%2Fxv) [n:127.0.0.1:41043__xz%2Fxv c:control_collection   x:collection1] o.a.s.c.c.ZkStateReader Load collection config from: [/collections/control_collection]
   [junit4]   2> 633538 INFO  (coreLoadExecutor-2301-thread-1-processing-n:127.0.0.1:41043__xz%2Fxv) [n:127.0.0.1:41043__xz%2Fxv c:control_collection   x:collection1] o.a.s.c.c.ZkStateReader path=[/collections/control_collection] [configName]=[conf1] specified config exists in ZooKeeper
   [junit4]   2> 633538 INFO  (coreLoadExecutor-2301-thread-1-processing-n:127.0.0.1:41043__xz%2Fxv) [n:127.0.0.1:41043__xz%2Fxv c:control_collection   x:collection1] o.a.s.c.SolrResourceLoader new SolrResourceLoader for directory: '/home/jenkins/workspace/Lucene-Solr-6.x-Linux/solr/build/solr-core/test/J2/temp/solr.cloud.UnloadDistributedZkTest_8F8FE54A34F992D8-001/control-001/cores/collection1'
   [junit4]   2> 633538 INFO  (coreLoadExecutor-2301-thread-1-processing-n:127.0.0.1:41043__xz%2Fxv) [n:127.0.0.1:41043__xz%2Fxv c:control_collection   x:collection1] o.a.s.c.SolrResourceLoader JNDI not configured for solr (NoInitialContextEx)
   [junit4]   2> 633538 INFO  (coreLoadExecutor-2301-thread-1-processing-n:127.0.0.1:41043__xz%2Fxv) [n:127.0.0.1:41043__xz%2Fxv c:control_collection   x:collection1] o.a.s.c.SolrResourceLoader solr home defaulted to 'solr/' (could not find system property or JNDI)
   [junit4]   2> 633539 INFO  (coreLoadExecutor-2301-thread-1-processing-n:127.0.0.1:41043__xz%2Fxv) [n:127.0.0.1:41043__xz%2Fxv c:control_collection   x:collection1] o.a.s.c.Config loaded config solrconfig.xml with version 0 
   [junit4]   2> 633544 INFO  (coreLoadExecutor-2301-thread-1-processing-n:127.0.0.1:41043__xz%2Fxv) [n:127.0.0.1:41043__xz%2Fxv c:control_collection   x:collection1] o.a.s.c.SolrConfig current version of requestparams : -1
   [junit4]   2> 633548 INFO  (coreLoadExecutor-2301-thread-1-processing-n:127.0.0.1:41043__xz%2Fxv) [n:127.0.0.1:41043__xz%2Fxv c:control_collection   x:collection1] o.a.s.c.SolrConfig Using Lucene MatchVersion: 6.1.0
   [junit4]   2> 633556 INFO  (coreLoadExecutor-2301-thread-1-processing-n:127.0.0.1:41043__xz%2Fxv) [n:127.0.0.1:41043__xz%2Fxv c:control_collection   x:collection1] o.a.s.c.SolrConfig Loaded SolrConfig: solrconfig.xml
   [junit4]   2> 633563 INFO  (coreLoadExecutor-2301-thread-1-processing-n:127.0.0.1:41043__xz%2Fxv) [n:127.0.0.1:41043__xz%2Fxv c:control_collection   x:collection1] o.a.s.s.IndexSchema [collection1] Schema name=test
   [junit4]   2> 633652 INFO  (coreLoadExecutor-2301-thread-1-processing-n:127.0.0.1:41043__xz%2Fxv) [n:127.0.0.1:41043__xz%2Fxv c:control_collection   x:collection1] o.a.s.s.OpenExchangeRatesOrgProvider Initialized with rates=open-exchange-rates.json, refreshInterval=1440.
   [junit4]   2> 633657 INFO  (coreLoadExecutor-2301-thread-1-processing-n:127.0.0.1:41043__xz%2Fxv) [n:127.0.0.1:41043__xz%2Fxv c:control_collection   x:collection1] o.a.s.s.IndexSchema default search field in schema is text
   [junit4]   2> 633658 INFO  (coreLoadExecutor-2301-thread-1-processing-n:127.0.0.1:41043__xz%2Fxv) [n:127.0.0.1:41043__xz%2Fxv c:control_collection   x:collection1] o.a.s.s.IndexSchema unique key field: id
   [junit4]   2> 633666 INFO  (coreLoadExecutor-2301-thread-1-processing-n:127.0.0.1:41043__xz%2Fxv) [n:127.0.0.1:41043__xz%2Fxv c:control_collection   x:collection1] o.a.s.s.FileExchangeRateProvider Reloading exchange rates from file currency.xml
   [junit4]   2> 633668 INFO  (coreLoadExecutor-2301-thread-1-processing-n:127.0.0.1:41043__xz%2Fxv) [n:127.0.0.1:41043__xz%2Fxv c:control_collection   x:collection1] o.a.s.s.FileExchangeRateProvider Reloading exchange rates from file currency.xml
   [junit4]   2> 633669 INFO  (coreLoadExecutor-2301-thread-1-processing-n:127.0.0.1:41043__xz%2Fxv) [n:127.0.0.1:41043__xz%2Fxv c:control_collection   x:collection1] o.a.s.s.OpenExchangeRatesOrgProvider Reloading exchange rates from open-exchange-rates.json
   [junit4]   2> 633670 INFO  (coreLoadExecutor-2301-thread-1-processing-n:127.0.0.1:41043__xz%2Fxv) [n:127.0.0.1:41043__xz%2Fxv c:control_collection   x:collection1] o.a.s.s.OpenExchangeRatesOrgProvider Reloading exchange rates from open-exchange-rates.json
   [junit4]   2> 633671 INFO  (coreLoadExecutor-2301-thread-1-processing-n:127.0.0.1:41043__xz%2Fxv) [n:127.0.0.1:41043__xz%2Fxv c:control_collection   x:collection1] o.a.s.c.ConfigSetProperties Did not find ConfigSet properties, assuming default properties: Can't find resource 'configsetprops.json' in classpath or '/configs/conf1', cwd=/home/jenkins/workspace/Lucene-Solr-6.x-Linux/solr/build/solr-core/test/J2
   [junit4]   2> 633671 INFO  (coreLoadExecutor-2301-thread-1-processing-n:127.0.0.1:41043__xz%2Fxv) [n:127.0.0.1:41043__xz%2Fxv c:control_collection   x:collection1] o.a.s.c.CoreContainer Creating SolrCore 'collection1' using configuration from collection control_collection
   [junit4]   2> 633671 INFO  (coreLoadExecutor-2301-thread-1-processing-n:127.0.0.1:41043__xz%2Fxv) [n:127.0.0.1:41043__xz%2Fxv c:control_collection s:shard1 r:core_node1 x:collection1] o.a.s.c.SolrCore org.apache.solr.core.MockDirectoryFactory
   [junit4]   2> 633671 INFO  (coreLoadExecutor-2301-thread-1-processing-n:127.0.0.1:41043__xz%2Fxv) [n:127.0.0.1:41043__xz%2Fxv c:control_collection s:shard1 r:core_node1 x:collection1] o.a.s.c.SolrCore [[collection1] ] Opening new SolrCore at [/home/jenkins/workspace/Lucene-Solr-6.x-Linux/solr/build/solr-core/test/J2/temp/solr.cloud.UnloadDistributedZkTest_8F8FE54A34F992D8-001/control-001/cores/collection1], dataDir=[/home/jenkins/workspace/Lucene-Solr-6.x-Linux/solr/build/solr-core/test/J2/temp/solr.cloud.UnloadDistributedZkTest_8F8FE54A34F992D8-001/control-001/cores/collection1/data/]
   [junit4]   2> 633671 INFO  (coreLoadExecutor-2301-thread-1-processing-n:127.0.0.1:41043__xz%2Fxv) [n:127.0.0.1:41043__xz%2Fxv c:control_collection s:shard1 r:core_node1 x:collection1] o.a.s.c.JmxMonitoredMap JMX monitoring is enabled. Adding Solr mbeans to JMX Server: com.sun.jmx.mbeanserver.JmxMBeanServer@13a9802
   [junit4]   2> 633672 INFO  (coreLoadExecutor-2301-thread-1-processing-n:127.0.0.1:41043__xz%2Fxv) [n:127.0.0.1:41043__xz%2Fxv c:control_collection s:shard1 r:core_node1 x:collection1] o.a.s.c.CachingDirectoryFactory return new directory for /home/jenkins/workspace/Lucene-Solr-6.x-Linux/solr/build/solr-core/test/J2/temp/solr.cloud.UnloadDistributedZkTest_8F8FE54A34F992D8-001/control-001/cores/collection1/data
   [junit4]   2> 633672 INFO  (coreLoadExecutor-2301-thread-1-processing-n:127.0.0.1:41043__xz%2Fxv) [n:127.0.0.1:41043__xz%2Fxv c:control_collection s:shard1 r:core_node1 x:collection1] o.a.s.c.SolrCore New index directory detected: old=null new=/home/jenkins/workspace/Lucene-Solr-6.x-Linux/solr/build/solr-core/test/J2/temp/solr.cloud.UnloadDistributedZkTest_8F8FE54A34F992D8-001/control-001/cores/collection1/data/index/
   [junit4]   2> 633672 WARN  (coreLoadExecutor-2301-thread-1-processing-n:127.0.0.1:41043__xz%2Fxv) [n:127.0.0.1:41043__xz%2Fxv c:control_collection s:shard1 r:core_node1 x:collection1] o.a.s.c.SolrCore [collection1] Solr index directory '/home/jenkins/workspace/Lucene-Solr-6.x-Linux/solr/build/solr-core/test/J2/temp/solr.cloud.UnloadDistributedZkTest_8F8FE54A34F992D8-001/control-001/cores/collection1/data/index' doesn't exist. Creating new index...
   [junit4]   2> 633672 INFO  (coreLoadExecutor-2301-thread-1-processing-n:127.0.0.1:41043__xz%2Fxv) [n:127.0.0.1:41043__xz%2Fxv c:control_collection s:shard1 r:core_node1 x:collection1] o.a.s.c.CachingDirectoryFactory return new directory for /home/jenkins/workspace/Lucene-Solr-6.x-Linux/solr/build/solr-core/test/J2/temp/solr.cloud.UnloadDistributedZkTest_8F8FE54A34F992D8-001/control-001/cores/collection1/data/index
   [junit4]   2> 633673 INFO  (coreLoadExecutor-2301-thread-1-processing-n:127.0.0.1:41043__xz%2Fxv) [n:127.0.0.1:41043__xz%2Fxv c:control_collection s:shard1 r:core_node1 x:collection1] o.a.s.u.RandomMergePolicy RandomMergePolicy wrapping class org.apache.lucene.index.LogDocMergePolicy: [LogDocMergePolicy: minMergeSize=1000, mergeFactor=42, maxMergeSize=9223372036854775807, maxMergeSizeForForcedMerge=9223372036854775807, calibrateSizeByDeletes=false, maxMergeDocs=2147483647, maxCFSSegmentSizeMB=8.796093022207999E12, noCFSRatio=0.6833077463698777]
   [junit4]   2> 633673 INFO  (coreLoadExecutor-2301-thread-1-processing-n:127.0.0.1:41043__xz%2Fxv) [n:127.0.0.1:41043__xz%2Fxv c:control_collection s:shard1 r:core_node1 x:collection1] o.a.s.c.SolrDeletionPolicy SolrDeletionPolicy.onCommit: commits: num=1
   [junit4]   2> 	commit{dir=MockDirectoryWrapper(RAMDirectory@15fdfc1 lockFactory=org.apache.lucene.store.SingleInstanceLockFactory@1c5a45a),segFN=segments_1,generation=1}
   [junit4]   2> 633673 INFO  (coreLoadExecutor-2301-thread-1-processing-n:127.0.0.1:41043__xz%2Fxv) [n:127.0.0.1:41043__xz%2Fxv c:control_collection s:shard1 r:core_node1 x:collection1] o.a.s.c.SolrDeletionPolicy newest commit generation = 1
   [junit4]   2> 633673 INFO  (OldIndexDirectoryCleanupThreadForCore-collection1) [n:127.0.0.1:41043__xz%2Fxv c:control_collection s:shard1 r:core_node1 x:collection1] o.a.s.c.SolrCore Looking for old index directories to cleanup for core collection1 in /home/jenkins/workspace/Lucene-Solr-6.x-Linux/solr/build/solr-core/test/J2/temp/solr.cloud.UnloadDistributedZkTest_8F8FE54A34F992D8-001/control-001/cores/collection1/data/
   [junit4]   2> 633674 WARN  (OldIndexDirectoryCleanupThreadForCore-collection1) [n:127.0.0.1:41043__xz%2Fxv c:control_collection s:shard1 r:core_node1 x:collection1] o.a.s.c.DirectoryFactory /home/jenkins/workspace/Lucene-Solr-6.x-Linux/solr/build/solr-core/test/J2/temp/solr.cloud.UnloadDistributedZkTest_8F8FE54A34F992D8-001/control-001/cores/collection1/data/ does not point to a valid data directory; skipping clean-up of old index directories.
   [junit4]   2> 633677 INFO  (coreLoadExecutor-2301-thread-1-processing-n:127.0.0.1:41043__xz%2Fxv) [n:127.0.0.1:41043__xz%2Fxv c:control_collection s:shard1 r:core_node1 x:collection1] o.a.s.u.p.UpdateRequestProcessorChain creating updateRequestProcessorChain "nodistrib"
   [junit4]   2> 633677 INFO  (coreLoadExecutor-2301-thread-1-processing-n:127.0.0.1:41043__xz%2Fxv) [n:127.0.0.1:41043__xz%2Fxv c:control_collection s:shard1 r:core_node1 x:collection1] o.a.s.u.p.UpdateRequestProcessorChain creating updateRequestProcessorChain "dedupe"
   [junit4]   2> 633677 INFO  (coreLoadExecutor-2301-thread-1-processing-n:127.0.0.1:41043__xz%2Fxv) [n:127.0.0.1:41043__xz%2Fxv c:control_collection s:shard1 r:core_node1 x:collection1] o.a.s.u.p.UpdateRequestProcessorChain inserting DistributedUpdateProcessorFactory into updateRequestProcessorChain "dedupe"
   [junit4]   2> 633677 INFO  (coreLoadExecutor-2301-thread-1-processing-n:127.0.0.1:41043__xz%2Fxv) [n:127.0.0.1:41043__xz%2Fxv c:control_collection s:shard1 r:core_node1 x:collection1] o.a.s.u.p.UpdateRequestProcessorChain creating updateRequestProcessorChain "stored_sig"
   [junit4]   2> 633677 INFO  (coreLoadExecutor-2301-thread-1-processing-n:127.0.0.1:41043__xz%2Fxv) [n:127.0.0.1:41043__xz%2Fxv c:control_collection s:shard1 r:core_node1 x:collection1] o.a.s.u.p.UpdateRequestProcessorChain inserting DistributedUpdateProcessorFactory into updateRequestProcessorChain "stored_sig"
   [junit4]   2> 633677 INFO  (coreLoadExecutor-2301-thread-1-processing-n:127.0.0.1:41043__xz%2Fxv) [n:127.0.0.1:41043__xz%2Fxv c:control_collection s:shard1 r:core_node1 x:collection1] o.a.s.u.p.UpdateRequestProcessorChain creating updateRequestProcessorChain "distrib-dup-test-chain-explicit"
   [junit4]   2> 633677 INFO  (coreLoadExecutor-2301-thread-1-processing-n:127.0.0.1:41043__xz%2Fxv) [n:127.0.0.1:41043__xz%2Fxv c:control_collection s:shard1 r:core_node1 x:collection1] o.a.s.u.p.UpdateRequestProcessorChain creating updateRequestProcessorChain "distrib-dup-test-chain-implicit"
   [junit4]   2> 633678 INFO  (coreLoadExecutor-2301-thread-1-processing-n:127.0.0.1:41043__xz%2Fxv) [n:127.0.0.1:41043__xz%2Fxv c:control_collection s:shard1 r:core_node1 x:collection1] o.a.s.u.p.UpdateRequestProcessorChain inserting DistributedUpdateProcessorFactory into updateRequestProcessorChain "distrib-dup-test-chain-implicit"
   [junit4]   2> 633678 INFO  (coreLoadExecutor-2301-thread-1-processing-n:127.0.0.1:41043__xz%2Fxv) [n:127.0.0.1:41043__xz%2Fxv c:control_collection s:shard1 r:core_node1 x:collection1] o.a.s.c.SolrCore no updateRequestProcessorChain defined as default, creating implicit default
   [junit4]   2> 633678 WARN  (coreLoadExecutor-2301-thread-1-processing-n:127.0.0.1:41043__xz%2Fxv) [n:127.0.0.1:41043__xz%2Fxv c:control_collection s:shard1 r:core_node1 x:collection1] o.a.s.c.RequestHandlers INVALID paramSet a in requestHandler {type = requestHandler,name = /dump,class = DumpRequestHandler,args = {defaults={a=A,b=B}}}
   [junit4]   2> 633680 INFO  (coreLoadExecutor-2301-thread-1-processing-n:127.0.0.1:41043__xz%2Fxv) [n:127.0.0.1:41043__xz%2Fxv c:control_collection s:shard1 r:core_node1 x:collection1] o.a.s.h.l.XMLLoader xsltCacheLifetimeSeconds=60
   [junit4]   2> 633681 INFO  (coreLoadExecutor-2301-thread-1-processing-n:127.0.0.1:41043__xz%2Fxv) [n:127.0.0.1:41043__xz%2Fxv c:control_collection s:shard1 r:core_node1 x:collection1] o.a.s.h.l.XMLLoader xsltCacheLifetimeSeconds=60
   [junit4]   2> 633683 INFO  (coreLoadExecutor-2301-thread-1-processing-n:127.0.0.1:41043__xz%2Fxv) [n:127.0.0.1:41043__xz%2Fxv c:control_collection s:shard1 r:core_node1 x:collection1] o.a.s.h.l.XMLLoader xsltCacheLifetimeSeconds=60
   [junit4]   2> 633684 INFO  (coreLoadExecutor-2301-thread-1-processing-n:127.0.0.1:41043__xz%2Fxv) [n:127.0.0.1:41043__xz%2Fxv c:control_collection s:shard1 r:core_node1 x:collection1] o.a.s.h.l.XMLLoader xsltCacheLifetimeSeconds=60
   [junit4]   2> 633689 INFO  (coreLoadExecutor-2301-thread-1-processing-n:127.0.0.1:41043__xz%2Fxv) [n:127.0.0.1:41043__xz%2Fxv c:control_collection s:shard1 r:core_node1 x:collection1] o.a.s.c.RequestHandlers Registered paths: /admin/mbeans,standard,/dump,/update/csv,/sql,/update/json/docs,/admin/luke,/export,/admin/segments,/get,/admin/system,/replication,/admin/properties,/config,/stream,/schema,/admin/plugins,/admin/logging,/update/json,/admin/ping,/admin/threads,/update,/admin/file
   [junit4]   2> 633689 INFO  (coreLoadExecutor-2301-thread-1-processing-n:127.0.0.1:41043__xz%2Fxv) [n:127.0.0.1:41043__xz%2Fxv c:control_collection s:shard1 r:core_node1 x:collection1] o.a.s.c.SolrCore Using default statsCache cache: org.apache.solr.search.stats.LocalStatsCache
   [junit4]   2> 633689 INFO  (coreLoadExecutor-2301-thread-1-processing-n:127.0.0.1:41043__xz%2Fxv) [n:127.0.0.1:41043__xz%2Fxv c:control_collection s:shard1 r:core_node1 x:collection1] o.a.s.u.UpdateHandler Using UpdateLog implementation: org.apache.solr.update.UpdateLog
   [junit4]   2> 633689 INFO  (coreLoadExecutor-2301-thread-1-processing-n:127.0.0.1:41043__xz%2Fxv) [n:127.0.0.1:41043__xz%2Fxv c:control_collection s:shard1 r:core_node1 x:collection1] o.a.s.u.UpdateLog Initializing UpdateLog: dataDir= defaultSyncLevel=FLUSH numRecordsToKeep=100 maxNumLogsToKeep=10 numVersionBuckets=65536
   [junit4]   2> 633690 INFO  (coreLoadExecutor-2301-thread-1-processing-n:127.0.0.1:41043__xz%2Fxv) [n:127.0.0.1:41043__xz%2Fxv c:control_collection s:shard1 r:core_node1 x:collection1] o.a.s.u.CommitTracker Hard AutoCommit: disabled
   [junit4]   2> 633690 INFO  (coreLoadExecutor-2301-thread-1-processing-n:127.0.0.1:41043__xz%2Fxv) [n:127.0.0.1:41043__xz%2Fxv c:control_collection s:shard1 r:core_node1 x:collection1] o.a.s.u.CommitTracker Soft AutoCommit: disabled
   [junit4]   2> 633691 INFO  (coreLoadExecutor-2301-thread-1-processing-n:127.0.0.1:41043__xz%2Fxv) [n:127.0.0.1:41043__xz%2Fxv c:control_collection s:shard1 r:core_node1 x:collection1] o.a.s.u.RandomMergePolicy RandomMergePolicy wrapping class org.apache.lucene.index.TieredMergePolicy: [TieredMergePolicy: maxMergeAtOnce=10, maxMergeAtOnceExplicit=35, maxMergedSegmentMB=84.7734375, floorSegmentMB=0.974609375, forceMergeDeletesPctAllowed=10.329757058267603, segmentsPerTier=22.0, maxCFSSegmentSizeMB=8.796093022207999E12, noCFSRatio=0.0
   [junit4]   2> 633691 INFO  (coreLoadExecutor-2301-thread-1-processing-n:127.0.0.1:41043__xz%2Fxv) [n:127.0.0.1:41043__xz%2Fxv c:control_collection s:shard1 r:core_node1 x:collection1] o.a.s.c.SolrDeletionPolicy SolrDeletionPolicy.onInit: commits: num=1
   [junit4]   2> 	commit{dir=MockDirectoryWrapper(RAMDirectory@15fdfc1 lockFactory=org.apache.lucene.store.SingleInstanceLockFactory@1c5a45a),segFN=segments_1,generation=1}
   [junit4]   2> 633691 INFO  (coreLoadExecutor-2301-thread-1-processing-n:127.0.0.1:41043__xz%2Fxv) [n:127.0.0.1:41043__xz%2Fxv c:control_collection s:shard1 r:core_node1 x:collection1] o.a.s.c.SolrDeletionPolicy newest commit generation = 1
   [junit4]   2> 633691 INFO  (coreLoadExecutor-2301-thread-1-processing-n:127.0.0.1:41043__xz%2Fxv) [n:127.0.0.1:41043__xz%2Fxv c:control_collection s:shard1 r:core_node1 x:collection1] o.a.s.s.SolrIndexSearcher Opening [Searcher@1bd860a[collection1] main]
   [junit4]   2> 633692 INFO  (coreLoadExecutor-2301-thread-1-processing-n:127.0.0.1:41043__xz%2Fxv) [n:127.0.0.1:41043__xz%2Fxv c:control_collection s:shard1 r:core_node1 x:collection1] o.a.s.c.c.ZkStateReader Load collection config from: [/collections/control_collection]
   [junit4]   2> 633692 INFO  (coreLoadExecutor-2301-thread-1-processing-n:127.0.0.1:41043__xz%2Fxv) [n:127.0.0.1:41043__xz%2Fxv c:control_collection s:shard1 r:core_node1 x:collection1] o.a.s.c.c.ZkStateReader path=[/collections/control_collection] [configName]=[conf1] specified config exists in ZooKeeper
   [junit4]   2> 633692 INFO  (coreLoadExecutor-2301-thread-1-processing-n:127.0.0.1:41043__xz%2Fxv) [n:127.0.0.1:41043__xz%2Fxv c:control_collection s:shard1 r:core_node1 x:collection1] o.a.s.r.ManagedResourceStorage Setting up ZooKeeper-based storage for the RestManager with znodeBase: /configs/conf1
   [junit4]   2> 633692 INFO  (coreLoadExecutor-2301-thread-1-processing-n:127.0.0.1:41043__xz%2Fxv) [n:127.0.0.1:41043__xz%2Fxv c:control_collection s:shard1 r:core_node1 x:collection1] o.a.s.r.ManagedResourceStorage Configured ZooKeeperStorageIO with znodeBase: /configs/conf1
   [junit4]   2> 633692 INFO  (coreLoadExecutor-2301-thread-1-processing-n:127.0.0.1:41043__xz%2Fxv) [n:127.0.0.1:41043__xz%2Fxv c:control_collection s:shard1 r:core_node1 x:collection1] o.a.s.r.RestManager Initializing RestManager with initArgs: {}
   [junit4]   2> 633693 INFO  (coreLoadExecutor-2301-thread-1-processing-n:127.0.0.1:41043__xz%2Fxv) [n:127.0.0.1:41043__xz%2Fxv c:control_collection s:shard1 r:core_node1 x:collection1] o.a.s.r.ManagedResourceStorage Reading _rest_managed.json using ZooKeeperStorageIO:path=/configs/conf1
   [junit4]   2> 633693 INFO  (coreLoadExecutor-2301-thread-1-processing-n:127.0.0.1:41043__xz%2Fxv) [n:127.0.0.1:41043__xz%2Fxv c:control_collection s:shard1 r:core_node1 x:collection1] o.a.s.r.ManagedResourceStorage No data found for znode /configs/conf1/_rest_managed.json
   [junit4]   2> 633693 INFO  (coreLoadExecutor-2301-thread-1-processing-n:127.0.0.1:41043__xz%2Fxv) [n:127.0.0.1:41043__xz%2Fxv c:control_collection s:shard1 r:core_node1 x:collection1] o.a.s.r.ManagedResourceStorage Loaded null at path _rest_managed.json using ZooKeeperStorageIO:path=/configs/conf1
   [junit4]   2> 633693 INFO  (coreLoadExecutor-2301-thread-1-processing-n:127.0.0.1:41043__xz%2Fxv) [n:127.0.0.1:41043__xz%2Fxv c:control_collection s:shard1 r:core_node1 x:collection1] o.a.s.r.RestManager Initializing 0 registered ManagedResources
   [junit4]   2> 633693 INFO  (coreLoadExecutor-2301-thread-1-processing-n:127.0.0.1:41043__xz%2Fxv) [n:127.0.0.1:41043__xz%2Fxv c:control_collection s:shard1 r:core_node1 x:collection1] o.a.s.h.ReplicationHandler Commits will be reserved for  10000
   [junit4]   2> 633695 INFO  (searcherExecutor-2302-thread-1-processing-n:127.0.0.1:41043__xz%2Fxv x:collection1 s:shard1 c:control_collection r:core_node1) [n:127.0.0.1:41043__xz%2Fxv c:control_collection s:shard1 r:core_node1 x:collection1] o.a.s.c.SolrCore [collection1] Registered new searcher Searcher@1bd860a[collection1] main{ExitableDirectoryReader(UninvertingDirectoryReader())}
   [junit4]   2> 633695 INFO  (coreLoadExecutor-2301-thread-1-processing-n:127.0.0.1:41043__xz%2Fxv) [n:127.0.0.1:41043__xz%2Fxv c:control_collection s:shard1 r:core_node1 x:collection1] o.a.s.u.UpdateLog Looking up max value of version field to seed version buckets
   [junit4]   2> 633695 INFO  (coreLoadExecutor-2301-thread-1-processing-n:127.0.0.1:41043__xz%2Fxv) [n:127.0.0.1:41043__xz%2Fxv c:control_collection s:shard1 r:core_node1 x:collection1] o.a.s.u.VersionInfo Refreshing highest value of _version_ for 65536 version buckets from index
   [junit4]   2> 633695 INFO  (coreLoadExecutor-2301-thread-1-processing-n:127.0.0.1:41043__xz%2Fxv) [n:127.0.0.1:41043__xz%2Fxv c:control_collection s:shard1 r:core_node1 x:collection1] o.a.s.u.VersionInfo No terms found for _version_, cannot seed version bucket highest value from index
   [junit4]   2> 633695 INFO  (coreLoadExecutor-2301-thread-1-processing-n:127.0.0.1:41043__xz%2Fxv) [n:127.0.0.1:41043__xz%2Fxv c:control_collection s:shard1 r:core_node1 x:collection1] o.a.s.u.UpdateLog Could not find max version in index or recent updates, using new clock 1529416391114883072
   [junit4]   2> 633696 INFO  (coreLoadExecutor-2301-thread-1-processing-n:127.0.0.1:41043__xz%2Fxv) [n:127.0.0.1:41043__xz%2Fxv c:control_collection s:shard1 r:core_node1 x:collection1] o.a.s.u.UpdateLog Took 1.0ms to seed version buckets with highest version 1529416391114883072
   [junit4]   2> 633697 INFO  (coreLoadExecutor-2301-thread-1-processing-n:127.0.0.1:41043__xz%2Fxv) [n:127.0.0.1:41043__xz%2Fxv c:control_collection s:shard1 r:core_node1 x:collection1] o.a.s.c.ZkController watch zkdir /configs/conf1
   [junit4]   2> 633697 INFO  (coreLoadExecutor-2301-thread-1-processing-n:127.0.0.1:41043__xz%2Fxv) [n:127.0.0.1:41043__xz%2Fxv c:control_collection s:shard1 r:core_node1 x:collection1] o.a.s.c.CoreContainer registering core: collection1
   [junit4]   2> 633697 INFO  (coreZkRegister-2295-thread-1-processing-n:127.0.0.1:41043__xz%2Fxv x:collection1 s:shard1 c:control_collection r:core_node1) [n:127.0.0.1:41043__xz%2Fxv c:control_collection s:shard1 r:core_node1 x:collection1] o.a.s.c.ZkController Register replica - core:collection1 address:http://127.0.0.1:41043/_xz/xv collection:control_collection shard:shard1
   [junit4]   2> 633698 INFO  (coreZkRegister-2295-thread-1-processing-n:127.0.0.1:41043__xz%2Fxv x:collection1 s:shard1 c:control_collection r:core_node1) [n:127.0.0.1:41043__xz%2Fxv c:control_collection s:shard1 r:core_node1 x:collection1] o.a.s.c.c.SolrZkClient makePath: /collections/control_collection/leader_elect/shard1/election
   [junit4]   2> 633700 INFO  (coreZkRegister-2295-thread-1-processing-n:127.0.0.1:41043__xz%2Fxv x:collection1 s:shard1 c:control_collection r:core_node1) [n:127.0.0.1:41043__xz%2Fxv c:control_collection s:shard1 r:core_node1 x:collection1] o.a.s.c.LeaderElector Joined leadership election with path: /collections/control_collection/leader_elect/shard1/election/95588524344737796-core_node1-n_0000000000
   [junit4]   2> 633700 INFO  (coreZkRegister-2295-thread-1-processing-n:127.0.0.1:41043__xz%2Fxv x:collection1 s:shard1 c:control_collection r:core_node1) [n:127.0.0.1:41043__xz%2Fxv c:control_collection s:shard1 r:core_node1 x:collection1] o.a.s.c.ShardLeaderElectionContext Running the leader process for shard=shard1 and weAreReplacement=false and leaderVoteWait=180000
   [junit4]   2> 633701 INFO  (coreZkRegister-2295-thread-1-processing-n:127.0.0.1:41043__xz%2Fxv x:collection1 s:shard1 c:control_collection r:core_node1) [n:127.0.0.1:41043__xz%2Fxv c:control_collection s:shard1 r:core_node1 x:collection1] o.a.s.c.ShardLeaderElectionContext Enough replicas found to continue.
   [junit4]   2> 633701 INFO  (coreZkRegister-2295-thread-1-processing-n:127.0.0.1:41043__xz%2Fxv x:collection1 s:shard1 c:control_collection r:core_node1) [n:127.0.0.1:41043__xz%2Fxv c:control_collection s:shard1 r:core_node1 x:collection1] o.a.s.c.ShardLeaderElectionContext I may be the new leader - try and sync
   [junit4]   2> 633701 INFO  (coreZkRegister-2295-thread-1-processing-n:127.0.0.1:41043__xz%2Fxv x:collection1 s:shard1 c:control_collection r:core_node1) [n:127.0.0.1:41043__xz%2Fxv c:control_collection s:shard1 r:core_node1 x:collection1] o.a.s.c.SyncStrategy Sync replicas to http://127.0.0.1:41043/_xz/xv/collection1/
   [junit4]   2> 633701 INFO  (OverseerStateUpdate-95588524344737796-127.0.0.1:41043__xz%2Fxv-n_0000000000) [n:127.0.0.1:41043__xz%2Fxv    ] o.a.s.c.Overseer processMessage: queueSize: 1, message = {
   [junit4]   2>   "operation":"leader",
   [junit4]   2>   "shard":"shard1",
   [junit4]   2>   "collection":"control_collection"} current state version: 1
   [junit4]   2> 633701 INFO  (coreZkRegister-2295-thread-1-processing-n:127.0.0.1:41043__xz%2Fxv x:collection1 s:shard1 c:control_collection r:core_node1) [n:127.0.0.1:41043__xz%2Fxv c:control_collection s:shard1 r:core_node1 x:collection1] o.a.s.c.SyncStrategy Sync Success - now sync replicas to me
   [junit4]   2> 633701 INFO  (coreZkRegister-2295-thread-1-processing-n:127.0.0.1:41043__xz%2Fxv x:collection1 s:shard1 c:control_collection r:core_node1) [n:127.0.0.1:41043__xz%2Fxv c:control_collection s:shard1 r:core_node1 x:collection1] o.a.s.c.SyncStrategy http://127.0.0.1:41043/_xz/xv/collection1/ has no replicas
   [junit4]   2> 633702 INFO  (coreZkRegister-2295-thread-1-processing-n:127.0.0.1:41043__xz%2Fxv x:collection1 s:shard1 c:control_collection r:core_node1) [n:127.0.0.1:41043__xz%2Fxv c:control_collection s:shard1 r:core_node1 x:collection1] o.a.s.c.c.SolrZkClient makePath: /collections/control_collection/leaders/shard1
   [junit4]   2> 633704 INFO  (coreZkRegister-2295-thread-1-processing-n:127.0.0.1:41043__xz%2Fxv x:collection1 s:shard1 c:control_collection r:core_node1) [n:127.0.0.1:41043__xz%2Fxv c:control_collection s:shard1 r:core_node1 x:collection1] o.a.s.c.ShardLeaderElectionContextBase Creating leader registration node /collections/control_collection/leaders/shard1/leader after winning as /collections/control_collection/leader_elect/shard1/election/95588524344737796-core_node1-n_0000000000
   [junit4]   2> 633705 INFO  (coreZkRegister-2295-thread-1-processing-n:127.0.0.1:41043__xz%2Fxv x:collection1 s:shard1 c:control_collection r:core_node1) [n:127.0.0.1:41043__xz%2Fxv c:control_collection s:shard1 r:core_node1 x:collection1] o.a.s.c.ShardLeaderElectionContext I am the new leader: http://127.0.0.1:41043/_xz/xv/collection1/ shard1
   [junit4]   2> 633706 INFO  (OverseerStateUpdate-95588524344737796-127.0.0.1:41043__xz%2Fxv-n_0000000000) [n:127.0.0.1:41043__xz%2Fxv    ] o.a.s.c.Overseer processMessage: queueSize: 1, message = {
   [junit4]   2>   "operation":"leader",
   [junit4]   2>   "shard":"shard1",
   [junit4]   2>   "collection":"control_collection",
   [junit4]   2>   "base_url":"http://127.0.0.1:41043/_xz/xv",
   [junit4]   2>   "core":"collection1",
   [junit4]   2>   "state":"active"} current state version: 1
   [junit4]   2> 633808 INFO  (zkCallback-692-thread-1-processing-n:127.0.0.1:41043__xz%2Fxv) [n:127.0.0.1:41043__xz%2Fxv    ] o.a.s.c.c.ZkStateReader A cluster state change: [WatchedEvent state:SyncConnected type:NodeDataChanged path:/clusterstate.json], has occurred - updating... (live nodes size: [1])
   [junit4]   2> 633856 INFO  (coreZkRegister-2295-thread-1-processing-n:127.0.0.1:41043__xz%2Fxv x:collection1 s:shard1 c:control_collection r:core_node1) [n:127.0.0.1:41043__xz%2Fxv c:control_collection s:shard1 r:core_node1 x:collection1] o.a.s.c.ZkController We are http://127.0.0.1:41043/_xz/xv/collection1/ and leader is http://127.0.0.1:41043/_xz/xv/collection1/
   [junit4]   2> 633856 INFO  (coreZkRegister-2295-thread-1-processing-n:127.0.0.1:41043__xz%2Fxv x:collection1 s:shard1 c:control_collection r:core_node1) [n:127.0.0.1:41043__xz%2Fxv c:control_collection s:shard1 r:core_node1 x:collection1] o.a.s.c.ZkController No LogReplay needed for core=collection1 baseURL=http://127.0.0.1:41043/_xz/xv
   [junit4]   2> 633856 INFO  (coreZkRegister-2295-thread-1-processing-n:127.0.0.1:41043__xz%2Fxv x:collection1 s:shard1 c:control_collection r:core_node1) [n:127.0.0.1:41043__xz%2Fxv c:control_collection s:shard1 r:core_node1 x:collection1] o.a.s.c.ZkController I am the leader, no recovery necessary
   [junit4]   2> 633856 INFO  (coreZkRegister-2295-thread-1-processing-n:127.0.0.1:41043__xz%2Fxv x:collection1 s:shard1 c:control_collection r:core_node1) [n:127.0.0.1:41043__xz%2Fxv c:control_collection s:shard1 r:core_node1 x:collection1] o.a.s.c.ZkController publishing state=active
   [junit4]   2> 633856 INFO  (coreZkRegister-2295-thread-1-processing-n:127.0.0.1:41043__xz%2Fxv x:collection1 s:shard1 c:control_collection r:core_node1) [n:127.0.0.1:41043__xz%2Fxv c:control_collection s:shard1 r:core_node1 x:collection1] o.a.s.c.ZkController numShards not found on descriptor - reading it from system property
   [junit4]   2> 633858 INFO  (OverseerStateUpdate-95588524344737796-127.0.0.1:41043__xz%2Fxv-n_0000000000) [n:127.0.0.1:41043__xz%2Fxv    ] o.a.s.c.Overseer processMessage: queueSize: 1, message = {
   [junit4]   2>   "core":"collection1",
   [junit4]   2>   "core_node_name":"core_node1",
   [junit4]   2>   "roles":null,
   [junit4]   2>   "base_url":"http://127.0.0.1:41043/_xz/xv",
   [junit4]   2>   "node_name":"127.0.0.1:41043__xz%2Fxv",
   [junit4]   2>   "numShards":"1",
   [junit4]   2>   "state":"active",
   [junit4]   2>   "shard":"shard1",
   [junit4]   2>   "collection":"control_collection",
   [junit4]   2>   "operation":"state"} current state version: 2
   [junit4]   2> 633858 INFO  (OverseerStateUpdate-95588524344737796-127.0.0.1:41043__xz%2Fxv-n_0000000000) [n:127.0.0.1:41043__xz%2Fxv    ] o.a.s.c.o.ReplicaMutator Update state numShards=1 message={
   [junit4]   2>   "core":"collection1",
   [junit4]   2>   "core_node_name":"core_node1",
   [junit4]   2>   "roles":null,
   [junit4]   2>   "base_url":"http://127.0.0.1:41043/_xz/xv",
   [junit4]   2>   "node_name":"127.0.0.1:41043__xz%2Fxv",
   [junit4]   2>   "numShards":"1",
   [junit4]   2>   "state":"active",
   [junit4]   2>   "shard":"shard1",
   [junit4]   2>   "collection":"control_collection",
   [junit4]   2>   "operation":"state"}
   [junit4]   2> 633960 INFO  (zkCallback-692-thread-1-processing-n:127.0.0.1:41043__xz%2Fxv) [n:127.0.0.1:41043__xz%2Fxv    ] o.a.s.c.c.ZkStateReader A cluster state change: [WatchedEvent state:SyncConnected type:NodeDataChanged path:/clusterstate.json], has occurred - updating... (live nodes size: [1])
   [junit4]   2> 634034 INFO  (TEST-UnloadDistributedZkTest.test-seed#[8F8FE54A34F992D8]) [    ] o.a.s.c.c.SolrZkClient Using default ZkCredentialsProvider
   [junit4]   2> 634034 INFO  (TEST-UnloadDistributedZkTest.test-seed#[8F8FE54A34F992D8]) [    ] o.a.s.c.c.ConnectionManager Waiting for client to connect to ZooKeeper
   [junit4]   2> 634035 INFO  (zkCallback-694-thread-1) [    ] o.a.s.c.c.ConnectionManager Watcher org.apache.solr.common.cloud.ConnectionManager@3872f5 name:ZooKeeperConnection Watcher:127.0.0.1:37429/solr got event WatchedEvent state:SyncConnected type:None path:null path:null type:None
   [junit4]   2> 634035 INFO  (TEST-UnloadDistributedZkTest.test-seed#[8F8FE54A34F992D8]) [    ] o.a.s.c.c.ConnectionManager Client is connected to ZooKeeper
   [junit4]   2> 634036 INFO  (TEST-UnloadDistributedZkTest.test-seed#[8F8FE54A34F992D8]) [    ] o.a.s.c.c.SolrZkClient Using default ZkACLProvider
   [junit4]   2> 634036 INFO  (TEST-UnloadDistributedZkTest.test-seed#[8F8FE54A34F992D8]) [    ] o.a.s.c.c.ZkStateReader Updating cluster state from ZooKeeper... 
   [junit4]   2> 634037 INFO  (TEST-UnloadDistributedZkTest.test-seed#[8F8FE54A34F992D8]) [    ] o.a.s.c.c.ZkStateReader Updated live nodes from ZooKeeper... (0) -> (1)
   [junit4]   2> 634037 INFO  (TEST-UnloadDistributedZkTest.test-seed#[8F8FE54A34F992D8]) [    ] o.a.s.c.ChaosMonkey monkey: init - expire sessions:false cause connection loss:false
   [junit4]   2> 634112 INFO  (TEST-UnloadDistributedZkTest.test-seed#[8F8FE54A34F992D8]) [    ] o.a.s.SolrTestCaseJ4 Writing core.properties file to /home/jenkins/workspace/Lucene-Solr-6.x-Linux/solr/build/solr-core/test/J2/temp/solr.cloud.UnloadDistributedZkTest_8F8FE54A34F992D8-001/shard-1-001/cores/collection1
   [junit4]   2> 634112 INFO  (TEST-UnloadDistributedZkTest.test-seed#[8F8FE54A34F992D8]) [    ] o.a.s.c.AbstractFullDistribZkTestBase create jetty 1 in directory /home/jenkins/workspace/Lucene-Solr-6.x-Linux/solr/build/solr-core/test/J2/temp/solr.cloud.UnloadDistributedZkTest_8F8FE54A34F992D8-001/shard-1-001
   [junit4]   2> 634113 INFO  (TEST-UnloadDistributedZkTest.test-seed#[8F8FE54A34F992D8]) [    ] o.e.j.s.Server jetty-9.3.8.v20160314
   [junit4]   2> 634114 INFO  (TEST-UnloadDistributedZkTest.test-seed#[8F8FE54A34F992D8]) [    ] o.e.j.s.h.ContextHandler Started o.e.j.s.ServletContextHandler@19daffb{/_xz/xv,null,AVAILABLE}
   [junit4]   2> 634115 INFO  (TEST-UnloadDistributedZkTest.test-seed#[8F8FE54A34F992D8]) [    ] o.e.j.s.ServerConnector Started ServerConnector@b862e9{HTTP/1.1,[http/1.1]}{127.0.0.1:37508}
   [junit4]   2> 634115 INFO  (TEST-UnloadDistributedZkTest.test-seed#[8F8FE54A34F992D8]) [    ] o.e.j.s.Server Started @635693ms
   [junit4]   2> 634115 INFO  (TEST-UnloadDistributedZkTest.test-seed#[8F8FE54A34F992D8]) [    ] o.a.s.c.s.e.JettySolrRunner Jetty properties: {solr.data.dir=/home/jenkins/workspace/Lucene-Solr-6.x-Linux/solr/build/solr-core/test/J2/temp/solr.cloud.UnloadDistributedZkTest_8F8FE54A34F992D8-001/tempDir-001/jetty1, solrconfig=solrconfig.xml, hostContext=/_xz/xv, hostPort=37508, coreRootDirectory=/home/jenkins/workspace/Lucene-Solr-6.x-Linux/solr/build/solr-core/test/J2/temp/solr.cloud.UnloadDistributedZkTest_8F8FE54A34F992D8-001/shard-1-001/cores}
   [junit4]   2> 634115 INFO  (TEST-UnloadDistributedZkTest.test-seed#[8F8FE54A34F992D8]) [    ] o.a.s.s.SolrDispatchFilter SolrDispatchFilter.init(): sun.misc.Launcher$AppClassLoader@1d16e93
   [junit4]   2> 634115 INFO  (TEST-UnloadDistributedZkTest.test-seed#[8F8FE54A34F992D8]) [    ] o.a.s.c.SolrResourceLoader new SolrResourceLoader for directory: '/home/jenkins/workspace/Lucene-Solr-6.x-Linux/solr/build/solr-core/test/J2/temp/solr.cloud.UnloadDistributedZkTest_8F8FE54A34F992D8-001/shard-1-001'
   [junit4]   2> 634116 INFO  (TEST-UnloadDistributedZkTest.test-seed#[8F8FE54A34F992D8]) [    ] o.a.s.c.SolrResourceLoader JNDI not configured for solr (NoInitialContextEx)
   [junit4]   2> 634116 INFO  (TEST-UnloadDistributedZkTest.test-seed#[8F8FE54A34F992D8]) [    ] o.a.s.c.SolrResourceLoader solr home defaulted to 'solr/' (could not find system property or JNDI)
   [junit4]   2> 634116 INFO  (TEST-UnloadDistributedZkTest.test-seed#[8F8FE54A34F992D8]) [    ] o.a.s.c.c.SolrZkClient Using default ZkCredentialsProvider
   [junit4]   2> 634116 INFO  (TEST-UnloadDistributedZkTest.test-seed#[8F8FE54A34F992D8]) [    ] o.a.s.c.c.ConnectionManager Waiting for client to connect to ZooKeeper
   [junit4]   2> 634117 INFO  (zkCallback-695-thread-1) [    ] o.a.s.c.c.ConnectionManager Watcher org.apache.solr.common.cloud.ConnectionManager@13aabc1 name:ZooKeeperConnection Watcher:127.0.0.1:37429/solr got event WatchedEvent state:SyncConnected type:None path:null path:null type:None
   [junit4]   2> 634117 INFO  (TEST-UnloadDistributedZkTest.test-seed#[8F8FE54A34F992D8]) [    ] o.a.s.c.c.ConnectionManager Client is connected to ZooKeeper
   [junit4]   2> 634118 INFO  (TEST-UnloadDistributedZkTest.test-seed#[8F8FE54A34F992D8]) [    ] o.a.s.c.c.SolrZkClient Using default ZkACLProvider
   [junit4]   2> 634119 INFO  (TEST-UnloadDistributedZkTest.test-seed#[8F8FE54A34F992D8]) [    ] o.a.s.s.SolrDispatchFilter Loading solr.xml from SolrHome (not found in ZooKeeper)
   [junit4]   2> 634119 INFO  (TEST-UnloadDistributedZkTest.test-seed#[8F8FE54A34F992D8]) [    ] o.a.s.c.SolrXmlConfig Loading container configuration from /home/jenkins/workspace/Lucene-Solr-6.x-Linux/solr/build/solr-core/test/J2/temp/solr.cloud.UnloadDistributedZkTest_8F8FE54A34F992D8-001/shard-1-001/solr.xml
   [junit4]   2> 634124 INFO  (TEST-UnloadDistributedZkTest.test-seed#[8F8FE54A34F992D8]) [    ] o.a.s.c.CorePropertiesLocator Config-defined core root directory: /home/jenkins/workspace/Lucene-Solr-6.x-Linux/solr/build/solr-core/test/J2/temp/solr.cloud.UnloadDistributedZkTest_8F8FE54A34F992D8-001/shard-1-001/cores
   [junit4]   2> 634124 INFO  (TEST-UnloadDistributedZkTest.test-seed#[8F8FE54A34F992D8]) [    ] o.a.s.c.CoreContainer New CoreContainer 27982335
   [junit4]   2> 634124 INFO  (TEST-UnloadDistributedZkTest.test-seed#[8F8FE54A34F992D8]) [    ] o.a.s.c.CoreContainer Loading cores into CoreContainer [instanceDir=/home/jenkins/workspace/Lucene-Solr-6.x-Linux/solr/build/solr-core/test/J2/temp/solr.cloud.UnloadDistributedZkTest_8F8FE54A34F992D8-001/shard-1-001]
   [junit4]   2> 634124 WARN  (TEST-UnloadDistributedZkTest.test-seed#[8F8FE54A34F992D8]) [    ] o.a.s.c.CoreContainer Couldn't add files from /home/jenkins/workspace/Lucene-Solr-6.x-Linux/solr/build/solr-core/test/J2/temp/solr.cloud.UnloadDistributedZkTest_8F8FE54A34F992D8-001/shard-1-001/lib to classpath: /home/jenkins/workspace/Lucene-Solr-6.x-Linux/solr/build/solr-core/test/J2/temp/solr.cloud.UnloadDistributedZkTest_8F8FE54A34F992D8-001/shard-1-001/lib
   [junit4]   2> 634124 INFO  (TEST-UnloadDistributedZkTest.test-seed#[8F8FE54A34F992D8]) [    ] o.a.s.h.c.HttpShardHandlerFactory created with socketTimeout : 90000,urlScheme : ,connTimeout : 15000,maxConnectionsPerHost : 20,maxConnections : 10000,corePoolSize : 0,maximumPoolSize : 2147483647,maxThreadIdleTime : 5,sizeOfQueue : -1,fairnessPolicy : false,useRetries : false,
   [junit4]   2> 634126 INFO  (TEST-UnloadDistributedZkTest.test-seed#[8F8FE54A34F992D8]) [    ] o.a.s.u.UpdateShardHandler Creating UpdateShardHandler HTTP client with params: socketTimeout=340000&connTimeout=45000&retry=true
   [junit4]   2> 634127 INFO  (TEST-UnloadDistributedZkTest.test-seed#[8F8FE54A34F992D8]) [    ] o.a.s.l.LogWatcher SLF4J impl is org.slf4j.impl.Log4jLoggerFactory
   [junit4]   2> 634127 INFO  (TEST-UnloadDistributedZkTest.test-seed#[8F8FE54A34F992D8]) [    ] o.a.s.l.LogWatcher Registering Log Listener [Log4j (org.slf4j.impl.Log4jLoggerFactory)]
   [junit4]   2> 634127 INFO  (TEST-UnloadDistributedZkTest.test-seed#[8F8FE54A34F992D8]) [    ] o.a.s.c.ZkContainer Zookeeper client=127.0.0.1:37429/solr
   [junit4]   2> 634127 INFO  (TEST-UnloadDistributedZkTest.test-seed#[8F8FE54A34F992D8]) [    ] o.a.s.c.ZkController zkHost includes chroot
   [junit4]   2> 634127 INFO  (TEST-UnloadDistributedZkTest.test-seed#[8F8FE54A34F992D8]) [    ] o.a.s.c.c.SolrZkClient Using default ZkCredentialsProvider
   [junit4]   2> 634128 INFO  (TEST-UnloadDistributedZkTest.test-seed#[8F8FE54A34F992D8]) [    ] o.a.s.c.c.ConnectionManager Waiting for client to connect to ZooKeeper
   [junit4]   2> 634129 INFO  (zkCallback-698-thread-1) [    ] o.a.s.c.c.ConnectionManager Watcher org.apache.solr.common.cloud.ConnectionManager@139e9d name:ZooKeeperConnection Watcher:127.0.0.1:37429 got event WatchedEvent state:SyncConnected type:None path:null path:null type:None
   [junit4]   2> 634129 INFO  (TEST-UnloadDistributedZkTest.test-seed#[8F8FE54A34F992D8]) [    ] o.a.s.c.c.ConnectionManager Client is connected to ZooKeeper
   [junit4]   2> 634130 INFO  (TEST-UnloadDistributedZkTest.test-seed#[8F8FE54A34F992D8]) [    ] o.a.s.c.c.SolrZkClient Using default ZkACLProvider
   [junit4]   2> 634131 INFO  (TEST-UnloadDistributedZkTest.test-seed#[8F8FE54A34F992D8]) [n:127.0.0.1:37508__xz%2Fxv    ] o.a.s.c.c.ConnectionManager Waiting for client to connect to ZooKeeper
   [junit4]   2> 634132 INFO  (zkCallback-699-thread-1-processing-n:127.0.0.1:37508__xz%2Fxv) [n:127.0.0.1:37508__xz%2Fxv    ] o.a.s.c.c.ConnectionManager Watcher org.apache.solr.common.cloud.ConnectionManager@1a1130e name:ZooKeeperConnection Watcher:127.0.0.1:37429/solr got event WatchedEvent state:SyncConnected type:None path:null path:null type:None
   [junit4]   2> 634132 INFO  (TEST-UnloadDistributedZkTest.test-seed#[8F8FE54A34F992D8]) [n:127.0.0.1:37508__xz%2Fxv    ] o.a.s.c.c.ConnectionManager Client is connected to ZooKeeper
   [junit4]   2> 634137 INFO  (TEST-UnloadDistributedZkTest.test-seed#[8F8FE54A34F992D8]) [n:127.0.0.1:37508__xz%2Fxv    ] o.a.s.c.c.ZkStateReader Updating cluster state from ZooKeeper... 
   [junit4]   2> 634138 INFO  (TEST-UnloadDistributedZkTest.test-seed#[8F8FE54A34F992D8]) [n:127.0.0.1:37508__xz%2Fxv    ] o.a.s.c.c.ZkStateReader Updated live nodes from ZooKeeper... (0) -> (1)
   [junit4]   2> 634144 INFO  (TEST-UnloadDistributedZkTest.test-seed#[8F8FE54A34F992D8]) [n:127.0.0.1:37508__xz%2Fxv    ] o.a.s.c.Overseer Overseer (id=null) closing
   [junit4]   2> 634144 INFO  (TEST-UnloadDistributedZkTest.test-seed#[8F8FE54A34F992D8]) [n:127.0.0.1:37508__xz%2Fxv    ] o.a.s.c.LeaderElector Joined leadership election with path: /overseer_elect/election/95588524344737800-127.0.0.1:37508__xz%2Fxv-n_0000000001
   [junit4]   2> 634145 INFO  (TEST-UnloadDistributedZkTest.test-seed#[8F8FE54A34F992D8]) [n:127.0.0.1:37508__xz%2Fxv    ] o.a.s.c.LeaderElector Watching path /overseer_elect/election/95588524344737796-127.0.0.1:41043__xz%2Fxv-n_0000000000 to know if I could be the leader
   [junit4]   2> 634145 INFO  (TEST-UnloadDistributedZkTest.test-seed#[8F8FE54A34F992D8]) [n:127.0.0.1:37508__xz%2Fxv    ] o.a.s.c.ZkController Publish node=127.0.0.1:37508__xz%2Fxv as DOWN
   [junit4]   2> 634147 INFO  (OverseerStateUpdate-95588524344737796-127.0.0.1:41043__xz%2Fxv-n_0000000000) [n:127.0.0.1:41043__xz%2Fxv    ] o.a.s.c.Overseer processMessage: queueSize: 1, message = {
   [junit4]   2>   "operation":"downnode",
   [junit4]   2>   "node_name":"127.0.0.1:37508__xz%2Fxv"} current state version: 3
   [junit4]   2> 634147 INFO  (OverseerStateUpdate-95588524344737796-127.0.0.1:41043__xz%2Fxv-n_0000000000) [n:127.0.0.1:41043__xz%2Fxv    ] o.a.s.c.o.NodeMutator DownNode state invoked for node: 127.0.0.1:37508__xz%2Fxv
   [junit4]   2> 634249 INFO  (zkCallback-694-thread-1) [    ] o.a.s.c.c.ZkStateReader A cluster state change: [WatchedEvent state:SyncConnected type:NodeDataChanged path:/clusterstate.json], has occurred - updating... (live nodes size: [1])
   [junit4]   2> 634249 INFO  (zkCallback-699-thread-1-processing-n:127.0.0.1:37508__xz%2Fxv) [n:127.0.0.1:37508__xz%2Fxv    ] o.a.s.c.c.ZkStateReader A cluster state change: [WatchedEvent state:SyncConnected type:NodeDataChanged path:/clusterstate.json], has occurred - updating... (live nodes size: [1])
   [junit4]   2> 634249 INFO  (zkCallback-692-thread-1-processing-n:127.0.0.1:41043__xz%2Fxv) [n:127.0.0.1:41043__xz%2Fxv    ] o.a.s.c.c.ZkStateReader A cluster state change: [WatchedEvent state:SyncConnected type:NodeDataChanged path:/clusterstate.json], has occurred - updating... (live nodes size: [1])
   [junit4]   2> 635147 INFO  (TEST-UnloadDistributedZkTest.test-seed#[8F8FE54A34F992D8]) [n:127.0.0.1:37508__xz%2Fxv    ] o.a.s.c.ZkController Register node as live in ZooKeeper:/live_nodes/127.0.0.1:37508__xz%2Fxv
   [junit4]   2> 635156 INFO  (TEST-UnloadDistributedZkTest.test-seed#[8F8FE54A34F992D8]) [n:127.0.0.1:37508__xz%2Fxv    ] o.a.s.c.c.SolrZkClient makePath: /live_nodes/127.0.0.1:37508__xz%2Fxv
   [junit4]   2> 635157 INFO  (zkCallback-694-thread-1) [    ] o.a.s.c.c.ZkStateReader A live node change: [WatchedEvent state:SyncConnected type:NodeChildrenChanged path:/live_nodes], has occurred - updating... (live nodes size: [1])
   [junit4]   2> 635157 INFO  (zkCallback-692-thread-1-processing-n:127.0.0.1:41043__xz%2Fxv) [n:127.0.0.1:41043__xz%2Fxv    ] o.a.s.c.c.ZkStateReader A live node change: [WatchedEvent state:SyncConnected type:NodeChildrenChanged path:/live_nodes], has occurred - updating... (live nodes size: [1])
   [junit4]   2> 635157 INFO  (zkCallback-699-thread-1-processing-n:127.0.0.1:37508__xz%2Fxv) [n:127.0.0.1:37508__xz%2Fxv    ] o.a.s.c.c.ZkStateReader A live node change: [WatchedEvent state:SyncConnected type:NodeChildrenChanged path:/live_nodes], has occurred - updating... (live nodes size: [1])
   [junit4]   2> 635157 INFO  (zkCallback-694-thread-1) [    ] o.a.s.c.c.ZkStateReader Updated live nodes from ZooKeeper... (1) -> (2)
   [junit4]   2> 635158 INFO  (zkCallback-699-thread-1-processing-n:127.0.0.1:37508__xz%2Fxv) [n:127.0.0.1:37508__xz%2Fxv    ] o.a.s.c.c.ZkStateReader Updated live nodes from ZooKeeper... (1) -> (2)
   [junit4]   2> 635158 INFO  (zkCallback-692-thread-1-processing-n:127.0.0.1:41043__xz%2Fxv) [n:127.0.0.1:41043__xz%2Fxv    ] o.a.s.c.c.ZkStateReader Updated live nodes from ZooKeeper... (1) -> (2)
   [junit4]   2> 635176 INFO  (TEST-UnloadDistributedZkTest.test-seed#[8F8FE54A34F992D8]) [n:127.0.0.1:37508__xz%2Fxv    ] o.a.s.c.CoreContainer Security conf doesn't exist. Skipping setup for authorization module.
   [junit4]   2> 635176 INFO  (TEST-UnloadDistributedZkTest.test-seed#[8F8FE54A34F992D8]) [n:127.0.0.1:37508__xz%2Fxv    ] o.a.s.c.CoreContainer No authentication plugin used.
   [junit4]   2> 635177 INFO  (TEST-UnloadDistributedZkTest.test-seed#[8F8FE54A34F992D8]) [n:127.0.0.1:37508__xz%2Fxv    ] o.a.s.c.CorePropertiesLocator Looking for core definitions underneath /home/jenkins/workspace/Lucene-Solr-6.x-Linux/solr/build/solr-core/test/J2/temp/solr.cloud.UnloadDistributedZkTest_8F8FE54A34F992D8-001/shard-1-001/cores
   [junit4]   2> 635177 INFO  (TEST-UnloadDistributedZkTest.test-seed#[8F8FE54A34F992D8]) [n:127.0.0.1:37508__xz%2Fxv    ] o.a.s.c.CoreDescriptor Created CoreDescriptor: {name=collection1, config=solrconfig.xml, transient=false, schema=schema.xml, loadOnStartup=true, configSetProperties=configsetprops.json, collection=collection1, coreNodeName=, dataDir=data/, shard=}
   [junit4]   2> 635177 INFO  (TEST-UnloadDistributedZkTest.test-seed#[8F8FE54A34F992D8]) [n:127.0.0.1:37508__xz%2Fxv    ] o.a.s.c.CorePropertiesLocator Found core collection1 in /home/jenkins/workspace/Lucene-Solr-6.x-Linux/solr/build/solr-core/test/J2/temp/solr.cloud.UnloadDistributedZkTest_8F8FE54A34F992D8-001/shard-1-001/cores/collection1
   [junit4]   2> 635178 INFO  (TEST-UnloadDistributedZkTest.test-seed#[8F8FE54A34F992D8]) [n:127.0.0.1:37508__xz%2Fxv    ] o.a.s.c.CorePropertiesLocator Found 1 core definitions
   [junit4]   2> 635179 INFO  (TEST-UnloadDistributedZkTest.test-seed#[8F8FE54A34F992D8]) [n:127.0.0.1:37508__xz%2Fxv    ] o.a.s.s.SolrDispatchFilter user.dir=/home/jenkins/workspace/Lucene-Solr-6.x-Linux/solr/build/solr-core/test/J2
   [junit4]   2> 635179 INFO  (TEST-UnloadDistributedZkTest.test-seed#[8F8FE54A34F992D8]) [n:127.0.0.1:37508__xz%2Fxv    ] o.a.s.s.SolrDispatchFilter SolrDispatchFilter.init() done
   [junit4]   2> 635179 INFO  (coreLoadExecutor-2312-thread-1-processing-n:127.0.0.1:37508__xz%2Fxv) [n:127.0.0.1:37508__xz%2Fxv c:collection1   x:collection1] o.a.s.c.ZkController publishing state=down
   [junit4]   2> 635179 INFO  (coreLoadExecutor-2312-thread-1-processing-n:127.0.0.1:37508__xz%2Fxv) [n:127.0.0.1:37508__xz%2Fxv c:collection1   x:collection1] o.a.s.c.ZkController numShards not found on descriptor - reading it from system property
   [junit4]   2> 635181 INFO  (OverseerStateUpdate-95588524344737796-127.0.0.1:41043__xz%2Fxv-n_0000000000) [n:127.0.0.1:41043__xz%2Fxv    ] o.a.s.c.Overseer processMessage: queueSize: 1, message = {
   [junit4]   2>   "core":"collection1",
   [junit4]   2>   "roles":null,
   [junit4]   2>   "base_url":"http://127.0.0.1:37508/_xz/xv",
   [junit4]   2>   "node_name":"127.0.0.1:37508__xz%2Fxv",
   [junit4]   2>   "numShards":"2",
   [junit4]   2>   "state":"down",
   [junit4]   2>   "shard":null,
   [junit4]   2>   "collection":"collection1",
   [junit4]   2>   "operation":"state"} current state version: 4
   [junit4]   2> 635181 INFO  (coreLoadExecutor-2312-thread-1-processing-n:127.0.0.1:37508__xz%2Fxv) [n:127.0.0.1:37508__xz%2Fxv c:collection1   x:collection1] o.a.s.c.ZkController look for our core node name
   [junit4]   2> 635181 INFO  (OverseerStateUpdate-95588524344737796-127.0.0.1:41043__xz%2Fxv-n_0000000000) [n:127.0.0.1:41043__xz%2Fxv    ] o.a.s.c.o.ReplicaMutator Update state numShards=2 message={
   [junit4]   2>   "core":"collection1",
   [junit4]   2>   "roles":null,
   [junit4]   2>   "base_url":"http://127.0.0.1:37508/_xz/xv",
   [junit4]   2>   "node_name":"127.0.0.1:37508__xz%2Fxv",
   [junit4]   2>   "numShards":"2",
   [junit4]   2>   "state":"down",
   [junit4]   2>   "shard":null,
   [junit4]   2>   "collection":"collection1",
   [junit4]   2>   "operation":"state"}
   [junit4]   2> 635181 INFO  (OverseerStateUpdate-95588524344737796-127.0.0.1:41043__xz%2Fxv-n_0000000000) [n:127.0.0.1:41043__xz%2Fxv    ] o.a.s.c.o.ClusterStateMutator building a new cName: collection1
   [junit4]   2> 635181 INFO  (OverseerStateUpdate-95588524344737796-127.0.0.1:41043__xz%2Fxv-n_0000000000) [n:127.0.0.1:41043__xz%2Fxv    ] o.a.s.c.o.ReplicaMutator Assigning new node to shard shard=shard2
   [junit4]   2> 635284 INFO  (zkCallback-694-thread-1) [    ] o.a.s.c.c.ZkStateReader A cluster state change: [WatchedEvent state:SyncConnected type:NodeDataChanged path:/clusterstate.json], has occurred - updating... (live nodes size: [2])
   [junit4]   2> 635284 INFO  (zkCallback-699-thread-1-processing-n:127.0.0.1:37508__xz%2Fxv) [n:127.0.0.1:37508__xz%2Fxv    ] o.a.s.c.c.ZkStateReader A cluster state change: [WatchedEvent state:SyncConnected type:NodeDataChanged path:/clusterstate.json], has occurred - updating... (live nodes size: [2])
   [junit4]   2> 635284 INFO  (zkCallback-692-thread-1-processing-n:127.0.0.1:41043__xz%2Fxv) [n:127.0.0.1:41043__xz%2Fxv    ] o.a.s.c.c.ZkStateReader A cluster state change: [WatchedEvent state:SyncConnected type:NodeDataChanged path:/clusterstate.json], has occurred - updating... (live nodes size: [2])
   [junit4]   2> 636181 INFO  (coreLoadExecutor-2312-thread-1-processing-n:127.0.0.1:37508__xz%2Fxv) [n:127.0.0.1:37508__xz%2Fxv c:collection1   x:collection1] o.a.s.c.ZkController waiting to find shard id in clusterstate for collection1
   [junit4]   2> 636181 INFO  (coreLoadExecutor-2312-thread-1-processing-n:127.0.0.1:37508__xz%2Fxv) [n:127.0.0.1:37508__xz%2Fxv c:collection1   x:collection1] o.a.s.c.ZkController Check for collection zkNode:collection1
   [junit4]   2> 636182 INFO  (coreLoadExecutor-2312-thread-1-processing-n:127.0.0.1:37508__xz%2Fxv) [n:127.0.0.1:37508__xz%2Fxv c:collection1   x:collection1] o.a.s.c.ZkController Collection zkNode exists
   [junit4]   2> 636182 INFO  (coreLoadExecutor-2312-thread-1-processing-n:127.0.0.1:37508__xz%2Fxv) [n:127.0.0.1:37508__xz%2Fxv c:collection1   x:collection1] o.a.s.c.c.ZkStateReader Load collection config from: [/collections/collection1]
   [junit4]   2> 636182 INFO  (coreLoadExecutor-2312-thread-1-processing-n:127.0.0.1:37508__xz%2Fxv) [n:127.0.0.1:37508__xz%2Fxv c:collection1   x:collection1] o.a.s.c.c.ZkStateReader path=[/collections/collection1] [configName]=[conf1] specified config exists in ZooKeeper
   [junit4]   2> 636182 INFO  (coreLoadExecutor-2312-thread-1-processing-n:127.0.0.1:37508__xz%2Fxv) [n:127.0.0.1:37508__xz%2Fxv c:collection1   x:collection1] o.a.s.c.SolrResourceLoader new SolrResourceLoader for directory: '/home/jenkins/workspace/Lucene-Solr-6.x-Linux/solr/build/solr-core/test/J2/temp/solr.cloud.UnloadDistributedZkTest_8F8FE54A34F992D8-001/shard-1-001/cores/collection1'
   [junit4]   2> 636183 INFO  (coreLoadExecutor-2312-thread-1-processing-n:127.0.0.1:37508__xz%2Fxv) [n:127.0.0.1:37508__xz%2Fxv c:collection1   x:collection1] o.a.s.c.SolrResourceLoader JNDI not configured for solr (NoInitialContextEx)
   [junit4]   2> 636183 INFO  (coreLoadExecutor-2312-thread-1-processing-n:127.0.0.1:37508__xz%2Fxv) [n:127.0.0.1:37508__xz%2Fxv c:collection1   x:collection1] o.a.s.c.SolrResourceLoader solr home defaulted to 'solr/' (could not find system property or JNDI)
   [junit4]   2> 636185 INFO  (coreLoadExecutor-2312-thread-1-processing-n:127.0.0.1:37508__xz%2Fxv) [n:127.0.0.1:37508__xz%2Fxv c:collection1   x:collection1] o.a.s.c.Config loaded config solrconfig.xml with version 0 
   [junit4]   2> 636194 INFO  (coreLoadExecutor-2312-thread-1-processing-n:127.0.0.1:37508__xz%2Fxv) [n:127.0.0.1:37508__xz%2Fxv c:collection1   x:collection1] o.a.s.c.SolrConfig current version of requestparams : -1
   [junit4]   2> 636207 INFO  (coreLoadExecutor-2312-thread-1-processing-n:127.0.0.1:37508__xz%2Fxv) [n:127.0.0.1:37508__xz%2Fxv c:collection1   x:collection1] o.a.s.c.SolrConfig Using Lucene MatchVersion: 6.1.0
   [junit4]   2> 636223 INFO  (coreLoadExecutor-2312-thread-1-processing-n:127.0.0.1:37508__xz%2Fxv) [n:127.0.0.1:37508__xz%2Fxv c:collection1   x:collection1] o.a.s.c.SolrConfig Loaded SolrConfig: solrconfig.xml
   [junit4]   2> 636233 INFO  (coreLoadExecutor-2312-thread-1-processing-n:127.0.0.1:37508__xz%2Fxv) [n:127.0.0.1:37508__xz%2Fxv c:collection1   x:collection1] o.a.s.s.IndexSchema [collection1] Schema name=test
   [junit4]   2> 636391 INFO  (coreLoadExecutor-2312-thread-1-processing-n:127.0.0.1:37508__xz%2Fxv) [n:127.0.0.1:37508__xz%2Fxv c:collection1   x:collection1] o.a.s.s.OpenExchangeRatesOrgProvider Initialized with rates=open-exchange-rates.json, refreshInterval=1440.
   [junit4]   2> 636407 INFO  (coreLoadExecutor-2312-thread-1-processing-n:127.0.0.1:37508__xz%2Fxv) [n:127.0.0.1:37508__xz%2Fxv c:collection1   x:collection1] o.a.s.s.IndexSchema default search field in schema is text
   [junit4]   2> 636409 INFO  (coreLoadExecutor-2312-thread-1-processing-n:127.0.0.1:37508__xz%2Fxv) [n:127.0.0.1:37508__xz%2Fxv c:collection1   x:collection1] o.a.s.s.IndexSchema unique key field: id
   [junit4]   2> 636423 INFO  (coreLoadExecutor-2312-thread-1-processing-n:127.0.0.1:37508__xz%2Fxv) [n:127.0.0.1:37508__xz%2Fxv c:collection1   x:collection1] o.a.s.s.FileExchangeRateProvider Reloading exchange rates from file currency.xml
   [junit4]   2> 636426 INFO  (coreLoadExecutor-2312-thread-1-processing-n:127.0.0.1:37508__xz%2Fxv) [n:127.0.0.1:37508__xz%2Fxv c:collection1   x:collection1] o.a.s.s.FileExchangeRateProvider Reloading exchange rates from file currency.xml
   [junit4]   2> 636431 INFO  (coreLoadExecutor-2312-thread-1-processing-n:127.0.0.1:37508__xz%2Fxv) [n:127.0.0.1:37508__xz%2Fxv c:collection1   x:collection1] o.a.s.s.OpenExchangeRatesOrgProvider Reloading exchange rates from open-exchange-rates.json
   [junit4]   2> 636432 INFO  (coreLoadExecutor-2312-thread-1-processing-n:127.0.0.1:37508__xz%2Fxv) [n:127.0.0.1:37508__xz%2Fxv c:collection1   x:collection1] o.a.s.s.OpenExchangeRatesOrgProvider Reloading exchange rates from open-exchange-rates.json
   [junit4]   2> 636435 INFO  (coreLoadExecutor-2312-thread-1-processing-n:127.0.0.1:37508__xz%2Fxv) [n:127.0.0.1:37508__xz%2Fxv c:collection1   x:collection1] o.a.s.c.ConfigSetProperties Did not find ConfigSet properties, assuming default properties: Can't find resource 'configsetprops.json' in classpath or '/configs/conf1', cwd=/home/jenkins/workspace/Lucene-Solr-6.x-Linux/solr/build/solr-core/test/J2
   [junit4]   2> 636435 INFO  (coreLoadExecutor-2312-thread-1-processing-n:127.0.0.1:37508__xz%2Fxv) [n:127.0.0.1:37508__xz%2Fxv c:collection1   x:collection1] o.a.s.c.CoreContainer Creating SolrCore 'collection1' using configuration from collection collection1
   [junit4]   2> 636435 INFO  (coreLoadExecutor-2312-thread-1-processing-n:127.0.0.1:37508__xz%2Fxv) [n:127.0.0.1:37508__xz%2Fxv c:collection1 s:shard2 r:core_node1 x:collection1] o.a.s.c.SolrCore org.apache.solr.core.MockDirectoryFactory
   [junit4]   2> 636436 INFO  (coreLoadExecutor-2312-thread-1-processing-n:127.0.0.1:37508__xz%2Fxv) [n:127.0.0.1:37508__xz%2Fxv c:collection1 s:shard2 r:core_node1 x:collection1] o.a.s.c.SolrCore [[collection1] ] Opening new SolrCore at [/home/jenkins/workspace/Lucene-Solr-6.x-Linux/solr/build/solr-core/test/J2/temp/solr.cloud.UnloadDistributedZkTest_8F8FE54A34F992D8-001/shard-1-001/cores/collection1], dataDir=[/home/jenkins/workspace/Lucene-Solr-6.x-Linux/solr/build/solr-core/test/J2/temp/solr.cloud.UnloadDistributedZkTest_8F8FE54A34F992D8-001/shard-1-001/cores/collection1/data/]
   [junit4]   2> 636436 INFO  (coreLoadExecutor-2312-thread-1-processing-n:127.0.0.1:37508__xz%2Fxv) [n:127.0.0.1:37508__xz%2Fxv c:collection1 s:shard2 r:core_node1 x:collection1] o.a.s.c.JmxMonitoredMap JMX monitoring is enabled. Adding Solr mbeans to JMX Server: com.sun.jmx.mbeanserver.JmxMBeanServer@13a9802
   [junit4]   2> 636437 INFO  (coreLoadExecutor-2312-thread-1-processing-n:127.0.0.1:37508__xz%2Fxv) [n:127.0.0.1:37508__xz%2Fxv c:collection1 s:shard2 r:core_node1 x:collection1] o.a.s.c.CachingDirectoryFactory return new directory for /home/jenkins/workspace/Lucene-Solr-6.x-Linux/solr/build/solr-core/test/J2/temp/solr.cloud.UnloadDistributedZkTest_8F8FE54A34F992D8-001/shard-1-001/cores/collection1/data
   [junit4]   2> 636437 INFO  (coreLoadExecutor-2312-thread-1-processing-n:127.0.0.1:37508__xz%2Fxv) [n:127.0.0.1:37508__xz%2Fxv c:collection1 s:shard2 r:core_node1 x:collection1] o.a.s.c.SolrCore New index directory detected: old=null new=/home/jenkins/workspace/Lucene-Solr-6.x-Linux/solr/build/solr-core/test/J2/temp/solr.cloud.UnloadDistributedZkTest_8F8FE54A34F992D8-001/shard-1-001/cores/collection1/data/index/
   [junit4]   2> 636437 WARN  (coreLoadExecutor-2312-thread-1-processing-n:127.0.0.1:37508__xz%2Fxv) [n:127.0.0.1:37508__xz%2Fxv c:collection1 s:shard2 r:core_node1 x:collection1] o.a.s.c.SolrCore [collection1] Solr index directory '/home/jenkins/workspace/Lucene-Solr-6.x-Linux/solr/build/solr-core/test/J2/temp/solr.cloud.UnloadDistributedZkTest_8F8FE54A34F992D8-001/shard-1-001/cores/collection1/data/index' doesn't exist. Creating new index...
   [junit4]   2> 636437 INFO  (coreLoadExecutor-2312-thread-1-processing-n:127.0.0.1:37508__xz%2Fxv) [n:127.0.0.1:37508__xz%2Fxv c:collection1 s:shard2 r:core_node1 x:collection1] o.a.s.c.CachingDirectoryFactory return new directory for /home/jenkins/workspace/Lucene-Solr-6.x-Linux/solr/build/solr-core/test/J2/temp/solr.cloud.UnloadDistributedZkTest_8F8FE54A34F992D8-001/shard-1-001/cores/collection1/data/index
   [junit4]   2> 636437 INFO  (coreLoadExecutor-2312-thread-1-processing-n:127.0.0.1:37508__xz%2Fxv) [n:127.0.0.1:37508__xz%2Fxv c:collection1 s:shard2 r:core_node1 x:collection1] o.a.s.u.RandomMergePolicy RandomMergePolicy wrapping class org.apache.lucene.index.LogDocMergePolicy: [LogDocMergePolicy: minMergeSize=1

[...truncated too long message...]

t-seed#[8F8FE54A34F992D8]) [    ] o.a.s.c.ZkTestServer connecting to 127.0.0.1:37429 37429
   [junit4]   2> 769603 INFO  (Thread-1556) [    ] o.a.s.c.ZkTestServer connecting to 127.0.0.1:37429 37429
   [junit4]   2> 769603 WARN  (Thread-1556) [    ] o.a.s.c.ZkTestServer Watch limit violations: 
   [junit4]   2> Maximum concurrent create/delete watches above limit:
   [junit4]   2> 
   [junit4]   2> 	7	/solr/aliases.json
   [junit4]   2> 	5	/solr/security.json
   [junit4]   2> 	5	/solr/configs/conf1
   [junit4]   2> 
   [junit4]   2> Maximum concurrent data watches above limit:
   [junit4]   2> 
   [junit4]   2> 	7	/solr/clusterstate.json
   [junit4]   2> 	2	/solr/collections/multiunload/leader_elect/shard2/election/95588524344737806-core_node9-n_0000000003
   [junit4]   2> 	2	/solr/collections/multiunload/leader_elect/shard1/election/95588524344737806-core_node8-n_0000000001
   [junit4]   2> 
   [junit4]   2> Maximum concurrent children watches above limit:
   [junit4]   2> 
   [junit4]   2> 	7	/solr/live_nodes
   [junit4]   2> 	7	/solr/collections
   [junit4]   2> 	5	/solr/overseer/queue
   [junit4]   2> 	5	/solr/overseer/collection-queue-work
   [junit4]   2> 
   [junit4]   2> NOTE: reproduce with: ant test  -Dtestcase=UnloadDistributedZkTest -Dtests.method=test -Dtests.seed=8F8FE54A34F992D8 -Dtests.multiplier=3 -Dtests.slow=true -Dtests.locale=th-TH -Dtests.timezone=America/Creston -Dtests.asserts=true -Dtests.file.encoding=ISO-8859-1
   [junit4] ERROR    137s J2 | UnloadDistributedZkTest.test <<<
   [junit4]    > Throwable #1: com.carrotsearch.randomizedtesting.UncaughtExceptionError: Captured an uncaught exception in thread: Thread[id=4989, name=testExecutor-2380-thread-12, state=RUNNABLE, group=TGRP-UnloadDistributedZkTest]
   [junit4]    > 	at __randomizedtesting.SeedInfo.seed([8F8FE54A34F992D8:7DBDA909A05FF20]:0)
   [junit4]    > Caused by: java.lang.RuntimeException: org.apache.solr.client.solrj.SolrServerException: Timeout occured while waiting response from server at: http://127.0.0.1:34497/_xz/xv
   [junit4]    > 	at __randomizedtesting.SeedInfo.seed([8F8FE54A34F992D8]:0)
   [junit4]    > 	at org.apache.solr.cloud.BasicDistributedZkTest.lambda$createCores$0(BasicDistributedZkTest.java:583)
   [junit4]    > 	at org.apache.solr.common.util.ExecutorUtil$MDCAwareThreadPoolExecutor.lambda$execute$0(ExecutorUtil.java:229)
   [junit4]    > 	at java.util.concurrent.ThreadPoolExecutor.runWorker(ThreadPoolExecutor.java:1142)
   [junit4]    > 	at java.util.concurrent.ThreadPoolExecutor$Worker.run(ThreadPoolExecutor.java:617)
   [junit4]    > 	at java.lang.Thread.run(Thread.java:745)
   [junit4]    > Caused by: org.apache.solr.client.solrj.SolrServerException: Timeout occured while waiting response from server at: http://127.0.0.1:34497/_xz/xv
   [junit4]    > 	at org.apache.solr.client.solrj.impl.HttpSolrClient.executeMethod(HttpSolrClient.java:588)
   [junit4]    > 	at org.apache.solr.client.solrj.impl.HttpSolrClient.request(HttpSolrClient.java:241)
   [junit4]    > 	at org.apache.solr.client.solrj.impl.HttpSolrClient.request(HttpSolrClient.java:230)
   [junit4]    > 	at org.apache.solr.client.solrj.SolrClient.request(SolrClient.java:1219)
   [junit4]    > 	at org.apache.solr.cloud.BasicDistributedZkTest.lambda$createCores$0(BasicDistributedZkTest.java:581)
   [junit4]    > 	... 4 more
   [junit4]    > Caused by: java.net.SocketTimeoutException: Read timed out
   [junit4]    > 	at java.net.SocketInputStream.socketRead0(Native Method)
   [junit4]    > 	at java.net.SocketInputStream.socketRead(SocketInputStream.java:116)
   [junit4]    > 	at java.net.SocketInputStream.read(SocketInputStream.java:170)
   [junit4]    > 	at java.net.SocketInputStream.read(SocketInputStream.java:141)
   [junit4]    > 	at org.apache.http.impl.io.AbstractSessionInputBuffer.fillBuffer(AbstractSessionInputBuffer.java:160)
   [junit4]    > 	at org.apache.http.impl.io.SocketInputBuffer.fillBuffer(SocketInputBuffer.java:84)
   [junit4]    > 	at org.apache.http.impl.io.AbstractSessionInputBuffer.readLine(AbstractSessionInputBuffer.java:273)
   [junit4]    > 	at org.apache.http.impl.conn.DefaultHttpResponseParser.parseHead(DefaultHttpResponseParser.java:140)
   [junit4]    > 	at org.apache.http.impl.conn.DefaultHttpResponseParser.parseHead(DefaultHttpResponseParser.java:57)
   [junit4]    > 	at org.apache.http.impl.io.AbstractMessageParser.parse(AbstractMessageParser.java:261)
   [junit4]    > 	at org.apache.http.impl.AbstractHttpClientConnection.receiveResponseHeader(AbstractHttpClientConnection.java:283)
   [junit4]    > 	at org.apache.http.impl.conn.DefaultClientConnection.receiveResponseHeader(DefaultClientConnection.java:251)
   [junit4]    > 	at org.apache.http.impl.conn.ManagedClientConnectionImpl.receiveResponseHeader(ManagedClientConnectionImpl.java:197)
   [junit4]    > 	at org.apache.http.protocol.HttpRequestExecutor.doReceiveResponse(HttpRequestExecutor.java:272)
   [junit4]    > 	at org.apache.http.protocol.HttpRequestExecutor.execute(HttpRequestExecutor.java:124)
   [junit4]    > 	at org.apache.http.impl.client.DefaultRequestDirector.tryExecute(DefaultRequestDirector.java:685)
   [junit4]    > 	at org.apache.http.impl.client.DefaultRequestDirector.execute(DefaultRequestDirector.java:487)
   [junit4]    > 	at org.apache.http.impl.client.AbstractHttpClient.doExecute(AbstractHttpClient.java:882)
   [junit4]    > 	at org.apache.http.impl.client.CloseableHttpClient.execute(CloseableHttpClient.java:82)
   [junit4]    > 	at org.apache.http.impl.client.CloseableHttpClient.execute(CloseableHttpClient.java:107)
   [junit4]    > 	at org.apache.http.impl.client.CloseableHttpClient.execute(CloseableHttpClient.java:55)
   [junit4]    > 	at org.apache.solr.client.solrj.impl.HttpSolrClient.executeMethod(HttpSolrClient.java:482)
   [junit4]    > 	... 8 more
   [junit4]   2> 769607 INFO  (SUITE-UnloadDistributedZkTest-seed#[8F8FE54A34F992D8]-worker) [    ] o.a.s.SolrTestCaseJ4 ###deleteCore
   [junit4]   2> Mar 21, 2016 1:01:07 PM com.carrotsearch.randomizedtesting.ThreadLeakControl checkThreadLeaks
   [junit4]   2> WARNING: Will linger awaiting termination of 1 leaked thread(s).
   [junit4]   2> NOTE: test params are: codec=Asserting(Lucene60): {other_tl1=PostingsFormat(name=MockRandom), range_facet_l_dv=PostingsFormat(name=Direct), _version_=PostingsFormat(name=MockRandom), multiDefault=Lucene50(blocksize=128), a_t=PostingsFormat(name=MockRandom), intDefault=PostingsFormat(name=MockRandom), a_i1=PostingsFormat(name=MockRandom), id=PostingsFormat(name=Direct), range_facet_i_dv=PostingsFormat(name=MockRandom), text=FSTOrd50, range_facet_l=PostingsFormat(name=MockRandom), timestamp=PostingsFormat(name=MockRandom)}, docValues:{range_facet_l_dv=DocValuesFormat(name=Asserting), range_facet_i_dv=DocValuesFormat(name=Lucene54), timestamp=DocValuesFormat(name=Lucene54)}, maxPointsInLeafNode=1559, maxMBSortInHeap=5.988530558169412, sim=RandomSimilarity(queryNorm=true,coord=no): {}, locale=th-TH, timezone=America/Creston
   [junit4]   2> NOTE: Linux 4.2.0-34-generic i386/Oracle Corporation 1.8.0_72 (32-bit)/cpus=12,threads=1,free=369594648,total=534773760
   [junit4]   2> NOTE: All tests run in this JVM: [TestCharFilters, FullSolrCloudDistribCmdsTest, CoreAdminHandlerTest, ConjunctionSolrSpellCheckerTest, TestCoreDiscovery, ReplicationFactorTest, LeaderElectionTest, TestExtendedDismaxParser, CoreAdminRequestStatusTest, LukeRequestHandlerTest, MultiThreadedOCPTest, TestJettySolrRunner, SearchHandlerTest, CollectionsAPISolrJTest, PrimitiveFieldTypeTest, DirectUpdateHandlerOptimizeTest, ConnectionManagerTest, TestFieldSortValues, CursorMarkTest, TestOrdValues, TestSolrDeletionPolicy1, TestRandomCollapseQParserPlugin, CdcrRequestHandlerTest, TestSolrQueryResponse, BadComponentTest, TestCollectionAPI, SecurityConfHandlerTest, RegexBoostProcessorTest, TermVectorComponentDistributedTest, BitVectorTest, CollectionStateFormat2Test, TestUseDocValuesAsStored2, TestSolrQueryParser, TestFieldResource, HighlighterConfigTest, AssignTest, SolrCoreCheckLockOnStartupTest, IgnoreCommitOptimizeUpdateProcessorFactoryTest, TestSweetSpotSimilarityFactory, TestBlobHandler, TestNamedUpdateProcessors, TestSort, TestInfoStreamLogging, TestInitQParser, LeaderInitiatedRecoveryOnCommitTest, FacetPivotSmallTest, CleanupOldIndexTest, VersionInfoTest, TestCollationField, TestSuggestSpellingConverter, TestStressReorder, DocValuesMultiTest, TestXmlQParser, DistributedQueryComponentCustomSortTest, TestManagedSynonymFilterFactory, BasicDistributedZk2Test, TestRecoveryHdfs, TestMacros, TestIndexSearcher, TestCSVResponseWriter, FieldAnalysisRequestHandlerTest, UnloadDistributedZkTest]
   [junit4] Completed [219/581 (1!)] on J2 in 138.35s, 1 test, 1 error <<< FAILURES!

[...truncated 1152 lines...]
BUILD FAILED
/home/jenkins/workspace/Lucene-Solr-6.x-Linux/build.xml:740: The following error occurred while executing this line:
/home/jenkins/workspace/Lucene-Solr-6.x-Linux/build.xml:684: The following error occurred while executing this line:
/home/jenkins/workspace/Lucene-Solr-6.x-Linux/build.xml:59: The following error occurred while executing this line:
/home/jenkins/workspace/Lucene-Solr-6.x-Linux/solr/build.xml:233: The following error occurred while executing this line:
/home/jenkins/workspace/Lucene-Solr-6.x-Linux/solr/common-build.xml:529: The following error occurred while executing this line:
/home/jenkins/workspace/Lucene-Solr-6.x-Linux/lucene/common-build.xml:1457: The following error occurred while executing this line:
/home/jenkins/workspace/Lucene-Solr-6.x-Linux/lucene/common-build.xml:1014: There were test failures: 581 suites (10 ignored), 2330 tests, 1 error, 115 ignored (70 assumptions) [seed: 8F8FE54A34F992D8]

Total time: 59 minutes 46 seconds
Build step 'Invoke Ant' marked build as failure
Archiving artifacts
[WARNINGS] Skipping publisher since build result is FAILURE
Recording test results
Email was triggered for: Failure - Any
Sending email for trigger: Failure - Any



Mime
View raw message