lucene-dev mailing list archives

Site index · List index
Message view « Date » · « Thread »
Top « Date » · « Thread »
From Apache Jenkins Server <jenk...@builds.apache.org>
Subject [JENKINS] Lucene-Solr-Tests-trunk-Java8 - Build # 935 - Failure
Date Wed, 02 Mar 2016 21:42:54 GMT
Build: https://builds.apache.org/job/Lucene-Solr-Tests-trunk-Java8/935/

1 tests failed.
FAILED:  org.apache.solr.core.TestDynamicLoading.testDynamicLoading

Error Message:
Could not get expected value  'X val' for path 'x' full output: {   "responseHeader":{     "status":0,     "QTime":0},   "params":{"wt":"json"},   "context":{     "webapp":"/_t",     "path":"/test1",     "httpMethod":"GET"},   "class":"org.apache.solr.core.BlobStoreTestRequestHandler",   "x":null}

Stack Trace:
java.lang.AssertionError: Could not get expected value  'X val' for path 'x' full output: {
  "responseHeader":{
    "status":0,
    "QTime":0},
  "params":{"wt":"json"},
  "context":{
    "webapp":"/_t",
    "path":"/test1",
    "httpMethod":"GET"},
  "class":"org.apache.solr.core.BlobStoreTestRequestHandler",
  "x":null}
	at __randomizedtesting.SeedInfo.seed([B3A124B130BEB0DE:6BEC09E6C763157E]:0)
	at org.junit.Assert.fail(Assert.java:93)
	at org.junit.Assert.assertTrue(Assert.java:43)
	at org.apache.solr.core.TestSolrConfigHandler.testForResponseElement(TestSolrConfigHandler.java:458)
	at org.apache.solr.core.TestDynamicLoading.testDynamicLoading(TestDynamicLoading.java:238)
	at sun.reflect.NativeMethodAccessorImpl.invoke0(Native Method)
	at sun.reflect.NativeMethodAccessorImpl.invoke(NativeMethodAccessorImpl.java:62)
	at sun.reflect.DelegatingMethodAccessorImpl.invoke(DelegatingMethodAccessorImpl.java:43)
	at java.lang.reflect.Method.invoke(Method.java:497)
	at com.carrotsearch.randomizedtesting.RandomizedRunner.invoke(RandomizedRunner.java:1764)
	at com.carrotsearch.randomizedtesting.RandomizedRunner$8.evaluate(RandomizedRunner.java:871)
	at com.carrotsearch.randomizedtesting.RandomizedRunner$9.evaluate(RandomizedRunner.java:907)
	at com.carrotsearch.randomizedtesting.RandomizedRunner$10.evaluate(RandomizedRunner.java:921)
	at org.apache.solr.BaseDistributedSearchTestCase$ShardsRepeatRule$ShardsFixedStatement.callStatement(BaseDistributedSearchTestCase.java:996)
	at org.apache.solr.BaseDistributedSearchTestCase$ShardsRepeatRule$ShardsStatement.evaluate(BaseDistributedSearchTestCase.java:971)
	at com.carrotsearch.randomizedtesting.rules.SystemPropertiesRestoreRule$1.evaluate(SystemPropertiesRestoreRule.java:57)
	at org.apache.lucene.util.TestRuleSetupTeardownChained$1.evaluate(TestRuleSetupTeardownChained.java:49)
	at org.apache.lucene.util.AbstractBeforeAfterRule$1.evaluate(AbstractBeforeAfterRule.java:45)
	at org.apache.lucene.util.TestRuleThreadAndTestName$1.evaluate(TestRuleThreadAndTestName.java:48)
	at org.apache.lucene.util.TestRuleIgnoreAfterMaxFailures$1.evaluate(TestRuleIgnoreAfterMaxFailures.java:64)
	at org.apache.lucene.util.TestRuleMarkFailure$1.evaluate(TestRuleMarkFailure.java:47)
	at com.carrotsearch.randomizedtesting.rules.StatementAdapter.evaluate(StatementAdapter.java:36)
	at com.carrotsearch.randomizedtesting.ThreadLeakControl$StatementRunner.run(ThreadLeakControl.java:367)
	at com.carrotsearch.randomizedtesting.ThreadLeakControl.forkTimeoutingTask(ThreadLeakControl.java:809)
	at com.carrotsearch.randomizedtesting.ThreadLeakControl$3.evaluate(ThreadLeakControl.java:460)
	at com.carrotsearch.randomizedtesting.RandomizedRunner.runSingleTest(RandomizedRunner.java:880)
	at com.carrotsearch.randomizedtesting.RandomizedRunner$5.evaluate(RandomizedRunner.java:781)
	at com.carrotsearch.randomizedtesting.RandomizedRunner$6.evaluate(RandomizedRunner.java:816)
	at com.carrotsearch.randomizedtesting.RandomizedRunner$7.evaluate(RandomizedRunner.java:827)
	at com.carrotsearch.randomizedtesting.rules.StatementAdapter.evaluate(StatementAdapter.java:36)
	at com.carrotsearch.randomizedtesting.rules.SystemPropertiesRestoreRule$1.evaluate(SystemPropertiesRestoreRule.java:57)
	at org.apache.lucene.util.AbstractBeforeAfterRule$1.evaluate(AbstractBeforeAfterRule.java:45)
	at com.carrotsearch.randomizedtesting.rules.StatementAdapter.evaluate(StatementAdapter.java:36)
	at org.apache.lucene.util.TestRuleStoreClassName$1.evaluate(TestRuleStoreClassName.java:41)
	at com.carrotsearch.randomizedtesting.rules.NoShadowingOrOverridesOnMethodsRule$1.evaluate(NoShadowingOrOverridesOnMethodsRule.java:40)
	at com.carrotsearch.randomizedtesting.rules.NoShadowingOrOverridesOnMethodsRule$1.evaluate(NoShadowingOrOverridesOnMethodsRule.java:40)
	at com.carrotsearch.randomizedtesting.rules.StatementAdapter.evaluate(StatementAdapter.java:36)
	at com.carrotsearch.randomizedtesting.rules.StatementAdapter.evaluate(StatementAdapter.java:36)
	at com.carrotsearch.randomizedtesting.rules.StatementAdapter.evaluate(StatementAdapter.java:36)
	at org.apache.lucene.util.TestRuleAssertionsRequired$1.evaluate(TestRuleAssertionsRequired.java:53)
	at org.apache.lucene.util.TestRuleMarkFailure$1.evaluate(TestRuleMarkFailure.java:47)
	at org.apache.lucene.util.TestRuleIgnoreAfterMaxFailures$1.evaluate(TestRuleIgnoreAfterMaxFailures.java:64)
	at org.apache.lucene.util.TestRuleIgnoreTestSuites$1.evaluate(TestRuleIgnoreTestSuites.java:54)
	at com.carrotsearch.randomizedtesting.rules.StatementAdapter.evaluate(StatementAdapter.java:36)
	at com.carrotsearch.randomizedtesting.ThreadLeakControl$StatementRunner.run(ThreadLeakControl.java:367)
	at java.lang.Thread.run(Thread.java:745)




Build Log:
[...truncated 12062 lines...]
   [junit4] Suite: org.apache.solr.core.TestDynamicLoading
   [junit4]   2> Creating dataDir: /x1/jenkins/jenkins-slave/workspace/Lucene-Solr-Tests-trunk-Java8/solr/build/solr-core/test/J1/temp/solr.core.TestDynamicLoading_B3A124B130BEB0DE-001/init-core-data-001
   [junit4]   2> 1741351 INFO  (SUITE-TestDynamicLoading-seed#[B3A124B130BEB0DE]-worker) [    ] o.a.s.SolrTestCaseJ4 Randomized ssl (true) and clientAuth (true)
   [junit4]   2> 1741351 INFO  (SUITE-TestDynamicLoading-seed#[B3A124B130BEB0DE]-worker) [    ] o.a.s.BaseDistributedSearchTestCase Setting hostContext system property: /_t/
   [junit4]   2> 1741354 INFO  (TEST-TestDynamicLoading.testDynamicLoading-seed#[B3A124B130BEB0DE]) [    ] o.a.s.c.ZkTestServer STARTING ZK TEST SERVER
   [junit4]   2> 1741354 INFO  (Thread-5776) [    ] o.a.s.c.ZkTestServer client port:0.0.0.0/0.0.0.0:0
   [junit4]   2> 1741354 INFO  (Thread-5776) [    ] o.a.s.c.ZkTestServer Starting server
   [junit4]   2> 1741454 INFO  (TEST-TestDynamicLoading.testDynamicLoading-seed#[B3A124B130BEB0DE]) [    ] o.a.s.c.ZkTestServer start zk server on port:35721
   [junit4]   2> 1741454 INFO  (TEST-TestDynamicLoading.testDynamicLoading-seed#[B3A124B130BEB0DE]) [    ] o.a.s.c.c.SolrZkClient Using default ZkCredentialsProvider
   [junit4]   2> 1741455 INFO  (TEST-TestDynamicLoading.testDynamicLoading-seed#[B3A124B130BEB0DE]) [    ] o.a.s.c.c.ConnectionManager Waiting for client to connect to ZooKeeper
   [junit4]   2> 1741457 INFO  (zkCallback-2105-thread-1) [    ] o.a.s.c.c.ConnectionManager Watcher org.apache.solr.common.cloud.ConnectionManager@7afc06c8 name:ZooKeeperConnection Watcher:127.0.0.1:35721 got event WatchedEvent state:SyncConnected type:None path:null path:null type:None
   [junit4]   2> 1741457 INFO  (TEST-TestDynamicLoading.testDynamicLoading-seed#[B3A124B130BEB0DE]) [    ] o.a.s.c.c.ConnectionManager Client is connected to ZooKeeper
   [junit4]   2> 1741457 INFO  (TEST-TestDynamicLoading.testDynamicLoading-seed#[B3A124B130BEB0DE]) [    ] o.a.s.c.c.SolrZkClient Using default ZkACLProvider
   [junit4]   2> 1741457 INFO  (TEST-TestDynamicLoading.testDynamicLoading-seed#[B3A124B130BEB0DE]) [    ] o.a.s.c.c.SolrZkClient makePath: /solr
   [junit4]   2> 1741459 INFO  (TEST-TestDynamicLoading.testDynamicLoading-seed#[B3A124B130BEB0DE]) [    ] o.a.s.c.c.SolrZkClient Using default ZkCredentialsProvider
   [junit4]   2> 1741460 INFO  (TEST-TestDynamicLoading.testDynamicLoading-seed#[B3A124B130BEB0DE]) [    ] o.a.s.c.c.ConnectionManager Waiting for client to connect to ZooKeeper
   [junit4]   2> 1741460 INFO  (zkCallback-2106-thread-1) [    ] o.a.s.c.c.ConnectionManager Watcher org.apache.solr.common.cloud.ConnectionManager@664f4bcc name:ZooKeeperConnection Watcher:127.0.0.1:35721/solr got event WatchedEvent state:SyncConnected type:None path:null path:null type:None
   [junit4]   2> 1741461 INFO  (TEST-TestDynamicLoading.testDynamicLoading-seed#[B3A124B130BEB0DE]) [    ] o.a.s.c.c.ConnectionManager Client is connected to ZooKeeper
   [junit4]   2> 1741461 INFO  (TEST-TestDynamicLoading.testDynamicLoading-seed#[B3A124B130BEB0DE]) [    ] o.a.s.c.c.SolrZkClient Using default ZkACLProvider
   [junit4]   2> 1741461 INFO  (TEST-TestDynamicLoading.testDynamicLoading-seed#[B3A124B130BEB0DE]) [    ] o.a.s.c.c.SolrZkClient makePath: /collections/collection1
   [junit4]   2> 1741462 INFO  (TEST-TestDynamicLoading.testDynamicLoading-seed#[B3A124B130BEB0DE]) [    ] o.a.s.c.c.SolrZkClient makePath: /collections/collection1/shards
   [junit4]   2> 1741463 INFO  (TEST-TestDynamicLoading.testDynamicLoading-seed#[B3A124B130BEB0DE]) [    ] o.a.s.c.c.SolrZkClient makePath: /collections/control_collection
   [junit4]   2> 1741465 INFO  (TEST-TestDynamicLoading.testDynamicLoading-seed#[B3A124B130BEB0DE]) [    ] o.a.s.c.c.SolrZkClient makePath: /collections/control_collection/shards
   [junit4]   2> 1741466 INFO  (TEST-TestDynamicLoading.testDynamicLoading-seed#[B3A124B130BEB0DE]) [    ] o.a.s.c.AbstractZkTestCase put /x1/jenkins/jenkins-slave/workspace/Lucene-Solr-Tests-trunk-Java8/solr/core/src/test-files/solr/collection1/conf/solrconfig-tlog.xml to /configs/conf1/solrconfig.xml
   [junit4]   2> 1741466 INFO  (TEST-TestDynamicLoading.testDynamicLoading-seed#[B3A124B130BEB0DE]) [    ] o.a.s.c.c.SolrZkClient makePath: /configs/conf1/solrconfig.xml
   [junit4]   2> 1741468 INFO  (TEST-TestDynamicLoading.testDynamicLoading-seed#[B3A124B130BEB0DE]) [    ] o.a.s.c.AbstractZkTestCase put /x1/jenkins/jenkins-slave/workspace/Lucene-Solr-Tests-trunk-Java8/solr/core/src/test-files/solr/collection1/conf/schema.xml to /configs/conf1/schema.xml
   [junit4]   2> 1741468 INFO  (TEST-TestDynamicLoading.testDynamicLoading-seed#[B3A124B130BEB0DE]) [    ] o.a.s.c.c.SolrZkClient makePath: /configs/conf1/schema.xml
   [junit4]   2> 1741470 INFO  (TEST-TestDynamicLoading.testDynamicLoading-seed#[B3A124B130BEB0DE]) [    ] o.a.s.c.AbstractZkTestCase put /x1/jenkins/jenkins-slave/workspace/Lucene-Solr-Tests-trunk-Java8/solr/core/src/test-files/solr/collection1/conf/solrconfig.snippet.randomindexconfig.xml to /configs/conf1/solrconfig.snippet.randomindexconfig.xml
   [junit4]   2> 1741470 INFO  (TEST-TestDynamicLoading.testDynamicLoading-seed#[B3A124B130BEB0DE]) [    ] o.a.s.c.c.SolrZkClient makePath: /configs/conf1/solrconfig.snippet.randomindexconfig.xml
   [junit4]   2> 1741471 INFO  (TEST-TestDynamicLoading.testDynamicLoading-seed#[B3A124B130BEB0DE]) [    ] o.a.s.c.AbstractZkTestCase put /x1/jenkins/jenkins-slave/workspace/Lucene-Solr-Tests-trunk-Java8/solr/core/src/test-files/solr/collection1/conf/stopwords.txt to /configs/conf1/stopwords.txt
   [junit4]   2> 1741471 INFO  (TEST-TestDynamicLoading.testDynamicLoading-seed#[B3A124B130BEB0DE]) [    ] o.a.s.c.c.SolrZkClient makePath: /configs/conf1/stopwords.txt
   [junit4]   2> 1741473 INFO  (TEST-TestDynamicLoading.testDynamicLoading-seed#[B3A124B130BEB0DE]) [    ] o.a.s.c.AbstractZkTestCase put /x1/jenkins/jenkins-slave/workspace/Lucene-Solr-Tests-trunk-Java8/solr/core/src/test-files/solr/collection1/conf/protwords.txt to /configs/conf1/protwords.txt
   [junit4]   2> 1741473 INFO  (TEST-TestDynamicLoading.testDynamicLoading-seed#[B3A124B130BEB0DE]) [    ] o.a.s.c.c.SolrZkClient makePath: /configs/conf1/protwords.txt
   [junit4]   2> 1741474 INFO  (TEST-TestDynamicLoading.testDynamicLoading-seed#[B3A124B130BEB0DE]) [    ] o.a.s.c.AbstractZkTestCase put /x1/jenkins/jenkins-slave/workspace/Lucene-Solr-Tests-trunk-Java8/solr/core/src/test-files/solr/collection1/conf/currency.xml to /configs/conf1/currency.xml
   [junit4]   2> 1741474 INFO  (TEST-TestDynamicLoading.testDynamicLoading-seed#[B3A124B130BEB0DE]) [    ] o.a.s.c.c.SolrZkClient makePath: /configs/conf1/currency.xml
   [junit4]   2> 1741476 INFO  (TEST-TestDynamicLoading.testDynamicLoading-seed#[B3A124B130BEB0DE]) [    ] o.a.s.c.AbstractZkTestCase put /x1/jenkins/jenkins-slave/workspace/Lucene-Solr-Tests-trunk-Java8/solr/core/src/test-files/solr/collection1/conf/enumsConfig.xml to /configs/conf1/enumsConfig.xml
   [junit4]   2> 1741476 INFO  (TEST-TestDynamicLoading.testDynamicLoading-seed#[B3A124B130BEB0DE]) [    ] o.a.s.c.c.SolrZkClient makePath: /configs/conf1/enumsConfig.xml
   [junit4]   2> 1741477 INFO  (TEST-TestDynamicLoading.testDynamicLoading-seed#[B3A124B130BEB0DE]) [    ] o.a.s.c.AbstractZkTestCase put /x1/jenkins/jenkins-slave/workspace/Lucene-Solr-Tests-trunk-Java8/solr/core/src/test-files/solr/collection1/conf/open-exchange-rates.json to /configs/conf1/open-exchange-rates.json
   [junit4]   2> 1741477 INFO  (TEST-TestDynamicLoading.testDynamicLoading-seed#[B3A124B130BEB0DE]) [    ] o.a.s.c.c.SolrZkClient makePath: /configs/conf1/open-exchange-rates.json
   [junit4]   2> 1741479 INFO  (TEST-TestDynamicLoading.testDynamicLoading-seed#[B3A124B130BEB0DE]) [    ] o.a.s.c.AbstractZkTestCase put /x1/jenkins/jenkins-slave/workspace/Lucene-Solr-Tests-trunk-Java8/solr/core/src/test-files/solr/collection1/conf/mapping-ISOLatin1Accent.txt to /configs/conf1/mapping-ISOLatin1Accent.txt
   [junit4]   2> 1741479 INFO  (TEST-TestDynamicLoading.testDynamicLoading-seed#[B3A124B130BEB0DE]) [    ] o.a.s.c.c.SolrZkClient makePath: /configs/conf1/mapping-ISOLatin1Accent.txt
   [junit4]   2> 1741481 INFO  (TEST-TestDynamicLoading.testDynamicLoading-seed#[B3A124B130BEB0DE]) [    ] o.a.s.c.AbstractZkTestCase put /x1/jenkins/jenkins-slave/workspace/Lucene-Solr-Tests-trunk-Java8/solr/core/src/test-files/solr/collection1/conf/old_synonyms.txt to /configs/conf1/old_synonyms.txt
   [junit4]   2> 1741481 INFO  (TEST-TestDynamicLoading.testDynamicLoading-seed#[B3A124B130BEB0DE]) [    ] o.a.s.c.c.SolrZkClient makePath: /configs/conf1/old_synonyms.txt
   [junit4]   2> 1741482 INFO  (TEST-TestDynamicLoading.testDynamicLoading-seed#[B3A124B130BEB0DE]) [    ] o.a.s.c.AbstractZkTestCase put /x1/jenkins/jenkins-slave/workspace/Lucene-Solr-Tests-trunk-Java8/solr/core/src/test-files/solr/collection1/conf/synonyms.txt to /configs/conf1/synonyms.txt
   [junit4]   2> 1741482 INFO  (TEST-TestDynamicLoading.testDynamicLoading-seed#[B3A124B130BEB0DE]) [    ] o.a.s.c.c.SolrZkClient makePath: /configs/conf1/synonyms.txt
   [junit4]   2> 1741484 INFO  (TEST-TestDynamicLoading.testDynamicLoading-seed#[B3A124B130BEB0DE]) [    ] o.a.s.c.c.SolrZkClient Using default ZkCredentialsProvider
   [junit4]   2> 1741485 INFO  (TEST-TestDynamicLoading.testDynamicLoading-seed#[B3A124B130BEB0DE]) [    ] o.a.s.c.c.ConnectionManager Waiting for client to connect to ZooKeeper
   [junit4]   2> 1741486 INFO  (zkCallback-2107-thread-1) [    ] o.a.s.c.c.ConnectionManager Watcher org.apache.solr.common.cloud.ConnectionManager@6102e6fe name:ZooKeeperConnection Watcher:127.0.0.1:35721/solr got event WatchedEvent state:SyncConnected type:None path:null path:null type:None
   [junit4]   2> 1741486 INFO  (TEST-TestDynamicLoading.testDynamicLoading-seed#[B3A124B130BEB0DE]) [    ] o.a.s.c.c.ConnectionManager Client is connected to ZooKeeper
   [junit4]   2> 1741486 INFO  (TEST-TestDynamicLoading.testDynamicLoading-seed#[B3A124B130BEB0DE]) [    ] o.a.s.c.c.SolrZkClient Using default ZkACLProvider
   [junit4]   2> 1741579 INFO  (TEST-TestDynamicLoading.testDynamicLoading-seed#[B3A124B130BEB0DE]) [    ] o.a.s.SolrTestCaseJ4 Writing core.properties file to /x1/jenkins/jenkins-slave/workspace/Lucene-Solr-Tests-trunk-Java8/solr/build/solr-core/test/J1/temp/solr.core.TestDynamicLoading_B3A124B130BEB0DE-001/control-001/cores/collection1
   [junit4]   2> 1741582 INFO  (TEST-TestDynamicLoading.testDynamicLoading-seed#[B3A124B130BEB0DE]) [    ] o.e.j.s.Server jetty-9.3.6.v20151106
   [junit4]   2> 1741583 INFO  (TEST-TestDynamicLoading.testDynamicLoading-seed#[B3A124B130BEB0DE]) [    ] o.e.j.s.h.ContextHandler Started o.e.j.s.ServletContextHandler@3fffdd9f{/_t,null,AVAILABLE}
   [junit4]   2> 1741585 INFO  (TEST-TestDynamicLoading.testDynamicLoading-seed#[B3A124B130BEB0DE]) [    ] o.e.j.u.s.SslContextFactory x509=X509@4b592286(solrtest,h=[],w=[]) for SslContextFactory@2aa4dfaa(file:///x1/jenkins/jenkins-slave/workspace/Lucene-Solr-Tests-trunk-Java8/solr/server/etc/test/solrtest.keystore,file:///x1/jenkins/jenkins-slave/workspace/Lucene-Solr-Tests-trunk-Java8/solr/server/etc/test/solrtest.keystore)
   [junit4]   2> 1741587 INFO  (TEST-TestDynamicLoading.testDynamicLoading-seed#[B3A124B130BEB0DE]) [    ] o.e.j.s.ServerConnector Started ServerConnector@28eb956a{SSL,[ssl, http/1.1]}{127.0.0.1:52512}
   [junit4]   2> 1741587 INFO  (TEST-TestDynamicLoading.testDynamicLoading-seed#[B3A124B130BEB0DE]) [    ] o.e.j.s.Server Started @1746799ms
   [junit4]   2> 1741587 INFO  (TEST-TestDynamicLoading.testDynamicLoading-seed#[B3A124B130BEB0DE]) [    ] o.a.s.c.s.e.JettySolrRunner Jetty properties: {solr.data.dir=/x1/jenkins/jenkins-slave/workspace/Lucene-Solr-Tests-trunk-Java8/solr/build/solr-core/test/J1/temp/solr.core.TestDynamicLoading_B3A124B130BEB0DE-001/tempDir-001/control/data, hostContext=/_t, hostPort=52512, coreRootDirectory=/x1/jenkins/jenkins-slave/workspace/Lucene-Solr-Tests-trunk-Java8/solr/build/solr-core/test/J1/temp/solr.core.TestDynamicLoading_B3A124B130BEB0DE-001/control-001/cores}
   [junit4]   2> 1741588 INFO  (TEST-TestDynamicLoading.testDynamicLoading-seed#[B3A124B130BEB0DE]) [    ] o.a.s.s.SolrDispatchFilter SolrDispatchFilter.init(): sun.misc.Launcher$AppClassLoader@4e0e2f2a
   [junit4]   2> 1741588 INFO  (TEST-TestDynamicLoading.testDynamicLoading-seed#[B3A124B130BEB0DE]) [    ] o.a.s.c.SolrResourceLoader new SolrResourceLoader for directory: '/x1/jenkins/jenkins-slave/workspace/Lucene-Solr-Tests-trunk-Java8/solr/build/solr-core/test/J1/temp/solr.core.TestDynamicLoading_B3A124B130BEB0DE-001/control-001'
   [junit4]   2> 1741588 INFO  (TEST-TestDynamicLoading.testDynamicLoading-seed#[B3A124B130BEB0DE]) [    ] o.a.s.c.SolrResourceLoader JNDI not configured for solr (NoInitialContextEx)
   [junit4]   2> 1741588 INFO  (TEST-TestDynamicLoading.testDynamicLoading-seed#[B3A124B130BEB0DE]) [    ] o.a.s.c.SolrResourceLoader solr home defaulted to 'solr/' (could not find system property or JNDI)
   [junit4]   2> 1741588 INFO  (TEST-TestDynamicLoading.testDynamicLoading-seed#[B3A124B130BEB0DE]) [    ] o.a.s.c.c.SolrZkClient Using default ZkCredentialsProvider
   [junit4]   2> 1741589 INFO  (TEST-TestDynamicLoading.testDynamicLoading-seed#[B3A124B130BEB0DE]) [    ] o.a.s.c.c.ConnectionManager Waiting for client to connect to ZooKeeper
   [junit4]   2> 1741590 INFO  (zkCallback-2108-thread-1) [    ] o.a.s.c.c.ConnectionManager Watcher org.apache.solr.common.cloud.ConnectionManager@6b948c8a name:ZooKeeperConnection Watcher:127.0.0.1:35721/solr got event WatchedEvent state:SyncConnected type:None path:null path:null type:None
   [junit4]   2> 1741590 INFO  (TEST-TestDynamicLoading.testDynamicLoading-seed#[B3A124B130BEB0DE]) [    ] o.a.s.c.c.ConnectionManager Client is connected to ZooKeeper
   [junit4]   2> 1741590 INFO  (TEST-TestDynamicLoading.testDynamicLoading-seed#[B3A124B130BEB0DE]) [    ] o.a.s.c.c.SolrZkClient Using default ZkACLProvider
   [junit4]   2> 1741591 INFO  (TEST-TestDynamicLoading.testDynamicLoading-seed#[B3A124B130BEB0DE]) [    ] o.a.s.s.SolrDispatchFilter Loading solr.xml from SolrHome (not found in ZooKeeper)
   [junit4]   2> 1741591 INFO  (TEST-TestDynamicLoading.testDynamicLoading-seed#[B3A124B130BEB0DE]) [    ] o.a.s.c.SolrXmlConfig Loading container configuration from /x1/jenkins/jenkins-slave/workspace/Lucene-Solr-Tests-trunk-Java8/solr/build/solr-core/test/J1/temp/solr.core.TestDynamicLoading_B3A124B130BEB0DE-001/control-001/solr.xml
   [junit4]   2> 1741596 INFO  (TEST-TestDynamicLoading.testDynamicLoading-seed#[B3A124B130BEB0DE]) [    ] o.a.s.c.CorePropertiesLocator Config-defined core root directory: /x1/jenkins/jenkins-slave/workspace/Lucene-Solr-Tests-trunk-Java8/solr/build/solr-core/test/J1/temp/solr.core.TestDynamicLoading_B3A124B130BEB0DE-001/control-001/cores
   [junit4]   2> 1741596 INFO  (TEST-TestDynamicLoading.testDynamicLoading-seed#[B3A124B130BEB0DE]) [    ] o.a.s.c.CoreContainer New CoreContainer 189947214
   [junit4]   2> 1741596 INFO  (TEST-TestDynamicLoading.testDynamicLoading-seed#[B3A124B130BEB0DE]) [    ] o.a.s.c.CoreContainer Loading cores into CoreContainer [instanceDir=/x1/jenkins/jenkins-slave/workspace/Lucene-Solr-Tests-trunk-Java8/solr/build/solr-core/test/J1/temp/solr.core.TestDynamicLoading_B3A124B130BEB0DE-001/control-001]
   [junit4]   2> 1741596 WARN  (TEST-TestDynamicLoading.testDynamicLoading-seed#[B3A124B130BEB0DE]) [    ] o.a.s.c.CoreContainer Couldn't add files from /x1/jenkins/jenkins-slave/workspace/Lucene-Solr-Tests-trunk-Java8/solr/build/solr-core/test/J1/temp/solr.core.TestDynamicLoading_B3A124B130BEB0DE-001/control-001/lib to classpath: /x1/jenkins/jenkins-slave/workspace/Lucene-Solr-Tests-trunk-Java8/solr/build/solr-core/test/J1/temp/solr.core.TestDynamicLoading_B3A124B130BEB0DE-001/control-001/lib
   [junit4]   2> 1741596 INFO  (TEST-TestDynamicLoading.testDynamicLoading-seed#[B3A124B130BEB0DE]) [    ] o.a.s.h.c.HttpShardHandlerFactory created with socketTimeout : 90000,urlScheme : ,connTimeout : 15000,maxConnectionsPerHost : 20,maxConnections : 10000,corePoolSize : 0,maximumPoolSize : 2147483647,maxThreadIdleTime : 5,sizeOfQueue : -1,fairnessPolicy : false,useRetries : false,
   [junit4]   2> 1741599 INFO  (TEST-TestDynamicLoading.testDynamicLoading-seed#[B3A124B130BEB0DE]) [    ] o.a.s.u.UpdateShardHandler Creating UpdateShardHandler HTTP client with params: socketTimeout=340000&connTimeout=45000&retry=true
   [junit4]   2> 1741600 INFO  (TEST-TestDynamicLoading.testDynamicLoading-seed#[B3A124B130BEB0DE]) [    ] o.a.s.l.LogWatcher SLF4J impl is org.slf4j.impl.Log4jLoggerFactory
   [junit4]   2> 1741600 INFO  (TEST-TestDynamicLoading.testDynamicLoading-seed#[B3A124B130BEB0DE]) [    ] o.a.s.l.LogWatcher Registering Log Listener [Log4j (org.slf4j.impl.Log4jLoggerFactory)]
   [junit4]   2> 1741600 INFO  (TEST-TestDynamicLoading.testDynamicLoading-seed#[B3A124B130BEB0DE]) [    ] o.a.s.c.ZkContainer Zookeeper client=127.0.0.1:35721/solr
   [junit4]   2> 1741600 INFO  (TEST-TestDynamicLoading.testDynamicLoading-seed#[B3A124B130BEB0DE]) [    ] o.a.s.c.ZkController zkHost includes chroot
   [junit4]   2> 1741600 INFO  (TEST-TestDynamicLoading.testDynamicLoading-seed#[B3A124B130BEB0DE]) [    ] o.a.s.c.c.SolrZkClient Using default ZkCredentialsProvider
   [junit4]   2> 1741601 INFO  (TEST-TestDynamicLoading.testDynamicLoading-seed#[B3A124B130BEB0DE]) [    ] o.a.s.c.c.ConnectionManager Waiting for client to connect to ZooKeeper
   [junit4]   2> 1741602 INFO  (zkCallback-2111-thread-1) [    ] o.a.s.c.c.ConnectionManager Watcher org.apache.solr.common.cloud.ConnectionManager@6acec1e1 name:ZooKeeperConnection Watcher:127.0.0.1:35721 got event WatchedEvent state:SyncConnected type:None path:null path:null type:None
   [junit4]   2> 1741602 INFO  (TEST-TestDynamicLoading.testDynamicLoading-seed#[B3A124B130BEB0DE]) [    ] o.a.s.c.c.ConnectionManager Client is connected to ZooKeeper
   [junit4]   2> 1741602 INFO  (TEST-TestDynamicLoading.testDynamicLoading-seed#[B3A124B130BEB0DE]) [    ] o.a.s.c.c.SolrZkClient Using default ZkACLProvider
   [junit4]   2> 1741603 INFO  (TEST-TestDynamicLoading.testDynamicLoading-seed#[B3A124B130BEB0DE]) [n:127.0.0.1:52512__t    ] o.a.s.c.c.ConnectionManager Waiting for client to connect to ZooKeeper
   [junit4]   2> 1741604 INFO  (zkCallback-2112-thread-1-processing-n:127.0.0.1:52512__t) [n:127.0.0.1:52512__t    ] o.a.s.c.c.ConnectionManager Watcher org.apache.solr.common.cloud.ConnectionManager@49f1bc3c name:ZooKeeperConnection Watcher:127.0.0.1:35721/solr got event WatchedEvent state:SyncConnected type:None path:null path:null type:None
   [junit4]   2> 1741604 INFO  (TEST-TestDynamicLoading.testDynamicLoading-seed#[B3A124B130BEB0DE]) [n:127.0.0.1:52512__t    ] o.a.s.c.c.ConnectionManager Client is connected to ZooKeeper
   [junit4]   2> 1741605 INFO  (TEST-TestDynamicLoading.testDynamicLoading-seed#[B3A124B130BEB0DE]) [n:127.0.0.1:52512__t    ] o.a.s.c.c.SolrZkClient makePath: /overseer/queue
   [junit4]   2> 1741607 INFO  (TEST-TestDynamicLoading.testDynamicLoading-seed#[B3A124B130BEB0DE]) [n:127.0.0.1:52512__t    ] o.a.s.c.c.SolrZkClient makePath: /overseer/collection-queue-work
   [junit4]   2> 1741609 INFO  (TEST-TestDynamicLoading.testDynamicLoading-seed#[B3A124B130BEB0DE]) [n:127.0.0.1:52512__t    ] o.a.s.c.c.SolrZkClient makePath: /overseer/collection-map-running
   [junit4]   2> 1741611 INFO  (TEST-TestDynamicLoading.testDynamicLoading-seed#[B3A124B130BEB0DE]) [n:127.0.0.1:52512__t    ] o.a.s.c.c.SolrZkClient makePath: /overseer/collection-map-completed
   [junit4]   2> 1741612 INFO  (TEST-TestDynamicLoading.testDynamicLoading-seed#[B3A124B130BEB0DE]) [n:127.0.0.1:52512__t    ] o.a.s.c.c.SolrZkClient makePath: /overseer/collection-map-failure
   [junit4]   2> 1741614 INFO  (TEST-TestDynamicLoading.testDynamicLoading-seed#[B3A124B130BEB0DE]) [n:127.0.0.1:52512__t    ] o.a.s.c.c.SolrZkClient makePath: /live_nodes
   [junit4]   2> 1741616 INFO  (TEST-TestDynamicLoading.testDynamicLoading-seed#[B3A124B130BEB0DE]) [n:127.0.0.1:52512__t    ] o.a.s.c.c.SolrZkClient makePath: /aliases.json
   [junit4]   2> 1741617 INFO  (TEST-TestDynamicLoading.testDynamicLoading-seed#[B3A124B130BEB0DE]) [n:127.0.0.1:52512__t    ] o.a.s.c.c.SolrZkClient makePath: /clusterstate.json
   [junit4]   2> 1741618 INFO  (TEST-TestDynamicLoading.testDynamicLoading-seed#[B3A124B130BEB0DE]) [n:127.0.0.1:52512__t    ] o.a.s.c.c.SolrZkClient makePath: /security.json
   [junit4]   2> 1741618 INFO  (TEST-TestDynamicLoading.testDynamicLoading-seed#[B3A124B130BEB0DE]) [n:127.0.0.1:52512__t    ] o.a.s.c.c.ZkStateReader Updating cluster state from ZooKeeper... 
   [junit4]   2> 1741619 INFO  (TEST-TestDynamicLoading.testDynamicLoading-seed#[B3A124B130BEB0DE]) [n:127.0.0.1:52512__t    ] o.a.s.c.c.ZkStateReader Updated live nodes from ZooKeeper... (0) -> (0)
   [junit4]   2> 1741621 INFO  (TEST-TestDynamicLoading.testDynamicLoading-seed#[B3A124B130BEB0DE]) [n:127.0.0.1:52512__t    ] o.a.s.c.c.SolrZkClient makePath: /overseer_elect
   [junit4]   2> 1741622 INFO  (TEST-TestDynamicLoading.testDynamicLoading-seed#[B3A124B130BEB0DE]) [n:127.0.0.1:52512__t    ] o.a.s.c.c.SolrZkClient makePath: /overseer_elect/election
   [junit4]   2> 1741623 INFO  (TEST-TestDynamicLoading.testDynamicLoading-seed#[B3A124B130BEB0DE]) [n:127.0.0.1:52512__t    ] o.a.s.c.Overseer Overseer (id=null) closing
   [junit4]   2> 1741623 INFO  (TEST-TestDynamicLoading.testDynamicLoading-seed#[B3A124B130BEB0DE]) [n:127.0.0.1:52512__t    ] o.a.s.c.LeaderElector Joined leadership election with path: /overseer_elect/election/95482968441225221-127.0.0.1:52512__t-n_0000000000
   [junit4]   2> 1741623 INFO  (TEST-TestDynamicLoading.testDynamicLoading-seed#[B3A124B130BEB0DE]) [n:127.0.0.1:52512__t    ] o.a.s.c.OverseerElectionContext I am going to be the leader 127.0.0.1:52512__t
   [junit4]   2> 1741623 INFO  (TEST-TestDynamicLoading.testDynamicLoading-seed#[B3A124B130BEB0DE]) [n:127.0.0.1:52512__t    ] o.a.s.c.c.SolrZkClient makePath: /overseer_elect/leader
   [junit4]   2> 1741624 INFO  (TEST-TestDynamicLoading.testDynamicLoading-seed#[B3A124B130BEB0DE]) [n:127.0.0.1:52512__t    ] o.a.s.c.Overseer Overseer (id=95482968441225221-127.0.0.1:52512__t-n_0000000000) starting
   [junit4]   2> 1741626 INFO  (TEST-TestDynamicLoading.testDynamicLoading-seed#[B3A124B130BEB0DE]) [n:127.0.0.1:52512__t    ] o.a.s.c.c.SolrZkClient makePath: /overseer/queue-work
   [junit4]   2> 1741631 INFO  (TEST-TestDynamicLoading.testDynamicLoading-seed#[B3A124B130BEB0DE]) [n:127.0.0.1:52512__t    ] o.a.s.c.OverseerAutoReplicaFailoverThread Starting OverseerAutoReplicaFailoverThread autoReplicaFailoverWorkLoopDelay=10000 autoReplicaFailoverWaitAfterExpiration=30000 autoReplicaFailoverBadNodeExpiration=60000
   [junit4]   2> 1741631 INFO  (OverseerCollectionConfigSetProcessor-95482968441225221-127.0.0.1:52512__t-n_0000000000) [n:127.0.0.1:52512__t    ] o.a.s.c.OverseerTaskProcessor Process current queue of overseer operations
   [junit4]   2> 1741631 INFO  (TEST-TestDynamicLoading.testDynamicLoading-seed#[B3A124B130BEB0DE]) [n:127.0.0.1:52512__t    ] o.a.s.c.ZkController Register node as live in ZooKeeper:/live_nodes/127.0.0.1:52512__t
   [junit4]   2> 1741631 INFO  (OverseerStateUpdate-95482968441225221-127.0.0.1:52512__t-n_0000000000) [n:127.0.0.1:52512__t    ] o.a.s.c.Overseer Starting to work on the main queue
   [junit4]   2> 1741633 INFO  (TEST-TestDynamicLoading.testDynamicLoading-seed#[B3A124B130BEB0DE]) [n:127.0.0.1:52512__t    ] o.a.s.c.c.SolrZkClient makePath: /live_nodes/127.0.0.1:52512__t
   [junit4]   2> 1741634 INFO  (OverseerStateUpdate-95482968441225221-127.0.0.1:52512__t-n_0000000000) [n:127.0.0.1:52512__t    ] o.a.s.c.c.ZkStateReader Updated live nodes from ZooKeeper... (0) -> (0)
   [junit4]   2> 1741635 INFO  (zkCallback-2112-thread-1-processing-n:127.0.0.1:52512__t) [n:127.0.0.1:52512__t    ] o.a.s.c.c.ZkStateReader A live node change: [WatchedEvent state:SyncConnected type:NodeChildrenChanged path:/live_nodes], has occurred - updating... (live nodes size: [0])
   [junit4]   2> 1741635 INFO  (zkCallback-2112-thread-1-processing-n:127.0.0.1:52512__t) [n:127.0.0.1:52512__t    ] o.a.s.c.c.ZkStateReader Updated live nodes from ZooKeeper... (0) -> (1)
   [junit4]   2> 1741646 INFO  (TEST-TestDynamicLoading.testDynamicLoading-seed#[B3A124B130BEB0DE]) [n:127.0.0.1:52512__t    ] o.a.s.c.CoreContainer Security conf doesn't exist. Skipping setup for authorization module.
   [junit4]   2> 1741646 INFO  (TEST-TestDynamicLoading.testDynamicLoading-seed#[B3A124B130BEB0DE]) [n:127.0.0.1:52512__t    ] o.a.s.c.CoreContainer No authentication plugin used.
   [junit4]   2> 1741647 INFO  (TEST-TestDynamicLoading.testDynamicLoading-seed#[B3A124B130BEB0DE]) [n:127.0.0.1:52512__t    ] o.a.s.c.CorePropertiesLocator Looking for core definitions underneath /x1/jenkins/jenkins-slave/workspace/Lucene-Solr-Tests-trunk-Java8/solr/build/solr-core/test/J1/temp/solr.core.TestDynamicLoading_B3A124B130BEB0DE-001/control-001/cores
   [junit4]   2> 1741648 INFO  (TEST-TestDynamicLoading.testDynamicLoading-seed#[B3A124B130BEB0DE]) [n:127.0.0.1:52512__t    ] o.a.s.c.CoreDescriptor Created CoreDescriptor: {name=collection1, config=solrconfig.xml, transient=false, schema=schema.xml, loadOnStartup=true, configSetProperties=configsetprops.json, collection=control_collection, coreNodeName=, dataDir=data/, shard=}
   [junit4]   2> 1741648 INFO  (TEST-TestDynamicLoading.testDynamicLoading-seed#[B3A124B130BEB0DE]) [n:127.0.0.1:52512__t    ] o.a.s.c.CorePropertiesLocator Found core collection1 in /x1/jenkins/jenkins-slave/workspace/Lucene-Solr-Tests-trunk-Java8/solr/build/solr-core/test/J1/temp/solr.core.TestDynamicLoading_B3A124B130BEB0DE-001/control-001/cores/collection1
   [junit4]   2> 1741648 INFO  (TEST-TestDynamicLoading.testDynamicLoading-seed#[B3A124B130BEB0DE]) [n:127.0.0.1:52512__t    ] o.a.s.c.CorePropertiesLocator Found 1 core definitions
   [junit4]   2> 1741649 INFO  (TEST-TestDynamicLoading.testDynamicLoading-seed#[B3A124B130BEB0DE]) [n:127.0.0.1:52512__t    ] o.a.s.s.SolrDispatchFilter user.dir=/x1/jenkins/jenkins-slave/workspace/Lucene-Solr-Tests-trunk-Java8/solr/build/solr-core/test/J1
   [junit4]   2> 1741649 INFO  (TEST-TestDynamicLoading.testDynamicLoading-seed#[B3A124B130BEB0DE]) [n:127.0.0.1:52512__t    ] o.a.s.s.SolrDispatchFilter SolrDispatchFilter.init() done
   [junit4]   2> 1741649 INFO  (coreLoadExecutor-5794-thread-1-processing-n:127.0.0.1:52512__t) [n:127.0.0.1:52512__t c:control_collection   x:collection1] o.a.s.c.ZkController publishing state=down
   [junit4]   2> 1741649 INFO  (coreLoadExecutor-5794-thread-1-processing-n:127.0.0.1:52512__t) [n:127.0.0.1:52512__t c:control_collection   x:collection1] o.a.s.c.ZkController numShards not found on descriptor - reading it from system property
   [junit4]   2> 1741651 INFO  (OverseerStateUpdate-95482968441225221-127.0.0.1:52512__t-n_0000000000) [n:127.0.0.1:52512__t    ] o.a.s.c.Overseer processMessage: queueSize: 1, message = {
   [junit4]   2>   "core":"collection1",
   [junit4]   2>   "roles":null,
   [junit4]   2>   "base_url":"https://127.0.0.1:52512/_t",
   [junit4]   2>   "node_name":"127.0.0.1:52512__t",
   [junit4]   2>   "numShards":"1",
   [junit4]   2>   "state":"down",
   [junit4]   2>   "shard":null,
   [junit4]   2>   "collection":"control_collection",
   [junit4]   2>   "operation":"state"} current state version: 0
   [junit4]   2> 1741651 INFO  (coreLoadExecutor-5794-thread-1-processing-n:127.0.0.1:52512__t) [n:127.0.0.1:52512__t c:control_collection   x:collection1] o.a.s.c.ZkController look for our core node name
   [junit4]   2> 1741652 INFO  (OverseerStateUpdate-95482968441225221-127.0.0.1:52512__t-n_0000000000) [n:127.0.0.1:52512__t    ] o.a.s.c.o.ReplicaMutator Update state numShards=1 message={
   [junit4]   2>   "core":"collection1",
   [junit4]   2>   "roles":null,
   [junit4]   2>   "base_url":"https://127.0.0.1:52512/_t",
   [junit4]   2>   "node_name":"127.0.0.1:52512__t",
   [junit4]   2>   "numShards":"1",
   [junit4]   2>   "state":"down",
   [junit4]   2>   "shard":null,
   [junit4]   2>   "collection":"control_collection",
   [junit4]   2>   "operation":"state"}
   [junit4]   2> 1741652 INFO  (OverseerStateUpdate-95482968441225221-127.0.0.1:52512__t-n_0000000000) [n:127.0.0.1:52512__t    ] o.a.s.c.o.ClusterStateMutator building a new cName: control_collection
   [junit4]   2> 1741652 INFO  (OverseerStateUpdate-95482968441225221-127.0.0.1:52512__t-n_0000000000) [n:127.0.0.1:52512__t    ] o.a.s.c.o.ReplicaMutator Assigning new node to shard shard=shard1
   [junit4]   2> 1741654 INFO  (zkCallback-2112-thread-1-processing-n:127.0.0.1:52512__t) [n:127.0.0.1:52512__t    ] o.a.s.c.c.ZkStateReader A cluster state change: [WatchedEvent state:SyncConnected type:NodeDataChanged path:/clusterstate.json], has occurred - updating... (live nodes size: [1])
   [junit4]   2> 1742652 INFO  (coreLoadExecutor-5794-thread-1-processing-n:127.0.0.1:52512__t) [n:127.0.0.1:52512__t c:control_collection   x:collection1] o.a.s.c.ZkController waiting to find shard id in clusterstate for collection1
   [junit4]   2> 1742652 INFO  (coreLoadExecutor-5794-thread-1-processing-n:127.0.0.1:52512__t) [n:127.0.0.1:52512__t c:control_collection   x:collection1] o.a.s.c.ZkController Check for collection zkNode:control_collection
   [junit4]   2> 1742652 INFO  (coreLoadExecutor-5794-thread-1-processing-n:127.0.0.1:52512__t) [n:127.0.0.1:52512__t c:control_collection   x:collection1] o.a.s.c.ZkController Collection zkNode exists
   [junit4]   2> 1742652 INFO  (coreLoadExecutor-5794-thread-1-processing-n:127.0.0.1:52512__t) [n:127.0.0.1:52512__t c:control_collection   x:collection1] o.a.s.c.c.ZkStateReader Load collection config from: [/collections/control_collection]
   [junit4]   2> 1742653 INFO  (coreLoadExecutor-5794-thread-1-processing-n:127.0.0.1:52512__t) [n:127.0.0.1:52512__t c:control_collection   x:collection1] o.a.s.c.c.ZkStateReader path=[/collections/control_collection] [configName]=[conf1] specified config exists in ZooKeeper
   [junit4]   2> 1742653 INFO  (coreLoadExecutor-5794-thread-1-processing-n:127.0.0.1:52512__t) [n:127.0.0.1:52512__t c:control_collection   x:collection1] o.a.s.c.SolrResourceLoader new SolrResourceLoader for directory: '/x1/jenkins/jenkins-slave/workspace/Lucene-Solr-Tests-trunk-Java8/solr/build/solr-core/test/J1/temp/solr.core.TestDynamicLoading_B3A124B130BEB0DE-001/control-001/cores/collection1'
   [junit4]   2> 1742653 INFO  (coreLoadExecutor-5794-thread-1-processing-n:127.0.0.1:52512__t) [n:127.0.0.1:52512__t c:control_collection   x:collection1] o.a.s.c.SolrResourceLoader JNDI not configured for solr (NoInitialContextEx)
   [junit4]   2> 1742653 INFO  (coreLoadExecutor-5794-thread-1-processing-n:127.0.0.1:52512__t) [n:127.0.0.1:52512__t c:control_collection   x:collection1] o.a.s.c.SolrResourceLoader solr home defaulted to 'solr/' (could not find system property or JNDI)
   [junit4]   2> 1742655 INFO  (coreLoadExecutor-5794-thread-1-processing-n:127.0.0.1:52512__t) [n:127.0.0.1:52512__t c:control_collection   x:collection1] o.a.s.c.Config loaded config solrconfig.xml with version 0 
   [junit4]   2> 1742659 INFO  (coreLoadExecutor-5794-thread-1-processing-n:127.0.0.1:52512__t) [n:127.0.0.1:52512__t c:control_collection   x:collection1] o.a.s.c.SolrConfig current version of requestparams : -1
   [junit4]   2> 1742662 WARN  (coreLoadExecutor-5794-thread-1-processing-n:127.0.0.1:52512__t) [n:127.0.0.1:52512__t c:control_collection   x:collection1] o.a.s.c.Config Beginning with Solr 5.5, <mergePolicy> is deprecated, use <mergePolicyFactory> instead.
   [junit4]   2> 1742663 INFO  (coreLoadExecutor-5794-thread-1-processing-n:127.0.0.1:52512__t) [n:127.0.0.1:52512__t c:control_collection   x:collection1] o.a.s.c.SolrConfig Using Lucene MatchVersion: 7.0.0
   [junit4]   2> 1742681 INFO  (coreLoadExecutor-5794-thread-1-processing-n:127.0.0.1:52512__t) [n:127.0.0.1:52512__t c:control_collection   x:collection1] o.a.s.c.SolrConfig Loaded SolrConfig: solrconfig.xml
   [junit4]   2> 1742687 INFO  (coreLoadExecutor-5794-thread-1-processing-n:127.0.0.1:52512__t) [n:127.0.0.1:52512__t c:control_collection   x:collection1] o.a.s.s.IndexSchema [collection1] Schema name=test
   [junit4]   2> 1742781 INFO  (coreLoadExecutor-5794-thread-1-processing-n:127.0.0.1:52512__t) [n:127.0.0.1:52512__t c:control_collection   x:collection1] o.a.s.s.OpenExchangeRatesOrgProvider Initialized with rates=open-exchange-rates.json, refreshInterval=1440.
   [junit4]   2> 1742787 INFO  (coreLoadExecutor-5794-thread-1-processing-n:127.0.0.1:52512__t) [n:127.0.0.1:52512__t c:control_collection   x:collection1] o.a.s.s.IndexSchema default search field in schema is text
   [junit4]   2> 1742788 INFO  (coreLoadExecutor-5794-thread-1-processing-n:127.0.0.1:52512__t) [n:127.0.0.1:52512__t c:control_collection   x:collection1] o.a.s.s.IndexSchema unique key field: id
   [junit4]   2> 1742796 INFO  (coreLoadExecutor-5794-thread-1-processing-n:127.0.0.1:52512__t) [n:127.0.0.1:52512__t c:control_collection   x:collection1] o.a.s.s.FileExchangeRateProvider Reloading exchange rates from file currency.xml
   [junit4]   2> 1742798 INFO  (coreLoadExecutor-5794-thread-1-processing-n:127.0.0.1:52512__t) [n:127.0.0.1:52512__t c:control_collection   x:collection1] o.a.s.s.FileExchangeRateProvider Reloading exchange rates from file currency.xml
   [junit4]   2> 1742800 INFO  (coreLoadExecutor-5794-thread-1-processing-n:127.0.0.1:52512__t) [n:127.0.0.1:52512__t c:control_collection   x:collection1] o.a.s.s.OpenExchangeRatesOrgProvider Reloading exchange rates from open-exchange-rates.json
   [junit4]   2> 1742801 INFO  (coreLoadExecutor-5794-thread-1-processing-n:127.0.0.1:52512__t) [n:127.0.0.1:52512__t c:control_collection   x:collection1] o.a.s.s.OpenExchangeRatesOrgProvider Reloading exchange rates from open-exchange-rates.json
   [junit4]   2> 1742802 INFO  (coreLoadExecutor-5794-thread-1-processing-n:127.0.0.1:52512__t) [n:127.0.0.1:52512__t c:control_collection   x:collection1] o.a.s.c.ConfigSetProperties Did not find ConfigSet properties, assuming default properties: Can't find resource 'configsetprops.json' in classpath or '/configs/conf1', cwd=/x1/jenkins/jenkins-slave/workspace/Lucene-Solr-Tests-trunk-Java8/solr/build/solr-core/test/J1
   [junit4]   2> 1742802 INFO  (coreLoadExecutor-5794-thread-1-processing-n:127.0.0.1:52512__t) [n:127.0.0.1:52512__t c:control_collection   x:collection1] o.a.s.c.CoreContainer Creating SolrCore 'collection1' using configuration from collection control_collection
   [junit4]   2> 1742803 INFO  (coreLoadExecutor-5794-thread-1-processing-n:127.0.0.1:52512__t) [n:127.0.0.1:52512__t c:control_collection s:shard1 r:core_node1 x:collection1] o.a.s.c.SolrCore org.apache.solr.core.MockDirectoryFactory
   [junit4]   2> 1742803 INFO  (coreLoadExecutor-5794-thread-1-processing-n:127.0.0.1:52512__t) [n:127.0.0.1:52512__t c:control_collection s:shard1 r:core_node1 x:collection1] o.a.s.c.SolrCore [[collection1] ] Opening new SolrCore at [/x1/jenkins/jenkins-slave/workspace/Lucene-Solr-Tests-trunk-Java8/solr/build/solr-core/test/J1/temp/solr.core.TestDynamicLoading_B3A124B130BEB0DE-001/control-001/cores/collection1], dataDir=[/x1/jenkins/jenkins-slave/workspace/Lucene-Solr-Tests-trunk-Java8/solr/build/solr-core/test/J1/temp/solr.core.TestDynamicLoading_B3A124B130BEB0DE-001/control-001/cores/collection1/data/]
   [junit4]   2> 1742803 INFO  (coreLoadExecutor-5794-thread-1-processing-n:127.0.0.1:52512__t) [n:127.0.0.1:52512__t c:control_collection s:shard1 r:core_node1 x:collection1] o.a.s.c.JmxMonitoredMap JMX monitoring is enabled. Adding Solr mbeans to JMX Server: com.sun.jmx.mbeanserver.JmxMBeanServer@749bc964
   [junit4]   2> 1742803 INFO  (coreLoadExecutor-5794-thread-1-processing-n:127.0.0.1:52512__t) [n:127.0.0.1:52512__t c:control_collection s:shard1 r:core_node1 x:collection1] o.a.s.c.CachingDirectoryFactory return new directory for /x1/jenkins/jenkins-slave/workspace/Lucene-Solr-Tests-trunk-Java8/solr/build/solr-core/test/J1/temp/solr.core.TestDynamicLoading_B3A124B130BEB0DE-001/control-001/cores/collection1/data
   [junit4]   2> 1742804 INFO  (coreLoadExecutor-5794-thread-1-processing-n:127.0.0.1:52512__t) [n:127.0.0.1:52512__t c:control_collection s:shard1 r:core_node1 x:collection1] o.a.s.c.SolrCore New index directory detected: old=null new=/x1/jenkins/jenkins-slave/workspace/Lucene-Solr-Tests-trunk-Java8/solr/build/solr-core/test/J1/temp/solr.core.TestDynamicLoading_B3A124B130BEB0DE-001/control-001/cores/collection1/data/index/
   [junit4]   2> 1742804 WARN  (coreLoadExecutor-5794-thread-1-processing-n:127.0.0.1:52512__t) [n:127.0.0.1:52512__t c:control_collection s:shard1 r:core_node1 x:collection1] o.a.s.c.SolrCore [collection1] Solr index directory '/x1/jenkins/jenkins-slave/workspace/Lucene-Solr-Tests-trunk-Java8/solr/build/solr-core/test/J1/temp/solr.core.TestDynamicLoading_B3A124B130BEB0DE-001/control-001/cores/collection1/data/index' doesn't exist. Creating new index...
   [junit4]   2> 1742804 INFO  (coreLoadExecutor-5794-thread-1-processing-n:127.0.0.1:52512__t) [n:127.0.0.1:52512__t c:control_collection s:shard1 r:core_node1 x:collection1] o.a.s.c.CachingDirectoryFactory return new directory for /x1/jenkins/jenkins-slave/workspace/Lucene-Solr-Tests-trunk-Java8/solr/build/solr-core/test/J1/temp/solr.core.TestDynamicLoading_B3A124B130BEB0DE-001/control-001/cores/collection1/data/index
   [junit4]   2> 1742804 INFO  (coreLoadExecutor-5794-thread-1-processing-n:127.0.0.1:52512__t) [n:127.0.0.1:52512__t c:control_collection s:shard1 r:core_node1 x:collection1] o.a.s.u.RandomMergePolicy RandomMergePolicy wrapping class org.apache.lucene.index.LogDocMergePolicy: [LogDocMergePolicy: minMergeSize=1000, mergeFactor=45, maxMergeSize=9223372036854775807, maxMergeSizeForForcedMerge=9223372036854775807, calibrateSizeByDeletes=true, maxMergeDocs=2147483647, maxCFSSegmentSizeMB=8.796093022207999E12, noCFSRatio=0.3235235433399717]
   [junit4]   2> 1742805 INFO  (coreLoadExecutor-5794-thread-1-processing-n:127.0.0.1:52512__t) [n:127.0.0.1:52512__t c:control_collection s:shard1 r:core_node1 x:collection1] o.a.s.c.SolrDeletionPolicy SolrDeletionPolicy.onCommit: commits: num=1
   [junit4]   2> 	commit{dir=MockDirectoryWrapper(RAMDirectory@56caaf34 lockFactory=org.apache.lucene.store.SingleInstanceLockFactory@27ae710f),segFN=segments_1,generation=1}
   [junit4]   2> 1742805 INFO  (coreLoadExecutor-5794-thread-1-processing-n:127.0.0.1:52512__t) [n:127.0.0.1:52512__t c:control_collection s:shard1 r:core_node1 x:collection1] o.a.s.c.SolrDeletionPolicy newest commit generation = 1
   [junit4]   2> 1742805 INFO  (OldIndexDirectoryCleanupThreadForCore-collection1) [n:127.0.0.1:52512__t c:control_collection s:shard1 r:core_node1 x:collection1] o.a.s.c.SolrCore Looking for old index directories to cleanup for core collection1 in /x1/jenkins/jenkins-slave/workspace/Lucene-Solr-Tests-trunk-Java8/solr/build/solr-core/test/J1/temp/solr.core.TestDynamicLoading_B3A124B130BEB0DE-001/control-001/cores/collection1/data/
   [junit4]   2> 1742805 WARN  (OldIndexDirectoryCleanupThreadForCore-collection1) [n:127.0.0.1:52512__t c:control_collection s:shard1 r:core_node1 x:collection1] o.a.s.c.DirectoryFactory /x1/jenkins/jenkins-slave/workspace/Lucene-Solr-Tests-trunk-Java8/solr/build/solr-core/test/J1/temp/solr.core.TestDynamicLoading_B3A124B130BEB0DE-001/control-001/cores/collection1/data/ does not point to a valid data directory; skipping clean-up of old index directories.
   [junit4]   2> 1742808 INFO  (coreLoadExecutor-5794-thread-1-processing-n:127.0.0.1:52512__t) [n:127.0.0.1:52512__t c:control_collection s:shard1 r:core_node1 x:collection1] o.a.s.u.p.UpdateRequestProcessorChain creating updateRequestProcessorChain "nodistrib"
   [junit4]   2> 1742808 INFO  (coreLoadExecutor-5794-thread-1-processing-n:127.0.0.1:52512__t) [n:127.0.0.1:52512__t c:control_collection s:shard1 r:core_node1 x:collection1] o.a.s.u.p.UpdateRequestProcessorChain creating updateRequestProcessorChain "dedupe"
   [junit4]   2> 1742808 INFO  (coreLoadExecutor-5794-thread-1-processing-n:127.0.0.1:52512__t) [n:127.0.0.1:52512__t c:control_collection s:shard1 r:core_node1 x:collection1] o.a.s.u.p.UpdateRequestProcessorChain inserting DistributedUpdateProcessorFactory into updateRequestProcessorChain "dedupe"
   [junit4]   2> 1742808 INFO  (coreLoadExecutor-5794-thread-1-processing-n:127.0.0.1:52512__t) [n:127.0.0.1:52512__t c:control_collection s:shard1 r:core_node1 x:collection1] o.a.s.u.p.UpdateRequestProcessorChain creating updateRequestProcessorChain "stored_sig"
   [junit4]   2> 1742808 INFO  (coreLoadExecutor-5794-thread-1-processing-n:127.0.0.1:52512__t) [n:127.0.0.1:52512__t c:control_collection s:shard1 r:core_node1 x:collection1] o.a.s.u.p.UpdateRequestProcessorChain inserting DistributedUpdateProcessorFactory into updateRequestProcessorChain "stored_sig"
   [junit4]   2> 1742808 INFO  (coreLoadExecutor-5794-thread-1-processing-n:127.0.0.1:52512__t) [n:127.0.0.1:52512__t c:control_collection s:shard1 r:core_node1 x:collection1] o.a.s.u.p.UpdateRequestProcessorChain creating updateRequestProcessorChain "distrib-dup-test-chain-explicit"
   [junit4]   2> 1742809 INFO  (coreLoadExecutor-5794-thread-1-processing-n:127.0.0.1:52512__t) [n:127.0.0.1:52512__t c:control_collection s:shard1 r:core_node1 x:collection1] o.a.s.u.p.UpdateRequestProcessorChain creating updateRequestProcessorChain "distrib-dup-test-chain-implicit"
   [junit4]   2> 1742809 INFO  (coreLoadExecutor-5794-thread-1-processing-n:127.0.0.1:52512__t) [n:127.0.0.1:52512__t c:control_collection s:shard1 r:core_node1 x:collection1] o.a.s.u.p.UpdateRequestProcessorChain inserting DistributedUpdateProcessorFactory into updateRequestProcessorChain "distrib-dup-test-chain-implicit"
   [junit4]   2> 1742809 INFO  (coreLoadExecutor-5794-thread-1-processing-n:127.0.0.1:52512__t) [n:127.0.0.1:52512__t c:control_collection s:shard1 r:core_node1 x:collection1] o.a.s.c.SolrCore no updateRequestProcessorChain defined as default, creating implicit default
   [junit4]   2> 1742809 WARN  (coreLoadExecutor-5794-thread-1-processing-n:127.0.0.1:52512__t) [n:127.0.0.1:52512__t c:control_collection s:shard1 r:core_node1 x:collection1] o.a.s.c.RequestHandlers INVALID paramSet a in requestHandler {type = requestHandler,name = /dump,class = DumpRequestHandler,args = {defaults={a=A,b=B}}}
   [junit4]   2> 1742811 INFO  (coreLoadExecutor-5794-thread-1-processing-n:127.0.0.1:52512__t) [n:127.0.0.1:52512__t c:control_collection s:shard1 r:core_node1 x:collection1] o.a.s.h.l.XMLLoader xsltCacheLifetimeSeconds=60
   [junit4]   2> 1742811 INFO  (coreLoadExecutor-5794-thread-1-processing-n:127.0.0.1:52512__t) [n:127.0.0.1:52512__t c:control_collection s:shard1 r:core_node1 x:collection1] o.a.s.h.l.XMLLoader xsltCacheLifetimeSeconds=60
   [junit4]   2> 1742812 INFO  (coreLoadExecutor-5794-thread-1-processing-n:127.0.0.1:52512__t) [n:127.0.0.1:52512__t c:control_collection s:shard1 r:core_node1 x:collection1] o.a.s.h.l.XMLLoader xsltCacheLifetimeSeconds=60
   [junit4]   2> 1742813 INFO  (coreLoadExecutor-5794-thread-1-processing-n:127.0.0.1:52512__t) [n:127.0.0.1:52512__t c:control_collection s:shard1 r:core_node1 x:collection1] o.a.s.h.l.XMLLoader xsltCacheLifetimeSeconds=60
   [junit4]   2> 1742816 INFO  (coreLoadExecutor-5794-thread-1-processing-n:127.0.0.1:52512__t) [n:127.0.0.1:52512__t c:control_collection s:shard1 r:core_node1 x:collection1] o.a.s.c.RequestHandlers Registered paths: /admin/mbeans,standard,/dump,/update/csv,/sql,/update/json/docs,/admin/luke,/export,/admin/segments,/get,/admin/system,/replication,/admin/properties,/config,/stream,/schema,/admin/plugins,/admin/logging,/update/json,/admin/ping,/admin/threads,/update,/admin/file
   [junit4]   2> 1742817 INFO  (coreLoadExecutor-5794-thread-1-processing-n:127.0.0.1:52512__t) [n:127.0.0.1:52512__t c:control_collection s:shard1 r:core_node1 x:collection1] o.a.s.c.SolrCore Using default statsCache cache: org.apache.solr.search.stats.LocalStatsCache
   [junit4]   2> 1742817 INFO  (coreLoadExecutor-5794-thread-1-processing-n:127.0.0.1:52512__t) [n:127.0.0.1:52512__t c:control_collection s:shard1 r:core_node1 x:collection1] o.a.s.u.UpdateHandler Using UpdateLog implementation: org.apache.solr.update.UpdateLog
   [junit4]   2> 1742818 INFO  (coreLoadExecutor-5794-thread-1-processing-n:127.0.0.1:52512__t) [n:127.0.0.1:52512__t c:control_collection s:shard1 r:core_node1 x:collection1] o.a.s.u.UpdateLog Initializing UpdateLog: dataDir= defaultSyncLevel=FLUSH numRecordsToKeep=100 maxNumLogsToKeep=10 numVersionBuckets=65536
   [junit4]   2> 1742833 INFO  (coreLoadExecutor-5794-thread-1-processing-n:127.0.0.1:52512__t) [n:127.0.0.1:52512__t c:control_collection s:shard1 r:core_node1 x:collection1] o.a.s.u.CommitTracker Hard AutoCommit: disabled
   [junit4]   2> 1742833 INFO  (coreLoadExecutor-5794-thread-1-processing-n:127.0.0.1:52512__t) [n:127.0.0.1:52512__t c:control_collection s:shard1 r:core_node1 x:collection1] o.a.s.u.CommitTracker Soft AutoCommit: disabled
   [junit4]   2> 1742833 INFO  (coreLoadExecutor-5794-thread-1-processing-n:127.0.0.1:52512__t) [n:127.0.0.1:52512__t c:control_collection s:shard1 r:core_node1 x:collection1] o.a.s.u.RandomMergePolicy RandomMergePolicy wrapping class org.apache.lucene.index.LogDocMergePolicy: [LogDocMergePolicy: minMergeSize=1000, mergeFactor=46, maxMergeSize=9223372036854775807, maxMergeSizeForForcedMerge=9223372036854775807, calibrateSizeByDeletes=false, maxMergeDocs=2147483647, maxCFSSegmentSizeMB=8.796093022207999E12, noCFSRatio=0.6530698125743056]
   [junit4]   2> 1742833 INFO  (coreLoadExecutor-5794-thread-1-processing-n:127.0.0.1:52512__t) [n:127.0.0.1:52512__t c:control_collection s:shard1 r:core_node1 x:collection1] o.a.s.c.SolrDeletionPolicy SolrDeletionPolicy.onInit: commits: num=1
   [junit4]   2> 	commit{dir=MockDirectoryWrapper(RAMDirectory@56caaf34 lockFactory=org.apache.lucene.store.SingleInstanceLockFactory@27ae710f),segFN=segments_1,generation=1}
   [junit4]   2> 1742834 INFO  (coreLoadExecutor-5794-thread-1-processing-n:127.0.0.1:52512__t) [n:127.0.0.1:52512__t c:control_collection s:shard1 r:core_node1 x:collection1] o.a.s.c.SolrDeletionPolicy newest commit generation = 1
   [junit4]   2> 1742834 INFO  (coreLoadExecutor-5794-thread-1-processing-n:127.0.0.1:52512__t) [n:127.0.0.1:52512__t c:control_collection s:shard1 r:core_node1 x:collection1] o.a.s.s.SolrIndexSearcher Opening [Searcher@48bfa312[collection1] main]
   [junit4]   2> 1742834 INFO  (coreLoadExecutor-5794-thread-1-processing-n:127.0.0.1:52512__t) [n:127.0.0.1:52512__t c:control_collection s:shard1 r:core_node1 x:collection1] o.a.s.c.c.ZkStateReader Load collection config from: [/collections/control_collection]
   [junit4]   2> 1742834 INFO  (coreLoadExecutor-5794-thread-1-processing-n:127.0.0.1:52512__t) [n:127.0.0.1:52512__t c:control_collection s:shard1 r:core_node1 x:collection1] o.a.s.c.c.ZkStateReader path=[/collections/control_collection] [configName]=[conf1] specified config exists in ZooKeeper
   [junit4]   2> 1742835 INFO  (coreLoadExecutor-5794-thread-1-processing-n:127.0.0.1:52512__t) [n:127.0.0.1:52512__t c:control_collection s:shard1 r:core_node1 x:collection1] o.a.s.r.ManagedResourceStorage Setting up ZooKeeper-based storage for the RestManager with znodeBase: /configs/conf1
   [junit4]   2> 1742835 INFO  (coreLoadExecutor-5794-thread-1-processing-n:127.0.0.1:52512__t) [n:127.0.0.1:52512__t c:control_collection s:shard1 r:core_node1 x:collection1] o.a.s.r.ManagedResourceStorage Configured ZooKeeperStorageIO with znodeBase: /configs/conf1
   [junit4]   2> 1742835 INFO  (coreLoadExecutor-5794-thread-1-processing-n:127.0.0.1:52512__t) [n:127.0.0.1:52512__t c:control_collection s:shard1 r:core_node1 x:collection1] o.a.s.r.RestManager Initializing RestManager with initArgs: {}
   [junit4]   2> 1742835 INFO  (coreLoadExecutor-5794-thread-1-processing-n:127.0.0.1:52512__t) [n:127.0.0.1:52512__t c:control_collection s:shard1 r:core_node1 x:collection1] o.a.s.r.ManagedResourceStorage Reading _rest_managed.json using ZooKeeperStorageIO:path=/configs/conf1
   [junit4]   2> 1742836 INFO  (coreLoadExecutor-5794-thread-1-processing-n:127.0.0.1:52512__t) [n:127.0.0.1:52512__t c:control_collection s:shard1 r:core_node1 x:collection1] o.a.s.r.ManagedResourceStorage No data found for znode /configs/conf1/_rest_managed.json
   [junit4]   2> 1742836 INFO  (coreLoadExecutor-5794-thread-1-processing-n:127.0.0.1:52512__t) [n:127.0.0.1:52512__t c:control_collection s:shard1 r:core_node1 x:collection1] o.a.s.r.ManagedResourceStorage Loaded null at path _rest_managed.json using ZooKeeperStorageIO:path=/configs/conf1
   [junit4]   2> 1742836 INFO  (coreLoadExecutor-5794-thread-1-processing-n:127.0.0.1:52512__t) [n:127.0.0.1:52512__t c:control_collection s:shard1 r:core_node1 x:collection1] o.a.s.r.RestManager Initializing 0 registered ManagedResources
   [junit4]   2> 1742836 INFO  (coreLoadExecutor-5794-thread-1-processing-n:127.0.0.1:52512__t) [n:127.0.0.1:52512__t c:control_collection s:shard1 r:core_node1 x:collection1] o.a.s.h.ReplicationHandler Commits will be reserved for  10000
   [junit4]   2> 1742836 INFO  (coreLoadExecutor-5794-thread-1-processing-n:127.0.0.1:52512__t) [n:127.0.0.1:52512__t c:control_collection s:shard1 r:core_node1 x:collection1] o.a.s.u.UpdateLog Looking up max value of version field to seed version buckets
   [junit4]   2> 1742836 INFO  (coreLoadExecutor-5794-thread-1-processing-n:127.0.0.1:52512__t) [n:127.0.0.1:52512__t c:control_collection s:shard1 r:core_node1 x:collection1] o.a.s.u.VersionInfo Refreshing highest value of _version_ for 65536 version buckets from index
   [junit4]   2> 1742836 INFO  (coreLoadExecutor-5794-thread-1-processing-n:127.0.0.1:52512__t) [n:127.0.0.1:52512__t c:control_collection s:shard1 r:core_node1 x:collection1] o.a.s.u.VersionInfo No terms found for _version_, cannot seed version bucket highest value from index
   [junit4]   2> 1742836 INFO  (coreLoadExecutor-5794-thread-1-processing-n:127.0.0.1:52512__t) [n:127.0.0.1:52512__t c:control_collection s:shard1 r:core_node1 x:collection1] o.a.s.u.UpdateLog Could not find max version in index or recent updates, using new clock 1527727496612544512
   [junit4]   2> 1742839 INFO  (coreLoadExecutor-5794-thread-1-processing-n:127.0.0.1:52512__t) [n:127.0.0.1:52512__t c:control_collection s:shard1 r:core_node1 x:collection1] o.a.s.u.UpdateLog Took 2.0ms to seed version buckets with highest version 1527727496612544512
   [junit4]   2> 1742839 INFO  (searcherExecutor-5795-thread-1-processing-n:127.0.0.1:52512__t x:collection1 s:shard1 c:control_collection r:core_node1) [n:127.0.0.1:52512__t c:control_collection s:shard1 r:core_node1 x:collection1] o.a.s.c.SolrCore [collection1] Registered new searcher Searcher@48bfa312[collection1] main{ExitableDirectoryReader(UninvertingDirectoryReader())}
   [junit4]   2> 1742839 INFO  (coreLoadExecutor-5794-thread-1-processing-n:127.0.0.1:52512__t) [n:127.0.0.1:52512__t c:control_collection s:shard1 r:core_node1 x:collection1] o.a.s.c.ZkController watch zkdir /configs/conf1
   [junit4]   2> 1742840 INFO  (coreLoadExecutor-5794-thread-1-processing-n:127.0.0.1:52512__t) [n:127.0.0.1:52512__t c:control_collection s:shard1 r:core_node1 x:collection1] o.a.s.c.CoreContainer registering core: collection1
   [junit4]   2> 1742840 INFO  (coreZkRegister-5788-thread-1-processing-n:127.0.0.1:52512__t x:collection1 s:shard1 c:control_collection r:core_node1) [n:127.0.0.1:52512__t c:control_collection s:shard1 r:core_node1 x:collection1] o.a.s.c.ZkController Register replica - core:collection1 address:https://127.0.0.1:52512/_t collection:control_collection shard:shard1
   [junit4]   2> 1742841 INFO  (coreZkRegister-5788-thread-1-processing-n:127.0.0.1:52512__t x:collection1 s:shard1 c:control_collection r:core_node1) [n:127.0.0.1:52512__t c:control_collection s:shard1 r:core_node1 x:collection1] o.a.s.c.c.SolrZkClient makePath: /collections/control_collection/leader_elect/shard1/election
   [junit4]   2> 1742844 INFO  (coreZkRegister-5788-thread-1-processing-n:127.0.0.1:52512__t x:collection1 s:shard1 c:control_collection r:core_node1) [n:127.0.0.1:52512__t c:control_collection s:shard1 r:core_node1 x:collection1] o.a.s.c.LeaderElector Joined leadership election with path: /collections/control_collection/leader_elect/shard1/election/95482968441225221-core_node1-n_0000000000
   [junit4]   2> 1742844 INFO  (coreZkRegister-5788-thread-1-processing-n:127.0.0.1:52512__t x:collection1 s:shard1 c:control_collection r:core_node1) [n:127.0.0.1:52512__t c:control_collection s:shard1 r:core_node1 x:collection1] o.a.s.c.ShardLeaderElectionContext Running the leader process for shard=shard1 and weAreReplacement=false and leaderVoteWait=10000
   [junit4]   2> 1742846 INFO  (coreZkRegister-5788-thread-1-processing-n:127.0.0.1:52512__t x:collection1 s:shard1 c:control_collection r:core_node1) [n:127.0.0.1:52512__t c:control_collection s:shard1 r:core_node1 x:collection1] o.a.s.c.ShardLeaderElectionContext Enough replicas found to continue.
   [junit4]   2> 1742846 INFO  (coreZkRegister-5788-thread-1-processing-n:127.0.0.1:52512__t x:collection1 s:shard1 c:control_collection r:core_node1) [n:127.0.0.1:52512__t c:control_collection s:shard1 r:core_node1 x:collection1] o.a.s.c.ShardLeaderElectionContext I may be the new leader - try and sync
   [junit4]   2> 1742846 INFO  (coreZkRegister-5788-thread-1-processing-n:127.0.0.1:52512__t x:collection1 s:shard1 c:control_collection r:core_node1) [n:127.0.0.1:52512__t c:control_collection s:shard1 r:core_node1 x:collection1] o.a.s.c.SyncStrategy Sync replicas to https://127.0.0.1:52512/_t/collection1/
   [junit4]   2> 1742846 INFO  (coreZkRegister-5788-thread-1-processing-n:127.0.0.1:52512__t x:collection1 s:shard1 c:control_collection r:core_node1) [n:127.0.0.1:52512__t c:control_collection s:shard1 r:core_node1 x:collection1] o.a.s.c.SyncStrategy Sync Success - now sync replicas to me
   [junit4]   2> 1742846 INFO  (coreZkRegister-5788-thread-1-processing-n:127.0.0.1:52512__t x:collection1 s:shard1 c:control_collection r:core_node1) [n:127.0.0.1:52512__t c:control_collection s:shard1 r:core_node1 x:collection1] o.a.s.c.SyncStrategy https://127.0.0.1:52512/_t/collection1/ has no replicas
   [junit4]   2> 1742846 INFO  (OverseerStateUpdate-95482968441225221-127.0.0.1:52512__t-n_0000000000) [n:127.0.0.1:52512__t    ] o.a.s.c.Overseer processMessage: queueSize: 1, message = {
   [junit4]   2>   "operation":"leader",
   [junit4]   2>   "shard":"shard1",
   [junit4]   2>   "collection":"control_collection"} current state version: 1
   [junit4]   2> 1742847 INFO  (coreZkRegister-5788-thread-1-processing-n:127.0.0.1:52512__t x:collection1 s:shard1 c:control_collection r:core_node1) [n:127.0.0.1:52512__t c:control_collection s:shard1 r:core_node1 x:collection1] o.a.s.c.c.SolrZkClient makePath: /collections/control_collection/leaders/shard1
   [junit4]   2> 1742850 INFO  (coreZkRegister-5788-thread-1-processing-n:127.0.0.1:52512__t x:collection1 s:shard1 c:control_collection r:core_node1) [n:127.0.0.1:52512__t c:control_collection s:shard1 r:core_node1 x:collection1] o.a.s.c.ShardLeaderElectionContextBase Creating leader registration node /collections/control_collection/leaders/shard1/leader after winning as /collections/control_collection/leader_elect/shard1/election/95482968441225221-core_node1-n_0000000000
   [junit4]   2> 1742852 INFO  (coreZkRegister-5788-thread-1-processing-n:127.0.0.1:52512__t x:collection1 s:shard1 c:control_collection r:core_node1) [n:127.0.0.1:52512__t c:control_collection s:shard1 r:core_node1 x:collection1] o.a.s.c.ShardLeaderElectionContext I am the new leader: https://127.0.0.1:52512/_t/collection1/ shard1
   [junit4]   2> 1742852 INFO  (OverseerStateUpdate-95482968441225221-127.0.0.1:52512__t-n_0000000000) [n:127.0.0.1:52512__t    ] o.a.s.c.Overseer processMessage: queueSize: 1, message = {
   [junit4]   2>   "operation":"leader",
   [junit4]   2>   "shard":"shard1",
   [junit4]   2>   "collection":"control_collection",
   [junit4]   2>   "base_url":"https://127.0.0.1:52512/_t",
   [junit4]   2>   "core":"collection1",
   [junit4]   2>   "state":"active"} current state version: 1
   [junit4]   2> 1742954 INFO  (zkCallback-2112-thread-1-processing-n:127.0.0.1:52512__t) [n:127.0.0.1:52512__t    ] o.a.s.c.c.ZkStateReader A cluster state change: [WatchedEvent state:SyncConnected type:NodeDataChanged path:/clusterstate.json], has occurred - updating... (live nodes size: [1])
   [junit4]   2> 1743003 INFO  (coreZkRegister-5788-thread-1-processing-n:127.0.0.1:52512__t x:collection1 s:shard1 c:control_collection r:core_node1) [n:127.0.0.1:52512__t c:control_collection s:shard1 r:core_node1 x:collection1] o.a.s.c.ZkController We are https://127.0.0.1:52512/_t/collection1/ and leader is https://127.0.0.1:52512/_t/collection1/
   [junit4]   2> 1743003 INFO  (coreZkRegister-5788-thread-1-processing-n:127.0.0.1:52512__t x:collection1 s:shard1 c:control_collection r:core_node1) [n:127.0.0.1:52512__t c:control_collection s:shard1 r:core_node1 x:collection1] o.a.s.c.ZkController No LogReplay needed for core=collection1 baseURL=https://127.0.0.1:52512/_t
   [junit4]   2> 1743003 INFO  (coreZkRegister-5788-thread-1-processing-n:127.0.0.1:52512__t x:collection1 s:shard1 c:control_collection r:core_node1) [n:127.0.0.1:52512__t c:control_collection s:shard1 r:core_node1 x:collection1] o.a.s.c.ZkController I am the leader, no recovery necessary
   [junit4]   2> 1743003 INFO  (coreZkRegister-5788-thread-1-processing-n:127.0.0.1:52512__t x:collection1 s:shard1 c:control_collection r:core_node1) [n:127.0.0.1:52512__t c:control_collection s:shard1 r:core_node1 x:collection1] o.a.s.c.ZkController publishing state=active
   [junit4]   2> 1743003 INFO  (coreZkRegister-5788-thread-1-processing-n:127.0.0.1:52512__t x:collection1 s:shard1 c:control_collection r:core_node1) [n:127.0.0.1:52512__t c:control_collection s:shard1 r:core_node1 x:collection1] o.a.s.c.ZkController numShards not found on descriptor - reading it from system property
   [junit4]   2> 1743005 INFO  (OverseerStateUpdate-95482968441225221-127.0.0.1:52512__t-n_0000000000) [n:127.0.0.1:52512__t    ] o.a.s.c.Overseer processMessage: queueSize: 1, message = {
   [junit4]   2>   "core":"collection1",
   [junit4]   2>   "core_node_name":"core_node1",
   [junit4]   2>   "roles":null,
   [junit4]   2>   "base_url":"https://127.0.0.1:52512/_t",
   [junit4]   2>   "node_name":"127.0.0.1:52512__t",
   [junit4]   2>   "numShards":"1",
   [junit4]   2>   "state":"active",
   [junit4]   2>   "shard":"shard1",
   [junit4]   2>   "collection":"control_collection",
   [junit4]   2>   "operation":"state"} current state version: 2
   [junit4]   2> 1743010 INFO  (coreZkRegister-5788-thread-1-processing-n:127.0.0.1:52512__t x:collection1 s:shard1 c:control_collection r:core_node1) [n:127.0.0.1:52512__t c:control_collection s:shard1 r:core_node1 x:collection1] o.a.s.c.c.ZkStateReader Updated live nodes from ZooKeeper... (1) -> (1)
   [junit4]   2> 1743010 INFO  (OverseerStateUpdate-95482968441225221-127.0.0.1:52512__t-n_0000000000) [n:127.0.0.1:52512__t    ] o.a.s.c.o.ReplicaMutator Update state numShards=1 message={
   [junit4]   2>   "core":"collection1",
   [junit4]   2>   "core_node_name":"core_node1",
   [junit4]   2>   "roles":null,
   [junit4]   2>   "base_url":"https://127.0.0.1:52512/_t",
   [junit4]   2>   "node_name":"127.0.0.1:52512__t",
   [junit4]   2>   "numShards":"1",
   [junit4]   2>   "state":"active",
   [junit4]   2>   "shard":"shard1",
   [junit4]   2>   "collection":"control_collection",
   [junit4]   2>   "operation":"state"}
   [junit4]   2> 1743113 INFO  (zkCallback-2112-thread-1-processing-n:127.0.0.1:52512__t) [n:127.0.0.1:52512__t    ] o.a.s.c.c.ZkStateReader A cluster state change: [WatchedEvent state:SyncConnected type:NodeDataChanged path:/clusterstate.json], has occurred - updating... (live nodes size: [1])
   [junit4]   2> 1743152 INFO  (TEST-TestDynamicLoading.testDynamicLoading-seed#[B3A124B130BEB0DE]) [    ] o.a.s.c.c.SolrZkClient Using default ZkCredentialsProvider
   [junit4]   2> 1743158 INFO  (TEST-TestDynamicLoading.testDynamicLoading-seed#[B3A124B130BEB0DE]) [    ] o.a.s.c.c.ConnectionManager Waiting for client to connect to ZooKeeper
   [junit4]   2> 1743159 INFO  (zkCallback-2114-thread-1) [    ] o.a.s.c.c.ConnectionManager Watcher org.apache.solr.common.cloud.ConnectionManager@7152245e name:ZooKeeperConnection Watcher:127.0.0.1:35721/solr got event WatchedEvent state:SyncConnected type:None path:null path:null type:None
   [junit4]   2> 1743159 INFO  (TEST-TestDynamicLoading.testDynamicLoading-seed#[B3A124B130BEB0DE]) [    ] o.a.s.c.c.ConnectionManager Client is connected to ZooKeeper
   [junit4]   2> 1743159 INFO  (TEST-TestDynamicLoading.testDynamicLoading-seed#[B3A124B130BEB0DE]) [    ] o.a.s.c.c.SolrZkClient Using default ZkACLProvider
   [junit4]   2> 1743159 INFO  (TEST-TestDynamicLoading.testDynamicLoading-seed#[B3A124B130BEB0DE]) [    ] o.a.s.c.c.ZkStateReader Updating cluster state from ZooKeeper... 
   [junit4]   2> 1743160 INFO  (TEST-TestDynamicLoading.testDynamicLoading-seed#[B3A124B130BEB0DE]) [    ] o.a.s.c.c.ZkStateReader Updated live nodes from ZooKeeper... (0) -> (1)
   [junit4]   2> 1743162 INFO  (TEST-TestDynamicLoading.testDynamicLoading-seed#[B3A124B130BEB0DE]) [    ] o.a.s.c.ChaosMonkey monkey: init - expire sessions:false cause connection loss:false
   [junit4]   2> 1743255 INFO  (TEST-TestDynamicLoading.testDynamicLoading-seed#[B3A124B130BEB0DE]) [    ] o.a.s.SolrTestCaseJ4 Writing core.properties file to /x1/jenkins/jenkins-slave/workspace/Lucene-Solr-Tests-trunk-Java8/solr/build/solr-core/test/J1/temp/solr.core.TestDynamicLoading_B3A124B130BEB0DE-001/shard-1-001/cores/collection1
   [junit4]   2> 1743256 INFO  (TEST-TestDynamicLoading.testDynamicLoading-seed#[B3A124B130BEB0DE]) [    ] o.a.s.c.AbstractFullDistribZkTestBase create jetty 1 in directory /x1/jenkins/jenkins-slave/workspace/Lucene-Solr-Tests-trunk-Java8/solr/build/solr-core/test/J1/temp/solr.core.TestDynamicLoading_B3A124B130BEB0DE-001/shard-1-001
   [junit4]   2> 1743257 INFO  (TEST-TestDynamicLoading.testDynamicLoading-seed#[B3A124B130BEB0DE]) [    ] o.e.j.s.Server jetty-9.3.6.v20151106
   [junit4]   2> 1743258 INFO  (TEST-TestDynamicLoading.testDynamicLoading-seed#[B3A124B130BEB0DE]) [    ] o.e.j.s.h.ContextHandler Started o.e.j.s.ServletContextHandler@2971d3b1{/_t,null,AVAILABLE}
   [junit4]   2> 1743259 INFO  (TEST-TestDynamicLoading.testDynamicLoading-seed#[B3A124B130BEB0DE]) [    ] o.e.j.u.s.SslContextFactory x509=X509@3cb60662(solrtest,h=[],w=[]) for SslContextFactory@234201f9(file:///x1/jenkins/jenkins-slave/workspace/Lucene-Solr-Tests-trunk-Java8/solr/server/etc/test/solrtest.keystore,file:///x1/jenkins/jenkins-slave/workspace/Lucene-Solr-Tests-trunk-Java8/solr/server/etc/test/solrtest.keystore)
   [junit4]   2> 1743261 INFO  (TEST-TestDynamicLoading.testDynamicLoading-seed#[B3A124B130BEB0DE]) [    ] o.e.j.s.ServerConnector Started ServerConnector@7447cc81{SSL,[ssl, http/1.1]}{127.0.0.1:36935}
   [junit4]   2> 1743261 INFO  (TEST-TestDynamicLoading.testDynamicLoading-seed#[B3A124B130BEB0DE]) [    ] o.e.j.s.Server Started @1748473ms
   [junit4]   2> 1743262 INFO  (TEST-TestDynamicLoading.testDynamicLoading-seed#[B3A124B130BEB0DE]) [    ] o.a.s.c.s.e.JettySolrRunner Jetty properties: {solr.data.dir=/x1/jenkins/jenkins-slave/workspace/Lucene-Solr-Tests-trunk-Java8/solr/build/solr-core/test/J1/temp/solr.core.TestDynamicLoading_B3A124B130BEB0DE-001/tempDir-001/jetty1, solrconfig=solrconfig.xml, hostContext=/_t, hostPort=36935, coreRootDirectory=/x1/jenkins/jenkins-slave/workspace/Lucene-Solr-Tests-trunk-Java8/solr/build/solr-core/test/J1/temp/solr.core.TestDynamicLoading_B3A124B130BEB0DE-001/shard-1-001/cores}
   [junit4]   2> 1743262 INFO  (TEST-TestDynamicLoading.testDynamicLoading-seed#[B3A124B130BEB0DE]) [    ] o.a.s.s.SolrDispatchFilter SolrDispatchFilter.init(): sun.misc.Launcher$AppClassLoader@4e0e2f2a
   [junit4]   2> 1743262 INFO  (TEST-TestDynamicLoading.testDynamicLoading-seed#[B3A124B130BEB0DE]) [    ] o.a.s.c.SolrResourceLoader new SolrResourceLoader for directory: '/x1/jenkins/jenkins-slave/workspace/Lucene-Solr-Tests-trunk-Java8/solr/build/solr-core/test/J1/temp/solr.core.TestDynamicLoading_B3A124B130BEB0DE-001/shard-1-001'
   [junit4]   2> 1743262 INFO  (TEST-TestDynamicLoading.testDynamicLoading-seed#[B3A124B130BEB0DE]) [    ] o.a.s.c.SolrResourceLoader JNDI not configured for solr (NoInitialContextEx)
   [junit4]   2> 1743262 INFO  (TEST-TestDynamicLoading.testDynamicLoading-seed#[B3A124B130BEB0DE]) [    ] o.a.s.c.SolrResourceLoader solr home defaulted to 'solr/' (could not find system property or JNDI)
   [junit4]   2> 1743263 INFO  (TEST-TestDynamicLoading.testDynamicLoading-seed#[B3A124B130BEB0DE]) [    ] o.a.s.c.c.SolrZkClient Using default ZkCredentialsProvider
   [junit4]   2> 1743263 INFO  (TEST-TestDynamicLoading.testDynamicLoading-seed#[B3A124B130BEB0DE]) [    ] o.a.s.c.c.ConnectionManager Waiting for client to connect to ZooKeeper
   [junit4]   2> 1743264 INFO  (zkCallback-2115-thread-1) [    ] o.a.s.c.c.ConnectionManager Watcher org.apache.solr.common.cloud.ConnectionManager@2804d662 name:ZooKeeperConnection Watcher:127.0.0.1:35721/solr got event WatchedEvent state:SyncConnected type:None path:null path:null type:None
   [junit4]   2> 1743264 INFO  (TEST-TestDynamicLoading.testDynamicLoading-seed#[B3A124B130BEB0DE]) [    ] o.a.s.c.c.ConnectionManager Client is connected to ZooKeeper
   [junit4]   2> 1743265 INFO  (TEST-TestDynamicLoading.testDynamicLoading-seed#[B3A124B130BEB0DE]) [    ] o.a.s.c.c.SolrZkClient Using default ZkACLProvider
   [junit4]   2> 1743265 INFO  (TEST-TestDynamicLoading.testDynamicLoading-seed#[B3A124B130BEB0DE]) [    ] o.a.s.s.SolrDispatchFilter Loading solr.xml from SolrHome (not found in ZooKeeper)
   [junit4]   2> 1743265 INFO  (TEST-TestDynamicLoading.testDynamicLoading-seed#[B3A124B130BEB0DE]) [    ] o.a.s.c.SolrXmlConfig Loading container configuration from /x1/jenkins/jenkins-slave/workspace/Lucene-Solr-Tests-trunk-Java8/solr/build/solr-core/test/J1/temp/solr.core.TestDynamicLoading_B3A124B130BEB0DE-001/shard-1-001/solr.xml
   [junit4]   2> 1743270 INFO  (TEST-TestDynamicLoading.testDynamicLoading-seed#[B3A124B130BEB0DE]) [    ] o.a.s.c.CorePropertiesLocator Config-defined core root directory: /x1/jenkins/jenkins-slave/workspace/Lucene-Solr-Tests-trunk-Java8/solr/build/solr-core/test/J1/temp/solr.core.TestDynamicLoading_B3A124B130BEB0DE-001/shard-1-001/cores
   [junit4]   2> 1743270 INFO  (TEST-TestDynamicLoading.testDynamicLoading-seed#[B3A124B130BEB0DE]) [    ] o.a.s.c.CoreContainer New CoreContainer 196337512
   [junit4]   2> 1743270 INFO  (TEST-TestDynamicLoading.testDynamicLoading-seed#[B3A124B130BEB0DE]) [    ] o.a.s.c.CoreContainer Loading cores into CoreContainer [instanceDir=/x1/jenkins/jenkins-slave/workspace/Lucene-Solr-Tests-trunk-Java8/solr/build/solr-core/test/J1/temp/solr.core.TestDynamicLoading_B3A124B130BEB0DE-001/shard-1-001]
   [junit4]   2> 1743271 WARN  (TEST-TestDynamicLoading.testDynamicLoading-seed#[B3A124B130BEB0DE]) [    ] o.a.s.c.CoreContainer Couldn't add files from /x1/jenkins/jenkins-slave/workspace/Lucene-Solr-Tests-trunk-Java8/solr/build/solr-core/test/J1/temp/solr.core.TestDynamicLoading_B3A124B130BEB0DE-001/shard-1-001/lib to classpath: /x1/jenkins/jenkins-slave/workspace/Lucene-Solr-Tests-trunk-Java8/solr/build/solr-core/test/J1/temp/solr.core.TestDynamicLoading_B3A124B130BEB0DE-001/shard-1-001/lib
   [junit4]   2> 1743271 INFO  (TEST-TestDynamicLoading.testDynamicLoading-seed#[B3A124B130BEB0DE]) [    ] o.a.s.h.c.HttpShardHandlerFactory created with socketTimeout : 90000,urlScheme : ,connTimeout : 15000,maxConnectionsPerHost : 20,maxConnections : 10000,corePoolSize : 0,maximumPoolSize : 2147483647,maxThreadIdleTime : 5,sizeOfQueue : -1,fairnessPolicy : false,useRetries : false,
   [junit4]   2> 1743273 INFO  (TEST-TestDynamicLoading.testDynamicLoading-seed#[B3A124B130BEB0DE]) [    ] o.a.s.u.UpdateShardHandler Creating UpdateShardHandler HTTP client with params: socketTimeout=340000&connTimeout=45000&retry=true
   [junit4]   2> 1743274 INFO  (TEST-TestDynamicLoading.testDynamicLoading-seed#[B3A124B130BEB0DE]) [    ] o.a.s.l.LogWatcher SLF4J impl is org.slf4j.impl.Log4jLoggerFactory
   [junit4]   2> 1743274 INFO  (TEST-TestDynamicLoading.testDynamicLoading-seed#[B3A124B130BEB0DE]) [    ] o.a.s.l.LogWatcher Registering Log Listener [Log4j (org.slf4j.impl.Log4jLoggerFactory)]
   [junit4]   2> 1743275 INFO  (TEST-TestDynamicLoading.testDynamicLoading-seed#[B3A124B130BEB0DE]) [    ] o.a.s.c.ZkContainer Zookeeper client=127.0.0.1:35721/solr
   [junit4]   2> 1743275 INFO  (TEST-TestDynamicLoading.testDynamicLoading-seed#[B3A124B130BEB0DE]) [    ] o.a.s.c.ZkController zkHost includes chroot
   [junit4]   2> 1743275 INFO  (TEST-TestDynamicLoading.testDynamicLoading-seed#[B3A124B130BEB0DE]) [    ] o.a.s.c.c.SolrZkClient Using default ZkCredentialsProvider
   [junit4]   2> 1743276 INFO  (TEST-TestDynamicLoading.testDynamicLoading-seed#[B3A124B130BEB0DE]) [    ] o.a.s.c.c.ConnectionManager Waiting for client to connect to ZooKeeper
   [junit4]   2> 1743277 INFO  (zkCallback-2118-thread-1) [    ] o.a.s.c.c.ConnectionManager Watcher org.apache.solr.common.cloud.ConnectionManager@68650d6 name:ZooKeeperConnection Watcher:127.0.0.1:35721 got event WatchedEvent state:SyncConnected type:None path:null path:null type:None
   [junit4]   2> 1743277 INFO  (TEST-TestDynamicLoading.testDynamicLoading-seed#[B3A124B130BEB0DE]) [    ] o.a.s.c.c.ConnectionManager Client is connected to ZooKeeper
   [junit4]   2> 1743277 INFO  (TEST-TestDynamicLoading.testDynamicLoading-seed#[B3A124B130BEB0DE]) [    ] o.a.s.c.c.SolrZkClient Using default ZkACLProvider
   [junit4]   2> 1743279 INFO  (TEST-TestDynamicLoading.testDynamicLoading-seed#[B3A124B130BEB0DE]) [n:127.0.0.1:36935__t    ] o.a.s.c.c.ConnectionManager Waiting for client to connect to ZooKeeper
   [junit4]   2> 1743279 INFO  (zkCallback-2119-thread-1-processing-n:127.0.0.1:36935__t) [n:127.0.0.1:36935__t    ] o.a.s.c.c.ConnectionManager Watcher org.apache.solr.common.cloud.ConnectionManager@70341f75 name:ZooKeeperConnection Watcher:127.0.0.1:35721/solr got event WatchedEvent state:SyncConnected type:None path:null path:null type:None
   [junit4]   2> 1743279 INFO  (TEST-TestDynamicLoading.testDynamicLoading-seed#[B3A124B130BEB0DE]) [n:127.0.0.1:36935__t    ] o.a.s.c.c.ConnectionManager Client is connected to ZooKeeper
   [junit4]   2> 1743285 INFO  (TEST-TestDynamicLoading.testDynamicLoading-seed#[B3A124B130BEB0DE]) [n:127.0.0.1:36935__t    ] o.a.s.c.c.ZkStateReader Updating cluster state from ZooKeeper... 
   [junit4]   2> 1743286 INFO  (TEST-TestDynamicLoading.testDynamicLoading-seed#[B3A124B130BEB0DE]) [n:127.0.0.1:36935__t    ] o.a.s.c.c.ZkStateReader Updated live nodes from ZooKeeper... (0) -> (1)
   [junit4]   2> 1743288 INFO  (TEST-TestDynamicLoading.testDynamicLoading-seed#[B3A124B130BEB0DE]) [n:127.0.0.1:36935__t    ] o.a.s.c.Overseer Overseer (id=null) closing
   [junit4]   2> 1743288 INFO  (TEST-TestDynamicLoading.testDynamicLoading-seed#[B3A124B130BEB0DE]) [n:127.0.0.1:36935__t    ] o.a.s.c.LeaderElector Joined leadership election with path: /overseer_elect/election/95482968441225225-127.0.0.1:36935__t-n_0000000001
   [junit4]   2> 1743288 INFO  (TEST-TestDynamicLoading.testDynamicLoading-seed#[B3A124B130BEB0DE]) [n:127.0.0.1:36935__t    ] o.a.s.c.LeaderElector Watching path /overseer_elect/election/95482968441225221-127.0.0.1:52512__t-n_0000000000 to know if I could be the leader
   [junit4]   2> 1743289 INFO  (TEST-TestDynamicLoading.testDynamicLoading-seed#[B3A124B130BEB0DE]) [n:127.0.0.1:36935__t    ] o.a.s.c.ZkController Publish node=127.0.0.1:36935__t as DOWN
   [junit4]   2> 1743294 INFO  (OverseerStateUpdate-95482968441225221-127.0.0.1:52512__t-n_0000000000) [n:127.0.0.1:52512__t    ] o.a.s.c.Overseer processMessage: queueSize: 1, message = {
   [junit4]   2>   "operation":"downnode",
   [junit4]   2>   "node_name":"127.0.0.1:36935__t"} current state version: 3
   [junit4]   2> 1743294 INFO  (OverseerStateUpdate-95482968441225221-127.0.0.1:52512__t-n_0000000000) [n:127.0.0.1:52512__t    ] o.a.s.c.o.NodeMutator DownNode state invoked for node: 127.0.0.1:36935__t
   [junit4]   2> 1743396 INFO  (zkCallback-2112-thread-1-processing-n:127.0.0.1:52512__t) [n:127.0.0.1:52512__t    ] o.a.s.c.c.ZkStateReader A cluster state change: [WatchedEvent state:SyncConnected type:NodeDataChanged path:/clusterstate.json], has occurred - updating... (live nodes size: [1])
   [junit4]   2> 1743396 INFO  (zkCallback-2114-thread-1) [    ] o.a.s.c.c.ZkStateReader A cluster state change: [WatchedEvent state:SyncConnected type:NodeDataChanged path:/clusterstate.json], has occurred - updating... (live nodes size: [1])
   [junit4]   2> 1743397 INFO  (zkCallback-2119-thread-1-processing-n:127.0.0.1:36935__t) [n:127.0.0.1:36935__t    ] o.a.s.c.c.ZkStateReader A cluster state change: [WatchedEvent state:SyncConnected type:NodeDataChanged path:/clusterstate.json], has occurred - updating... (live nodes size: [1])
   [junit4]   2> 1744290 INFO  (TEST-TestDynamicLoading.testDynamicLoading-seed#[B3A124B130BEB0DE]) [n:127.0.0.1:36935__t    ] o.a.s.c.ZkController Register node as live in ZooKeeper:/live_nodes/127.0.0.1:36935__t
   [junit4]   2> 1744291 INFO  (TEST-TestDynamicLoading.testDynamicLoading-seed#[B3A124B130BEB0DE]) [n:127.0.0.1:36935__t    ] o.a.s.c.c.SolrZkClient makePath: /live_nodes/127.0.0.1:36935__t
   [junit4]   2> 1744292 INFO  (zkCallback-2112-thread-1-processing-n:127.0.0.1:52512__t) [n:127.0.0.1:52512__t    ] o.a.s.c.c.ZkStateReader A live node change: [WatchedEvent state:SyncConnected type:NodeChildrenChanged path:/live_nodes], has occurred - updating... (live nodes size: [1])
   [junit4]   2> 1744292 INFO  (zkCallback-2119-thread-1-processing-n:127.0.0.1:36935__t) [n:127.0.0.1:36935__t    ] o.a.s.c.c.ZkStateReader A live node change: [WatchedEvent state:SyncConnected type:NodeChildrenChanged path:/live_nodes], has occurred - updating... (live nodes size: [1])
   [junit4]   2> 1744292 INFO  (zkCallback-2114-thread-1) [    ] o.a.s.c.c.ZkStateReader A live node change: [WatchedEvent state:SyncConnected type:NodeChildrenChanged path:/live_nodes], has occurred - updating... (live nodes size: [1])
   [junit4]   2> 1744293 INFO  (zkCallback-2112-thread-1-processing-n:127.0.0.1:52512__t) [n:127.0.0.1:52512__t    ] o.a.s.c.c.ZkStateReader Updated live nodes from ZooKeeper... (1) -> (2)
   [junit4]   2> 1744293 INFO  (zkCallback-2119-thread-1-processing-n:127.0.0.1:36935__t) [n:127.0.0.1:36935__t    ] o.a.s.c.c.ZkStateReader Updated live nodes from ZooKeeper... (1) -> (2)
   [junit4]   2> 1744293 INFO  (zkCallback-2114-thread-1) [    ] o.a.s.c.c.ZkStateReader Updated live nodes from ZooKeeper... (1) -> (2)
   [junit4]   2> 1744301 INFO  (TEST-TestDynamicLoading.testDynamicLoading-seed#[B3A124B130BEB0DE]) [n:127.0.0.1:36935__t    ] o.a.s.c.CoreContainer Security conf doesn't exist. Skipping setup for authorization module.
   [junit4]   2> 1744301 INFO  (TEST-TestDynamicLoading.testDynamicLoading-seed#[B3A124B130BEB0DE]) [n:127.0.0.1:36935__t    ] o.a.s.c.CoreContainer No authentication plugin used.
   [junit4]   2> 1744301 INFO  (TEST-TestDynamicLoading.testDynamicLoading-seed#[B3A124B130BEB0DE]) [n:127.0.0.1:36935__t    ] o.a.s.c.CorePropertiesLocator Looking for core definitions underneath /x1/jenkins/jenkins-slave/workspace/Lucene-Solr-Tests-trunk-Java8/solr/build/solr-core/test/J1/temp/solr.core.TestDynamicLoading_B3A124B130BEB0DE-001/shard-1-001/cores
   [junit4]   2> 1744302 INFO  (TEST-TestDynamicLoading.testDynamicLoading-seed#[B3A124B130BEB0DE]) [n:127.0.0.1:36935__t    ] o.a.s.c.CoreDescriptor Created CoreDescriptor: {name=collection1, config=solrconfig.xml, transient=false, schema=schema.xml, loadOnStartup=true, configSetProperties=configsetprops.json, collection=collection1, coreNodeName=, dataDir=data/, shard=}
   [junit4]   2> 1744302 INFO  (TEST-TestDynamicLoading.testDynamicLoading-seed#[B3A124B130BEB0DE]) [n:127.0.0.1:36935__t    ] o.a.s.c.CorePropertiesLocator Found core collection1 in /x1/jenkins/jenkins-slave/workspace/Lucene-Solr-Tests-trunk-Java8/solr/build/solr-core/test/J1/temp/solr.core.TestDynamicLoading_B3A124B130BEB0DE-001/shard-1-001/cores/collection1
   [junit4]   2> 1744302 INFO  (TEST-TestDynamicLoading.testDynamicLoading-seed#[B3A124B130BEB0DE]) [n:127.0.0.1:36935__t    ] o.a.s.c.CorePropertiesLocator Found 1 core definitions
   [junit4]   2> 1744304 INFO  (TEST-TestDynamicLoading.testDynamicLoading-seed#[B3A124B130BEB0DE]) [n:127.0.0.1:36935__t    ] o.a.s.s.SolrDispatchFilter user.dir=/x1/jenkins/jenkins-slave/workspace/Lucene-Solr-Tests-trunk-Java8/solr/build/solr-core/test/J1
   [junit4]   2> 1744304 INFO  (TEST-TestDynamicLoading.testDynamicLoading-seed#[B3A124B130BEB0DE]) [n:127.0.0.1:36935__t    ] o.a.s.s.SolrDispatchFilter SolrDispatchFilter.init() done
   [junit4]   2> 1744305 INFO  (coreLoadExecutor-5805-thread-1-processing-n:127.0.0.1:36935__t) [n:127.0.0.1:36935__t c:collection1   x:collection1] o.a.s.c.ZkController publishing state=down
   [junit4]   2> 1744305 INFO  (coreLoadExecutor-5805-thread-1-processing-n:127.0.0.1:36935__t) [n:127.0.0.1:36935__t c:collection1   x:collection1] o.a.s.c.ZkController numShards not found on descriptor - reading it from system property
   [junit4]   2> 1744306 INFO  (coreLoadExecutor-5805-thread-1-processing-n:127.0.0.1:36935__t) [n:127.0.0.1:36935__t c:collection1   x:collection1] o.a.s.c.ZkController look for our core node name
   [junit4]   2> 1744306 INFO  (OverseerStateUpdate-95482968441225221-127.0.0.1:52512__t-n_0000000000) [n:127.0.0.1:52512__t    ] o.a.s.c.Overseer processMessage: queueSize: 1, message = {
   [junit4]   2>   "core":"collection1",
   [junit4]   2>   "roles":null,
   [junit4]   2>   "base_url":"https://127.0.0.1:36935/_t",
   [junit4]   2>   "node_name":"127.0.0.1:36935__t",
   [junit4]   2>   "numShards":"2",
   [junit4]   2>   "state":"down",
   [junit4]   2>   "shard":null,
   [junit4]   2>   "collection":"collection1",
   [junit4]   2>   "operation":"state"} current state version: 4
   [junit4]   2> 1744307 INFO  (OverseerStateUpdate-95482968441225221-127.0.0.1:52512__t-n_0000000000) [n:127.0.0.1:52512__t    ] o.a.s.c.o.ReplicaMutator Update state numShards=2 message={
   [junit4]   2>   "core":"collection1",
   [junit4]   2>   "roles":null,
   [junit4]   2>   "base_url":"https://127.0.0.1:36935/_t",
   [junit4]   2>   "node_name":"127.0.0.1:36935__t",
   [junit4]   2>   "numShards":"2",
   [junit4]   2>   "state":"down",
   [junit4]   2>   "shard":null,
   [junit4]   2>   "collection":"collection1",
   [junit4]   2>   "operation":"state"}
   [junit4]   2> 1744307 INFO  (OverseerStateUpdate-95482968441225221-127.0.0.1:52512__t-n_0000000000) [n:127.0.0.1:52512__t    ] o.a.s.c.o.ClusterStateMutator building a new cName: collection1
   [junit4]   2> 1744307 INFO  (OverseerStateUpdate-95482968441225221-127.0.0.1:52512__t-n_0000000000) [n:127.0.0.1:52512__t    ] o.a.s.c.o.ReplicaMutator Assigning new node to shard shard=shard2
   [junit4]   2> 1744410 INFO  (zkCallback-2112-thread-1-processing-n:127.0.0.1:52512__t) [n:127.0.0.1:52512__t    ] o.a.s.c.c.ZkStateReader A cluster state change: [WatchedEvent state:SyncConnected type:NodeDataChanged path:/clusterstate.json], has occurred - updating... (live nodes size: [2])
   [junit4]   2> 1744410 INFO  (zkCallback-2119-thread-1-processing-n:127.0.0.1:36935__t) [n:127.0.0.1:36935__t    ] o.a.s.c.c.ZkStateReader A cluster state change: [WatchedEvent state:SyncConnected type:NodeDataChanged path:/clusterstate.json], has occurred - updating... (live nodes size: [2])
   [junit4]   2> 1744410 INFO  (zkCallback-2114-thread-1) [    ] o.a.s.c.c.ZkStateReader A cluster state change: [WatchedEvent state:SyncConnected type:NodeDataChanged path:/clusterstate.json], has occurred - updating... (live nodes size: [2])
   [junit4]   2> 1745307 INFO  (coreLoadExecutor-5805-thread-1-processing-n:127.0.0.1:36935__t) [n:127.0.0.1:36935__t c:collection1   x:collection1] o.a.s.c.ZkController waiting to find shard id in clusterstate for collection1
   [junit4]   2> 1745307 INFO  (coreLoadExecutor-5805-thread-1-processing-n:127.0.0.1:36935__t) [n:127.0.0.1:36935__t c:collection1   x:collection1] o.a.s.c.ZkController Check for collection zkNode:collection1
   [junit4]   2> 1745308 INFO  (coreLoadExecutor-5805-thread-1-processing-n:127.0.0.1:36935__t) [n:127.0.0.1:36935__t c:collection1   x:collection1] o.a.s.c.ZkController Collection zkNode exists
   [junit4]   2> 1745308 INFO  (coreLoadExecutor-5805-thread-1-processing-n:127.0.0.1:36935__t) [n:127.0.0.1:36935__t c:collection1   x:collection1] o.a.s.c.c.ZkStateReader Load collection config from: [/collections/collection1]
   [junit4]   2> 1745308 INFO  (coreLoadExecutor-5805-thread-1-processing-n:127.0.0.1:36935__t) [n:127.0.0.1:36935__t c:collection1   x:collection1] o.a.s.c.c.ZkStateReader path=[/collections/collection1] [configName]=[conf1] specified config exists in ZooKeeper
   [junit4]   2> 1745308 INFO  (coreLoadExecutor-5805-thread-1-processing-n:127.0.0.1:36935__t) [n:127.0.0.1:36935__t c:collection1   x:collection1] o.a.s.c.SolrResourceLoader new SolrResourceLoader for directory: '/x1/jenkins/jenkins-slave/workspace/Lucene-Solr-Tests-trunk-Java8/solr/build/solr-core/test/J1/temp/solr.core.TestDynamicLoading_B3A124B130BEB0DE-001/shard-1-001/cores/collection1'
   [junit4]   2> 1745309 INFO  (coreLoadExecutor-5805-thread-1-processing-n:127.0.0.1:36935__t) [n:127.0.0.1:36935__t c:collection1   x:collection1] o.a.s.c.SolrResourceLoader JNDI not configured for solr (NoInitialContextEx)
   [junit4]   2> 1745309 INFO  (coreLoadExecutor-5805-thread-1-processing-n:127.0.0.1:36935__t) [n:127.0.0.1:36935__t c:collection1   x:collection1] o.a.s.c.SolrResourceLoader solr home defaulted to 'solr/' (could not find system property or JNDI)
   [junit4]   2> 1745310 INFO  (coreLoadExecutor-5805-thread-1-processing-n:127.0.0.1:36935__t) [n:127.0.0.1:36935__t c:collection1   x:collection1] o.a.s.c.Config loaded config solrconfig.xml with version 0 
   [junit4]   2> 1745315 INFO  (coreLoadExecutor-5805-thread-1-processing-n:127.0.0.1:36935__t) [n:127.0.0.1:36935__t c:collection1   x:collection1] o.a.s.c.SolrConfig current version of requestparams : -1
   [junit4]   2> 1745319 WARN  (coreLoadExecutor-5805-thread-1-processing-n:127.0.0.1:36935__t) [n:127.0.0.1:36935__t c:collection1   x:collection1] o.a.s.c.Config Beginning with Solr 5.5, <mergePolicy> is deprecated, use <mergePolicyFactory> instead.
   [junit4]   2> 1745321 INFO  (coreLoadExecutor-5805-thread-1-processing-n:127.0.0.1:36935__t) [n:127.0.0.1:36935__t c:collection1   x:collection1] o.a.s.c.SolrConfig Using Lucene MatchVersion: 7.0.0
   [junit4]   2> 1745333 INFO  (coreLoadExecutor-5805-thread-1-processing-n:127.0.0.1:36935__t) [n:127.0.0.1:36935__t c:collection1   x:collection1] o.a.s.c.SolrConfig Loaded SolrConfig: solrconfig.xml
   [junit4]   2> 1745338 INFO  (coreLoadExecutor-5805-thread-1-processing-n:127.0.0.1:36935__t) [n:127.0.0.1:36935__t c:collection1   x:collection1] o.a.s.s.IndexSchema [collection1] Schema name=test
   [junit4]   2> 1745448 INFO  (coreLoadExecutor-5805-thread-1-processing-n:127.0.0.1:36935__t) [n:127.0.0.1:36935__t c:collection1   x:collection1] o.a.s.s.OpenExchangeRatesOrgProvider Initialized with rates=open-exchange-rates.json, refreshInterval=1440.
   [junit4]   2> 1745454 INFO  (coreLoadExecutor-5805-thread-1-processing-n:127.0.0.1:36935__t) [n:127.0.0.1:36935__t c:collection1   x:collection1] o.a.s.s.IndexSchema default search field in schema is text
   [junit4]   2> 1745455 INFO  (coreLoadExecutor-5805-thread-1-processing-n:127.0.0.1:36935__t) [n:127.0.0.1:36935__t c:collection1   x:collection1] o.a.s.s.IndexSchema unique key field: id
   [junit4]   2> 1745464 INFO  (coreLoadExecutor-5805-thread-1-processing-n:127.0.0.1:36935__t) [n:127.0.0.1:36935__t c:collection1   x:collection1] o.a.s.s.FileExchangeRateProvider Reloading exchange rates from file currency.xml
   [junit4]   2> 1745466 INFO  (coreLoadExecutor-5805-thread-1-processing-n:127.0.0.1:36935__t) [n:127.0.0.1:36935__t c:collection1   x:collection1] o.a.s.s.FileExchangeRateProvider Reloading exchange rates from file currency.xml
   [juni

[...truncated too long message...]

../../x1/jenkins/jenkins-slave/workspace/Lucene-Solr-Tests-trunk-Java8/solr/build/solr-core/test/J1/temp/solr.core.TestDynamicLoading_B3A124B130BEB0DE-001/shard-4-001/cores/.system_shard1_replica2/data/index;done=false>>]
   [junit4]   2> 1797873 INFO  (zkCallback-2135-thread-4-processing-n:127.0.0.1:43836__t) [n:127.0.0.1:43836__t c:.system s:shard1 r:core_node2 x:.system_shard1_replica2] o.a.s.c.CachingDirectoryFactory Closing directory: /x1/jenkins/jenkins-slave/workspace/Lucene-Solr-Tests-trunk-Java8/solr/build/solr-core/test/J1/../../../../../../../../../../x1/jenkins/jenkins-slave/workspace/Lucene-Solr-Tests-trunk-Java8/solr/build/solr-core/test/J1/temp/solr.core.TestDynamicLoading_B3A124B130BEB0DE-001/shard-4-001/cores/.system_shard1_replica2/data/index
   [junit4]   2> 1797874 INFO  (TEST-TestDynamicLoading.testDynamicLoading-seed#[B3A124B130BEB0DE]) [    ] o.e.j.s.ServerConnector Stopped ServerConnector@7bcbd982{SSL,[ssl, http/1.1]}{127.0.0.1:0}
   [junit4]   2> 1797874 INFO  (TEST-TestDynamicLoading.testDynamicLoading-seed#[B3A124B130BEB0DE]) [    ] o.e.j.s.h.ContextHandler Stopped o.e.j.s.ServletContextHandler@2ebca1a6{/_t,null,UNAVAILABLE}
   [junit4]   2> 1797877 INFO  (TEST-TestDynamicLoading.testDynamicLoading-seed#[B3A124B130BEB0DE]) [    ] o.a.s.c.ZkTestServer connecting to 127.0.0.1:35721 35721
   [junit4]   2> 1798067 INFO  (Thread-5776) [    ] o.a.s.c.ZkTestServer connecting to 127.0.0.1:35721 35721
   [junit4]   2> 1798069 WARN  (Thread-5776) [    ] o.a.s.c.ZkTestServer Watch limit violations: 
   [junit4]   2> Maximum concurrent create/delete watches above limit:
   [junit4]   2> 
   [junit4]   2> 	35	/solr/configs/conf1
   [junit4]   2> 	6	/solr/aliases.json
   [junit4]   2> 	5	/solr/security.json
   [junit4]   2> 	2	/solr/configs/.system
   [junit4]   2> 	2	/solr/configs/.system/managed-schema
   [junit4]   2> 
   [junit4]   2> Maximum concurrent data watches above limit:
   [junit4]   2> 
   [junit4]   2> 	6	/solr/clusterstate.json
   [junit4]   2> 	2	/solr/collections/.system/state.json
   [junit4]   2> 
   [junit4]   2> Maximum concurrent children watches above limit:
   [junit4]   2> 
   [junit4]   2> 	6	/solr/live_nodes
   [junit4]   2> 	6	/solr/collections
   [junit4]   2> 	3	/solr/overseer/queue
   [junit4]   2> 	3	/solr/overseer/collection-queue-work
   [junit4]   2> 
   [junit4]   2> NOTE: reproduce with: ant test  -Dtestcase=TestDynamicLoading -Dtests.method=testDynamicLoading -Dtests.seed=B3A124B130BEB0DE -Dtests.multiplier=2 -Dtests.slow=true -Dtests.locale=ar-YE -Dtests.timezone=NET -Dtests.asserts=true -Dtests.file.encoding=UTF-8
   [junit4] FAILURE 56.7s J1 | TestDynamicLoading.testDynamicLoading <<<
   [junit4]    > Throwable #1: java.lang.AssertionError: Could not get expected value  'X val' for path 'x' full output: {
   [junit4]    >   "responseHeader":{
   [junit4]    >     "status":0,
   [junit4]    >     "QTime":0},
   [junit4]    >   "params":{"wt":"json"},
   [junit4]    >   "context":{
   [junit4]    >     "webapp":"/_t",
   [junit4]    >     "path":"/test1",
   [junit4]    >     "httpMethod":"GET"},
   [junit4]    >   "class":"org.apache.solr.core.BlobStoreTestRequestHandler",
   [junit4]    >   "x":null}
   [junit4]    > 	at __randomizedtesting.SeedInfo.seed([B3A124B130BEB0DE:6BEC09E6C763157E]:0)
   [junit4]    > 	at org.apache.solr.core.TestSolrConfigHandler.testForResponseElement(TestSolrConfigHandler.java:458)
   [junit4]    > 	at org.apache.solr.core.TestDynamicLoading.testDynamicLoading(TestDynamicLoading.java:238)
   [junit4]    > 	at org.apache.solr.BaseDistributedSearchTestCase$ShardsRepeatRule$ShardsFixedStatement.callStatement(BaseDistributedSearchTestCase.java:996)
   [junit4]    > 	at org.apache.solr.BaseDistributedSearchTestCase$ShardsRepeatRule$ShardsStatement.evaluate(BaseDistributedSearchTestCase.java:971)
   [junit4]    > 	at java.lang.Thread.run(Thread.java:745)
   [junit4]   2> 1798073 INFO  (SUITE-TestDynamicLoading-seed#[B3A124B130BEB0DE]-worker) [    ] o.a.s.SolrTestCaseJ4 ###deleteCore
   [junit4]   2> NOTE: leaving temporary files on disk at: /x1/jenkins/jenkins-slave/workspace/Lucene-Solr-Tests-trunk-Java8/solr/build/solr-core/test/J1/temp/solr.core.TestDynamicLoading_B3A124B130BEB0DE-001
   [junit4]   2> Mar 02, 2016 9:35:31 PM com.carrotsearch.randomizedtesting.ThreadLeakControl checkThreadLeaks
   [junit4]   2> WARNING: Will linger awaiting termination of 1 leaked thread(s).
   [junit4]   2> NOTE: test params are: codec=Asserting(Lucene60), sim=RandomSimilarity(queryNorm=true,coord=crazy): {}, locale=ar-YE, timezone=NET
   [junit4]   2> NOTE: Linux 3.13.0-52-generic amd64/Oracle Corporation 1.8.0_66 (64-bit)/cpus=4,threads=1,free=237099664,total=531103744
   [junit4]   2> NOTE: All tests run in this JVM: [BlockDirectoryTest, TestSchemaVersionResource, SolrCloudExampleTest, ForceLeaderTest, DocumentBuilderTest, AsyncMigrateRouteKeyTest, SortByFunctionTest, TermsComponentTest, ShardRoutingCustomTest, TestDistributedGrouping, TestSolrCLIRunExample, ChaosMonkeySafeLeaderTest, TestCodecSupport, DocValuesTest, FullHLLTest, CdcrUpdateLogTest, TestDistribIDF, CursorMarkTest, TestOrdValues, TestLMJelinekMercerSimilarityFactory, TestFieldTypeCollectionResource, ZkCLITest, DeleteStatusTest, TestDocumentBuilder, HighlighterTest, TermVectorComponentTest, LoggingHandlerTest, TestMacros, TestConfigSets, TestTrie, TestExceedMaxTermLength, TestLFUCache, TestAuthorizationFramework, SuggestComponentTest, SolrCmdDistributorTest, TestInitQParser, TestBlobHandler, ZkStateWriterTest, TestCoreContainer, PreAnalyzedUpdateProcessorTest, LeaderInitiatedRecoveryOnCommitTest, CollectionsAPIDistributedZkTest, TestSolrQueryParserResource, SSLMigrationTest, TestCursorMarkWithoutUniqueKey, SolrIndexSplitterTest, ConnectionManagerTest, TestPartialUpdateDeduplication, FacetPivotSmallTest, ReplicationFactorTest, TestSolrConfigHandlerCloud, CdcrReplicationHandlerTest, TestManagedSynonymFilterFactory, TestQueryTypes, TestSolrCloudWithKerberosAlt, DistanceUnitsTest, MBeansHandlerTest, BasicFunctionalityTest, TestLRUStatsCache, DistributedIntervalFacetingTest, TestStandardQParsers, TestUpdate, TestAnalyzeInfixSuggestions, TestSolrDeletionPolicy2, ShardRoutingTest, TestLeaderInitiatedRecoveryThread, SortSpecParsingTest, DistributedFacetPivotSmallAdvancedTest, TestXmlQParser, TestWordDelimiterFilterFactory, CollectionsAPIAsyncDistributedZkTest, SuggesterFSTTest, CSVRequestHandlerTest, SpellPossibilityIteratorTest, AliasIntegrationTest, TestPivotHelperCode, UpdateRequestProcessorFactoryTest, TestBM25SimilarityFactory, TestNoOpRegenerator, CoreAdminRequestStatusTest, TestReloadAndDeleteDocs, MinimalSchemaTest, BigEndianAscendingWordSerializerTest, SolrIndexConfigTest, DistanceFunctionTest, UniqFieldsUpdateProcessorFactoryTest, DeleteLastCustomShardedReplicaTest, TestCloudDeleteByQuery, TestSimpleQParserPlugin, TestCollapseQParserPlugin, TestRecoveryHdfs, TestSolrDynamicMBean, TimeZoneUtilsTest, SyncSliceTest, ClusterStateUpdateTest, ZkSolrClientTest, TestFaceting, TestHashPartitioner, TestRealTimeGet, TestStressVersions, TestRangeQuery, TestSolr4Spatial, SpellCheckComponentTest, ConvertedLegacyTest, TestFiltering, CurrencyFieldOpenExchangeTest, CurrencyFieldXmlFileTest, SimplePostToolTest, TestCoreDiscovery, SignatureUpdateProcessorFactoryTest, TestExtendedDismaxParser, SpellCheckCollatorTest, SpatialFilterTest, SuggesterWFSTTest, SchemaVersionSpecificBehaviorTest, FieldMutatingUpdateProcessorTest, DefaultValueUpdateProcessorTest, TestSolrDeletionPolicy1, SolrInfoMBeanTest, XsltUpdateRequestHandlerTest, IndexBasedSpellCheckerTest, TestQueryUtils, PrimitiveFieldTypeTest, FileBasedSpellCheckerTest, RequiredFieldsTest, TestSolrQueryParser, FastVectorHighlighterTest, SolrPluginUtilsTest, TestJmxIntegration, BinaryUpdateRequestHandlerTest, TestComponentsName, SOLR749Test, AlternateDirectoryTest, ResponseLogComponentTest, TestStressRecovery, PreAnalyzedFieldTest, TestSystemIdResolver, DateFieldTest, SpellingQueryConverterTest, DOMUtilTest, RAMDirectoryFactoryTest, TestLRUCache, TestUtils, SliceStateTest, SystemInfoHandlerTest, FileUtilsTest, DistributedMLTComponentTest, TestSimpleTrackingShardHandler, CloudExitableDirectoryReaderTest, CollectionStateFormat2Test, HttpPartitionTest, TestDownShardTolerantSearch, TestExclusionRuleCollectionAccess, TestRequestForwarding, TestSizeLimitedDistributedMap, TlogReplayBufferedWhileIndexingTest, TriLevelCompositeIdRoutingTest, HdfsRecoverLeaseTest, DirectoryFactoryTest, ExitableDirectoryReaderTest, TestConfigOverlay, TestConfigSetProperties, TestDynamicLoading]
   [junit4] Completed [482/581 (1!)] on J1 in 57.75s, 1 test, 1 failure <<< FAILURES!

[...truncated 314 lines...]
BUILD FAILED
/x1/jenkins/jenkins-slave/workspace/Lucene-Solr-Tests-trunk-Java8/build.xml:740: The following error occurred while executing this line:
/x1/jenkins/jenkins-slave/workspace/Lucene-Solr-Tests-trunk-Java8/build.xml:684: The following error occurred while executing this line:
/x1/jenkins/jenkins-slave/workspace/Lucene-Solr-Tests-trunk-Java8/build.xml:59: The following error occurred while executing this line:
/x1/jenkins/jenkins-slave/workspace/Lucene-Solr-Tests-trunk-Java8/solr/build.xml:233: The following error occurred while executing this line:
/x1/jenkins/jenkins-slave/workspace/Lucene-Solr-Tests-trunk-Java8/solr/common-build.xml:524: The following error occurred while executing this line:
/x1/jenkins/jenkins-slave/workspace/Lucene-Solr-Tests-trunk-Java8/lucene/common-build.xml:1457: The following error occurred while executing this line:
/x1/jenkins/jenkins-slave/workspace/Lucene-Solr-Tests-trunk-Java8/lucene/common-build.xml:1014: There were test failures: 581 suites (8 ignored), 2345 tests, 1 failure, 87 ignored (71 assumptions) [seed: B3A124B130BEB0DE]

Total time: 61 minutes 2 seconds
Build step 'Invoke Ant' marked build as failure
Archiving artifacts
Recording test results
Email was triggered for: Failure - Any
Sending email for trigger: Failure - Any



Mime
View raw message