lucene-dev mailing list archives

Site index · List index
Message view « Date » · « Thread »
Top « Date » · « Thread »
From Policeman Jenkins Server <jenk...@thetaphi.de>
Subject [JENKINS-EA] Lucene-Solr-master-Linux (64bit/jdk-9-ea+111-patched) - Build # 16364 - Still Failing!
Date Mon, 28 Mar 2016 19:51:21 GMT
Build: http://jenkins.thetaphi.de/job/Lucene-Solr-master-Linux/16364/
Java: 64bit/jdk-9-ea+111-patched -XX:+UseCompressedOops -XX:+UseG1GC -XX:-CompactStrings

4 tests failed.
FAILED:  org.apache.lucene.search.TestLatLonPointQueries.testAllLonEqual

Error Message:
invalid latitude NaN; must be between -90.0 and 90.0

Stack Trace:
java.lang.IllegalArgumentException: invalid latitude NaN; must be between -90.0 and 90.0
	at __randomizedtesting.SeedInfo.seed([AA446CF783002BC5:3B4E9D0A73AA6BD1]:0)
	at org.apache.lucene.spatial.util.GeoUtils.checkLatitude(GeoUtils.java:66)
	at org.apache.lucene.document.LatLonPoint.encodeLatitude(LatLonPoint.java:140)
	at org.apache.lucene.search.TestLatLonPointQueries.quantizeLat(TestLatLonPointQueries.java:47)
	at org.apache.lucene.spatial.util.BaseGeoPointTestCase.verify(BaseGeoPointTestCase.java:730)
	at org.apache.lucene.spatial.util.BaseGeoPointTestCase.testAllLonEqual(BaseGeoPointTestCase.java:468)
	at sun.reflect.NativeMethodAccessorImpl.invoke0(java.base@9-ea/Native Method)
	at sun.reflect.NativeMethodAccessorImpl.invoke(java.base@9-ea/NativeMethodAccessorImpl.java:62)
	at sun.reflect.DelegatingMethodAccessorImpl.invoke(java.base@9-ea/DelegatingMethodAccessorImpl.java:43)
	at java.lang.reflect.Method.invoke(java.base@9-ea/Method.java:531)
	at com.carrotsearch.randomizedtesting.RandomizedRunner.invoke(RandomizedRunner.java:1764)
	at com.carrotsearch.randomizedtesting.RandomizedRunner$8.evaluate(RandomizedRunner.java:871)
	at com.carrotsearch.randomizedtesting.RandomizedRunner$9.evaluate(RandomizedRunner.java:907)
	at com.carrotsearch.randomizedtesting.RandomizedRunner$10.evaluate(RandomizedRunner.java:921)
	at org.apache.lucene.util.TestRuleSetupTeardownChained$1.evaluate(TestRuleSetupTeardownChained.java:49)
	at org.apache.lucene.util.AbstractBeforeAfterRule$1.evaluate(AbstractBeforeAfterRule.java:45)
	at org.apache.lucene.util.TestRuleThreadAndTestName$1.evaluate(TestRuleThreadAndTestName.java:48)
	at org.apache.lucene.util.TestRuleIgnoreAfterMaxFailures$1.evaluate(TestRuleIgnoreAfterMaxFailures.java:64)
	at org.apache.lucene.util.TestRuleMarkFailure$1.evaluate(TestRuleMarkFailure.java:47)
	at com.carrotsearch.randomizedtesting.rules.StatementAdapter.evaluate(StatementAdapter.java:36)
	at com.carrotsearch.randomizedtesting.ThreadLeakControl$StatementRunner.run(ThreadLeakControl.java:367)
	at com.carrotsearch.randomizedtesting.ThreadLeakControl.forkTimeoutingTask(ThreadLeakControl.java:809)
	at com.carrotsearch.randomizedtesting.ThreadLeakControl$3.evaluate(ThreadLeakControl.java:460)
	at com.carrotsearch.randomizedtesting.RandomizedRunner.runSingleTest(RandomizedRunner.java:880)
	at com.carrotsearch.randomizedtesting.RandomizedRunner$5.evaluate(RandomizedRunner.java:781)
	at com.carrotsearch.randomizedtesting.RandomizedRunner$6.evaluate(RandomizedRunner.java:816)
	at com.carrotsearch.randomizedtesting.RandomizedRunner$7.evaluate(RandomizedRunner.java:827)
	at org.apache.lucene.util.AbstractBeforeAfterRule$1.evaluate(AbstractBeforeAfterRule.java:45)
	at com.carrotsearch.randomizedtesting.rules.StatementAdapter.evaluate(StatementAdapter.java:36)
	at org.apache.lucene.util.TestRuleStoreClassName$1.evaluate(TestRuleStoreClassName.java:41)
	at com.carrotsearch.randomizedtesting.rules.NoShadowingOrOverridesOnMethodsRule$1.evaluate(NoShadowingOrOverridesOnMethodsRule.java:40)
	at com.carrotsearch.randomizedtesting.rules.NoShadowingOrOverridesOnMethodsRule$1.evaluate(NoShadowingOrOverridesOnMethodsRule.java:40)
	at com.carrotsearch.randomizedtesting.rules.StatementAdapter.evaluate(StatementAdapter.java:36)
	at com.carrotsearch.randomizedtesting.rules.StatementAdapter.evaluate(StatementAdapter.java:36)
	at com.carrotsearch.randomizedtesting.rules.StatementAdapter.evaluate(StatementAdapter.java:36)
	at org.apache.lucene.util.TestRuleAssertionsRequired$1.evaluate(TestRuleAssertionsRequired.java:53)
	at org.apache.lucene.util.TestRuleMarkFailure$1.evaluate(TestRuleMarkFailure.java:47)
	at org.apache.lucene.util.TestRuleIgnoreAfterMaxFailures$1.evaluate(TestRuleIgnoreAfterMaxFailures.java:64)
	at org.apache.lucene.util.TestRuleIgnoreTestSuites$1.evaluate(TestRuleIgnoreTestSuites.java:54)
	at com.carrotsearch.randomizedtesting.rules.StatementAdapter.evaluate(StatementAdapter.java:36)
	at com.carrotsearch.randomizedtesting.ThreadLeakControl$StatementRunner.run(ThreadLeakControl.java:367)
	at java.lang.Thread.run(java.base@9-ea/Thread.java:804)


FAILED:  org.apache.lucene.search.TestLatLonPointQueries.testRandomTiny

Error Message:
invalid latitude NaN; must be between -90.0 and 90.0

Stack Trace:
java.lang.IllegalArgumentException: invalid latitude NaN; must be between -90.0 and 90.0
	at __randomizedtesting.SeedInfo.seed([AA446CF783002BC5:E303B2B1DD211369]:0)
	at org.apache.lucene.spatial.util.GeoUtils.checkLatitude(GeoUtils.java:66)
	at org.apache.lucene.document.LatLonPoint.encodeLatitude(LatLonPoint.java:140)
	at org.apache.lucene.search.TestLatLonPointQueries.quantizeLat(TestLatLonPointQueries.java:47)
	at org.apache.lucene.spatial.util.BaseGeoPointTestCase.verify(BaseGeoPointTestCase.java:730)
	at org.apache.lucene.spatial.util.BaseGeoPointTestCase.doTestRandom(BaseGeoPointTestCase.java:665)
	at org.apache.lucene.spatial.util.BaseGeoPointTestCase.testRandomTiny(BaseGeoPointTestCase.java:583)
	at sun.reflect.NativeMethodAccessorImpl.invoke0(java.base@9-ea/Native Method)
	at sun.reflect.NativeMethodAccessorImpl.invoke(java.base@9-ea/NativeMethodAccessorImpl.java:62)
	at sun.reflect.DelegatingMethodAccessorImpl.invoke(java.base@9-ea/DelegatingMethodAccessorImpl.java:43)
	at java.lang.reflect.Method.invoke(java.base@9-ea/Method.java:531)
	at com.carrotsearch.randomizedtesting.RandomizedRunner.invoke(RandomizedRunner.java:1764)
	at com.carrotsearch.randomizedtesting.RandomizedRunner$8.evaluate(RandomizedRunner.java:871)
	at com.carrotsearch.randomizedtesting.RandomizedRunner$9.evaluate(RandomizedRunner.java:907)
	at com.carrotsearch.randomizedtesting.RandomizedRunner$10.evaluate(RandomizedRunner.java:921)
	at org.apache.lucene.util.TestRuleSetupTeardownChained$1.evaluate(TestRuleSetupTeardownChained.java:49)
	at org.apache.lucene.util.AbstractBeforeAfterRule$1.evaluate(AbstractBeforeAfterRule.java:45)
	at org.apache.lucene.util.TestRuleThreadAndTestName$1.evaluate(TestRuleThreadAndTestName.java:48)
	at org.apache.lucene.util.TestRuleIgnoreAfterMaxFailures$1.evaluate(TestRuleIgnoreAfterMaxFailures.java:64)
	at org.apache.lucene.util.TestRuleMarkFailure$1.evaluate(TestRuleMarkFailure.java:47)
	at com.carrotsearch.randomizedtesting.rules.StatementAdapter.evaluate(StatementAdapter.java:36)
	at com.carrotsearch.randomizedtesting.ThreadLeakControl$StatementRunner.run(ThreadLeakControl.java:367)
	at com.carrotsearch.randomizedtesting.ThreadLeakControl.forkTimeoutingTask(ThreadLeakControl.java:809)
	at com.carrotsearch.randomizedtesting.ThreadLeakControl$3.evaluate(ThreadLeakControl.java:460)
	at com.carrotsearch.randomizedtesting.RandomizedRunner.runSingleTest(RandomizedRunner.java:880)
	at com.carrotsearch.randomizedtesting.RandomizedRunner$5.evaluate(RandomizedRunner.java:781)
	at com.carrotsearch.randomizedtesting.RandomizedRunner$6.evaluate(RandomizedRunner.java:816)
	at com.carrotsearch.randomizedtesting.RandomizedRunner$7.evaluate(RandomizedRunner.java:827)
	at org.apache.lucene.util.AbstractBeforeAfterRule$1.evaluate(AbstractBeforeAfterRule.java:45)
	at com.carrotsearch.randomizedtesting.rules.StatementAdapter.evaluate(StatementAdapter.java:36)
	at org.apache.lucene.util.TestRuleStoreClassName$1.evaluate(TestRuleStoreClassName.java:41)
	at com.carrotsearch.randomizedtesting.rules.NoShadowingOrOverridesOnMethodsRule$1.evaluate(NoShadowingOrOverridesOnMethodsRule.java:40)
	at com.carrotsearch.randomizedtesting.rules.NoShadowingOrOverridesOnMethodsRule$1.evaluate(NoShadowingOrOverridesOnMethodsRule.java:40)
	at com.carrotsearch.randomizedtesting.rules.StatementAdapter.evaluate(StatementAdapter.java:36)
	at com.carrotsearch.randomizedtesting.rules.StatementAdapter.evaluate(StatementAdapter.java:36)
	at com.carrotsearch.randomizedtesting.rules.StatementAdapter.evaluate(StatementAdapter.java:36)
	at org.apache.lucene.util.TestRuleAssertionsRequired$1.evaluate(TestRuleAssertionsRequired.java:53)
	at org.apache.lucene.util.TestRuleMarkFailure$1.evaluate(TestRuleMarkFailure.java:47)
	at org.apache.lucene.util.TestRuleIgnoreAfterMaxFailures$1.evaluate(TestRuleIgnoreAfterMaxFailures.java:64)
	at org.apache.lucene.util.TestRuleIgnoreTestSuites$1.evaluate(TestRuleIgnoreTestSuites.java:54)
	at com.carrotsearch.randomizedtesting.rules.StatementAdapter.evaluate(StatementAdapter.java:36)
	at com.carrotsearch.randomizedtesting.ThreadLeakControl$StatementRunner.run(ThreadLeakControl.java:367)
	at java.lang.Thread.run(java.base@9-ea/Thread.java:804)


FAILED:  org.apache.lucene.search.TestLatLonPointQueries.testRandomMedium

Error Message:
invalid latitude NaN; must be between -90.0 and 90.0

Stack Trace:
java.lang.IllegalArgumentException: invalid latitude NaN; must be between -90.0 and 90.0
	at __randomizedtesting.SeedInfo.seed([AA446CF783002BC5:179A5B5FC26548A3]:0)
	at org.apache.lucene.spatial.util.GeoUtils.checkLatitude(GeoUtils.java:66)
	at org.apache.lucene.document.LatLonPoint.encodeLatitude(LatLonPoint.java:140)
	at org.apache.lucene.search.TestLatLonPointQueries.quantizeLat(TestLatLonPointQueries.java:47)
	at org.apache.lucene.spatial.util.BaseGeoPointTestCase.verify(BaseGeoPointTestCase.java:730)
	at org.apache.lucene.spatial.util.BaseGeoPointTestCase.doTestRandom(BaseGeoPointTestCase.java:665)
	at org.apache.lucene.spatial.util.BaseGeoPointTestCase.testRandomMedium(BaseGeoPointTestCase.java:587)
	at sun.reflect.NativeMethodAccessorImpl.invoke0(java.base@9-ea/Native Method)
	at sun.reflect.NativeMethodAccessorImpl.invoke(java.base@9-ea/NativeMethodAccessorImpl.java:62)
	at sun.reflect.DelegatingMethodAccessorImpl.invoke(java.base@9-ea/DelegatingMethodAccessorImpl.java:43)
	at java.lang.reflect.Method.invoke(java.base@9-ea/Method.java:531)
	at com.carrotsearch.randomizedtesting.RandomizedRunner.invoke(RandomizedRunner.java:1764)
	at com.carrotsearch.randomizedtesting.RandomizedRunner$8.evaluate(RandomizedRunner.java:871)
	at com.carrotsearch.randomizedtesting.RandomizedRunner$9.evaluate(RandomizedRunner.java:907)
	at com.carrotsearch.randomizedtesting.RandomizedRunner$10.evaluate(RandomizedRunner.java:921)
	at org.apache.lucene.util.TestRuleSetupTeardownChained$1.evaluate(TestRuleSetupTeardownChained.java:49)
	at org.apache.lucene.util.AbstractBeforeAfterRule$1.evaluate(AbstractBeforeAfterRule.java:45)
	at org.apache.lucene.util.TestRuleThreadAndTestName$1.evaluate(TestRuleThreadAndTestName.java:48)
	at org.apache.lucene.util.TestRuleIgnoreAfterMaxFailures$1.evaluate(TestRuleIgnoreAfterMaxFailures.java:64)
	at org.apache.lucene.util.TestRuleMarkFailure$1.evaluate(TestRuleMarkFailure.java:47)
	at com.carrotsearch.randomizedtesting.rules.StatementAdapter.evaluate(StatementAdapter.java:36)
	at com.carrotsearch.randomizedtesting.ThreadLeakControl$StatementRunner.run(ThreadLeakControl.java:367)
	at com.carrotsearch.randomizedtesting.ThreadLeakControl.forkTimeoutingTask(ThreadLeakControl.java:809)
	at com.carrotsearch.randomizedtesting.ThreadLeakControl$3.evaluate(ThreadLeakControl.java:460)
	at com.carrotsearch.randomizedtesting.RandomizedRunner.runSingleTest(RandomizedRunner.java:880)
	at com.carrotsearch.randomizedtesting.RandomizedRunner$5.evaluate(RandomizedRunner.java:781)
	at com.carrotsearch.randomizedtesting.RandomizedRunner$6.evaluate(RandomizedRunner.java:816)
	at com.carrotsearch.randomizedtesting.RandomizedRunner$7.evaluate(RandomizedRunner.java:827)
	at org.apache.lucene.util.AbstractBeforeAfterRule$1.evaluate(AbstractBeforeAfterRule.java:45)
	at com.carrotsearch.randomizedtesting.rules.StatementAdapter.evaluate(StatementAdapter.java:36)
	at org.apache.lucene.util.TestRuleStoreClassName$1.evaluate(TestRuleStoreClassName.java:41)
	at com.carrotsearch.randomizedtesting.rules.NoShadowingOrOverridesOnMethodsRule$1.evaluate(NoShadowingOrOverridesOnMethodsRule.java:40)
	at com.carrotsearch.randomizedtesting.rules.NoShadowingOrOverridesOnMethodsRule$1.evaluate(NoShadowingOrOverridesOnMethodsRule.java:40)
	at com.carrotsearch.randomizedtesting.rules.StatementAdapter.evaluate(StatementAdapter.java:36)
	at com.carrotsearch.randomizedtesting.rules.StatementAdapter.evaluate(StatementAdapter.java:36)
	at com.carrotsearch.randomizedtesting.rules.StatementAdapter.evaluate(StatementAdapter.java:36)
	at org.apache.lucene.util.TestRuleAssertionsRequired$1.evaluate(TestRuleAssertionsRequired.java:53)
	at org.apache.lucene.util.TestRuleMarkFailure$1.evaluate(TestRuleMarkFailure.java:47)
	at org.apache.lucene.util.TestRuleIgnoreAfterMaxFailures$1.evaluate(TestRuleIgnoreAfterMaxFailures.java:64)
	at org.apache.lucene.util.TestRuleIgnoreTestSuites$1.evaluate(TestRuleIgnoreTestSuites.java:54)
	at com.carrotsearch.randomizedtesting.rules.StatementAdapter.evaluate(StatementAdapter.java:36)
	at com.carrotsearch.randomizedtesting.ThreadLeakControl$StatementRunner.run(ThreadLeakControl.java:367)
	at java.lang.Thread.run(java.base@9-ea/Thread.java:804)


FAILED:  org.apache.lucene.search.TestLatLonPointQueries.testAllLatEqual

Error Message:
invalid latitude NaN; must be between -90.0 and 90.0

Stack Trace:
java.lang.IllegalArgumentException: invalid latitude NaN; must be between -90.0 and 90.0
	at __randomizedtesting.SeedInfo.seed([AA446CF783002BC5:17D13A798ACD09C8]:0)
	at org.apache.lucene.spatial.util.GeoUtils.checkLatitude(GeoUtils.java:66)
	at org.apache.lucene.document.LatLonPoint.encodeLatitude(LatLonPoint.java:140)
	at org.apache.lucene.search.TestLatLonPointQueries.quantizeLat(TestLatLonPointQueries.java:47)
	at org.apache.lucene.spatial.util.BaseGeoPointTestCase.verify(BaseGeoPointTestCase.java:730)
	at org.apache.lucene.spatial.util.BaseGeoPointTestCase.testAllLatEqual(BaseGeoPointTestCase.java:419)
	at sun.reflect.NativeMethodAccessorImpl.invoke0(java.base@9-ea/Native Method)
	at sun.reflect.NativeMethodAccessorImpl.invoke(java.base@9-ea/NativeMethodAccessorImpl.java:62)
	at sun.reflect.DelegatingMethodAccessorImpl.invoke(java.base@9-ea/DelegatingMethodAccessorImpl.java:43)
	at java.lang.reflect.Method.invoke(java.base@9-ea/Method.java:531)
	at com.carrotsearch.randomizedtesting.RandomizedRunner.invoke(RandomizedRunner.java:1764)
	at com.carrotsearch.randomizedtesting.RandomizedRunner$8.evaluate(RandomizedRunner.java:871)
	at com.carrotsearch.randomizedtesting.RandomizedRunner$9.evaluate(RandomizedRunner.java:907)
	at com.carrotsearch.randomizedtesting.RandomizedRunner$10.evaluate(RandomizedRunner.java:921)
	at org.apache.lucene.util.TestRuleSetupTeardownChained$1.evaluate(TestRuleSetupTeardownChained.java:49)
	at org.apache.lucene.util.AbstractBeforeAfterRule$1.evaluate(AbstractBeforeAfterRule.java:45)
	at org.apache.lucene.util.TestRuleThreadAndTestName$1.evaluate(TestRuleThreadAndTestName.java:48)
	at org.apache.lucene.util.TestRuleIgnoreAfterMaxFailures$1.evaluate(TestRuleIgnoreAfterMaxFailures.java:64)
	at org.apache.lucene.util.TestRuleMarkFailure$1.evaluate(TestRuleMarkFailure.java:47)
	at com.carrotsearch.randomizedtesting.rules.StatementAdapter.evaluate(StatementAdapter.java:36)
	at com.carrotsearch.randomizedtesting.ThreadLeakControl$StatementRunner.run(ThreadLeakControl.java:367)
	at com.carrotsearch.randomizedtesting.ThreadLeakControl.forkTimeoutingTask(ThreadLeakControl.java:809)
	at com.carrotsearch.randomizedtesting.ThreadLeakControl$3.evaluate(ThreadLeakControl.java:460)
	at com.carrotsearch.randomizedtesting.RandomizedRunner.runSingleTest(RandomizedRunner.java:880)
	at com.carrotsearch.randomizedtesting.RandomizedRunner$5.evaluate(RandomizedRunner.java:781)
	at com.carrotsearch.randomizedtesting.RandomizedRunner$6.evaluate(RandomizedRunner.java:816)
	at com.carrotsearch.randomizedtesting.RandomizedRunner$7.evaluate(RandomizedRunner.java:827)
	at org.apache.lucene.util.AbstractBeforeAfterRule$1.evaluate(AbstractBeforeAfterRule.java:45)
	at com.carrotsearch.randomizedtesting.rules.StatementAdapter.evaluate(StatementAdapter.java:36)
	at org.apache.lucene.util.TestRuleStoreClassName$1.evaluate(TestRuleStoreClassName.java:41)
	at com.carrotsearch.randomizedtesting.rules.NoShadowingOrOverridesOnMethodsRule$1.evaluate(NoShadowingOrOverridesOnMethodsRule.java:40)
	at com.carrotsearch.randomizedtesting.rules.NoShadowingOrOverridesOnMethodsRule$1.evaluate(NoShadowingOrOverridesOnMethodsRule.java:40)
	at com.carrotsearch.randomizedtesting.rules.StatementAdapter.evaluate(StatementAdapter.java:36)
	at com.carrotsearch.randomizedtesting.rules.StatementAdapter.evaluate(StatementAdapter.java:36)
	at com.carrotsearch.randomizedtesting.rules.StatementAdapter.evaluate(StatementAdapter.java:36)
	at org.apache.lucene.util.TestRuleAssertionsRequired$1.evaluate(TestRuleAssertionsRequired.java:53)
	at org.apache.lucene.util.TestRuleMarkFailure$1.evaluate(TestRuleMarkFailure.java:47)
	at org.apache.lucene.util.TestRuleIgnoreAfterMaxFailures$1.evaluate(TestRuleIgnoreAfterMaxFailures.java:64)
	at org.apache.lucene.util.TestRuleIgnoreTestSuites$1.evaluate(TestRuleIgnoreTestSuites.java:54)
	at com.carrotsearch.randomizedtesting.rules.StatementAdapter.evaluate(StatementAdapter.java:36)
	at com.carrotsearch.randomizedtesting.ThreadLeakControl$StatementRunner.run(ThreadLeakControl.java:367)
	at java.lang.Thread.run(java.base@9-ea/Thread.java:804)




Build Log:
[...truncated 8428 lines...]
   [junit4] Suite: org.apache.lucene.search.TestLatLonPointQueries
   [junit4]   2> NOTE: reproduce with: ant test  -Dtestcase=TestLatLonPointQueries -Dtests.method=testAllLonEqual
-Dtests.seed=AA446CF783002BC5 -Dtests.multiplier=3 -Dtests.slow=true -Dtests.locale=en-RW
-Dtests.timezone=Asia/Kuching -Dtests.asserts=true -Dtests.file.encoding=UTF-8
   [junit4] ERROR   0.03s J0 | TestLatLonPointQueries.testAllLonEqual <<<
   [junit4]    > Throwable #1: java.lang.IllegalArgumentException: invalid latitude NaN;
must be between -90.0 and 90.0
   [junit4]    > 	at __randomizedtesting.SeedInfo.seed([AA446CF783002BC5:3B4E9D0A73AA6BD1]:0)
   [junit4]    > 	at org.apache.lucene.spatial.util.GeoUtils.checkLatitude(GeoUtils.java:66)
   [junit4]    > 	at org.apache.lucene.document.LatLonPoint.encodeLatitude(LatLonPoint.java:140)
   [junit4]    > 	at org.apache.lucene.search.TestLatLonPointQueries.quantizeLat(TestLatLonPointQueries.java:47)
   [junit4]    > 	at org.apache.lucene.spatial.util.BaseGeoPointTestCase.verify(BaseGeoPointTestCase.java:730)
   [junit4]    > 	at org.apache.lucene.spatial.util.BaseGeoPointTestCase.testAllLonEqual(BaseGeoPointTestCase.java:468)
   [junit4]    > 	at java.lang.Thread.run(java.base@9-ea/Thread.java:804)
   [junit4] IGNOR/A 0.00s J0 | TestLatLonPointQueries.testRandomBig
   [junit4]    > Assumption #1: 'nightly' test group is disabled (@Nightly())
   [junit4]   2> NOTE: reproduce with: ant test  -Dtestcase=TestLatLonPointQueries -Dtests.method=testRandomTiny
-Dtests.seed=AA446CF783002BC5 -Dtests.multiplier=3 -Dtests.slow=true -Dtests.locale=en-RW
-Dtests.timezone=Asia/Kuching -Dtests.asserts=true -Dtests.file.encoding=UTF-8
   [junit4] ERROR   0.00s J0 | TestLatLonPointQueries.testRandomTiny <<<
   [junit4]    > Throwable #1: java.lang.IllegalArgumentException: invalid latitude NaN;
must be between -90.0 and 90.0
   [junit4]    > 	at __randomizedtesting.SeedInfo.seed([AA446CF783002BC5:E303B2B1DD211369]:0)
   [junit4]    > 	at org.apache.lucene.spatial.util.GeoUtils.checkLatitude(GeoUtils.java:66)
   [junit4]    > 	at org.apache.lucene.document.LatLonPoint.encodeLatitude(LatLonPoint.java:140)
   [junit4]    > 	at org.apache.lucene.search.TestLatLonPointQueries.quantizeLat(TestLatLonPointQueries.java:47)
   [junit4]    > 	at org.apache.lucene.spatial.util.BaseGeoPointTestCase.verify(BaseGeoPointTestCase.java:730)
   [junit4]    > 	at org.apache.lucene.spatial.util.BaseGeoPointTestCase.doTestRandom(BaseGeoPointTestCase.java:665)
   [junit4]    > 	at org.apache.lucene.spatial.util.BaseGeoPointTestCase.testRandomTiny(BaseGeoPointTestCase.java:583)
   [junit4]    > 	at java.lang.Thread.run(java.base@9-ea/Thread.java:804)
   [junit4]   2> NOTE: reproduce with: ant test  -Dtestcase=TestLatLonPointQueries -Dtests.method=testRandomMedium
-Dtests.seed=AA446CF783002BC5 -Dtests.multiplier=3 -Dtests.slow=true -Dtests.locale=en-RW
-Dtests.timezone=Asia/Kuching -Dtests.asserts=true -Dtests.file.encoding=UTF-8
   [junit4] ERROR   0.03s J0 | TestLatLonPointQueries.testRandomMedium <<<
   [junit4]    > Throwable #1: java.lang.IllegalArgumentException: invalid latitude NaN;
must be between -90.0 and 90.0
   [junit4]    > 	at __randomizedtesting.SeedInfo.seed([AA446CF783002BC5:179A5B5FC26548A3]:0)
   [junit4]    > 	at org.apache.lucene.spatial.util.GeoUtils.checkLatitude(GeoUtils.java:66)
   [junit4]    > 	at org.apache.lucene.document.LatLonPoint.encodeLatitude(LatLonPoint.java:140)
   [junit4]    > 	at org.apache.lucene.search.TestLatLonPointQueries.quantizeLat(TestLatLonPointQueries.java:47)
   [junit4]    > 	at org.apache.lucene.spatial.util.BaseGeoPointTestCase.verify(BaseGeoPointTestCase.java:730)
   [junit4]    > 	at org.apache.lucene.spatial.util.BaseGeoPointTestCase.doTestRandom(BaseGeoPointTestCase.java:665)
   [junit4]    > 	at org.apache.lucene.spatial.util.BaseGeoPointTestCase.testRandomMedium(BaseGeoPointTestCase.java:587)
   [junit4]    > 	at java.lang.Thread.run(java.base@9-ea/Thread.java:804)
   [junit4] IGNOR/A 0.00s J0 | TestLatLonPointQueries.testRandomDistanceHuge
   [junit4]    > Assumption #1: 'nightly' test group is disabled (@Nightly())
   [junit4]   2> NOTE: reproduce with: ant test  -Dtestcase=TestLatLonPointQueries -Dtests.method=testAllLatEqual
-Dtests.seed=AA446CF783002BC5 -Dtests.multiplier=3 -Dtests.slow=true -Dtests.locale=en-RW
-Dtests.timezone=Asia/Kuching -Dtests.asserts=true -Dtests.file.encoding=UTF-8
   [junit4] ERROR   0.03s J0 | TestLatLonPointQueries.testAllLatEqual <<<
   [junit4]    > Throwable #1: java.lang.IllegalArgumentException: invalid latitude NaN;
must be between -90.0 and 90.0
   [junit4]    > 	at __randomizedtesting.SeedInfo.seed([AA446CF783002BC5:17D13A798ACD09C8]:0)
   [junit4]    > 	at org.apache.lucene.spatial.util.GeoUtils.checkLatitude(GeoUtils.java:66)
   [junit4]    > 	at org.apache.lucene.document.LatLonPoint.encodeLatitude(LatLonPoint.java:140)
   [junit4]    > 	at org.apache.lucene.search.TestLatLonPointQueries.quantizeLat(TestLatLonPointQueries.java:47)
   [junit4]    > 	at org.apache.lucene.spatial.util.BaseGeoPointTestCase.verify(BaseGeoPointTestCase.java:730)
   [junit4]    > 	at org.apache.lucene.spatial.util.BaseGeoPointTestCase.testAllLatEqual(BaseGeoPointTestCase.java:419)
   [junit4]    > 	at java.lang.Thread.run(java.base@9-ea/Thread.java:804)
   [junit4]   2> NOTE: test params are: codec=Asserting(Lucene60): {string=BlockTreeOrds(blocksize=128),
id=FST50}, docValues:{field=DocValuesFormat(name=Direct), id=DocValuesFormat(name=Lucene54),
point=DocValuesFormat(name=Lucene54)}, maxPointsInLeafNode=1775, maxMBSortInHeap=5.106055880276306,
sim=RandomSimilarity(queryNorm=false,coord=yes): {}, locale=en-RW, timezone=Asia/Kuching
   [junit4]   2> NOTE: Linux 4.2.0-34-generic amd64/Oracle Corporation 9-ea (64-bit)/cpus=12,threads=1,free=315679976,total=526385152
   [junit4]   2> NOTE: All tests run in this JVM: [TestDocValuesNumbersQuery, TestIDVersionPostingsFormat,
TestLatLonPointQueries]
   [junit4] Completed [14/15 (1!)] on J0 in 9.90s, 42 tests, 4 errors, 2 skipped <<<
FAILURES!

[...truncated 17 lines...]
BUILD FAILED
/home/jenkins/workspace/Lucene-Solr-master-Linux/build.xml:740: The following error occurred
while executing this line:
/home/jenkins/workspace/Lucene-Solr-master-Linux/build.xml:684: The following error occurred
while executing this line:
/home/jenkins/workspace/Lucene-Solr-master-Linux/build.xml:59: The following error occurred
while executing this line:
/home/jenkins/workspace/Lucene-Solr-master-Linux/lucene/build.xml:476: The following error
occurred while executing this line:
/home/jenkins/workspace/Lucene-Solr-master-Linux/lucene/common-build.xml:2187: The following
error occurred while executing this line:
/home/jenkins/workspace/Lucene-Solr-master-Linux/lucene/module-build.xml:58: The following
error occurred while executing this line:
/home/jenkins/workspace/Lucene-Solr-master-Linux/lucene/common-build.xml:1457: The following
error occurred while executing this line:
/home/jenkins/workspace/Lucene-Solr-master-Linux/lucene/common-build.xml:1014: There were
test failures: 15 suites, 118 tests, 4 errors, 3 ignored (3 assumptions) [seed: AA446CF783002BC5]

Total time: 20 minutes 16 seconds
Build step 'Invoke Ant' marked build as failure
Archiving artifacts
[WARNINGS] Skipping publisher since build result is FAILURE
Recording test results
Email was triggered for: Failure - Any
Sending email for trigger: Failure - Any



Mime
View raw message