lucene-dev mailing list archives

Site index · List index
Message view « Date » · « Thread »
Top « Date » · « Thread »
From Policeman Jenkins Server <jenk...@thetaphi.de>
Subject [JENKINS] Lucene-Solr-master-Linux (32bit/jdk1.8.0_72) - Build # 16278 - Failure!
Date Sun, 20 Mar 2016 17:26:14 GMT
Build: http://jenkins.thetaphi.de/job/Lucene-Solr-master-Linux/16278/
Java: 32bit/jdk1.8.0_72 -client -XX:+UseParallelGC

1 tests failed.
FAILED:  org.apache.solr.handler.TestSQLHandler.doTest

Error Message:
--> http://127.0.0.1:44504/collection1:java.util.concurrent.ExecutionException: java.io.IOException: --> http://127.0.0.1:34360/collection1/: An exception has occurred on the server, refer to server log for details.

Stack Trace:
java.io.IOException: --> http://127.0.0.1:44504/collection1:java.util.concurrent.ExecutionException: java.io.IOException: --> http://127.0.0.1:34360/collection1/: An exception has occurred on the server, refer to server log for details.
	at __randomizedtesting.SeedInfo.seed([4E2F6420A5FAE254:E96BDC84C841F1ED]:0)
	at org.apache.solr.client.solrj.io.stream.SolrStream.read(SolrStream.java:201)
	at org.apache.solr.handler.TestSQLHandler.getTuples(TestSQLHandler.java:2425)
	at org.apache.solr.handler.TestSQLHandler.testBasicSelect(TestSQLHandler.java:238)
	at org.apache.solr.handler.TestSQLHandler.doTest(TestSQLHandler.java:89)
	at sun.reflect.NativeMethodAccessorImpl.invoke0(Native Method)
	at sun.reflect.NativeMethodAccessorImpl.invoke(NativeMethodAccessorImpl.java:62)
	at sun.reflect.DelegatingMethodAccessorImpl.invoke(DelegatingMethodAccessorImpl.java:43)
	at java.lang.reflect.Method.invoke(Method.java:498)
	at com.carrotsearch.randomizedtesting.RandomizedRunner.invoke(RandomizedRunner.java:1764)
	at com.carrotsearch.randomizedtesting.RandomizedRunner$8.evaluate(RandomizedRunner.java:871)
	at com.carrotsearch.randomizedtesting.RandomizedRunner$9.evaluate(RandomizedRunner.java:907)
	at com.carrotsearch.randomizedtesting.RandomizedRunner$10.evaluate(RandomizedRunner.java:921)
	at org.apache.solr.BaseDistributedSearchTestCase$ShardsRepeatRule$ShardsFixedStatement.callStatement(BaseDistributedSearchTestCase.java:996)
	at org.apache.solr.BaseDistributedSearchTestCase$ShardsRepeatRule$ShardsStatement.evaluate(BaseDistributedSearchTestCase.java:971)
	at com.carrotsearch.randomizedtesting.rules.SystemPropertiesRestoreRule$1.evaluate(SystemPropertiesRestoreRule.java:57)
	at org.apache.lucene.util.TestRuleSetupTeardownChained$1.evaluate(TestRuleSetupTeardownChained.java:49)
	at org.apache.lucene.util.AbstractBeforeAfterRule$1.evaluate(AbstractBeforeAfterRule.java:45)
	at org.apache.lucene.util.TestRuleThreadAndTestName$1.evaluate(TestRuleThreadAndTestName.java:48)
	at org.apache.lucene.util.TestRuleIgnoreAfterMaxFailures$1.evaluate(TestRuleIgnoreAfterMaxFailures.java:64)
	at org.apache.lucene.util.TestRuleMarkFailure$1.evaluate(TestRuleMarkFailure.java:47)
	at com.carrotsearch.randomizedtesting.rules.StatementAdapter.evaluate(StatementAdapter.java:36)
	at com.carrotsearch.randomizedtesting.ThreadLeakControl$StatementRunner.run(ThreadLeakControl.java:367)
	at com.carrotsearch.randomizedtesting.ThreadLeakControl.forkTimeoutingTask(ThreadLeakControl.java:809)
	at com.carrotsearch.randomizedtesting.ThreadLeakControl$3.evaluate(ThreadLeakControl.java:460)
	at com.carrotsearch.randomizedtesting.RandomizedRunner.runSingleTest(RandomizedRunner.java:880)
	at com.carrotsearch.randomizedtesting.RandomizedRunner$5.evaluate(RandomizedRunner.java:781)
	at com.carrotsearch.randomizedtesting.RandomizedRunner$6.evaluate(RandomizedRunner.java:816)
	at com.carrotsearch.randomizedtesting.RandomizedRunner$7.evaluate(RandomizedRunner.java:827)
	at com.carrotsearch.randomizedtesting.rules.StatementAdapter.evaluate(StatementAdapter.java:36)
	at com.carrotsearch.randomizedtesting.rules.SystemPropertiesRestoreRule$1.evaluate(SystemPropertiesRestoreRule.java:57)
	at org.apache.lucene.util.AbstractBeforeAfterRule$1.evaluate(AbstractBeforeAfterRule.java:45)
	at com.carrotsearch.randomizedtesting.rules.StatementAdapter.evaluate(StatementAdapter.java:36)
	at org.apache.lucene.util.TestRuleStoreClassName$1.evaluate(TestRuleStoreClassName.java:41)
	at com.carrotsearch.randomizedtesting.rules.NoShadowingOrOverridesOnMethodsRule$1.evaluate(NoShadowingOrOverridesOnMethodsRule.java:40)
	at com.carrotsearch.randomizedtesting.rules.NoShadowingOrOverridesOnMethodsRule$1.evaluate(NoShadowingOrOverridesOnMethodsRule.java:40)
	at com.carrotsearch.randomizedtesting.rules.StatementAdapter.evaluate(StatementAdapter.java:36)
	at com.carrotsearch.randomizedtesting.rules.StatementAdapter.evaluate(StatementAdapter.java:36)
	at com.carrotsearch.randomizedtesting.rules.StatementAdapter.evaluate(StatementAdapter.java:36)
	at org.apache.lucene.util.TestRuleAssertionsRequired$1.evaluate(TestRuleAssertionsRequired.java:53)
	at org.apache.lucene.util.TestRuleMarkFailure$1.evaluate(TestRuleMarkFailure.java:47)
	at org.apache.lucene.util.TestRuleIgnoreAfterMaxFailures$1.evaluate(TestRuleIgnoreAfterMaxFailures.java:64)
	at org.apache.lucene.util.TestRuleIgnoreTestSuites$1.evaluate(TestRuleIgnoreTestSuites.java:54)
	at com.carrotsearch.randomizedtesting.rules.StatementAdapter.evaluate(StatementAdapter.java:36)
	at com.carrotsearch.randomizedtesting.ThreadLeakControl$StatementRunner.run(ThreadLeakControl.java:367)
	at java.lang.Thread.run(Thread.java:745)




Build Log:
[...truncated 11895 lines...]
   [junit4] Suite: org.apache.solr.handler.TestSQLHandler
   [junit4]   2> Creating dataDir: /home/jenkins/workspace/Lucene-Solr-master-Linux/solr/build/solr-core/test/J1/temp/solr.handler.TestSQLHandler_4E2F6420A5FAE254-001/init-core-data-001
   [junit4]   2> 1124669 INFO  (SUITE-TestSQLHandler-seed#[4E2F6420A5FAE254]-worker) [    ] o.a.s.SolrTestCaseJ4 Randomized ssl (false) and clientAuth (false)
   [junit4]   2> 1124669 INFO  (SUITE-TestSQLHandler-seed#[4E2F6420A5FAE254]-worker) [    ] o.a.s.BaseDistributedSearchTestCase Setting hostContext system property: /
   [junit4]   2> 1124671 INFO  (TEST-TestSQLHandler.doTest-seed#[4E2F6420A5FAE254]) [    ] o.a.s.c.ZkTestServer STARTING ZK TEST SERVER
   [junit4]   2> 1124671 INFO  (Thread-3026) [    ] o.a.s.c.ZkTestServer client port:0.0.0.0/0.0.0.0:0
   [junit4]   2> 1124671 INFO  (Thread-3026) [    ] o.a.s.c.ZkTestServer Starting server
   [junit4]   2> 1124771 INFO  (TEST-TestSQLHandler.doTest-seed#[4E2F6420A5FAE254]) [    ] o.a.s.c.ZkTestServer start zk server on port:37517
   [junit4]   2> 1124771 INFO  (TEST-TestSQLHandler.doTest-seed#[4E2F6420A5FAE254]) [    ] o.a.s.c.c.SolrZkClient Using default ZkCredentialsProvider
   [junit4]   2> 1124772 INFO  (TEST-TestSQLHandler.doTest-seed#[4E2F6420A5FAE254]) [    ] o.a.s.c.c.ConnectionManager Waiting for client to connect to ZooKeeper
   [junit4]   2> 1124774 INFO  (zkCallback-1314-thread-1) [    ] o.a.s.c.c.ConnectionManager Watcher org.apache.solr.common.cloud.ConnectionManager@107db1c name:ZooKeeperConnection Watcher:127.0.0.1:37517 got event WatchedEvent state:SyncConnected type:None path:null path:null type:None
   [junit4]   2> 1124775 INFO  (TEST-TestSQLHandler.doTest-seed#[4E2F6420A5FAE254]) [    ] o.a.s.c.c.ConnectionManager Client is connected to ZooKeeper
   [junit4]   2> 1124775 INFO  (TEST-TestSQLHandler.doTest-seed#[4E2F6420A5FAE254]) [    ] o.a.s.c.c.SolrZkClient Using default ZkACLProvider
   [junit4]   2> 1124775 INFO  (TEST-TestSQLHandler.doTest-seed#[4E2F6420A5FAE254]) [    ] o.a.s.c.c.SolrZkClient makePath: /solr
   [junit4]   2> 1124780 INFO  (TEST-TestSQLHandler.doTest-seed#[4E2F6420A5FAE254]) [    ] o.a.s.c.c.SolrZkClient Using default ZkCredentialsProvider
   [junit4]   2> 1124780 INFO  (TEST-TestSQLHandler.doTest-seed#[4E2F6420A5FAE254]) [    ] o.a.s.c.c.ConnectionManager Waiting for client to connect to ZooKeeper
   [junit4]   2> 1124781 INFO  (zkCallback-1315-thread-1) [    ] o.a.s.c.c.ConnectionManager Watcher org.apache.solr.common.cloud.ConnectionManager@275d9e name:ZooKeeperConnection Watcher:127.0.0.1:37517/solr got event WatchedEvent state:SyncConnected type:None path:null path:null type:None
   [junit4]   2> 1124781 INFO  (TEST-TestSQLHandler.doTest-seed#[4E2F6420A5FAE254]) [    ] o.a.s.c.c.ConnectionManager Client is connected to ZooKeeper
   [junit4]   2> 1124782 INFO  (TEST-TestSQLHandler.doTest-seed#[4E2F6420A5FAE254]) [    ] o.a.s.c.c.SolrZkClient Using default ZkACLProvider
   [junit4]   2> 1124782 INFO  (TEST-TestSQLHandler.doTest-seed#[4E2F6420A5FAE254]) [    ] o.a.s.c.c.SolrZkClient makePath: /collections/collection1
   [junit4]   2> 1124783 INFO  (TEST-TestSQLHandler.doTest-seed#[4E2F6420A5FAE254]) [    ] o.a.s.c.c.SolrZkClient makePath: /collections/collection1/shards
   [junit4]   2> 1124785 INFO  (TEST-TestSQLHandler.doTest-seed#[4E2F6420A5FAE254]) [    ] o.a.s.c.c.SolrZkClient makePath: /collections/control_collection
   [junit4]   2> 1124786 INFO  (TEST-TestSQLHandler.doTest-seed#[4E2F6420A5FAE254]) [    ] o.a.s.c.c.SolrZkClient makePath: /collections/control_collection/shards
   [junit4]   2> 1124787 INFO  (TEST-TestSQLHandler.doTest-seed#[4E2F6420A5FAE254]) [    ] o.a.s.c.AbstractZkTestCase put /home/jenkins/workspace/Lucene-Solr-master-Linux/solr/core/src/test-files/solr/collection1/conf/solrconfig-sql.xml to /configs/conf1/solrconfig.xml
   [junit4]   2> 1124787 INFO  (TEST-TestSQLHandler.doTest-seed#[4E2F6420A5FAE254]) [    ] o.a.s.c.c.SolrZkClient makePath: /configs/conf1/solrconfig.xml
   [junit4]   2> 1124791 INFO  (TEST-TestSQLHandler.doTest-seed#[4E2F6420A5FAE254]) [    ] o.a.s.c.AbstractZkTestCase put /home/jenkins/workspace/Lucene-Solr-master-Linux/solr/core/src/test-files/solr/collection1/conf/schema-sql.xml to /configs/conf1/schema.xml
   [junit4]   2> 1124791 INFO  (TEST-TestSQLHandler.doTest-seed#[4E2F6420A5FAE254]) [    ] o.a.s.c.c.SolrZkClient makePath: /configs/conf1/schema.xml
   [junit4]   2> 1124793 INFO  (TEST-TestSQLHandler.doTest-seed#[4E2F6420A5FAE254]) [    ] o.a.s.c.AbstractZkTestCase put /home/jenkins/workspace/Lucene-Solr-master-Linux/solr/core/src/test-files/solr/collection1/conf/solrconfig.snippet.randomindexconfig.xml to /configs/conf1/solrconfig.snippet.randomindexconfig.xml
   [junit4]   2> 1124793 INFO  (TEST-TestSQLHandler.doTest-seed#[4E2F6420A5FAE254]) [    ] o.a.s.c.c.SolrZkClient makePath: /configs/conf1/solrconfig.snippet.randomindexconfig.xml
   [junit4]   2> 1124795 INFO  (TEST-TestSQLHandler.doTest-seed#[4E2F6420A5FAE254]) [    ] o.a.s.c.AbstractZkTestCase put /home/jenkins/workspace/Lucene-Solr-master-Linux/solr/core/src/test-files/solr/collection1/conf/stopwords.txt to /configs/conf1/stopwords.txt
   [junit4]   2> 1124795 INFO  (TEST-TestSQLHandler.doTest-seed#[4E2F6420A5FAE254]) [    ] o.a.s.c.c.SolrZkClient makePath: /configs/conf1/stopwords.txt
   [junit4]   2> 1124797 INFO  (TEST-TestSQLHandler.doTest-seed#[4E2F6420A5FAE254]) [    ] o.a.s.c.AbstractZkTestCase put /home/jenkins/workspace/Lucene-Solr-master-Linux/solr/core/src/test-files/solr/collection1/conf/protwords.txt to /configs/conf1/protwords.txt
   [junit4]   2> 1124797 INFO  (TEST-TestSQLHandler.doTest-seed#[4E2F6420A5FAE254]) [    ] o.a.s.c.c.SolrZkClient makePath: /configs/conf1/protwords.txt
   [junit4]   2> 1124799 INFO  (TEST-TestSQLHandler.doTest-seed#[4E2F6420A5FAE254]) [    ] o.a.s.c.AbstractZkTestCase put /home/jenkins/workspace/Lucene-Solr-master-Linux/solr/core/src/test-files/solr/collection1/conf/currency.xml to /configs/conf1/currency.xml
   [junit4]   2> 1124799 INFO  (TEST-TestSQLHandler.doTest-seed#[4E2F6420A5FAE254]) [    ] o.a.s.c.c.SolrZkClient makePath: /configs/conf1/currency.xml
   [junit4]   2> 1124800 INFO  (TEST-TestSQLHandler.doTest-seed#[4E2F6420A5FAE254]) [    ] o.a.s.c.AbstractZkTestCase put /home/jenkins/workspace/Lucene-Solr-master-Linux/solr/core/src/test-files/solr/collection1/conf/enumsConfig.xml to /configs/conf1/enumsConfig.xml
   [junit4]   2> 1124801 INFO  (TEST-TestSQLHandler.doTest-seed#[4E2F6420A5FAE254]) [    ] o.a.s.c.c.SolrZkClient makePath: /configs/conf1/enumsConfig.xml
   [junit4]   2> 1124802 INFO  (TEST-TestSQLHandler.doTest-seed#[4E2F6420A5FAE254]) [    ] o.a.s.c.AbstractZkTestCase put /home/jenkins/workspace/Lucene-Solr-master-Linux/solr/core/src/test-files/solr/collection1/conf/open-exchange-rates.json to /configs/conf1/open-exchange-rates.json
   [junit4]   2> 1124802 INFO  (TEST-TestSQLHandler.doTest-seed#[4E2F6420A5FAE254]) [    ] o.a.s.c.c.SolrZkClient makePath: /configs/conf1/open-exchange-rates.json
   [junit4]   2> 1124803 INFO  (TEST-TestSQLHandler.doTest-seed#[4E2F6420A5FAE254]) [    ] o.a.s.c.AbstractZkTestCase put /home/jenkins/workspace/Lucene-Solr-master-Linux/solr/core/src/test-files/solr/collection1/conf/mapping-ISOLatin1Accent.txt to /configs/conf1/mapping-ISOLatin1Accent.txt
   [junit4]   2> 1124804 INFO  (TEST-TestSQLHandler.doTest-seed#[4E2F6420A5FAE254]) [    ] o.a.s.c.c.SolrZkClient makePath: /configs/conf1/mapping-ISOLatin1Accent.txt
   [junit4]   2> 1124805 INFO  (TEST-TestSQLHandler.doTest-seed#[4E2F6420A5FAE254]) [    ] o.a.s.c.AbstractZkTestCase put /home/jenkins/workspace/Lucene-Solr-master-Linux/solr/core/src/test-files/solr/collection1/conf/old_synonyms.txt to /configs/conf1/old_synonyms.txt
   [junit4]   2> 1124805 INFO  (TEST-TestSQLHandler.doTest-seed#[4E2F6420A5FAE254]) [    ] o.a.s.c.c.SolrZkClient makePath: /configs/conf1/old_synonyms.txt
   [junit4]   2> 1124806 INFO  (TEST-TestSQLHandler.doTest-seed#[4E2F6420A5FAE254]) [    ] o.a.s.c.AbstractZkTestCase put /home/jenkins/workspace/Lucene-Solr-master-Linux/solr/core/src/test-files/solr/collection1/conf/synonyms.txt to /configs/conf1/synonyms.txt
   [junit4]   2> 1124807 INFO  (TEST-TestSQLHandler.doTest-seed#[4E2F6420A5FAE254]) [    ] o.a.s.c.c.SolrZkClient makePath: /configs/conf1/synonyms.txt
   [junit4]   2> 1124909 INFO  (TEST-TestSQLHandler.doTest-seed#[4E2F6420A5FAE254]) [    ] o.a.s.SolrTestCaseJ4 Writing core.properties file to /home/jenkins/workspace/Lucene-Solr-master-Linux/solr/build/solr-core/test/J1/temp/solr.handler.TestSQLHandler_4E2F6420A5FAE254-001/control-001/cores/collection1
   [junit4]   2> 1124910 INFO  (TEST-TestSQLHandler.doTest-seed#[4E2F6420A5FAE254]) [    ] o.e.j.s.Server jetty-9.3.8.v20160314
   [junit4]   2> 1124911 INFO  (TEST-TestSQLHandler.doTest-seed#[4E2F6420A5FAE254]) [    ] o.e.j.s.h.ContextHandler Started o.e.j.s.ServletContextHandler@1940efb{/,null,AVAILABLE}
   [junit4]   2> 1124915 INFO  (TEST-TestSQLHandler.doTest-seed#[4E2F6420A5FAE254]) [    ] o.e.j.s.ServerConnector Started ServerConnector@168fafd{HTTP/1.1,[http/1.1]}{127.0.0.1:35780}
   [junit4]   2> 1124915 INFO  (TEST-TestSQLHandler.doTest-seed#[4E2F6420A5FAE254]) [    ] o.e.j.s.Server Started @1126226ms
   [junit4]   2> 1124915 INFO  (TEST-TestSQLHandler.doTest-seed#[4E2F6420A5FAE254]) [    ] o.a.s.c.s.e.JettySolrRunner Jetty properties: {solr.data.dir=/home/jenkins/workspace/Lucene-Solr-master-Linux/solr/build/solr-core/test/J1/temp/solr.handler.TestSQLHandler_4E2F6420A5FAE254-001/tempDir-001/control/data, hostContext=/, hostPort=35780, coreRootDirectory=/home/jenkins/workspace/Lucene-Solr-master-Linux/solr/build/solr-core/test/J1/temp/solr.handler.TestSQLHandler_4E2F6420A5FAE254-001/control-001/cores}
   [junit4]   2> 1124915 INFO  (TEST-TestSQLHandler.doTest-seed#[4E2F6420A5FAE254]) [    ] o.a.s.s.SolrDispatchFilter SolrDispatchFilter.init(): sun.misc.Launcher$AppClassLoader@1d16e93
   [junit4]   2> 1124915 INFO  (TEST-TestSQLHandler.doTest-seed#[4E2F6420A5FAE254]) [    ] o.a.s.c.SolrResourceLoader new SolrResourceLoader for directory: '/home/jenkins/workspace/Lucene-Solr-master-Linux/solr/build/solr-core/test/J1/temp/solr.handler.TestSQLHandler_4E2F6420A5FAE254-001/control-001'
   [junit4]   2> 1124915 INFO  (TEST-TestSQLHandler.doTest-seed#[4E2F6420A5FAE254]) [    ] o.a.s.c.SolrResourceLoader JNDI not configured for solr (NoInitialContextEx)
   [junit4]   2> 1124916 INFO  (TEST-TestSQLHandler.doTest-seed#[4E2F6420A5FAE254]) [    ] o.a.s.c.SolrResourceLoader solr home defaulted to 'solr/' (could not find system property or JNDI)
   [junit4]   2> 1124916 INFO  (TEST-TestSQLHandler.doTest-seed#[4E2F6420A5FAE254]) [    ] o.a.s.c.c.SolrZkClient Using default ZkCredentialsProvider
   [junit4]   2> 1124917 INFO  (TEST-TestSQLHandler.doTest-seed#[4E2F6420A5FAE254]) [    ] o.a.s.c.c.ConnectionManager Waiting for client to connect to ZooKeeper
   [junit4]   2> 1124918 INFO  (zkCallback-1316-thread-1) [    ] o.a.s.c.c.ConnectionManager Watcher org.apache.solr.common.cloud.ConnectionManager@dc5b96 name:ZooKeeperConnection Watcher:127.0.0.1:37517/solr got event WatchedEvent state:SyncConnected type:None path:null path:null type:None
   [junit4]   2> 1124918 INFO  (TEST-TestSQLHandler.doTest-seed#[4E2F6420A5FAE254]) [    ] o.a.s.c.c.ConnectionManager Client is connected to ZooKeeper
   [junit4]   2> 1124918 INFO  (TEST-TestSQLHandler.doTest-seed#[4E2F6420A5FAE254]) [    ] o.a.s.c.c.SolrZkClient Using default ZkACLProvider
   [junit4]   2> 1124919 INFO  (TEST-TestSQLHandler.doTest-seed#[4E2F6420A5FAE254]) [    ] o.a.s.s.SolrDispatchFilter Loading solr.xml from SolrHome (not found in ZooKeeper)
   [junit4]   2> 1124919 INFO  (TEST-TestSQLHandler.doTest-seed#[4E2F6420A5FAE254]) [    ] o.a.s.c.SolrXmlConfig Loading container configuration from /home/jenkins/workspace/Lucene-Solr-master-Linux/solr/build/solr-core/test/J1/temp/solr.handler.TestSQLHandler_4E2F6420A5FAE254-001/control-001/solr.xml
   [junit4]   2> 1124929 INFO  (TEST-TestSQLHandler.doTest-seed#[4E2F6420A5FAE254]) [    ] o.a.s.c.CorePropertiesLocator Config-defined core root directory: /home/jenkins/workspace/Lucene-Solr-master-Linux/solr/build/solr-core/test/J1/temp/solr.handler.TestSQLHandler_4E2F6420A5FAE254-001/control-001/cores
   [junit4]   2> 1124929 INFO  (TEST-TestSQLHandler.doTest-seed#[4E2F6420A5FAE254]) [    ] o.a.s.c.CoreContainer New CoreContainer 7066729
   [junit4]   2> 1124929 INFO  (TEST-TestSQLHandler.doTest-seed#[4E2F6420A5FAE254]) [    ] o.a.s.c.CoreContainer Loading cores into CoreContainer [instanceDir=/home/jenkins/workspace/Lucene-Solr-master-Linux/solr/build/solr-core/test/J1/temp/solr.handler.TestSQLHandler_4E2F6420A5FAE254-001/control-001]
   [junit4]   2> 1124929 WARN  (TEST-TestSQLHandler.doTest-seed#[4E2F6420A5FAE254]) [    ] o.a.s.c.CoreContainer Couldn't add files from /home/jenkins/workspace/Lucene-Solr-master-Linux/solr/build/solr-core/test/J1/temp/solr.handler.TestSQLHandler_4E2F6420A5FAE254-001/control-001/lib to classpath: /home/jenkins/workspace/Lucene-Solr-master-Linux/solr/build/solr-core/test/J1/temp/solr.handler.TestSQLHandler_4E2F6420A5FAE254-001/control-001/lib
   [junit4]   2> 1124929 INFO  (TEST-TestSQLHandler.doTest-seed#[4E2F6420A5FAE254]) [    ] o.a.s.h.c.HttpShardHandlerFactory created with socketTimeout : 90000,urlScheme : ,connTimeout : 15000,maxConnectionsPerHost : 20,maxConnections : 10000,corePoolSize : 0,maximumPoolSize : 2147483647,maxThreadIdleTime : 5,sizeOfQueue : -1,fairnessPolicy : false,useRetries : false,
   [junit4]   2> 1124931 INFO  (TEST-TestSQLHandler.doTest-seed#[4E2F6420A5FAE254]) [    ] o.a.s.u.UpdateShardHandler Creating UpdateShardHandler HTTP client with params: socketTimeout=340000&connTimeout=45000&retry=true
   [junit4]   2> 1124931 INFO  (TEST-TestSQLHandler.doTest-seed#[4E2F6420A5FAE254]) [    ] o.a.s.l.LogWatcher SLF4J impl is org.slf4j.impl.Log4jLoggerFactory
   [junit4]   2> 1124931 INFO  (TEST-TestSQLHandler.doTest-seed#[4E2F6420A5FAE254]) [    ] o.a.s.l.LogWatcher Registering Log Listener [Log4j (org.slf4j.impl.Log4jLoggerFactory)]
   [junit4]   2> 1124931 INFO  (TEST-TestSQLHandler.doTest-seed#[4E2F6420A5FAE254]) [    ] o.a.s.c.ZkContainer Zookeeper client=127.0.0.1:37517/solr
   [junit4]   2> 1124931 INFO  (TEST-TestSQLHandler.doTest-seed#[4E2F6420A5FAE254]) [    ] o.a.s.c.ZkController zkHost includes chroot
   [junit4]   2> 1124931 INFO  (TEST-TestSQLHandler.doTest-seed#[4E2F6420A5FAE254]) [    ] o.a.s.c.c.SolrZkClient Using default ZkCredentialsProvider
   [junit4]   2> 1124932 INFO  (TEST-TestSQLHandler.doTest-seed#[4E2F6420A5FAE254]) [    ] o.a.s.c.c.ConnectionManager Waiting for client to connect to ZooKeeper
   [junit4]   2> 1124933 INFO  (zkCallback-1319-thread-1) [    ] o.a.s.c.c.ConnectionManager Watcher org.apache.solr.common.cloud.ConnectionManager@a5dd44 name:ZooKeeperConnection Watcher:127.0.0.1:37517 got event WatchedEvent state:SyncConnected type:None path:null path:null type:None
   [junit4]   2> 1124933 INFO  (TEST-TestSQLHandler.doTest-seed#[4E2F6420A5FAE254]) [    ] o.a.s.c.c.ConnectionManager Client is connected to ZooKeeper
   [junit4]   2> 1124934 INFO  (TEST-TestSQLHandler.doTest-seed#[4E2F6420A5FAE254]) [    ] o.a.s.c.c.SolrZkClient Using default ZkACLProvider
   [junit4]   2> 1124935 INFO  (TEST-TestSQLHandler.doTest-seed#[4E2F6420A5FAE254]) [n:127.0.0.1:35780_    ] o.a.s.c.c.ConnectionManager Waiting for client to connect to ZooKeeper
   [junit4]   2> 1124936 INFO  (zkCallback-1320-thread-1-processing-n:127.0.0.1:35780_) [n:127.0.0.1:35780_    ] o.a.s.c.c.ConnectionManager Watcher org.apache.solr.common.cloud.ConnectionManager@6ce087 name:ZooKeeperConnection Watcher:127.0.0.1:37517/solr got event WatchedEvent state:SyncConnected type:None path:null path:null type:None
   [junit4]   2> 1124936 INFO  (TEST-TestSQLHandler.doTest-seed#[4E2F6420A5FAE254]) [n:127.0.0.1:35780_    ] o.a.s.c.c.ConnectionManager Client is connected to ZooKeeper
   [junit4]   2> 1124937 INFO  (TEST-TestSQLHandler.doTest-seed#[4E2F6420A5FAE254]) [n:127.0.0.1:35780_    ] o.a.s.c.c.SolrZkClient makePath: /overseer/queue
   [junit4]   2> 1124939 INFO  (TEST-TestSQLHandler.doTest-seed#[4E2F6420A5FAE254]) [n:127.0.0.1:35780_    ] o.a.s.c.c.SolrZkClient makePath: /overseer/collection-queue-work
   [junit4]   2> 1124942 INFO  (TEST-TestSQLHandler.doTest-seed#[4E2F6420A5FAE254]) [n:127.0.0.1:35780_    ] o.a.s.c.c.SolrZkClient makePath: /overseer/collection-map-running
   [junit4]   2> 1124943 INFO  (TEST-TestSQLHandler.doTest-seed#[4E2F6420A5FAE254]) [n:127.0.0.1:35780_    ] o.a.s.c.c.SolrZkClient makePath: /overseer/collection-map-completed
   [junit4]   2> 1124945 INFO  (TEST-TestSQLHandler.doTest-seed#[4E2F6420A5FAE254]) [n:127.0.0.1:35780_    ] o.a.s.c.c.SolrZkClient makePath: /overseer/collection-map-failure
   [junit4]   2> 1124947 INFO  (TEST-TestSQLHandler.doTest-seed#[4E2F6420A5FAE254]) [n:127.0.0.1:35780_    ] o.a.s.c.c.SolrZkClient makePath: /live_nodes
   [junit4]   2> 1124948 INFO  (TEST-TestSQLHandler.doTest-seed#[4E2F6420A5FAE254]) [n:127.0.0.1:35780_    ] o.a.s.c.c.SolrZkClient makePath: /aliases.json
   [junit4]   2> 1124949 INFO  (TEST-TestSQLHandler.doTest-seed#[4E2F6420A5FAE254]) [n:127.0.0.1:35780_    ] o.a.s.c.c.SolrZkClient makePath: /clusterstate.json
   [junit4]   2> 1124950 INFO  (TEST-TestSQLHandler.doTest-seed#[4E2F6420A5FAE254]) [n:127.0.0.1:35780_    ] o.a.s.c.c.SolrZkClient makePath: /security.json
   [junit4]   2> 1124950 INFO  (TEST-TestSQLHandler.doTest-seed#[4E2F6420A5FAE254]) [n:127.0.0.1:35780_    ] o.a.s.c.c.ZkStateReader Updating cluster state from ZooKeeper... 
   [junit4]   2> 1124951 INFO  (TEST-TestSQLHandler.doTest-seed#[4E2F6420A5FAE254]) [n:127.0.0.1:35780_    ] o.a.s.c.c.ZkStateReader Updated live nodes from ZooKeeper... (0) -> (0)
   [junit4]   2> 1124953 INFO  (TEST-TestSQLHandler.doTest-seed#[4E2F6420A5FAE254]) [n:127.0.0.1:35780_    ] o.a.s.c.c.SolrZkClient makePath: /overseer_elect
   [junit4]   2> 1124954 INFO  (TEST-TestSQLHandler.doTest-seed#[4E2F6420A5FAE254]) [n:127.0.0.1:35780_    ] o.a.s.c.c.SolrZkClient makePath: /overseer_elect/election
   [junit4]   2> 1124955 INFO  (TEST-TestSQLHandler.doTest-seed#[4E2F6420A5FAE254]) [n:127.0.0.1:35780_    ] o.a.s.c.Overseer Overseer (id=null) closing
   [junit4]   2> 1124956 INFO  (TEST-TestSQLHandler.doTest-seed#[4E2F6420A5FAE254]) [n:127.0.0.1:35780_    ] o.a.s.c.LeaderElector Joined leadership election with path: /overseer_elect/election/95583859217006596-127.0.0.1:35780_-n_0000000000
   [junit4]   2> 1124956 INFO  (TEST-TestSQLHandler.doTest-seed#[4E2F6420A5FAE254]) [n:127.0.0.1:35780_    ] o.a.s.c.OverseerElectionContext I am going to be the leader 127.0.0.1:35780_
   [junit4]   2> 1124956 INFO  (TEST-TestSQLHandler.doTest-seed#[4E2F6420A5FAE254]) [n:127.0.0.1:35780_    ] o.a.s.c.c.SolrZkClient makePath: /overseer_elect/leader
   [junit4]   2> 1124957 INFO  (TEST-TestSQLHandler.doTest-seed#[4E2F6420A5FAE254]) [n:127.0.0.1:35780_    ] o.a.s.c.Overseer Overseer (id=95583859217006596-127.0.0.1:35780_-n_0000000000) starting
   [junit4]   2> 1124958 INFO  (TEST-TestSQLHandler.doTest-seed#[4E2F6420A5FAE254]) [n:127.0.0.1:35780_    ] o.a.s.c.c.SolrZkClient makePath: /overseer/queue-work
   [junit4]   2> 1124962 INFO  (TEST-TestSQLHandler.doTest-seed#[4E2F6420A5FAE254]) [n:127.0.0.1:35780_    ] o.a.s.c.OverseerAutoReplicaFailoverThread Starting OverseerAutoReplicaFailoverThread autoReplicaFailoverWorkLoopDelay=10000 autoReplicaFailoverWaitAfterExpiration=30000 autoReplicaFailoverBadNodeExpiration=60000
   [junit4]   2> 1124962 INFO  (OverseerCollectionConfigSetProcessor-95583859217006596-127.0.0.1:35780_-n_0000000000) [n:127.0.0.1:35780_    ] o.a.s.c.OverseerTaskProcessor Process current queue of overseer operations
   [junit4]   2> 1124963 INFO  (TEST-TestSQLHandler.doTest-seed#[4E2F6420A5FAE254]) [n:127.0.0.1:35780_    ] o.a.s.c.ZkController Register node as live in ZooKeeper:/live_nodes/127.0.0.1:35780_
   [junit4]   2> 1124963 INFO  (OverseerStateUpdate-95583859217006596-127.0.0.1:35780_-n_0000000000) [n:127.0.0.1:35780_    ] o.a.s.c.Overseer Starting to work on the main queue
   [junit4]   2> 1124963 INFO  (TEST-TestSQLHandler.doTest-seed#[4E2F6420A5FAE254]) [n:127.0.0.1:35780_    ] o.a.s.c.c.SolrZkClient makePath: /live_nodes/127.0.0.1:35780_
   [junit4]   2> 1124967 INFO  (zkCallback-1320-thread-1-processing-n:127.0.0.1:35780_) [n:127.0.0.1:35780_    ] o.a.s.c.c.ZkStateReader A live node change: [WatchedEvent state:SyncConnected type:NodeChildrenChanged path:/live_nodes], has occurred - updating... (live nodes size: [0])
   [junit4]   2> 1124967 INFO  (OverseerStateUpdate-95583859217006596-127.0.0.1:35780_-n_0000000000) [n:127.0.0.1:35780_    ] o.a.s.c.c.ZkStateReader Updated live nodes from ZooKeeper... (0) -> (1)
   [junit4]   2> 1124967 INFO  (zkCallback-1320-thread-1-processing-n:127.0.0.1:35780_) [n:127.0.0.1:35780_    ] o.a.s.c.c.ZkStateReader Updated live nodes from ZooKeeper... (1) -> (1)
   [junit4]   2> 1125026 INFO  (TEST-TestSQLHandler.doTest-seed#[4E2F6420A5FAE254]) [n:127.0.0.1:35780_    ] o.a.s.c.CoreContainer Security conf doesn't exist. Skipping setup for authorization module.
   [junit4]   2> 1125026 INFO  (TEST-TestSQLHandler.doTest-seed#[4E2F6420A5FAE254]) [n:127.0.0.1:35780_    ] o.a.s.c.CoreContainer No authentication plugin used.
   [junit4]   2> 1125027 INFO  (TEST-TestSQLHandler.doTest-seed#[4E2F6420A5FAE254]) [n:127.0.0.1:35780_    ] o.a.s.c.CorePropertiesLocator Looking for core definitions underneath /home/jenkins/workspace/Lucene-Solr-master-Linux/solr/build/solr-core/test/J1/temp/solr.handler.TestSQLHandler_4E2F6420A5FAE254-001/control-001/cores
   [junit4]   2> 1125028 INFO  (TEST-TestSQLHandler.doTest-seed#[4E2F6420A5FAE254]) [n:127.0.0.1:35780_    ] o.a.s.c.CoreDescriptor Created CoreDescriptor: {name=collection1, config=solrconfig.xml, transient=false, schema=schema.xml, loadOnStartup=true, configSetProperties=configsetprops.json, collection=control_collection, coreNodeName=, dataDir=data/, shard=}
   [junit4]   2> 1125028 INFO  (TEST-TestSQLHandler.doTest-seed#[4E2F6420A5FAE254]) [n:127.0.0.1:35780_    ] o.a.s.c.CorePropertiesLocator Found core collection1 in /home/jenkins/workspace/Lucene-Solr-master-Linux/solr/build/solr-core/test/J1/temp/solr.handler.TestSQLHandler_4E2F6420A5FAE254-001/control-001/cores/collection1
   [junit4]   2> 1125028 INFO  (TEST-TestSQLHandler.doTest-seed#[4E2F6420A5FAE254]) [n:127.0.0.1:35780_    ] o.a.s.c.CorePropertiesLocator Found 1 core definitions
   [junit4]   2> 1125029 INFO  (TEST-TestSQLHandler.doTest-seed#[4E2F6420A5FAE254]) [n:127.0.0.1:35780_    ] o.a.s.s.SolrDispatchFilter user.dir=/home/jenkins/workspace/Lucene-Solr-master-Linux/solr/build/solr-core/test/J1
   [junit4]   2> 1125029 INFO  (TEST-TestSQLHandler.doTest-seed#[4E2F6420A5FAE254]) [n:127.0.0.1:35780_    ] o.a.s.s.SolrDispatchFilter SolrDispatchFilter.init() done
   [junit4]   2> 1125029 INFO  (coreLoadExecutor-3514-thread-1-processing-n:127.0.0.1:35780_) [n:127.0.0.1:35780_ c:control_collection   x:collection1] o.a.s.c.ZkController publishing state=down
   [junit4]   2> 1125029 INFO  (coreLoadExecutor-3514-thread-1-processing-n:127.0.0.1:35780_) [n:127.0.0.1:35780_ c:control_collection   x:collection1] o.a.s.c.ZkController numShards not found on descriptor - reading it from system property
   [junit4]   2> 1125031 INFO  (coreLoadExecutor-3514-thread-1-processing-n:127.0.0.1:35780_) [n:127.0.0.1:35780_ c:control_collection   x:collection1] o.a.s.c.ZkController look for our core node name
   [junit4]   2> 1125031 INFO  (OverseerStateUpdate-95583859217006596-127.0.0.1:35780_-n_0000000000) [n:127.0.0.1:35780_    ] o.a.s.c.Overseer processMessage: queueSize: 1, message = {
   [junit4]   2>   "core":"collection1",
   [junit4]   2>   "roles":null,
   [junit4]   2>   "base_url":"http://127.0.0.1:35780",
   [junit4]   2>   "node_name":"127.0.0.1:35780_",
   [junit4]   2>   "numShards":"1",
   [junit4]   2>   "state":"down",
   [junit4]   2>   "shard":null,
   [junit4]   2>   "collection":"control_collection",
   [junit4]   2>   "operation":"state"} current state version: 0
   [junit4]   2> 1125031 INFO  (OverseerStateUpdate-95583859217006596-127.0.0.1:35780_-n_0000000000) [n:127.0.0.1:35780_    ] o.a.s.c.o.ReplicaMutator Update state numShards=1 message={
   [junit4]   2>   "core":"collection1",
   [junit4]   2>   "roles":null,
   [junit4]   2>   "base_url":"http://127.0.0.1:35780",
   [junit4]   2>   "node_name":"127.0.0.1:35780_",
   [junit4]   2>   "numShards":"1",
   [junit4]   2>   "state":"down",
   [junit4]   2>   "shard":null,
   [junit4]   2>   "collection":"control_collection",
   [junit4]   2>   "operation":"state"}
   [junit4]   2> 1125031 INFO  (OverseerStateUpdate-95583859217006596-127.0.0.1:35780_-n_0000000000) [n:127.0.0.1:35780_    ] o.a.s.c.o.ClusterStateMutator building a new cName: control_collection
   [junit4]   2> 1125032 INFO  (OverseerStateUpdate-95583859217006596-127.0.0.1:35780_-n_0000000000) [n:127.0.0.1:35780_    ] o.a.s.c.o.ReplicaMutator Assigning new node to shard shard=shard1
   [junit4]   2> 1125033 INFO  (zkCallback-1320-thread-1-processing-n:127.0.0.1:35780_) [n:127.0.0.1:35780_    ] o.a.s.c.c.ZkStateReader A cluster state change: [WatchedEvent state:SyncConnected type:NodeDataChanged path:/clusterstate.json], has occurred - updating... (live nodes size: [1])
   [junit4]   2> 1126031 INFO  (coreLoadExecutor-3514-thread-1-processing-n:127.0.0.1:35780_) [n:127.0.0.1:35780_ c:control_collection   x:collection1] o.a.s.c.ZkController waiting to find shard id in clusterstate for collection1
   [junit4]   2> 1126031 INFO  (coreLoadExecutor-3514-thread-1-processing-n:127.0.0.1:35780_) [n:127.0.0.1:35780_ c:control_collection   x:collection1] o.a.s.c.ZkController Check for collection zkNode:control_collection
   [junit4]   2> 1126032 INFO  (coreLoadExecutor-3514-thread-1-processing-n:127.0.0.1:35780_) [n:127.0.0.1:35780_ c:control_collection   x:collection1] o.a.s.c.ZkController Collection zkNode exists
   [junit4]   2> 1126032 INFO  (coreLoadExecutor-3514-thread-1-processing-n:127.0.0.1:35780_) [n:127.0.0.1:35780_ c:control_collection   x:collection1] o.a.s.c.c.ZkStateReader Load collection config from: [/collections/control_collection]
   [junit4]   2> 1126032 INFO  (coreLoadExecutor-3514-thread-1-processing-n:127.0.0.1:35780_) [n:127.0.0.1:35780_ c:control_collection   x:collection1] o.a.s.c.c.ZkStateReader path=[/collections/control_collection] [configName]=[conf1] specified config exists in ZooKeeper
   [junit4]   2> 1126033 INFO  (coreLoadExecutor-3514-thread-1-processing-n:127.0.0.1:35780_) [n:127.0.0.1:35780_ c:control_collection   x:collection1] o.a.s.c.SolrResourceLoader new SolrResourceLoader for directory: '/home/jenkins/workspace/Lucene-Solr-master-Linux/solr/build/solr-core/test/J1/temp/solr.handler.TestSQLHandler_4E2F6420A5FAE254-001/control-001/cores/collection1'
   [junit4]   2> 1126033 INFO  (coreLoadExecutor-3514-thread-1-processing-n:127.0.0.1:35780_) [n:127.0.0.1:35780_ c:control_collection   x:collection1] o.a.s.c.SolrResourceLoader JNDI not configured for solr (NoInitialContextEx)
   [junit4]   2> 1126033 INFO  (coreLoadExecutor-3514-thread-1-processing-n:127.0.0.1:35780_) [n:127.0.0.1:35780_ c:control_collection   x:collection1] o.a.s.c.SolrResourceLoader solr home defaulted to 'solr/' (could not find system property or JNDI)
   [junit4]   2> 1126035 INFO  (coreLoadExecutor-3514-thread-1-processing-n:127.0.0.1:35780_) [n:127.0.0.1:35780_ c:control_collection   x:collection1] o.a.s.c.Config loaded config solrconfig.xml with version 0 
   [junit4]   2> 1126044 INFO  (coreLoadExecutor-3514-thread-1-processing-n:127.0.0.1:35780_) [n:127.0.0.1:35780_ c:control_collection   x:collection1] o.a.s.c.SolrConfig current version of requestparams : -1
   [junit4]   2> 1126051 INFO  (coreLoadExecutor-3514-thread-1-processing-n:127.0.0.1:35780_) [n:127.0.0.1:35780_ c:control_collection   x:collection1] o.a.s.c.SolrConfig Using Lucene MatchVersion: 7.0.0
   [junit4]   2> 1126062 INFO  (coreLoadExecutor-3514-thread-1-processing-n:127.0.0.1:35780_) [n:127.0.0.1:35780_ c:control_collection   x:collection1] o.a.s.c.SolrConfig Loaded SolrConfig: solrconfig.xml
   [junit4]   2> 1126098 INFO  (coreLoadExecutor-3514-thread-1-processing-n:127.0.0.1:35780_) [n:127.0.0.1:35780_ c:control_collection   x:collection1] o.a.s.s.IndexSchema [collection1] Schema name=test
   [junit4]   2> 1126188 INFO  (coreLoadExecutor-3514-thread-1-processing-n:127.0.0.1:35780_) [n:127.0.0.1:35780_ c:control_collection   x:collection1] o.a.s.s.IndexSchema default search field in schema is text
   [junit4]   2> 1126189 INFO  (coreLoadExecutor-3514-thread-1-processing-n:127.0.0.1:35780_) [n:127.0.0.1:35780_ c:control_collection   x:collection1] o.a.s.s.IndexSchema unique key field: id
   [junit4]   2> 1126190 WARN  (coreLoadExecutor-3514-thread-1-processing-n:127.0.0.1:35780_) [n:127.0.0.1:35780_ c:control_collection   x:collection1] o.a.s.s.IndexSchema Field lowerfilt1and2 is not multivalued and destination for multiple copyFields (2)
   [junit4]   2> 1126190 WARN  (coreLoadExecutor-3514-thread-1-processing-n:127.0.0.1:35780_) [n:127.0.0.1:35780_ c:control_collection   x:collection1] o.a.s.s.IndexSchema Field text is not multivalued and destination for multiple copyFields (3)
   [junit4]   2> 1126192 INFO  (coreLoadExecutor-3514-thread-1-processing-n:127.0.0.1:35780_) [n:127.0.0.1:35780_ c:control_collection   x:collection1] o.a.s.c.ConfigSetProperties Did not find ConfigSet properties, assuming default properties: Can't find resource 'configsetprops.json' in classpath or '/configs/conf1', cwd=/home/jenkins/workspace/Lucene-Solr-master-Linux/solr/build/solr-core/test/J1
   [junit4]   2> 1126192 INFO  (coreLoadExecutor-3514-thread-1-processing-n:127.0.0.1:35780_) [n:127.0.0.1:35780_ c:control_collection   x:collection1] o.a.s.c.CoreContainer Creating SolrCore 'collection1' using configuration from collection control_collection
   [junit4]   2> 1126192 INFO  (coreLoadExecutor-3514-thread-1-processing-n:127.0.0.1:35780_) [n:127.0.0.1:35780_ c:control_collection s:shard1 r:core_node1 x:collection1] o.a.s.c.SolrCore org.apache.solr.core.MockDirectoryFactory
   [junit4]   2> 1126192 INFO  (coreLoadExecutor-3514-thread-1-processing-n:127.0.0.1:35780_) [n:127.0.0.1:35780_ c:control_collection s:shard1 r:core_node1 x:collection1] o.a.s.c.SolrCore [[collection1] ] Opening new SolrCore at [/home/jenkins/workspace/Lucene-Solr-master-Linux/solr/build/solr-core/test/J1/temp/solr.handler.TestSQLHandler_4E2F6420A5FAE254-001/control-001/cores/collection1], dataDir=[/home/jenkins/workspace/Lucene-Solr-master-Linux/solr/build/solr-core/test/J1/temp/solr.handler.TestSQLHandler_4E2F6420A5FAE254-001/control-001/cores/collection1/data/]
   [junit4]   2> 1126192 INFO  (coreLoadExecutor-3514-thread-1-processing-n:127.0.0.1:35780_) [n:127.0.0.1:35780_ c:control_collection s:shard1 r:core_node1 x:collection1] o.a.s.c.SolrCore JMX monitoring not detected for core: collection1
   [junit4]   2> 1126193 INFO  (coreLoadExecutor-3514-thread-1-processing-n:127.0.0.1:35780_) [n:127.0.0.1:35780_ c:control_collection s:shard1 r:core_node1 x:collection1] o.a.s.c.CachingDirectoryFactory return new directory for /home/jenkins/workspace/Lucene-Solr-master-Linux/solr/build/solr-core/test/J1/temp/solr.handler.TestSQLHandler_4E2F6420A5FAE254-001/control-001/cores/collection1/data
   [junit4]   2> 1126193 INFO  (coreLoadExecutor-3514-thread-1-processing-n:127.0.0.1:35780_) [n:127.0.0.1:35780_ c:control_collection s:shard1 r:core_node1 x:collection1] o.a.s.c.SolrCore New index directory detected: old=null new=/home/jenkins/workspace/Lucene-Solr-master-Linux/solr/build/solr-core/test/J1/temp/solr.handler.TestSQLHandler_4E2F6420A5FAE254-001/control-001/cores/collection1/data/index/
   [junit4]   2> 1126193 WARN  (coreLoadExecutor-3514-thread-1-processing-n:127.0.0.1:35780_) [n:127.0.0.1:35780_ c:control_collection s:shard1 r:core_node1 x:collection1] o.a.s.c.SolrCore [collection1] Solr index directory '/home/jenkins/workspace/Lucene-Solr-master-Linux/solr/build/solr-core/test/J1/temp/solr.handler.TestSQLHandler_4E2F6420A5FAE254-001/control-001/cores/collection1/data/index' doesn't exist. Creating new index...
   [junit4]   2> 1126193 INFO  (coreLoadExecutor-3514-thread-1-processing-n:127.0.0.1:35780_) [n:127.0.0.1:35780_ c:control_collection s:shard1 r:core_node1 x:collection1] o.a.s.c.CachingDirectoryFactory return new directory for /home/jenkins/workspace/Lucene-Solr-master-Linux/solr/build/solr-core/test/J1/temp/solr.handler.TestSQLHandler_4E2F6420A5FAE254-001/control-001/cores/collection1/data/index
   [junit4]   2> 1126194 INFO  (coreLoadExecutor-3514-thread-1-processing-n:127.0.0.1:35780_) [n:127.0.0.1:35780_ c:control_collection s:shard1 r:core_node1 x:collection1] o.a.s.c.SolrDeletionPolicy SolrDeletionPolicy.onCommit: commits: num=1
   [junit4]   2> 	commit{dir=MockDirectoryWrapper(RAMDirectory@78149a lockFactory=org.apache.lucene.store.SingleInstanceLockFactory@16bd9e5),segFN=segments_1,generation=1}
   [junit4]   2> 1126194 INFO  (coreLoadExecutor-3514-thread-1-processing-n:127.0.0.1:35780_) [n:127.0.0.1:35780_ c:control_collection s:shard1 r:core_node1 x:collection1] o.a.s.c.SolrDeletionPolicy newest commit generation = 1
   [junit4]   2> 1126194 INFO  (OldIndexDirectoryCleanupThreadForCore-collection1) [n:127.0.0.1:35780_ c:control_collection s:shard1 r:core_node1 x:collection1] o.a.s.c.SolrCore Looking for old index directories to cleanup for core collection1 in /home/jenkins/workspace/Lucene-Solr-master-Linux/solr/build/solr-core/test/J1/temp/solr.handler.TestSQLHandler_4E2F6420A5FAE254-001/control-001/cores/collection1/data/
   [junit4]   2> 1126195 WARN  (OldIndexDirectoryCleanupThreadForCore-collection1) [n:127.0.0.1:35780_ c:control_collection s:shard1 r:core_node1 x:collection1] o.a.s.c.DirectoryFactory /home/jenkins/workspace/Lucene-Solr-master-Linux/solr/build/solr-core/test/J1/temp/solr.handler.TestSQLHandler_4E2F6420A5FAE254-001/control-001/cores/collection1/data/ does not point to a valid data directory; skipping clean-up of old index directories.
   [junit4]   2> 1126196 INFO  (coreLoadExecutor-3514-thread-1-processing-n:127.0.0.1:35780_) [n:127.0.0.1:35780_ c:control_collection s:shard1 r:core_node1 x:collection1] o.a.s.c.SolrCore no updateRequestProcessorChain defined as default, creating implicit default
   [junit4]   2> 1126198 INFO  (coreLoadExecutor-3514-thread-1-processing-n:127.0.0.1:35780_) [n:127.0.0.1:35780_ c:control_collection s:shard1 r:core_node1 x:collection1] o.a.s.h.l.XMLLoader xsltCacheLifetimeSeconds=60
   [junit4]   2> 1126199 INFO  (coreLoadExecutor-3514-thread-1-processing-n:127.0.0.1:35780_) [n:127.0.0.1:35780_ c:control_collection s:shard1 r:core_node1 x:collection1] o.a.s.h.l.XMLLoader xsltCacheLifetimeSeconds=60
   [junit4]   2> 1126200 INFO  (coreLoadExecutor-3514-thread-1-processing-n:127.0.0.1:35780_) [n:127.0.0.1:35780_ c:control_collection s:shard1 r:core_node1 x:collection1] o.a.s.h.l.XMLLoader xsltCacheLifetimeSeconds=60
   [junit4]   2> 1126201 INFO  (coreLoadExecutor-3514-thread-1-processing-n:127.0.0.1:35780_) [n:127.0.0.1:35780_ c:control_collection s:shard1 r:core_node1 x:collection1] o.a.s.h.l.XMLLoader xsltCacheLifetimeSeconds=60
   [junit4]   2> 1126201 INFO  (coreLoadExecutor-3514-thread-1-processing-n:127.0.0.1:35780_) [n:127.0.0.1:35780_ c:control_collection s:shard1 r:core_node1 x:collection1] o.a.s.c.PluginBag requestHandler : '/replication' created with startup=lazy 
   [junit4]   2> 1126202 INFO  (coreLoadExecutor-3514-thread-1-processing-n:127.0.0.1:35780_) [n:127.0.0.1:35780_ c:control_collection s:shard1 r:core_node1 x:collection1] o.a.s.c.RequestHandlers Registered paths: /admin/mbeans,standard,,/update/csv,/sql,/update/json/docs,/admin/luke,/export,/admin/segments,/get,/admin/system,/replication,/admin/properties,/config,/stream,/schema,/admin/plugins,/admin/logging,/update/json,/admin/ping,/admin/threads,/update,/admin/file
   [junit4]   2> 1126202 INFO  (coreLoadExecutor-3514-thread-1-processing-n:127.0.0.1:35780_) [n:127.0.0.1:35780_ c:control_collection s:shard1 r:core_node1 x:collection1] o.a.s.c.SolrCore Using default statsCache cache: org.apache.solr.search.stats.LocalStatsCache
   [junit4]   2> 1126202 INFO  (coreLoadExecutor-3514-thread-1-processing-n:127.0.0.1:35780_) [n:127.0.0.1:35780_ c:control_collection s:shard1 r:core_node1 x:collection1] o.a.s.u.UpdateHandler Using UpdateLog implementation: org.apache.solr.update.UpdateLog
   [junit4]   2> 1126202 INFO  (coreLoadExecutor-3514-thread-1-processing-n:127.0.0.1:35780_) [n:127.0.0.1:35780_ c:control_collection s:shard1 r:core_node1 x:collection1] o.a.s.u.UpdateLog Initializing UpdateLog: dataDir= defaultSyncLevel=FLUSH numRecordsToKeep=100 maxNumLogsToKeep=10 numVersionBuckets=65536
   [junit4]   2> 1126204 INFO  (coreLoadExecutor-3514-thread-1-processing-n:127.0.0.1:35780_) [n:127.0.0.1:35780_ c:control_collection s:shard1 r:core_node1 x:collection1] o.a.s.u.CommitTracker Hard AutoCommit: disabled
   [junit4]   2> 1126204 INFO  (coreLoadExecutor-3514-thread-1-processing-n:127.0.0.1:35780_) [n:127.0.0.1:35780_ c:control_collection s:shard1 r:core_node1 x:collection1] o.a.s.u.CommitTracker Soft AutoCommit: disabled
   [junit4]   2> 1126204 INFO  (coreLoadExecutor-3514-thread-1-processing-n:127.0.0.1:35780_) [n:127.0.0.1:35780_ c:control_collection s:shard1 r:core_node1 x:collection1] o.a.s.c.SolrDeletionPolicy SolrDeletionPolicy.onInit: commits: num=1
   [junit4]   2> 	commit{dir=MockDirectoryWrapper(RAMDirectory@78149a lockFactory=org.apache.lucene.store.SingleInstanceLockFactory@16bd9e5),segFN=segments_1,generation=1}
   [junit4]   2> 1126204 INFO  (coreLoadExecutor-3514-thread-1-processing-n:127.0.0.1:35780_) [n:127.0.0.1:35780_ c:control_collection s:shard1 r:core_node1 x:collection1] o.a.s.c.SolrDeletionPolicy newest commit generation = 1
   [junit4]   2> 1126205 INFO  (coreLoadExecutor-3514-thread-1-processing-n:127.0.0.1:35780_) [n:127.0.0.1:35780_ c:control_collection s:shard1 r:core_node1 x:collection1] o.a.s.s.SolrIndexSearcher Opening [Searcher@12c0d13[collection1] main]
   [junit4]   2> 1126205 INFO  (coreLoadExecutor-3514-thread-1-processing-n:127.0.0.1:35780_) [n:127.0.0.1:35780_ c:control_collection s:shard1 r:core_node1 x:collection1] o.a.s.c.c.ZkStateReader Load collection config from: [/collections/control_collection]
   [junit4]   2> 1126206 INFO  (coreLoadExecutor-3514-thread-1-processing-n:127.0.0.1:35780_) [n:127.0.0.1:35780_ c:control_collection s:shard1 r:core_node1 x:collection1] o.a.s.c.c.ZkStateReader path=[/collections/control_collection] [configName]=[conf1] specified config exists in ZooKeeper
   [junit4]   2> 1126206 INFO  (coreLoadExecutor-3514-thread-1-processing-n:127.0.0.1:35780_) [n:127.0.0.1:35780_ c:control_collection s:shard1 r:core_node1 x:collection1] o.a.s.r.ManagedResourceStorage Setting up ZooKeeper-based storage for the RestManager with znodeBase: /configs/conf1
   [junit4]   2> 1126206 INFO  (coreLoadExecutor-3514-thread-1-processing-n:127.0.0.1:35780_) [n:127.0.0.1:35780_ c:control_collection s:shard1 r:core_node1 x:collection1] o.a.s.r.ManagedResourceStorage Configured ZooKeeperStorageIO with znodeBase: /configs/conf1
   [junit4]   2> 1126206 INFO  (coreLoadExecutor-3514-thread-1-processing-n:127.0.0.1:35780_) [n:127.0.0.1:35780_ c:control_collection s:shard1 r:core_node1 x:collection1] o.a.s.r.RestManager Initializing RestManager with initArgs: {}
   [junit4]   2> 1126206 INFO  (coreLoadExecutor-3514-thread-1-processing-n:127.0.0.1:35780_) [n:127.0.0.1:35780_ c:control_collection s:shard1 r:core_node1 x:collection1] o.a.s.r.ManagedResourceStorage Reading _rest_managed.json using ZooKeeperStorageIO:path=/configs/conf1
   [junit4]   2> 1126206 INFO  (coreLoadExecutor-3514-thread-1-processing-n:127.0.0.1:35780_) [n:127.0.0.1:35780_ c:control_collection s:shard1 r:core_node1 x:collection1] o.a.s.r.ManagedResourceStorage No data found for znode /configs/conf1/_rest_managed.json
   [junit4]   2> 1126206 INFO  (coreLoadExecutor-3514-thread-1-processing-n:127.0.0.1:35780_) [n:127.0.0.1:35780_ c:control_collection s:shard1 r:core_node1 x:collection1] o.a.s.r.ManagedResourceStorage Loaded null at path _rest_managed.json using ZooKeeperStorageIO:path=/configs/conf1
   [junit4]   2> 1126206 INFO  (coreLoadExecutor-3514-thread-1-processing-n:127.0.0.1:35780_) [n:127.0.0.1:35780_ c:control_collection s:shard1 r:core_node1 x:collection1] o.a.s.r.RestManager Initializing 0 registered ManagedResources
   [junit4]   2> 1126207 INFO  (searcherExecutor-3515-thread-1-processing-n:127.0.0.1:35780_ x:collection1 s:shard1 c:control_collection r:core_node1) [n:127.0.0.1:35780_ c:control_collection s:shard1 r:core_node1 x:collection1] o.a.s.c.SolrCore [collection1] Registered new searcher Searcher@12c0d13[collection1] main{ExitableDirectoryReader(UninvertingDirectoryReader())}
   [junit4]   2> 1126207 INFO  (coreLoadExecutor-3514-thread-1-processing-n:127.0.0.1:35780_) [n:127.0.0.1:35780_ c:control_collection s:shard1 r:core_node1 x:collection1] o.a.s.u.UpdateLog Looking up max value of version field to seed version buckets
   [junit4]   2> 1126207 INFO  (coreLoadExecutor-3514-thread-1-processing-n:127.0.0.1:35780_) [n:127.0.0.1:35780_ c:control_collection s:shard1 r:core_node1 x:collection1] o.a.s.u.VersionInfo Refreshing highest value of _version_ for 65536 version buckets from index
   [junit4]   2> 1126207 INFO  (coreLoadExecutor-3514-thread-1-processing-n:127.0.0.1:35780_) [n:127.0.0.1:35780_ c:control_collection s:shard1 r:core_node1 x:collection1] o.a.s.u.VersionInfo No terms found for _version_, cannot seed version bucket highest value from index
   [junit4]   2> 1126207 INFO  (coreLoadExecutor-3514-thread-1-processing-n:127.0.0.1:35780_) [n:127.0.0.1:35780_ c:control_collection s:shard1 r:core_node1 x:collection1] o.a.s.u.UpdateLog Could not find max version in index or recent updates, using new clock 1529341749081669632
   [junit4]   2> 1126209 INFO  (coreLoadExecutor-3514-thread-1-processing-n:127.0.0.1:35780_) [n:127.0.0.1:35780_ c:control_collection s:shard1 r:core_node1 x:collection1] o.a.s.u.UpdateLog Took 2.0ms to seed version buckets with highest version 1529341749081669632
   [junit4]   2> 1126209 INFO  (coreLoadExecutor-3514-thread-1-processing-n:127.0.0.1:35780_) [n:127.0.0.1:35780_ c:control_collection s:shard1 r:core_node1 x:collection1] o.a.s.c.ZkController watch zkdir /configs/conf1
   [junit4]   2> 1126210 INFO  (coreLoadExecutor-3514-thread-1-processing-n:127.0.0.1:35780_) [n:127.0.0.1:35780_ c:control_collection s:shard1 r:core_node1 x:collection1] o.a.s.c.CoreContainer registering core: collection1
   [junit4]   2> 1126210 INFO  (coreZkRegister-3508-thread-1-processing-n:127.0.0.1:35780_ x:collection1 s:shard1 c:control_collection r:core_node1) [n:127.0.0.1:35780_ c:control_collection s:shard1 r:core_node1 x:collection1] o.a.s.c.ZkController Register replica - core:collection1 address:http://127.0.0.1:35780 collection:control_collection shard:shard1
   [junit4]   2> 1126210 INFO  (coreZkRegister-3508-thread-1-processing-n:127.0.0.1:35780_ x:collection1 s:shard1 c:control_collection r:core_node1) [n:127.0.0.1:35780_ c:control_collection s:shard1 r:core_node1 x:collection1] o.a.s.c.c.SolrZkClient makePath: /collections/control_collection/leader_elect/shard1/election
   [junit4]   2> 1126212 INFO  (coreZkRegister-3508-thread-1-processing-n:127.0.0.1:35780_ x:collection1 s:shard1 c:control_collection r:core_node1) [n:127.0.0.1:35780_ c:control_collection s:shard1 r:core_node1 x:collection1] o.a.s.c.LeaderElector Joined leadership election with path: /collections/control_collection/leader_elect/shard1/election/95583859217006596-core_node1-n_0000000000
   [junit4]   2> 1126213 INFO  (coreZkRegister-3508-thread-1-processing-n:127.0.0.1:35780_ x:collection1 s:shard1 c:control_collection r:core_node1) [n:127.0.0.1:35780_ c:control_collection s:shard1 r:core_node1 x:collection1] o.a.s.c.ShardLeaderElectionContext Running the leader process for shard=shard1 and weAreReplacement=false and leaderVoteWait=10000
   [junit4]   2> 1126214 INFO  (coreZkRegister-3508-thread-1-processing-n:127.0.0.1:35780_ x:collection1 s:shard1 c:control_collection r:core_node1) [n:127.0.0.1:35780_ c:control_collection s:shard1 r:core_node1 x:collection1] o.a.s.c.ShardLeaderElectionContext Enough replicas found to continue.
   [junit4]   2> 1126214 INFO  (coreZkRegister-3508-thread-1-processing-n:127.0.0.1:35780_ x:collection1 s:shard1 c:control_collection r:core_node1) [n:127.0.0.1:35780_ c:control_collection s:shard1 r:core_node1 x:collection1] o.a.s.c.ShardLeaderElectionContext I may be the new leader - try and sync
   [junit4]   2> 1126214 INFO  (coreZkRegister-3508-thread-1-processing-n:127.0.0.1:35780_ x:collection1 s:shard1 c:control_collection r:core_node1) [n:127.0.0.1:35780_ c:control_collection s:shard1 r:core_node1 x:collection1] o.a.s.c.SyncStrategy Sync replicas to http://127.0.0.1:35780/collection1/
   [junit4]   2> 1126214 INFO  (OverseerStateUpdate-95583859217006596-127.0.0.1:35780_-n_0000000000) [n:127.0.0.1:35780_    ] o.a.s.c.Overseer processMessage: queueSize: 1, message = {
   [junit4]   2>   "operation":"leader",
   [junit4]   2>   "shard":"shard1",
   [junit4]   2>   "collection":"control_collection"} current state version: 1
   [junit4]   2> 1126214 INFO  (coreZkRegister-3508-thread-1-processing-n:127.0.0.1:35780_ x:collection1 s:shard1 c:control_collection r:core_node1) [n:127.0.0.1:35780_ c:control_collection s:shard1 r:core_node1 x:collection1] o.a.s.c.SyncStrategy Sync Success - now sync replicas to me
   [junit4]   2> 1126214 INFO  (coreZkRegister-3508-thread-1-processing-n:127.0.0.1:35780_ x:collection1 s:shard1 c:control_collection r:core_node1) [n:127.0.0.1:35780_ c:control_collection s:shard1 r:core_node1 x:collection1] o.a.s.c.SyncStrategy http://127.0.0.1:35780/collection1/ has no replicas
   [junit4]   2> 1126215 INFO  (coreZkRegister-3508-thread-1-processing-n:127.0.0.1:35780_ x:collection1 s:shard1 c:control_collection r:core_node1) [n:127.0.0.1:35780_ c:control_collection s:shard1 r:core_node1 x:collection1] o.a.s.c.c.SolrZkClient makePath: /collections/control_collection/leaders/shard1
   [junit4]   2> 1126216 INFO  (coreZkRegister-3508-thread-1-processing-n:127.0.0.1:35780_ x:collection1 s:shard1 c:control_collection r:core_node1) [n:127.0.0.1:35780_ c:control_collection s:shard1 r:core_node1 x:collection1] o.a.s.c.ShardLeaderElectionContextBase Creating leader registration node /collections/control_collection/leaders/shard1/leader after winning as /collections/control_collection/leader_elect/shard1/election/95583859217006596-core_node1-n_0000000000
   [junit4]   2> 1126218 INFO  (coreZkRegister-3508-thread-1-processing-n:127.0.0.1:35780_ x:collection1 s:shard1 c:control_collection r:core_node1) [n:127.0.0.1:35780_ c:control_collection s:shard1 r:core_node1 x:collection1] o.a.s.c.ShardLeaderElectionContext I am the new leader: http://127.0.0.1:35780/collection1/ shard1
   [junit4]   2> 1126218 INFO  (OverseerStateUpdate-95583859217006596-127.0.0.1:35780_-n_0000000000) [n:127.0.0.1:35780_    ] o.a.s.c.Overseer processMessage: queueSize: 1, message = {
   [junit4]   2>   "operation":"leader",
   [junit4]   2>   "shard":"shard1",
   [junit4]   2>   "collection":"control_collection",
   [junit4]   2>   "base_url":"http://127.0.0.1:35780",
   [junit4]   2>   "core":"collection1",
   [junit4]   2>   "state":"active"} current state version: 1
   [junit4]   2> 1126320 INFO  (zkCallback-1320-thread-1-processing-n:127.0.0.1:35780_) [n:127.0.0.1:35780_    ] o.a.s.c.c.ZkStateReader A cluster state change: [WatchedEvent state:SyncConnected type:NodeDataChanged path:/clusterstate.json], has occurred - updating... (live nodes size: [1])
   [junit4]   2> 1126369 INFO  (coreZkRegister-3508-thread-1-processing-n:127.0.0.1:35780_ x:collection1 s:shard1 c:control_collection r:core_node1) [n:127.0.0.1:35780_ c:control_collection s:shard1 r:core_node1 x:collection1] o.a.s.c.ZkController We are http://127.0.0.1:35780/collection1/ and leader is http://127.0.0.1:35780/collection1/
   [junit4]   2> 1126369 INFO  (coreZkRegister-3508-thread-1-processing-n:127.0.0.1:35780_ x:collection1 s:shard1 c:control_collection r:core_node1) [n:127.0.0.1:35780_ c:control_collection s:shard1 r:core_node1 x:collection1] o.a.s.c.ZkController No LogReplay needed for core=collection1 baseURL=http://127.0.0.1:35780
   [junit4]   2> 1126369 INFO  (coreZkRegister-3508-thread-1-processing-n:127.0.0.1:35780_ x:collection1 s:shard1 c:control_collection r:core_node1) [n:127.0.0.1:35780_ c:control_collection s:shard1 r:core_node1 x:collection1] o.a.s.c.ZkController I am the leader, no recovery necessary
   [junit4]   2> 1126369 INFO  (coreZkRegister-3508-thread-1-processing-n:127.0.0.1:35780_ x:collection1 s:shard1 c:control_collection r:core_node1) [n:127.0.0.1:35780_ c:control_collection s:shard1 r:core_node1 x:collection1] o.a.s.c.ZkController publishing state=active
   [junit4]   2> 1126369 INFO  (coreZkRegister-3508-thread-1-processing-n:127.0.0.1:35780_ x:collection1 s:shard1 c:control_collection r:core_node1) [n:127.0.0.1:35780_ c:control_collection s:shard1 r:core_node1 x:collection1] o.a.s.c.ZkController numShards not found on descriptor - reading it from system property
   [junit4]   2> 1126370 INFO  (OverseerStateUpdate-95583859217006596-127.0.0.1:35780_-n_0000000000) [n:127.0.0.1:35780_    ] o.a.s.c.Overseer processMessage: queueSize: 1, message = {
   [junit4]   2>   "core":"collection1",
   [junit4]   2>   "core_node_name":"core_node1",
   [junit4]   2>   "roles":null,
   [junit4]   2>   "base_url":"http://127.0.0.1:35780",
   [junit4]   2>   "node_name":"127.0.0.1:35780_",
   [junit4]   2>   "numShards":"1",
   [junit4]   2>   "state":"active",
   [junit4]   2>   "shard":"shard1",
   [junit4]   2>   "collection":"control_collection",
   [junit4]   2>   "operation":"state"} current state version: 2
   [junit4]   2> 1126371 INFO  (OverseerStateUpdate-95583859217006596-127.0.0.1:35780_-n_0000000000) [n:127.0.0.1:35780_    ] o.a.s.c.o.ReplicaMutator Update state numShards=1 message={
   [junit4]   2>   "core":"collection1",
   [junit4]   2>   "core_node_name":"core_node1",
   [junit4]   2>   "roles":null,
   [junit4]   2>   "base_url":"http://127.0.0.1:35780",
   [junit4]   2>   "node_name":"127.0.0.1:35780_",
   [junit4]   2>   "numShards":"1",
   [junit4]   2>   "state":"active",
   [junit4]   2>   "shard":"shard1",
   [junit4]   2>   "collection":"control_collection",
   [junit4]   2>   "operation":"state"}
   [junit4]   2> 1126473 INFO  (zkCallback-1320-thread-1-processing-n:127.0.0.1:35780_) [n:127.0.0.1:35780_    ] o.a.s.c.c.ZkStateReader A cluster state change: [WatchedEvent state:SyncConnected type:NodeDataChanged path:/clusterstate.json], has occurred - updating... (live nodes size: [1])
   [junit4]   2> 1126530 INFO  (TEST-TestSQLHandler.doTest-seed#[4E2F6420A5FAE254]) [    ] o.a.s.c.c.SolrZkClient Using default ZkCredentialsProvider
   [junit4]   2> 1126531 INFO  (TEST-TestSQLHandler.doTest-seed#[4E2F6420A5FAE254]) [    ] o.a.s.c.c.ConnectionManager Waiting for client to connect to ZooKeeper
   [junit4]   2> 1126532 INFO  (zkCallback-1322-thread-1) [    ] o.a.s.c.c.ConnectionManager Watcher org.apache.solr.common.cloud.ConnectionManager@195bda7 name:ZooKeeperConnection Watcher:127.0.0.1:37517/solr got event WatchedEvent state:SyncConnected type:None path:null path:null type:None
   [junit4]   2> 1126532 INFO  (TEST-TestSQLHandler.doTest-seed#[4E2F6420A5FAE254]) [    ] o.a.s.c.c.ConnectionManager Client is connected to ZooKeeper
   [junit4]   2> 1126532 INFO  (TEST-TestSQLHandler.doTest-seed#[4E2F6420A5FAE254]) [    ] o.a.s.c.c.SolrZkClient Using default ZkACLProvider
   [junit4]   2> 1126532 INFO  (TEST-TestSQLHandler.doTest-seed#[4E2F6420A5FAE254]) [    ] o.a.s.c.c.ZkStateReader Updating cluster state from ZooKeeper... 
   [junit4]   2> 1126533 INFO  (TEST-TestSQLHandler.doTest-seed#[4E2F6420A5FAE254]) [    ] o.a.s.c.c.ZkStateReader Updated live nodes from ZooKeeper... (0) -> (1)
   [junit4]   2> 1126534 INFO  (TEST-TestSQLHandler.doTest-seed#[4E2F6420A5FAE254]) [    ] o.a.s.c.ChaosMonkey monkey: init - expire sessions:false cause connection loss:false
   [junit4]   2> 1126590 INFO  (TEST-TestSQLHandler.doTest-seed#[4E2F6420A5FAE254]) [    ] o.a.s.SolrTestCaseJ4 Writing core.properties file to /home/jenkins/workspace/Lucene-Solr-master-Linux/solr/build/solr-core/test/J1/temp/solr.handler.TestSQLHandler_4E2F6420A5FAE254-001/shard-1-001/cores/collection1
   [junit4]   2> 1126591 INFO  (TEST-TestSQLHandler.doTest-seed#[4E2F6420A5FAE254]) [    ] o.a.s.c.AbstractFullDistribZkTestBase create jetty 1 in directory /home/jenkins/workspace/Lucene-Solr-master-Linux/solr/build/solr-core/test/J1/temp/solr.handler.TestSQLHandler_4E2F6420A5FAE254-001/shard-1-001
   [junit4]   2> 1126591 INFO  (TEST-TestSQLHandler.doTest-seed#[4E2F6420A5FAE254]) [    ] o.e.j.s.Server jetty-9.3.8.v20160314
   [junit4]   2> 1126592 INFO  (TEST-TestSQLHandler.doTest-seed#[4E2F6420A5FAE254]) [    ] o.e.j.s.h.ContextHandler Started o.e.j.s.ServletContextHandler@1781ac4{/,null,AVAILABLE}
   [junit4]   2> 1126593 INFO  (TEST-TestSQLHandler.doTest-seed#[4E2F6420A5FAE254]) [    ] o.e.j.s.ServerConnector Started ServerConnector@2072ba{HTTP/1.1,[http/1.1]}{127.0.0.1:44504}
   [junit4]   2> 1126593 INFO  (TEST-TestSQLHandler.doTest-seed#[4E2F6420A5FAE254]) [    ] o.e.j.s.Server Started @1127905ms
   [junit4]   2> 1126593 INFO  (TEST-TestSQLHandler.doTest-seed#[4E2F6420A5FAE254]) [    ] o.a.s.c.s.e.JettySolrRunner Jetty properties: {solr.data.dir=/home/jenkins/workspace/Lucene-Solr-master-Linux/solr/build/solr-core/test/J1/temp/solr.handler.TestSQLHandler_4E2F6420A5FAE254-001/tempDir-001/jetty1, solrconfig=solrconfig.xml, hostContext=/, hostPort=44504, coreRootDirectory=/home/jenkins/workspace/Lucene-Solr-master-Linux/solr/build/solr-core/test/J1/../../../../../../../../../home/jenkins/workspace/Lucene-Solr-master-Linux/solr/build/solr-core/test/J1/temp/solr.handler.TestSQLHandler_4E2F6420A5FAE254-001/shard-1-001/cores}
   [junit4]   2> 1126594 INFO  (TEST-TestSQLHandler.doTest-seed#[4E2F6420A5FAE254]) [    ] o.a.s.s.SolrDispatchFilter SolrDispatchFilter.init(): sun.misc.Launcher$AppClassLoader@1d16e93
   [junit4]   2> 1126594 INFO  (TEST-TestSQLHandler.doTest-seed#[4E2F6420A5FAE254]) [    ] o.a.s.c.SolrResourceLoader new SolrResourceLoader for directory: '/home/jenkins/workspace/Lucene-Solr-master-Linux/solr/build/solr-core/test/J1/temp/solr.handler.TestSQLHandler_4E2F6420A5FAE254-001/shard-1-001'
   [junit4]   2> 1126594 INFO  (TEST-TestSQLHandler.doTest-seed#[4E2F6420A5FAE254]) [    ] o.a.s.c.SolrResourceLoader JNDI not configured for solr (NoInitialContextEx)
   [junit4]   2> 1126594 INFO  (TEST-TestSQLHandler.doTest-seed#[4E2F6420A5FAE254]) [    ] o.a.s.c.SolrResourceLoader solr home defaulted to 'solr/' (could not find system property or JNDI)
   [junit4]   2> 1126594 INFO  (TEST-TestSQLHandler.doTest-seed#[4E2F6420A5FAE254]) [    ] o.a.s.c.c.SolrZkClient Using default ZkCredentialsProvider
   [junit4]   2> 1126594 INFO  (TEST-TestSQLHandler.doTest-seed#[4E2F6420A5FAE254]) [    ] o.a.s.c.c.ConnectionManager Waiting for client to connect to ZooKeeper
   [junit4]   2> 1126595 INFO  (zkCallback-1323-thread-1) [    ] o.a.s.c.c.ConnectionManager Watcher org.apache.solr.common.cloud.ConnectionManager@1ad4248 name:ZooKeeperConnection Watcher:127.0.0.1:37517/solr got event WatchedEvent state:SyncConnected type:None path:null path:null type:None
   [junit4]   2> 1126595 INFO  (TEST-TestSQLHandler.doTest-seed#[4E2F6420A5FAE254]) [    ] o.a.s.c.c.ConnectionManager Client is connected to ZooKeeper
   [junit4]   2> 1126596 INFO  (TEST-TestSQLHandler.doTest-seed#[4E2F6420A5FAE254]) [    ] o.a.s.c.c.SolrZkClient Using default ZkACLProvider
   [junit4]   2> 1126597 INFO  (TEST-TestSQLHandler.doTest-seed#[4E2F6420A5FAE254]) [    ] o.a.s.s.SolrDispatchFilter Loading solr.xml from SolrHome (not found in ZooKeeper)
   [junit4]   2> 1126597 INFO  (TEST-TestSQLHandler.doTest-seed#[4E2F6420A5FAE254]) [    ] o.a.s.c.SolrXmlConfig Loading container configuration from /home/jenkins/workspace/Lucene-Solr-master-Linux/solr/build/solr-core/test/J1/temp/solr.handler.TestSQLHandler_4E2F6420A5FAE254-001/shard-1-001/solr.xml
   [junit4]   2> 1126604 INFO  (TEST-TestSQLHandler.doTest-seed#[4E2F6420A5FAE254]) [    ] o.a.s.c.CorePropertiesLocator Config-defined core root directory: /home/jenkins/workspace/Lucene-Solr-master-Linux/solr/build/solr-core/test/J1/../../../../../../../../../home/jenkins/workspace/Lucene-Solr-master-Linux/solr/build/solr-core/test/J1/temp/solr.handler.TestSQLHandler_4E2F6420A5FAE254-001/shard-1-001/cores
   [junit4]   2> 1126604 INFO  (TEST-TestSQLHandler.doTest-seed#[4E2F6420A5FAE254]) [    ] o.a.s.c.CoreContainer New CoreContainer 5326180
   [junit4]   2> 1126604 INFO  (TEST-TestSQLHandler.doTest-seed#[4E2F6420A5FAE254]) [    ] o.a.s.c.CoreContainer Loading cores into CoreContainer [instanceDir=/home/jenkins/workspace/Lucene-Solr-master-Linux/solr/build/solr-core/test/J1/temp/solr.handler.TestSQLHandler_4E2F6420A5FAE254-001/shard-1-001]
   [junit4]   2> 1126604 WARN  (TEST-TestSQLHandler.doTest-seed#[4E2F6420A5FAE254]) [    ] o.a.s.c.CoreContainer Couldn't add files from /home/jenkins/workspace/Lucene-Solr-master-Linux/solr/build/solr-core/test/J1/temp/solr.handler.TestSQLHandler_4E2F6420A5FAE254-001/shard-1-001/lib to classpath: /home/jenkins/workspace/Lucene-Solr-master-Linux/solr/build/solr-core/test/J1/temp/solr.handler.TestSQLHandler_4E2F6420A5FAE254-001/shard-1-001/lib
   [junit4]   2> 1126604 INFO  (TEST-TestSQLHandler.doTest-seed#[4E2F6420A5FAE254]) [    ] o.a.s.h.c.HttpShardHandlerFactory created with socketTimeout : 90000,urlScheme : ,connTimeout : 15000,maxConnectionsPerHost : 20,maxConnections : 10000,corePoolSize : 0,maximumPoolSize : 2147483647,maxThreadIdleTime : 5,sizeOfQueue : -1,fairnessPolicy : false,useRetries : false,
   [junit4]   2> 1126605 INFO  (TEST-TestSQLHandler.doTest-seed#[4E2F6420A5FAE254]) [    ] o.a.s.u.UpdateShardHandler Creating UpdateShardHandler HTTP client with params: socketTimeout=340000&connTimeout=45000&retry=true
   [junit4]   2> 1126606 INFO  (TEST-TestSQLHandler.doTest-seed#[4E2F6420A5FAE254]) [    ] o.a.s.l.LogWatcher SLF4J impl is org.slf4j.impl.Log4jLoggerFactory
   [junit4]   2> 1126606 INFO  (TEST-TestSQLHandler.doTest-seed#[4E2F6420A5FAE254]) [    ] o.a.s.l.LogWatcher Registering Log Listener [Log4j (org.slf4j.impl.Log4jLoggerFactory)]
   [junit4]   2> 1126606 INFO  (TEST-TestSQLHandler.doTest-seed#[4E2F6420A5FAE254]) [    ] o.a.s.c.ZkContainer Zookeeper client=127.0.0.1:37517/solr
   [junit4]   2> 1126606 INFO  (TEST-TestSQLHandler.doTest-seed#[4E2F6420A5FAE254]) [    ] o.a.s.c.ZkController zkHost includes chroot
   [junit4]   2> 1126606 INFO  (TEST-TestSQLHandler.doTest-seed#[4E2F6420A5FAE254]) [    ] o.a.s.c.c.SolrZkClient Using default ZkCredentialsProvider
   [junit4]   2> 1126606 INFO  (TEST-TestSQLHandler.doTest-seed#[4E2F6420A5FAE254]) [    ] o.a.s.c.c.ConnectionManager Waiting for client to connect to ZooKeeper
   [junit4]   2> 1126607 INFO  (zkCallback-1326-thread-1) [    ] o.a.s.c.c.ConnectionManager Watcher org.apache.solr.common.cloud.ConnectionManager@dd5aa4 name:ZooKeeperConnection Watcher:127.0.0.1:37517 got event WatchedEvent state:SyncConnected type:None path:null path:null type:None
   [junit4]   2> 1126608 INFO  (TEST-TestSQLHandler.doTest-seed#[4E2F6420A5FAE254]) [    ] o.a.s.c.c.ConnectionManager Client is connected to ZooKeeper
   [junit4]   2> 1126609 INFO  (TEST-TestSQLHandler.doTest-seed#[4E2F6420A5FAE254]) [    ] o.a.s.c.c.SolrZkClient Using default ZkACLProvider
   [junit4]   2> 1126610 INFO  (TEST-TestSQLHandler.doTest-seed#[4E2F6420A5FAE254]) [n:127.0.0.1:44504_    ] o.a.s.c.c.ConnectionManager Waiting for client to connect to ZooKeeper
   [junit4]   2> 1126611 INFO  (zkCallback-1327-thread-1-processing-n:127.0.0.1:44504_) [n:127.0.0.1:44504_    ] o.a.s.c.c.ConnectionManager Watcher org.apache.solr.common.cloud.ConnectionManager@1e12d42 name:ZooKeeperConnection Watcher:127.0.0.1:37517/solr got event WatchedEvent state:SyncConnected type:None path:null path:null type:None
   [junit4]   2> 1126611 INFO  (TEST-TestSQLHandler.doTest-seed#[4E2F6420A5FAE254]) [n:127.0.0.1:44504_    ] o.a.s.c.c.ConnectionManager Client is connected to ZooKeeper
   [junit4]   2> 1126614 INFO  (TEST-TestSQLHandler.doTest-seed#[4E2F6420A5FAE254]) [n:127.0.0.1:44504_    ] o.a.s.c.c.ZkStateReader Updating cluster state from ZooKeeper... 
   [junit4]   2> 1126615 INFO  (TEST-TestSQLHandler.doTest-seed#[4E2F6420A5FAE254]) [n:127.0.0.1:44504_    ] o.a.s.c.c.ZkStateReader Updated live nodes from ZooKeeper... (0) -> (1)
   [junit4]   2> 1126616 INFO  (TEST-TestSQLHandler.doTest-seed#[4E2F6420A5FAE254]) [n:127.0.0.1:44504_    ] o.a.s.c.Overseer Overseer (id=null) closing
   [junit4]   2> 1126616 INFO  (TEST-TestSQLHandler.doTest-seed#[4E2F6420A5FAE254]) [n:127.0.0.1:44504_    ] o.a.s.c.LeaderElector Joined leadership election with path: /overseer_elect/election/95583859217006600-127.0.0.1:44504_-n_0000000001
   [junit4]   2> 1126616 INFO  (TEST-TestSQLHandler.doTest-seed#[4E2F6420A5FAE254]) [n:127.0.0.1:44504_    ] o.a.s.c.LeaderElector Watching path /overseer_elect/election/95583859217006596-127.0.0.1:35780_-n_0000000000 to know if I could be the leader
   [junit4]   2> 1126616 INFO  (TEST-TestSQLHandler.doTest-seed#[4E2F6420A5FAE254]) [n:127.0.0.1:44504_    ] o.a.s.c.ZkController Publish node=127.0.0.1:44504_ as DOWN
   [junit4]   2> 1126618 INFO  (OverseerStateUpdate-95583859217006596-127.0.0.1:35780_-n_0000000000) [n:127.0.0.1:35780_    ] o.a.s.c.Overseer processMessage: queueSize: 1, message = {
   [junit4]   2>   "operation":"downnode",
   [junit4]   2>   "node_name":"127.0.0.1:44504_"} current state version: 3
   [junit4]   2> 1126618 INFO  (OverseerStateUpdate-95583859217006596-127.0.0.1:35780_-n_0000000000) [n:127.0.0.1:35780_    ] o.a.s.c.o.NodeMutator DownNode state invoked for node: 127.0.0.1:44504_
   [junit4]   2> 1126720 INFO  (zkCallback-1320-thread-1-processing-n:127.0.0.1:35780_) [n:127.0.0.1:35780_    ] o.a.s.c.c.ZkStateReader A cluster state change: [WatchedEvent state:SyncConnected type:NodeDataChanged path:/clusterstate.json], has occurred - updating... (live nodes size: [1])
   [junit4]   2> 1126720 INFO  (zkCallback-1327-thread-1-processing-n:127.0.0.1:44504_) [n:127.0.0.1:44504_    ] o.a.s.c.c.ZkStateReader A cluster state change: [WatchedEvent state:SyncConnected type:NodeDataChanged path:/clusterstate.json], has occurred - updating... (live nodes size: [1])
   [junit4]   2> 1126720 INFO  (zkCallback-1322-thread-1) [    ] o.a.s.c.c.ZkStateReader A cluster state change: [WatchedEvent state:SyncConnected type:NodeDataChanged path:/clusterstate.json], has occurred - updating... (live nodes size: [1])
   [junit4]   2> 1127618 INFO  (TEST-TestSQLHandler.doTest-seed#[4E2F6420A5FAE254]) [n:127.0.0.1:44504_    ] o.a.s.c.ZkController Register node as live in ZooKeeper:/live_nodes/127.0.0.1:44504_
   [junit4]   2> 1127618 INFO  (TEST-TestSQLHandler.doTest-seed#[4E2F6420A5FAE254]) [n:127.0.0.1:44504_    ] o.a.s.c.c.SolrZkClient makePath: /live_nodes/127.0.0.1:44504_
   [junit4]   2> 1127619 INFO  (zkCallback-1327-thread-1-processing-n:127.0.0.1:44504_) [n:127.0.0.1:44504_    ] o.a.s.c.c.ZkStateReader A live node change: [WatchedEvent state:SyncConnected type:NodeChildrenChanged path:/live_nodes], has occurred - updating... (live nodes size: [1])
   [junit4]   2> 1127619 INFO  (zkCallback-1320-thread-1-processing-n:127.0.0.1:35780_) [n:127.0.0.1:35780_    ] o.a.s.c.c.ZkStateReader A live node change: [WatchedEvent state:SyncConnected type:NodeChildrenChanged path:/live_nodes], has occurred - updating... (live nodes size: [1])
   [junit4]   2> 1127619 INFO  (zkCallback-1322-thread-1) [    ] o.a.s.c.c.ZkStateReader A live node change: [WatchedEvent state:SyncConnected type:NodeChildrenChanged path:/live_nodes], has occurred - updating... (live nodes size: [1])
   [junit4]   2> 1127619 INFO  (zkCallback-1327-thread-1-processing-n:127.0.0.1:44504_) [n:127.0.0.1:44504_    ] o.a.s.c.c.ZkStateReader Updated live nodes from ZooKeeper... (1) -> (2)
   [junit4]   2> 1127619 INFO  (zkCallback-1320-thread-1-processing-n:127.0.0.1:35780_) [n:127.0.0.1:35780_    ] o.a.s.c.c.ZkStateReader Updated live nodes from ZooKeeper... (1) -> (2)
   [junit4]   2> 1127619 INFO  (zkCallback-1322-thread-1) [    ] o.a.s.c.c.ZkStateReader Updated live nodes from ZooKeeper... (1) -> (2)
   [junit4]   2> 1127659 INFO  (TEST-TestSQLHandler.doTest-seed#[4E2F6420A5FAE254]) [n:127.0.0.1:44504_    ] o.a.s.c.CoreContainer Security conf doesn't exist. Skipping setup for authorization module.
   [junit4]   2> 1127659 INFO  (TEST-TestSQLHandler.doTest-seed#[4E2F6420A5FAE254]) [n:127.0.0.1:44504_    ] o.a.s.c.CoreContainer No authentication plugin used.
   [junit4]   2> 1127660 INFO  (TEST-TestSQLHandler.doTest-seed#[4E2F6420A5FAE254]) [n:127.0.0.1:44504_    ] o.a.s.c.CorePropertiesLocator Looking for core definitions underneath /home/jenkins/workspace/Lucene-Solr-master-Linux/solr/build/solr-core/test/J1/../../../../../../../../../home/jenkins/workspace/Lucene-Solr-master-Linux/solr/build/solr-core/test/J1/temp/solr.handler.TestSQLHandler_4E2F6420A5FAE254-001/shard-1-001/cores
   [junit4]   2> 1127661 INFO  (TEST-TestSQLHandler.doTest-seed#[4E2F6420A5FAE254]) [n:127.0.0.1:44504_    ] o.a.s.c.CoreDescriptor Created CoreDescriptor: {name=collection1, config=solrconfig.xml, transient=false, schema=schema.xml, loadOnStartup=true, configSetProperties=configsetprops.json, collection=collection1, coreNodeName=, dataDir=data/, shard=}
   [junit4]   2> 1127661 INFO  (TEST-TestSQLHandler.doTest-seed#[4E2F6420A5FAE254]) [n:127.0.0.1:44504_    ] o.a.s.c.CorePropertiesLocator Found core collection1 in /home/jenkins/workspace/Lucene-Solr-master-Linux/solr/build/solr-core/test/J1/../../../../../../../../../home/jenkins/workspace/Lucene-Solr-master-Linux/solr/build/solr-core/test/J1/temp/solr.handler.TestSQLHandler_4E2F6420A5FAE254-001/shard-1-001/cores/collection1
   [junit4]   2> 1127661 INFO  (TEST-TestSQLHandler.doTest-seed#[4E2F6420A5FAE254]) [n:127.0.0.1:44504_    ] o.a.s.c.CorePropertiesLocator Found 1 core definitions
   [junit4]   2> 1127661 INFO  (TEST-TestSQLHandler.doTest-seed#[4E2F6420A5FAE254]) [n:127.0.0.1:44504_    ] o.a.s.s.SolrDispatchFilter user.dir=/home/jenkins/workspace/Lucene-Solr-master-Linux/solr/build/solr-core/test/J1
   [junit4]   2> 1127661 INFO  (TEST-TestSQLHandler.doTest-seed#[4E2F6420A5FAE254]) [n:127.0.0.1:44504_    ] o.a.s.s.SolrDispatchFilter SolrDispatchFilter.init() done
   [junit4]   2> 1127662 INFO  (coreLoadExecutor-3524-thread-1-processing-n:127.0.0.1:44504_) [n:127.0.0.1:44504_ c:collection1   x:collection1] o.a.s.c.ZkController publishing state=down
   [junit4]   2> 1127662 INFO  (coreLoadExecutor-3524-thread-1-processing-n:127.0.0.1:44504_) [n:127.0.0.1:44504_ c:collection1   x:collection1] o.a.s.c.ZkController numShards not found on descriptor - reading it from system property
   [junit4]   2> 1127663 INFO  (coreLoadExecutor-3524-thread-1-processing-n:127.0.0.1:44504_) [n:127.0.0.1:44504_ c:collection1   x:collection1] o.a.s.c.ZkController look for our core node name
   [junit4]   2> 1127663 INFO  (OverseerStateUpdate-95583859217006596-127.0.0.1:35780_-n_0000000000) [n:127.0.0.1:35780_    ] o.a.s.c.Overseer processMessage: queueSize: 1, message = {
   [junit4]   2>   "core":"collection1",
   [junit4]   2>   "roles":null,
   [junit4]   2>   "base_url":"http://127.0.0.1:44504",
   [junit4]   2>   "node_name":"127.0.0.1:44504_",
   [junit4]   2>   "numShards":"2",
   [junit4]   2>   "state":"down",
   [junit4]   2>   "shard":null,
   [junit4]   2>   "collection":"collection1",
   [junit4]   2>   "operation":"state"} current state version: 4
   [junit4]   2> 1127663 INFO  (OverseerStateUpdate-95583859217006596-127.0.0.1:35780_-n_0000000000) [n:127.0.0.1:35780_    ] o.a.s.c.o.ReplicaMutator Update state numShards=2 message={
   [junit4]   2>   "core":"collection1",
   [junit4]   2>   "roles":null,
   [junit4]   2>   "base_url":"http://127.0.0.1:44504",
   [junit4]   2>   "node_name":"127.0.0.1:44504_",
   [junit4]   2>   "numShards":"2",
   [junit4]   2>   "state":"down",
   [junit4]   2>   "shard":null,
   [junit4]   2>   "collection":"collection1",
   [junit4]   2>   "operation":"state"}
   [junit4]   2> 1127663 INFO  (OverseerStateUpdate-95583859217006596-127.0.0.1:35780_-n_0000000000) [n:127.0.0.1:35780_    ] o.a.s.c.o.ClusterStateMutator building a new cName: collection1
   [junit4]   2> 1127663 INFO  (OverseerStateUpdate-95583859217006596-127.0.0.1:35780_-n_0000000000) [n:127.0.0.1:35780_    ] o.a.s.c.o.ReplicaMutator Assigning new node to shard shard=shard2
   [junit4]   2> 1127766 INFO  (zkCallback-1320-thread-1-processing-n:127.0.0.1:35780_) [n:127.0.0.1:35780_    ] o.a.s.c.c.ZkStateReader A cluster state change: [WatchedEvent state:SyncConnected type:NodeDataChanged path:/clusterstate.json], has occurred - updating... (live nodes size: [2])
   [junit4]   2> 1127766 INFO  (zkCallback-1322-thread-1) [    ] o.a.s.c.c.ZkStateReader A cluster state change: [WatchedEvent state:SyncConnected type:NodeDataChanged path:/clusterstate.json], has occurred - updating... (live nodes size: [2])
   [junit4]   2> 1127766 INFO  (zkCallback-1327-thread-1-processing-n:127.0.0.1:44504_) [n:127.0.0.1:44504_    ] o.a.s.c.c.ZkStateReader A cluster state change: [WatchedEvent state:SyncConnected type:NodeDataChanged path:/clusterstate.json], has occurred - updating... (live nodes size: [2])
   [junit4]   2> 1128663 INFO  (coreLoadExecutor-3524-thread-1-processing-n:127.0.0.1:44504_) [n:127.0.0.1:44504_ c:collection1   x:collection1] o.a.s.c.ZkController waiting to find shard id in clusterstate for collection1
   [junit4]   2> 1128663 INFO  (coreLoadExecutor-3524-thread-1-processing-n:127.0.0.1:44504_) [n:127.0.0.1:44504_ c:collection1   x:collection1] o.a.s.c.ZkController Check for collection zkNode:collection1
   [junit4]   2> 1128664 INFO  (coreLoadExecutor-3524-thread-1-processing-n:127.0.0.1:44504_) [n:127.0.0.1:44504_ c:collection1   x:collection1] o.a.s.c.ZkController Collection zkNode exists
   [junit4]   2> 1128664 INFO  (coreLoadExecutor-3524-thread-1-processing-n:127.0.0.1:44504_) [n:127.0.0.1:44504_ c:collection1   x:collection1] o.a.s.c.c.ZkStateReader Load collection config from: [/collections/collection1]
   [junit4]   2> 1128664 INFO  (coreLoadExecutor-3524-thread-1-processing-n:127.0.0.1:44504_) [n:127.0.0.1:44504_ c:collection1   x:collection1] o.a.s.c.c.ZkStateReader path=[/collections/collection1] [configName]=[conf1] specified config exists in ZooKeeper
   [junit4]   2> 1128664 INFO  (coreLoadExecutor-3524-thread-1-processing-n:127.0.0.1:44504_) [n:127.0.0.1:44504_ c:collection1   x:collection1] o.a.s.c.SolrResourceLoader new SolrResourceLoader for directory: '/home/jenkins/workspace/Lucene-Solr-master-Linux/solr/build/solr-core/test/J1/temp/solr.handler.TestSQLHandler_4E2F6420A5FAE254-001/shard-1-001/cores/collection1'
   [junit4]   2> 1128664 INFO  (coreLoadExecutor-3524-thread-1-processing-n:127.0.0.1:44504_) [n:127.0.0.1:44504_ c:collection1   x:collection1] o.a.s.c.SolrResourceLoader JNDI not configured for solr (NoInitialContextEx)
   [junit4]   2> 1128665 INFO  (coreLoadExecutor-3524-thread-1-processing-n:127.0.0.1:44504_) [n:127.0.0.1:44504_ c:collection1   x:collection1] o.a.s.c.SolrResourceLoader solr home defaulted to 'solr/' (could not find system property or JNDI)
   [junit4]   2> 1128666 INFO  (coreLoadExecutor-3524-thread-1-processing-n:127.0.0.1:44504_) [n:127.0.0.1:44504_ c:collection1   x:collection1] o.a.s.c.Config loaded config solrconfig.xml with version 0 
   [junit4]   2> 1128671 INFO  (coreLoadExecutor-3524-thread-1-processing-n:127.0.0.1:44504_) [n:127.0.0.1:44504_ c:collection1   x:collection1] o.a.s.c.SolrConfig current version of requestparams : -1
   [junit4]   2> 1128675 INFO  (coreLoadExecutor-3524-thread-1-processing-n:127.0.0.1:44504_) [n:127.0.0.1:44504_ c:collection1   x:collection1] o.a.s.c.SolrConfig Using Lucene MatchVersion: 7.0.0
   [junit4]   2> 1128682 INFO  (coreLoadExecutor-3524-thread-1-processing-n:127.0.0.1:44504_) [n:127.0.0.1:44504_ c:collection1   x:collection1] o.a.s.c.SolrConfig Loaded SolrConfig: solrconfig.xml
   [junit4]   2> 1128692 INFO  (coreLoadExecutor-3524-thread-1-processing-n:127.0.0.1:44504_) [n:127.0.0.1:44504_ c:collection1   x:collection1] o.a.s.s.IndexSchema [collection1] Schema name=test
   [junit4]   2> 1128763 INFO  (coreLoadExecutor-3524-thread-1-processing-n:127.0.0.1:44504_) [n:127.0.0.1:44504_ c:collection1   x:collection1] o.a.s.s.IndexSchema default search field in schema is text
   [junit4]   2> 1128764 INFO  (coreLoadExecutor-3524-thread-1-processing-n:127.0.0.1:44504_) [n:127.0.0.1:44504_ c:collection1   x:collection1] o.a.s.s.IndexSchema unique key field: id
   [junit4]   2> 1128765 WARN  (coreLoadExecutor-3524-thread-1-processing-n:127.0.0.1:44504_) [n:127.0.0.1:44504_ c:collection1   x:collection1] o.a.s.s.IndexSchema Field lowerfilt1and2 is not multivalued and destination for multiple copyFields (2)
   [junit4]   2> 1128765 WARN  (coreLoadExecutor-3524-thread-1-processing-n:127.0.0.1:44504_) [n:127.0.0.1:44504_ c:collection1   x:collection1] o.a.s.s.IndexSchema Field text is not multivalued and destination for multiple copyFields (3)
   [junit4]   2> 1128767 INFO  (coreLoadExecutor-3524-thread-1-processing-n:127.0.0.1:44504_) [n:127.0.0.1:44504_ c:collection1   x:collection1] o.a.s.c.ConfigSetProperties Did not find ConfigSet properties, assuming default properties: Can't find resource 'configsetprops.json' in classpath or '/configs/conf1', cwd=/home/jenkins/workspace/Lucene-Solr-master-Linux/solr/build/solr-core/test/J1
   [junit4]   2> 1128767 INFO  (coreLoadExecutor-3524-thread-1-processing-n:127.0.0.1:44504_) [n:127.0.0.1:44504_ c:collection1   x:collection1] o.a.s.c.CoreContainer Creating SolrCore 'collection1' using configuration from collection collection1
   [junit4]   2> 1128767 INFO  (coreLoadExecutor-3524-thread-1-processing-n:127.0.0.1:44504_) [n:127.0.0.1:44504_ c:collection1 s:shard2 r:core_node1 x:collection1] o.a.s.c.SolrCore org.apache.solr.core.MockDirectoryFactory
   [junit4]   2> 1128767 INFO  (coreLoadExecutor-3524-thread-1-processing-n:127.0.0.1:44504_) [n:127.0.0.1:44504_ c:collection1 s:shard2 r:core_node1 x:collection1] o.a.s.c.SolrCore [[collection1] ] Opening new SolrCore at [/home/jenkins/workspace/Lucene-Solr-master-Linux/solr/build/solr-core/test/J1/temp/solr.handler.TestSQLHandler_4E2F6420A5FAE254-001/shard-1-001/cores/collection1], dataDir=[/home/jenkins/workspace/Lucene-Solr-master-Linux/solr/build/solr-core/test/J1/../../../../../../../../../home/jenkins/workspace/Lucene-Solr-master-Linux/solr/build/solr-core/test/J1/temp/solr.handler.TestSQLHandler_4E2F6420A5FAE254-001/shard-1-001/cores/collection1/data/]
   [junit4]   2> 1128767 INFO  (coreLoadExecutor-3524-thread-1-processing-n:127.0.0.1:44504_) [n:127.0.0.1:44504_ c:collection1 s:shard2 r:core_node1 x:collection1] o.a.s.c.SolrCore JMX monitoring not detected for core: collection1
   [junit4]   2> 1128768 INFO  (coreLoadExecutor-3524-thread-1-processing-n:127.0.0.1:44504_) [n:127.0.0.1:44504_ c:collection1 s:shard2 r:core_node1 x:collection1] o.a.s.c.CachingDirectoryFactory return new directory for /home/jenkins/workspace/Lucene-Solr-master-Linux/solr/build/solr-core/test/J1/../../../../../../../../../home/jenkins/workspace/Lucene-Solr-master-Linux/solr/build/solr-core/test/J1/temp/solr.handler.TestSQLHandler_4E2F6420A5FAE254-001/shard-1-001/cores/collection1/data
   [junit4]   2> 1128768 INFO  (coreLoadExecutor-3524-thread-1-processing-n:127.0.0.1:44504_) [n:127.0.0.1:44504_ c:collection1 s:shard2 r:core_node1 x:collection1] o.a.s.c.SolrCore New index directory detected: old=null new=/home/jenkins/workspace/Lucene-Solr-master-Linux/solr/build/solr-core/test/J1/../../../../../../../../../home/jenkins/workspace/Lucene-Solr-master-Linux/solr/build/solr-core/test/J1/temp/solr.handler.TestSQLHandler_4E2F6420A5FAE254-001/shard-1-001/cores/collection1/data/index/
   [junit4]   2> 1128768 WARN  (coreLoadExecutor-3524-thread-1-processing-n:127.0.0.1:44504_) [n:127.0.0.1:44504_ c:collection1 s:shard2 r:core_node1 x:collection1] o.a.s.c.SolrCore [collection1] Solr index directory '/home/jenkins/workspace/Lucene-Solr-master-Linux/solr/build/solr-core/test/J1/../../../../../../../../../home/jenkins/workspace/Lucene-Solr-master-Linux/solr/build/solr-core/test/J1/temp/solr.handler.TestSQLHandler_4E2F6420A5FAE254-001/shard-1-001/cores/collection1/data/index' doesn't exist. Creating new index...
   [junit4]   2> 1128768 INFO  (coreLoadExecutor-3524-thread-1-processing-n:127.0.0.1:44504_) [n:127.0.0.1:44504_ c:collection1 s:shard2 r:core_node1 x:collection1] o.a.s.c.CachingDirectoryFactory return new directory for /home/jenkins/workspace/Lucene-Solr-master-Linux/solr/build/solr-core/test/J1/../../../../../../../../../home/jenkins/workspace/Lucene-Solr-master-Linux/solr/build/solr-core/test/J1/temp/solr.handler.TestSQLHandler_4E2F6420A5FAE254-001/shard-1-001/cores/collection1/data/index
   [junit4]   2> 1128769 INFO  (coreLoadExecutor-3524-thread-1-processing-n:127.0.0.1:44504_) [n:127.0.0.1:44504_ c:collection1 s:shard2 r:core_node1 x:collection1] o.a.s.c.SolrDeletionPolicy SolrDeletionPolicy.onCommit: commits: num=1
   [junit4]   2> 	commit{dir=MockDirectoryWrapper(RAMDirectory@bd305d lockFactory=org.apache.lucene.store.SingleInstanceLockFactory@230148),segFN=segments_1,generation=1}
   [junit4]   2> 1128769 INFO  (coreLoadExecutor-3524-thread-1-processing-n:127.0.0.1:44504_) [n:127.0.0.1:44504_ c:collection1 s:shard2 r:core_node1 x:collection1] o.a.s.c.SolrDeletionPolicy newest commit generation = 1
   [junit4]   2> 1128769 INFO  (OldIndexDirectoryCleanupThreadForCore-collection1) [n:127.0.0.1:44504_ c:collection1 s:shard2 r:core_node1 x:collection1] o.a.s.c.SolrCore Looking for old index directories to cleanup for core collection1 in /home/jenkins/workspace/Lucene-Solr-master-Linux/solr/build/solr-core/test/J1/../../../../../../../../../home/jenkins/workspace/Lucene-Solr-master-Linux/solr/build/solr-core/test/J1/temp/solr.handler.TestSQLHandler_4E2F6420A5FAE254-001/shard-1-001/cores/collection1/data/
   [junit4]   2> 1128769 WARN  (OldIndexDirectoryCleanupThreadForCore-collection1) [n:127.0.0.1:44504_ c:collection1 s:shard2 r:core_node1 x:collection1] o.a.s.c.DirectoryFactory /home/jenkins/workspace/Lucene-Solr-master-Linux/solr/build/solr-core/test/J1/../../../../../../../../../home/jenkins/workspace/Lucene-Solr-master-Linux/solr/build/solr-core/test/J1/temp/solr.handler.TestSQLHandler_4E2F6420A5FAE254-001/shard-1-001/cores/collection1/data/ does not point to a valid data directory; skipping clean-up of old index directories.
   [junit4]   2> 1128771 INFO  (coreLoadExecutor-3524-thread-1-processing-n:127.0.0.1:44504_) [n:127.0.0.1:44504_ c:collection1 s:shard2 r:core_node1 x:collection1] o.a.s.c.SolrCore no updateRequestProcessorChain defined as default, creating implicit default
   [junit4]   2> 1128773 INFO  (coreLoadExecutor-3524-thread-1-processing-n:127.0.0.1:44504_) [n:127.0.0.1:44504_ c:collection1 s:shard2 r:core_node1 x:collection1] o.a.s.h.l.XMLLoader xsltCacheLifetimeSeconds=60
   [junit4]   2> 1128774 INFO  (coreLoadExecutor-3524-thread-1-processing-n:127.0.0.1:44504_) [n:127.0.0.1:44504_ c:collection1 s:shard2 r:core_node1 x:collection1] o.a.s.h.l.XMLLoader xsltCacheLifetimeSeconds=60
   [junit4]   2> 1128775 INFO  (coreLoadExecutor-3524-thread-1-processing-n:127.0.0.1:44504_) [n:127.0.0.1:44504_ c:collection1 s:shard2 r:core_node1 x:collection1] o.a.s.h.l.XMLLoader xsltCacheLifetimeSeconds=60
   [junit4]   2> 1128775 INFO  (coreLoadExecutor-3524-thread-1-processing-n:127.0.0.1:44504_) [n:127.0.0.1:44504_ c:collection1 s:shard2 r:core_node1 x:collection1] o.a.s.h.l.XMLLoader xsltCacheLifetimeSeconds=60
   [junit4]   2> 1128776 INFO  (coreLoadExecutor-3524-thread-1-processing-n:127.0.0.1:44504_) [n:127.0.0.1:44504_ c:collection1 s:shard2 r:core_node1 x:collection1] o.a.s.c.PluginBag requestHandler : '/replication' created with startup=lazy 
   [junit4]   2> 1128777 INFO  (coreLoadExecutor-3524-thread-1-processing-n:127.0.0.1:44504_) [n:127.0.0.1:44504_ c:collection1 s:shard2 r:core_node1 x:collection1] o.a.s.c.RequestHandlers Registered paths: /admin/mbeans,standard,,/update/csv,/sql,/update/json/docs,/admin/luke,/export,/admin/segments,/get,/admin/system,/replication,/admin/properties,/config,/stream,/schema,/admin/plugins,/admin/logging,/update/json,/admin/ping,/admin/threads,/update,/admin/file
   [junit4]   2> 1128777 INFO  (coreLoadExecutor-3524-thread-1-processing-n:127.0.0.1:44504_) [n:127.0.0.1:44504_ c:collection1 s:shard2 r:core_node1 x:collection1] o.a.s.c.SolrCore Using default statsCache cache: org.apache.solr.search.stats.LocalStatsCache
   [junit4]   2> 1128778 INFO  (coreLoadExecutor-3524-thread-1-processing-n:127.0.0.1:44504_) [n:127.0.0.1:44504_ c:collection1 s:shard2 r:core_node1 x:collection1] o.a.s.u.UpdateHandler Using UpdateLog implementation: org.apache.solr.update.UpdateLog
   [junit4]   2> 1128778 INFO  (coreLoadExecutor-3524-thread-1-processing-n:127.0.0.1:44504_) [n:127.0.0.1:44504_ c:collection1 s:shard2 r:core_node1 x:collection1] o.a.s.u.UpdateLog Initializing UpdateLog: dataDir= defaultSyncLevel=FLUSH numRecordsToKeep=100 maxNumLogsToKeep=10 numVersionBuckets=65536
   [junit4]   2> 1128778 INFO  (coreLoadExecutor-3524-thread-1-processing-n:127.0.0.1:44504_) [n:127.0.0.1:44504_ c:collection1 s:shard2 r:core_node1 x:collection1] o.a.s.u.CommitTracker Hard AutoCommit: disabled
   [junit4]   2> 1128778 INFO  (coreLoadExecutor-3524-thread-1-processing-n:127.0.0.1:44504_) [n:127.0.0.1:44504_ c:collection1 s:shard2 r:core_node1 x:collection1] o.a.s.u.CommitTracker Soft AutoCommit: disabled
   [junit4]   2> 1128779 INFO  (coreLoadExecutor-3524-thread-1-processing-n:127.0.0.1:44504_) [n:127.0.0.1:44504_ c:collection1 s:shard2 r:core_node1 x:collection1] o.a.s.c.SolrDeletionPolicy SolrDeletionPolicy.onInit: commits: num=1
   [junit4]   2> 	commit{dir=MockDirectoryWrapper(RAMDirectory@bd305d lockFactory=org.apache.lucene.store.SingleInstanceLockFactory@230148),segFN=segments_1,generation=1}
   [junit4]   2> 1128779 INFO  (coreLoadExecutor-3524-thread-1-processing-n:127.0.0.1:44504_) [n:127.0.0.1:44504_ c:collection1 s:shard2 r:core_node1 x:collection1] o.a.s.c.SolrDeletionPolicy newest commit generation = 1
   [junit4]   2> 1128779 INFO  (coreLoadExecutor-3524-thread-1-processing-n:127.0.0.1:44504_) [n:127.0.0.1:44504_ c:collection1 s:shard2 r:core_node1 x:collection1] o.a.s.s.SolrIndexSearcher Opening [Searcher@16c5a32[collection1] main]
   [junit4]   2> 1128779 INFO  (coreLoadExecutor-3524-thread-1-processing-n:127.0.0.1:44504_) [n:127.0.0.1:44504_ c:collection1 s:shard2 r:core_node1 x:collection1] o.a.s.c.c.ZkStateReader Load collection config from: [/collections/collection1]
   [junit4]   2> 1128780 INFO  (coreLoadExecutor-3524-thread-1-processing-n:127.0.0.1:44504_) [n:127.0.0.1:44504_ c:collection1 s:shard2 r:core_node1 x:collection1] o.a.s.c.c.ZkStateReader path=[/collections/collection1] [configName]=[conf1] specified config exists in ZooKeeper
   [junit4]   2> 1128780 INFO  (coreLoadExecutor-3524-thread-1-processing-n:127.0.0.1:44504_) [n:127.0.0.1:44504_ c:collection1 s:shard2 r:core_node1 x:collection1] o.a.s.r.ManagedResourceStorage Setting up ZooKeeper-based storage for the RestManager with znodeBase: /configs/conf1
   [junit4]   2> 1128780 INFO  (coreLoadExecutor-3524-thread-1-processing-n:127.0.0.1:44504_) [n:127.0.0.1:44504_ c:collection1 s:shard2 r:core_node1 x:collection1] o.a.s.r.ManagedResourceStorage Configured ZooKeeperStorageIO with znodeBase: /configs/conf1
   [junit4]   2> 1128781 INFO  (coreLoadExecutor-3524-thread-1-processing-n:127.0.0.1:44504_) [n:127.0.0.1:44504_ c:collection1 s:shard2 r:core_node1 x:collection1] o.a.s.r.RestManager Initializing RestManager with initArgs: {}
   [junit4]   2> 1128781 INFO  (coreLoadExecutor-3524-thread-1-processing-n:127.0.0.1:44504_) [n:127.0.0.1:44504_ c:collection1 s:shard2 r:core_node1 x:collection1] o.a.s.r.ManagedResourceStorage Reading _rest_managed.json using ZooKeeperStorageIO:path=/configs/conf1
   [junit4]   2> 1128781 INFO  (coreLoadExecutor-3524-thread-1-processing-n:127.0.0.1:44504_) [n:127.0.0.1:44504_ c:collection1 s:shard2 r:core_node1 x:collection1] o.a.s.r.Ma

[...truncated too long message...]

/test/J1/temp/solr.handler.TestSQLHandler_4E2F6420A5FAE254-001/shard-4-001/cores/collection1/data/index
   [junit4]   2> 1155777 INFO  (recoveryExecutor-1341-thread-1-processing-n:127.0.0.1:34360_ x:collection1 s:shard1 c:collection1 r:core_node4) [n:127.0.0.1:34360_ c:collection1 s:shard1 r:core_node4 x:collection1] o.a.s.c.CachingDirectoryFactory looking to close /home/jenkins/workspace/Lucene-Solr-master-Linux/solr/build/solr-core/test/J1/../../../../../../../../../home/jenkins/workspace/Lucene-Solr-master-Linux/solr/build/solr-core/test/J1/temp/solr.handler.TestSQLHandler_4E2F6420A5FAE254-001/shard-4-001/cores/collection1/data [CachedDir<<refCount=0;path=/home/jenkins/workspace/Lucene-Solr-master-Linux/solr/build/solr-core/test/J1/../../../../../../../../../home/jenkins/workspace/Lucene-Solr-master-Linux/solr/build/solr-core/test/J1/temp/solr.handler.TestSQLHandler_4E2F6420A5FAE254-001/shard-4-001/cores/collection1/data;done=false>>]
   [junit4]   2> 1155777 INFO  (recoveryExecutor-1341-thread-1-processing-n:127.0.0.1:34360_ x:collection1 s:shard1 c:collection1 r:core_node4) [n:127.0.0.1:34360_ c:collection1 s:shard1 r:core_node4 x:collection1] o.a.s.c.CachingDirectoryFactory Closing directory: /home/jenkins/workspace/Lucene-Solr-master-Linux/solr/build/solr-core/test/J1/../../../../../../../../../home/jenkins/workspace/Lucene-Solr-master-Linux/solr/build/solr-core/test/J1/temp/solr.handler.TestSQLHandler_4E2F6420A5FAE254-001/shard-4-001/cores/collection1/data
   [junit4]   2> 1155778 INFO  (TEST-TestSQLHandler.doTest-seed#[4E2F6420A5FAE254]) [    ] o.a.s.c.Overseer Overseer (id=95583859217006609-127.0.0.1:34360_-n_0000000004) closing
   [junit4]   2> 1155778 INFO  (OverseerStateUpdate-95583859217006609-127.0.0.1:34360_-n_0000000004) [n:127.0.0.1:34360_    ] o.a.s.c.Overseer Overseer Loop exiting : 127.0.0.1:34360_
   [junit4]   2> 1155803 INFO  (zkCallback-1343-thread-1-processing-n:127.0.0.1:34360_) [n:127.0.0.1:34360_    ] o.a.s.c.c.ZkStateReader A live node change: [WatchedEvent state:SyncConnected type:NodeChildrenChanged path:/live_nodes], has occurred - updating... (live nodes size: [1])
   [junit4]   2> 1155803 WARN  (zkCallback-1343-thread-1-processing-n:127.0.0.1:34360_) [n:127.0.0.1:34360_    ] o.a.s.c.c.ZkStateReader ZooKeeper watch triggered, but Solr cannot talk to ZK: [KeeperErrorCode = Session expired for /live_nodes]
   [junit4]   2> 1155804 INFO  (TEST-TestSQLHandler.doTest-seed#[4E2F6420A5FAE254]) [    ] o.e.j.s.ServerConnector Stopped ServerConnector@1df3c23{HTTP/1.1,[http/1.1]}{127.0.0.1:0}
   [junit4]   2> 1155805 INFO  (TEST-TestSQLHandler.doTest-seed#[4E2F6420A5FAE254]) [    ] o.e.j.s.h.ContextHandler Stopped o.e.j.s.ServletContextHandler@10ab39c{/,null,UNAVAILABLE}
   [junit4]   2> 1155806 INFO  (TEST-TestSQLHandler.doTest-seed#[4E2F6420A5FAE254]) [    ] o.a.s.c.ZkTestServer connecting to 127.0.0.1:37517 37517
   [junit4]   2> 1155939 INFO  (Thread-3026) [    ] o.a.s.c.ZkTestServer connecting to 127.0.0.1:37517 37517
   [junit4]   2> 1155940 WARN  (Thread-3026) [    ] o.a.s.c.ZkTestServer Watch limit violations: 
   [junit4]   2> Maximum concurrent create/delete watches above limit:
   [junit4]   2> 
   [junit4]   2> 	7	/solr/aliases.json
   [junit4]   2> 	5	/solr/security.json
   [junit4]   2> 	5	/solr/configs/conf1
   [junit4]   2> 
   [junit4]   2> Maximum concurrent data watches above limit:
   [junit4]   2> 
   [junit4]   2> 	7	/solr/clusterstate.json
   [junit4]   2> 
   [junit4]   2> Maximum concurrent children watches above limit:
   [junit4]   2> 
   [junit4]   2> 	7	/solr/live_nodes
   [junit4]   2> 	7	/solr/collections
   [junit4]   2> 	3	/solr/overseer/collection-queue-work
   [junit4]   2> 	2	/solr/overseer/queue
   [junit4]   2> 	2	/solr/overseer/queue-work
   [junit4]   2> 
   [junit4]   2> NOTE: reproduce with: ant test  -Dtestcase=TestSQLHandler -Dtests.method=doTest -Dtests.seed=4E2F6420A5FAE254 -Dtests.multiplier=3 -Dtests.slow=true -Dtests.locale=ar-SY -Dtests.timezone=Australia/Lindeman -Dtests.asserts=true -Dtests.file.encoding=ISO-8859-1
   [junit4] ERROR   31.3s J1 | TestSQLHandler.doTest <<<
   [junit4]    > Throwable #1: java.io.IOException: --> http://127.0.0.1:44504/collection1:java.util.concurrent.ExecutionException: java.io.IOException: --> http://127.0.0.1:34360/collection1/: An exception has occurred on the server, refer to server log for details.
   [junit4]    > 	at __randomizedtesting.SeedInfo.seed([4E2F6420A5FAE254:E96BDC84C841F1ED]:0)
   [junit4]    > 	at org.apache.solr.client.solrj.io.stream.SolrStream.read(SolrStream.java:201)
   [junit4]    > 	at org.apache.solr.handler.TestSQLHandler.getTuples(TestSQLHandler.java:2425)
   [junit4]    > 	at org.apache.solr.handler.TestSQLHandler.testBasicSelect(TestSQLHandler.java:238)
   [junit4]    > 	at org.apache.solr.handler.TestSQLHandler.doTest(TestSQLHandler.java:89)
   [junit4]    > 	at org.apache.solr.BaseDistributedSearchTestCase$ShardsRepeatRule$ShardsFixedStatement.callStatement(BaseDistributedSearchTestCase.java:996)
   [junit4]    > 	at org.apache.solr.BaseDistributedSearchTestCase$ShardsRepeatRule$ShardsStatement.evaluate(BaseDistributedSearchTestCase.java:971)
   [junit4]    > 	at java.lang.Thread.run(Thread.java:745)
   [junit4]   2> 1155945 INFO  (SUITE-TestSQLHandler-seed#[4E2F6420A5FAE254]-worker) [    ] o.a.s.SolrTestCaseJ4 ###deleteCore
   [junit4]   2> NOTE: leaving temporary files on disk at: /home/jenkins/workspace/Lucene-Solr-master-Linux/solr/build/solr-core/test/J1/temp/solr.handler.TestSQLHandler_4E2F6420A5FAE254-001
   [junit4]   2> Mar 20, 2016 5:12:56 PM com.carrotsearch.randomizedtesting.ThreadLeakControl checkThreadLeaks
   [junit4]   2> WARNING: Will linger awaiting termination of 1 leaked thread(s).
   [junit4]   2> NOTE: test params are: codec=Asserting(Lucene60): {_version_=FST50, multiDefault=PostingsFormat(name=LuceneVarGapFixedInterval), intDefault=FST50, id=BlockTreeOrds(blocksize=128), text=FSTOrd50, field_i=PostingsFormat(name=LuceneVarGapFixedInterval), str_s=FSTOrd50, timestamp=PostingsFormat(name=LuceneVarGapFixedInterval)}, docValues:{_version_=DocValuesFormat(name=Lucene54), multiDefault=DocValuesFormat(name=Direct), intDefault=DocValuesFormat(name=Lucene54), id=DocValuesFormat(name=Lucene54), field_i=DocValuesFormat(name=Direct), str_s=DocValuesFormat(name=Memory)}, maxPointsInLeafNode=974, maxMBSortInHeap=6.886017893035985, sim=RandomSimilarity(queryNorm=true,coord=no): {}, locale=ar-SY, timezone=Australia/Lindeman
   [junit4]   2> NOTE: Linux 4.2.0-34-generic i386/Oracle Corporation 1.8.0_72 (32-bit)/cpus=12,threads=1,free=156489640,total=438304768
   [junit4]   2> NOTE: All tests run in this JVM: [ZkCLITest, SimpleCollectionCreateDeleteTest, RequestLoggingTest, TestTrieFacet, SchemaVersionSpecificBehaviorTest, CdcrReplicationHandlerTest, TestBulkSchemaAPI, DistributedMLTComponentTest, BasicFunctionalityTest, TestNonDefinedSimilarityFactory, SpellingQueryConverterTest, MBeansHandlerTest, AnalysisErrorHandlingTest, TestMinMaxOnMultiValuedField, ChangedSchemaMergeTest, SpellPossibilityIteratorTest, UpdateRequestProcessorFactoryTest, SolrIndexConfigTest, MigrateRouteKeyTest, PKIAuthenticationIntegrationTest, LeaderFailoverAfterPartitionTest, HLLSerializationTest, OverriddenZkACLAndCredentialsProvidersTest, IndexBasedSpellCheckerTest, TestNamedUpdateProcessors, ConjunctionSolrSpellCheckerTest, SimplePostToolTest, ShardRoutingTest, DistribDocExpirationUpdateProcessorTest, TestCloudPivotFacet, TriLevelCompositeIdRoutingTest, TestCollationFieldDocValues, TestBM25SimilarityFactory, RuleEngineTest, BlockJoinFacetSimpleTest, SuggesterFSTTest, TimeZoneUtilsTest, AnalyticsQueryTest, DOMUtilTest, AsyncMigrateRouteKeyTest, TestObjectReleaseTracker, TestSystemIdResolver, TestDocumentBuilder, TestExactStatsCache, RankQueryTest, TestFiltering, TermVectorComponentTest, HdfsRecoveryZkTest, ChaosMonkeyNothingIsSafeTest, TestSolr4Spatial2, TestSolrQueryParserDefaultOperatorResource, TestAuthenticationFramework, DocValuesTest, HdfsDirectoryTest, MinimalSchemaTest, TestHashQParserPlugin, TestMiniSolrCloudClusterBase, CollectionsAPIDistributedZkTest, SuggestComponentContextFilterQueryTest, TestSimpleTrackingShardHandler, DeleteShardTest, RollingRestartTest, QueryResultKeyTest, SolrCmdDistributorTest, TestManagedResource, ZkStateReaderTest, LoggingHandlerTest, UniqFieldsUpdateProcessorFactoryTest, ConvertedLegacyTest, SimpleMLTQParserTest, TestExpandComponent, TestConfigSetsAPIExclusivity, WordBreakSolrSpellCheckerTest, TestUseDocValuesAsStored, CSVRequestHandlerTest, TestRequestForwarding, DistributedIntervalFacetingTest, TestTestInjection, TestSQLHandler]
   [junit4] Completed [416/580 (1!)] on J1 in 31.56s, 1 test, 1 error <<< FAILURES!

[...truncated 547 lines...]
BUILD FAILED
/home/jenkins/workspace/Lucene-Solr-master-Linux/build.xml:740: The following error occurred while executing this line:
/home/jenkins/workspace/Lucene-Solr-master-Linux/build.xml:684: The following error occurred while executing this line:
/home/jenkins/workspace/Lucene-Solr-master-Linux/build.xml:59: The following error occurred while executing this line:
/home/jenkins/workspace/Lucene-Solr-master-Linux/solr/build.xml:233: The following error occurred while executing this line:
/home/jenkins/workspace/Lucene-Solr-master-Linux/solr/common-build.xml:529: The following error occurred while executing this line:
/home/jenkins/workspace/Lucene-Solr-master-Linux/lucene/common-build.xml:1457: The following error occurred while executing this line:
/home/jenkins/workspace/Lucene-Solr-master-Linux/lucene/common-build.xml:1014: There were test failures: 580 suites (10 ignored), 2320 tests, 1 error, 115 ignored (70 assumptions) [seed: 4E2F6420A5FAE254]

Total time: 55 minutes 8 seconds
Build step 'Invoke Ant' marked build as failure
Archiving artifacts
[WARNINGS] Skipping publisher since build result is FAILURE
Recording test results
Email was triggered for: Failure - Any
Sending email for trigger: Failure - Any



Mime
View raw message