lucene-dev mailing list archives

Site index · List index
Message view « Date » · « Thread »
Top « Date » · « Thread »
From Policeman Jenkins Server <jenk...@thetaphi.de>
Subject [JENKINS-EA] Lucene-Solr-trunk-Linux (64bit/jdk-9-ea+107) - Build # 16056 - Still Failing!
Date Tue, 01 Mar 2016 05:43:05 GMT
Build: http://jenkins.thetaphi.de/job/Lucene-Solr-trunk-Linux/16056/
Java: 64bit/jdk-9-ea+107 -XX:+UseCompressedOops -XX:+UseConcMarkSweepGC

4 tests failed.
FAILED:  org.apache.lucene.index.TestDuelingCodecs.testCrazyReaderEquals

Error Message:
9

Stack Trace:
java.lang.ArrayIndexOutOfBoundsException: 9
	at __randomizedtesting.SeedInfo.seed([9E79CC7DFB2A1B66:2A431641F763C665]:0)
	at org.apache.lucene.util.automaton.MinimizationOperations.minimize(MinimizationOperations.java:235)
	at org.apache.lucene.util.automaton.RegExp.toAutomatonInternal(RegExp.java:524)
	at org.apache.lucene.util.automaton.RegExp.toAutomaton(RegExp.java:495)
	at org.apache.lucene.util.automaton.RegExp.toAutomaton(RegExp.java:426)
	at org.apache.lucene.util.LuceneTestCase.assertTermsEquals(LuceneTestCase.java:2015)
	at org.apache.lucene.util.LuceneTestCase.assertFieldsEquals(LuceneTestCase.java:1977)
	at org.apache.lucene.util.LuceneTestCase.assertTermVectorsEquals(LuceneTestCase.java:2402)
	at org.apache.lucene.util.LuceneTestCase.assertReaderEquals(LuceneTestCase.java:1940)
	at org.apache.lucene.index.TestDuelingCodecs.testCrazyReaderEquals(TestDuelingCodecs.java:172)
	at sun.reflect.NativeMethodAccessorImpl.invoke0(Native Method)
	at sun.reflect.NativeMethodAccessorImpl.invoke(NativeMethodAccessorImpl.java:62)
	at sun.reflect.DelegatingMethodAccessorImpl.invoke(DelegatingMethodAccessorImpl.java:43)
	at java.lang.reflect.Method.invoke(Method.java:520)
	at com.carrotsearch.randomizedtesting.RandomizedRunner.invoke(RandomizedRunner.java:1764)
	at com.carrotsearch.randomizedtesting.RandomizedRunner$8.evaluate(RandomizedRunner.java:871)
	at com.carrotsearch.randomizedtesting.RandomizedRunner$9.evaluate(RandomizedRunner.java:907)
	at com.carrotsearch.randomizedtesting.RandomizedRunner$10.evaluate(RandomizedRunner.java:921)
	at org.apache.lucene.util.TestRuleSetupTeardownChained$1.evaluate(TestRuleSetupTeardownChained.java:49)
	at org.apache.lucene.util.AbstractBeforeAfterRule$1.evaluate(AbstractBeforeAfterRule.java:45)
	at org.apache.lucene.util.TestRuleThreadAndTestName$1.evaluate(TestRuleThreadAndTestName.java:48)
	at org.apache.lucene.util.TestRuleIgnoreAfterMaxFailures$1.evaluate(TestRuleIgnoreAfterMaxFailures.java:64)
	at org.apache.lucene.util.TestRuleMarkFailure$1.evaluate(TestRuleMarkFailure.java:47)
	at com.carrotsearch.randomizedtesting.rules.StatementAdapter.evaluate(StatementAdapter.java:36)
	at com.carrotsearch.randomizedtesting.ThreadLeakControl$StatementRunner.run(ThreadLeakControl.java:367)
	at com.carrotsearch.randomizedtesting.ThreadLeakControl.forkTimeoutingTask(ThreadLeakControl.java:809)
	at com.carrotsearch.randomizedtesting.ThreadLeakControl$3.evaluate(ThreadLeakControl.java:460)
	at com.carrotsearch.randomizedtesting.RandomizedRunner.runSingleTest(RandomizedRunner.java:880)
	at com.carrotsearch.randomizedtesting.RandomizedRunner$5.evaluate(RandomizedRunner.java:781)
	at com.carrotsearch.randomizedtesting.RandomizedRunner$6.evaluate(RandomizedRunner.java:816)
	at com.carrotsearch.randomizedtesting.RandomizedRunner$7.evaluate(RandomizedRunner.java:827)
	at org.apache.lucene.util.AbstractBeforeAfterRule$1.evaluate(AbstractBeforeAfterRule.java:45)
	at com.carrotsearch.randomizedtesting.rules.StatementAdapter.evaluate(StatementAdapter.java:36)
	at org.apache.lucene.util.TestRuleStoreClassName$1.evaluate(TestRuleStoreClassName.java:41)
	at com.carrotsearch.randomizedtesting.rules.NoShadowingOrOverridesOnMethodsRule$1.evaluate(NoShadowingOrOverridesOnMethodsRule.java:40)
	at com.carrotsearch.randomizedtesting.rules.NoShadowingOrOverridesOnMethodsRule$1.evaluate(NoShadowingOrOverridesOnMethodsRule.java:40)
	at com.carrotsearch.randomizedtesting.rules.StatementAdapter.evaluate(StatementAdapter.java:36)
	at com.carrotsearch.randomizedtesting.rules.StatementAdapter.evaluate(StatementAdapter.java:36)
	at com.carrotsearch.randomizedtesting.rules.StatementAdapter.evaluate(StatementAdapter.java:36)
	at org.apache.lucene.util.TestRuleAssertionsRequired$1.evaluate(TestRuleAssertionsRequired.java:53)
	at org.apache.lucene.util.TestRuleMarkFailure$1.evaluate(TestRuleMarkFailure.java:47)
	at org.apache.lucene.util.TestRuleIgnoreAfterMaxFailures$1.evaluate(TestRuleIgnoreAfterMaxFailures.java:64)
	at org.apache.lucene.util.TestRuleIgnoreTestSuites$1.evaluate(TestRuleIgnoreTestSuites.java:54)
	at com.carrotsearch.randomizedtesting.rules.StatementAdapter.evaluate(StatementAdapter.java:36)
	at com.carrotsearch.randomizedtesting.ThreadLeakControl$StatementRunner.run(ThreadLeakControl.java:367)
	at java.lang.Thread.run(Thread.java:804)


FAILED:  org.apache.lucene.search.TestRegexpQuery.testRegexComplement

Error Message:
8

Stack Trace:
java.lang.ArrayIndexOutOfBoundsException: 8
	at __randomizedtesting.SeedInfo.seed([9E79CC7DFB2A1B66:70F86E33BE767D9B]:0)
	at org.apache.lucene.util.automaton.MinimizationOperations.minimize(MinimizationOperations.java:235)
	at org.apache.lucene.util.automaton.RegExp.toAutomatonInternal(RegExp.java:524)
	at org.apache.lucene.util.automaton.RegExp.toAutomaton(RegExp.java:495)
	at org.apache.lucene.util.automaton.RegExp.toAutomaton(RegExp.java:466)
	at org.apache.lucene.search.RegexpQuery.<init>(RegexpQuery.java:109)
	at org.apache.lucene.search.RegexpQuery.<init>(RegexpQuery.java:79)
	at org.apache.lucene.search.RegexpQuery.<init>(RegexpQuery.java:69)
	at org.apache.lucene.search.TestRegexpQuery.regexQueryNrHits(TestRegexpQuery.java:72)
	at org.apache.lucene.search.TestRegexpQuery.testRegexComplement(TestRegexpQuery.java:94)
	at sun.reflect.NativeMethodAccessorImpl.invoke0(Native Method)
	at sun.reflect.NativeMethodAccessorImpl.invoke(NativeMethodAccessorImpl.java:62)
	at sun.reflect.DelegatingMethodAccessorImpl.invoke(DelegatingMethodAccessorImpl.java:43)
	at java.lang.reflect.Method.invoke(Method.java:520)
	at com.carrotsearch.randomizedtesting.RandomizedRunner.invoke(RandomizedRunner.java:1764)
	at com.carrotsearch.randomizedtesting.RandomizedRunner$8.evaluate(RandomizedRunner.java:871)
	at com.carrotsearch.randomizedtesting.RandomizedRunner$9.evaluate(RandomizedRunner.java:907)
	at com.carrotsearch.randomizedtesting.RandomizedRunner$10.evaluate(RandomizedRunner.java:921)
	at org.apache.lucene.util.TestRuleSetupTeardownChained$1.evaluate(TestRuleSetupTeardownChained.java:49)
	at org.apache.lucene.util.AbstractBeforeAfterRule$1.evaluate(AbstractBeforeAfterRule.java:45)
	at org.apache.lucene.util.TestRuleThreadAndTestName$1.evaluate(TestRuleThreadAndTestName.java:48)
	at org.apache.lucene.util.TestRuleIgnoreAfterMaxFailures$1.evaluate(TestRuleIgnoreAfterMaxFailures.java:64)
	at org.apache.lucene.util.TestRuleMarkFailure$1.evaluate(TestRuleMarkFailure.java:47)
	at com.carrotsearch.randomizedtesting.rules.StatementAdapter.evaluate(StatementAdapter.java:36)
	at com.carrotsearch.randomizedtesting.ThreadLeakControl$StatementRunner.run(ThreadLeakControl.java:367)
	at com.carrotsearch.randomizedtesting.ThreadLeakControl.forkTimeoutingTask(ThreadLeakControl.java:809)
	at com.carrotsearch.randomizedtesting.ThreadLeakControl$3.evaluate(ThreadLeakControl.java:460)
	at com.carrotsearch.randomizedtesting.RandomizedRunner.runSingleTest(RandomizedRunner.java:880)
	at com.carrotsearch.randomizedtesting.RandomizedRunner$5.evaluate(RandomizedRunner.java:781)
	at com.carrotsearch.randomizedtesting.RandomizedRunner$6.evaluate(RandomizedRunner.java:816)
	at com.carrotsearch.randomizedtesting.RandomizedRunner$7.evaluate(RandomizedRunner.java:827)
	at org.apache.lucene.util.AbstractBeforeAfterRule$1.evaluate(AbstractBeforeAfterRule.java:45)
	at com.carrotsearch.randomizedtesting.rules.StatementAdapter.evaluate(StatementAdapter.java:36)
	at org.apache.lucene.util.TestRuleStoreClassName$1.evaluate(TestRuleStoreClassName.java:41)
	at com.carrotsearch.randomizedtesting.rules.NoShadowingOrOverridesOnMethodsRule$1.evaluate(NoShadowingOrOverridesOnMethodsRule.java:40)
	at com.carrotsearch.randomizedtesting.rules.NoShadowingOrOverridesOnMethodsRule$1.evaluate(NoShadowingOrOverridesOnMethodsRule.java:40)
	at com.carrotsearch.randomizedtesting.rules.StatementAdapter.evaluate(StatementAdapter.java:36)
	at com.carrotsearch.randomizedtesting.rules.StatementAdapter.evaluate(StatementAdapter.java:36)
	at com.carrotsearch.randomizedtesting.rules.StatementAdapter.evaluate(StatementAdapter.java:36)
	at org.apache.lucene.util.TestRuleAssertionsRequired$1.evaluate(TestRuleAssertionsRequired.java:53)
	at org.apache.lucene.util.TestRuleMarkFailure$1.evaluate(TestRuleMarkFailure.java:47)
	at org.apache.lucene.util.TestRuleIgnoreAfterMaxFailures$1.evaluate(TestRuleIgnoreAfterMaxFailures.java:64)
	at org.apache.lucene.util.TestRuleIgnoreTestSuites$1.evaluate(TestRuleIgnoreTestSuites.java:54)
	at com.carrotsearch.randomizedtesting.rules.StatementAdapter.evaluate(StatementAdapter.java:36)
	at com.carrotsearch.randomizedtesting.ThreadLeakControl$StatementRunner.run(ThreadLeakControl.java:367)
	at java.lang.Thread.run(Thread.java:804)


FAILED:  org.apache.lucene.util.automaton.TestUTF32ToUTF8.testRandomRegexes

Error Message:
source=3 is out of bounds (maxState is 2)

Stack Trace:
java.lang.IllegalArgumentException: source=3 is out of bounds (maxState is 2)
	at __randomizedtesting.SeedInfo.seed([9E79CC7DFB2A1B66:62DDB97E9243050F]:0)
	at org.apache.lucene.util.automaton.Automaton.addTransition(Automaton.java:165)
	at org.apache.lucene.util.automaton.MinimizationOperations.minimize(MinimizationOperations.java:245)
	at org.apache.lucene.util.automaton.RegExp.toAutomatonInternal(RegExp.java:537)
	at org.apache.lucene.util.automaton.RegExp.findLeaves(RegExp.java:617)
	at org.apache.lucene.util.automaton.RegExp.findLeaves(RegExp.java:614)
	at org.apache.lucene.util.automaton.RegExp.findLeaves(RegExp.java:614)
	at org.apache.lucene.util.automaton.RegExp.toAutomatonInternal(RegExp.java:521)
	at org.apache.lucene.util.automaton.RegExp.toAutomaton(RegExp.java:495)
	at org.apache.lucene.util.automaton.RegExp.toAutomaton(RegExp.java:426)
	at org.apache.lucene.util.automaton.TestUTF32ToUTF8.testRandomRegexes(TestUTF32ToUTF8.java:207)
	at sun.reflect.NativeMethodAccessorImpl.invoke0(Native Method)
	at sun.reflect.NativeMethodAccessorImpl.invoke(NativeMethodAccessorImpl.java:62)
	at sun.reflect.DelegatingMethodAccessorImpl.invoke(DelegatingMethodAccessorImpl.java:43)
	at java.lang.reflect.Method.invoke(Method.java:520)
	at com.carrotsearch.randomizedtesting.RandomizedRunner.invoke(RandomizedRunner.java:1764)
	at com.carrotsearch.randomizedtesting.RandomizedRunner$8.evaluate(RandomizedRunner.java:871)
	at com.carrotsearch.randomizedtesting.RandomizedRunner$9.evaluate(RandomizedRunner.java:907)
	at com.carrotsearch.randomizedtesting.RandomizedRunner$10.evaluate(RandomizedRunner.java:921)
	at org.apache.lucene.util.TestRuleSetupTeardownChained$1.evaluate(TestRuleSetupTeardownChained.java:49)
	at org.apache.lucene.util.AbstractBeforeAfterRule$1.evaluate(AbstractBeforeAfterRule.java:45)
	at org.apache.lucene.util.TestRuleThreadAndTestName$1.evaluate(TestRuleThreadAndTestName.java:48)
	at org.apache.lucene.util.TestRuleIgnoreAfterMaxFailures$1.evaluate(TestRuleIgnoreAfterMaxFailures.java:64)
	at org.apache.lucene.util.TestRuleMarkFailure$1.evaluate(TestRuleMarkFailure.java:47)
	at com.carrotsearch.randomizedtesting.rules.StatementAdapter.evaluate(StatementAdapter.java:36)
	at com.carrotsearch.randomizedtesting.ThreadLeakControl$StatementRunner.run(ThreadLeakControl.java:367)
	at com.carrotsearch.randomizedtesting.ThreadLeakControl.forkTimeoutingTask(ThreadLeakControl.java:809)
	at com.carrotsearch.randomizedtesting.ThreadLeakControl$3.evaluate(ThreadLeakControl.java:460)
	at com.carrotsearch.randomizedtesting.RandomizedRunner.runSingleTest(RandomizedRunner.java:880)
	at com.carrotsearch.randomizedtesting.RandomizedRunner$5.evaluate(RandomizedRunner.java:781)
	at com.carrotsearch.randomizedtesting.RandomizedRunner$6.evaluate(RandomizedRunner.java:816)
	at com.carrotsearch.randomizedtesting.RandomizedRunner$7.evaluate(RandomizedRunner.java:827)
	at org.apache.lucene.util.AbstractBeforeAfterRule$1.evaluate(AbstractBeforeAfterRule.java:45)
	at com.carrotsearch.randomizedtesting.rules.StatementAdapter.evaluate(StatementAdapter.java:36)
	at org.apache.lucene.util.TestRuleStoreClassName$1.evaluate(TestRuleStoreClassName.java:41)
	at com.carrotsearch.randomizedtesting.rules.NoShadowingOrOverridesOnMethodsRule$1.evaluate(NoShadowingOrOverridesOnMethodsRule.java:40)
	at com.carrotsearch.randomizedtesting.rules.NoShadowingOrOverridesOnMethodsRule$1.evaluate(NoShadowingOrOverridesOnMethodsRule.java:40)
	at com.carrotsearch.randomizedtesting.rules.StatementAdapter.evaluate(StatementAdapter.java:36)
	at com.carrotsearch.randomizedtesting.rules.StatementAdapter.evaluate(StatementAdapter.java:36)
	at com.carrotsearch.randomizedtesting.rules.StatementAdapter.evaluate(StatementAdapter.java:36)
	at org.apache.lucene.util.TestRuleAssertionsRequired$1.evaluate(TestRuleAssertionsRequired.java:53)
	at org.apache.lucene.util.TestRuleMarkFailure$1.evaluate(TestRuleMarkFailure.java:47)
	at org.apache.lucene.util.TestRuleIgnoreAfterMaxFailures$1.evaluate(TestRuleIgnoreAfterMaxFailures.java:64)
	at org.apache.lucene.util.TestRuleIgnoreTestSuites$1.evaluate(TestRuleIgnoreTestSuites.java:54)
	at com.carrotsearch.randomizedtesting.rules.StatementAdapter.evaluate(StatementAdapter.java:36)
	at com.carrotsearch.randomizedtesting.ThreadLeakControl$StatementRunner.run(ThreadLeakControl.java:367)
	at java.lang.Thread.run(Thread.java:804)


FAILED:  org.apache.lucene.search.TestDocValuesRewriteMethod.testRegexps

Error Message:
5

Stack Trace:
java.lang.ArrayIndexOutOfBoundsException: 5
	at __randomizedtesting.SeedInfo.seed([9E79CC7DFB2A1B66:7F258D6C25804CEE]:0)
	at org.apache.lucene.util.automaton.MinimizationOperations.minimize(MinimizationOperations.java:235)
	at org.apache.lucene.util.automaton.RegExp.toAutomatonInternal(RegExp.java:524)
	at org.apache.lucene.util.automaton.RegExp.toAutomaton(RegExp.java:495)
	at org.apache.lucene.util.automaton.RegExp.toAutomaton(RegExp.java:466)
	at org.apache.lucene.search.RegexpQuery.<init>(RegexpQuery.java:109)
	at org.apache.lucene.search.RegexpQuery.<init>(RegexpQuery.java:79)
	at org.apache.lucene.search.TestDocValuesRewriteMethod.assertSame(TestDocValuesRewriteMethod.java:117)
	at org.apache.lucene.search.TestDocValuesRewriteMethod.testRegexps(TestDocValuesRewriteMethod.java:109)
	at sun.reflect.NativeMethodAccessorImpl.invoke0(Native Method)
	at sun.reflect.NativeMethodAccessorImpl.invoke(NativeMethodAccessorImpl.java:62)
	at sun.reflect.DelegatingMethodAccessorImpl.invoke(DelegatingMethodAccessorImpl.java:43)
	at java.lang.reflect.Method.invoke(Method.java:520)
	at com.carrotsearch.randomizedtesting.RandomizedRunner.invoke(RandomizedRunner.java:1764)
	at com.carrotsearch.randomizedtesting.RandomizedRunner$8.evaluate(RandomizedRunner.java:871)
	at com.carrotsearch.randomizedtesting.RandomizedRunner$9.evaluate(RandomizedRunner.java:907)
	at com.carrotsearch.randomizedtesting.RandomizedRunner$10.evaluate(RandomizedRunner.java:921)
	at org.apache.lucene.util.TestRuleSetupTeardownChained$1.evaluate(TestRuleSetupTeardownChained.java:49)
	at org.apache.lucene.util.AbstractBeforeAfterRule$1.evaluate(AbstractBeforeAfterRule.java:45)
	at org.apache.lucene.util.TestRuleThreadAndTestName$1.evaluate(TestRuleThreadAndTestName.java:48)
	at org.apache.lucene.util.TestRuleIgnoreAfterMaxFailures$1.evaluate(TestRuleIgnoreAfterMaxFailures.java:64)
	at org.apache.lucene.util.TestRuleMarkFailure$1.evaluate(TestRuleMarkFailure.java:47)
	at com.carrotsearch.randomizedtesting.rules.StatementAdapter.evaluate(StatementAdapter.java:36)
	at com.carrotsearch.randomizedtesting.ThreadLeakControl$StatementRunner.run(ThreadLeakControl.java:367)
	at com.carrotsearch.randomizedtesting.ThreadLeakControl.forkTimeoutingTask(ThreadLeakControl.java:809)
	at com.carrotsearch.randomizedtesting.ThreadLeakControl$3.evaluate(ThreadLeakControl.java:460)
	at com.carrotsearch.randomizedtesting.RandomizedRunner.runSingleTest(RandomizedRunner.java:880)
	at com.carrotsearch.randomizedtesting.RandomizedRunner$5.evaluate(RandomizedRunner.java:781)
	at com.carrotsearch.randomizedtesting.RandomizedRunner$6.evaluate(RandomizedRunner.java:816)
	at com.carrotsearch.randomizedtesting.RandomizedRunner$7.evaluate(RandomizedRunner.java:827)
	at org.apache.lucene.util.AbstractBeforeAfterRule$1.evaluate(AbstractBeforeAfterRule.java:45)
	at com.carrotsearch.randomizedtesting.rules.StatementAdapter.evaluate(StatementAdapter.java:36)
	at org.apache.lucene.util.TestRuleStoreClassName$1.evaluate(TestRuleStoreClassName.java:41)
	at com.carrotsearch.randomizedtesting.rules.NoShadowingOrOverridesOnMethodsRule$1.evaluate(NoShadowingOrOverridesOnMethodsRule.java:40)
	at com.carrotsearch.randomizedtesting.rules.NoShadowingOrOverridesOnMethodsRule$1.evaluate(NoShadowingOrOverridesOnMethodsRule.java:40)
	at com.carrotsearch.randomizedtesting.rules.StatementAdapter.evaluate(StatementAdapter.java:36)
	at com.carrotsearch.randomizedtesting.rules.StatementAdapter.evaluate(StatementAdapter.java:36)
	at com.carrotsearch.randomizedtesting.rules.StatementAdapter.evaluate(StatementAdapter.java:36)
	at org.apache.lucene.util.TestRuleAssertionsRequired$1.evaluate(TestRuleAssertionsRequired.java:53)
	at org.apache.lucene.util.TestRuleMarkFailure$1.evaluate(TestRuleMarkFailure.java:47)
	at org.apache.lucene.util.TestRuleIgnoreAfterMaxFailures$1.evaluate(TestRuleIgnoreAfterMaxFailures.java:64)
	at org.apache.lucene.util.TestRuleIgnoreTestSuites$1.evaluate(TestRuleIgnoreTestSuites.java:54)
	at com.carrotsearch.randomizedtesting.rules.StatementAdapter.evaluate(StatementAdapter.java:36)
	at com.carrotsearch.randomizedtesting.ThreadLeakControl$StatementRunner.run(ThreadLeakControl.java:367)
	at java.lang.Thread.run(Thread.java:804)




Build Log:
[...truncated 761 lines...]
   [junit4] Suite: org.apache.lucene.search.TestDocValuesRewriteMethod
   [junit4]   2> NOTE: reproduce with: ant test  -Dtestcase=TestDocValuesRewriteMethod
-Dtests.method=testRegexps -Dtests.seed=9E79CC7DFB2A1B66 -Dtests.multiplier=3 -Dtests.slow=true
-Dtests.locale=pt-PT -Dtests.timezone=Canada/Atlantic -Dtests.asserts=true -Dtests.file.encoding=US-ASCII
   [junit4] ERROR   1.82s J0 | TestDocValuesRewriteMethod.testRegexps <<<
   [junit4]    > Throwable #1: java.lang.ArrayIndexOutOfBoundsException: 5
   [junit4]    > 	at __randomizedtesting.SeedInfo.seed([9E79CC7DFB2A1B66:7F258D6C25804CEE]:0)
   [junit4]    > 	at org.apache.lucene.util.automaton.MinimizationOperations.minimize(MinimizationOperations.java:235)
   [junit4]    > 	at org.apache.lucene.util.automaton.RegExp.toAutomatonInternal(RegExp.java:524)
   [junit4]    > 	at org.apache.lucene.util.automaton.RegExp.toAutomaton(RegExp.java:495)
   [junit4]    > 	at org.apache.lucene.util.automaton.RegExp.toAutomaton(RegExp.java:466)
   [junit4]    > 	at org.apache.lucene.search.RegexpQuery.<init>(RegexpQuery.java:109)
   [junit4]    > 	at org.apache.lucene.search.RegexpQuery.<init>(RegexpQuery.java:79)
   [junit4]    > 	at org.apache.lucene.search.TestDocValuesRewriteMethod.assertSame(TestDocValuesRewriteMethod.java:117)
   [junit4]    > 	at org.apache.lucene.search.TestDocValuesRewriteMethod.testRegexps(TestDocValuesRewriteMethod.java:109)
   [junit4]    > 	at java.lang.Thread.run(Thread.java:804)
   [junit4]   2> NOTE: test params are: codec=Asserting(Lucene60): {=PostingsFormat(name=MockRandom),
id=PostingsFormat(name=Asserting)}, docValues:{=DocValuesFormat(name=Asserting)}, maxPointsInLeafNode=1889,
maxMBSortInHeap=6.262586255014089, sim=ClassicSimilarity, locale=pt-PT, timezone=Canada/Atlantic
   [junit4]   2> NOTE: Linux 3.19.0-51-generic amd64/Oracle Corporation 9-ea (64-bit)/cpus=12,threads=1,free=310802256,total=508887040
   [junit4]   2> NOTE: All tests run in this JVM: [TestBinaryDocValuesUpdates, TestTimeLimitingCollector,
TestPagedBytes, TestTransactionRollback, TestDeterminizeLexicon, TestLucene50StoredFieldsFormat,
TestAutomatonQuery, TestCharFilter, TestQueryBuilder, TestVirtualMethod, TestUniqueTermCount,
TestMaxPosition, TestNativeFSLockFactory, TestBlockPostingsFormat2, TestSegmentReader, TestIndexWriterMergePolicy,
TestTermsEnum, TestDeterminism, Test2BTerms, TestConstantScoreQuery, TestMergedIterator, TestIndexWriterDelete,
TestIndexWriterWithThreads, TestThreadedForceMerge, TestIndexWriterLockRelease, TestRecyclingByteBlockAllocator,
TestSimpleFSLockFactory, TestTerms, TestNewestSegment, TestSizeBoundedForceMerge, TestInfoStream,
TestDocValuesRewriteMethod]
   [junit4] Completed [173/411 (1!)] on J0 in 1.97s, 2 tests, 1 error <<< FAILURES!

[...truncated 96 lines...]
   [junit4] Suite: org.apache.lucene.index.TestDuelingCodecs
   [junit4]   2> NOTE: reproduce with: ant test  -Dtestcase=TestDuelingCodecs -Dtests.method=testCrazyReaderEquals
-Dtests.seed=9E79CC7DFB2A1B66 -Dtests.multiplier=3 -Dtests.slow=true -Dtests.locale=sk -Dtests.timezone=Asia/Dushanbe
-Dtests.asserts=true -Dtests.file.encoding=US-ASCII
   [junit4] ERROR   6.65s J1 | TestDuelingCodecs.testCrazyReaderEquals <<<
   [junit4]    > Throwable #1: java.lang.ArrayIndexOutOfBoundsException: 9
   [junit4]    > 	at __randomizedtesting.SeedInfo.seed([9E79CC7DFB2A1B66:2A431641F763C665]:0)
   [junit4]    > 	at org.apache.lucene.util.automaton.MinimizationOperations.minimize(MinimizationOperations.java:235)
   [junit4]    > 	at org.apache.lucene.util.automaton.RegExp.toAutomatonInternal(RegExp.java:524)
   [junit4]    > 	at org.apache.lucene.util.automaton.RegExp.toAutomaton(RegExp.java:495)
   [junit4]    > 	at org.apache.lucene.util.automaton.RegExp.toAutomaton(RegExp.java:426)
   [junit4]    > 	at org.apache.lucene.util.LuceneTestCase.assertTermsEquals(LuceneTestCase.java:2015)
   [junit4]    > 	at org.apache.lucene.util.LuceneTestCase.assertFieldsEquals(LuceneTestCase.java:1977)
   [junit4]    > 	at org.apache.lucene.util.LuceneTestCase.assertTermVectorsEquals(LuceneTestCase.java:2402)
   [junit4]    > 	at org.apache.lucene.util.LuceneTestCase.assertReaderEquals(LuceneTestCase.java:1940)
   [junit4]    > 	at org.apache.lucene.index.TestDuelingCodecs.testCrazyReaderEquals(TestDuelingCodecs.java:172)
   [junit4]    > 	at java.lang.Thread.run(Thread.java:804)
   [junit4]   2> NOTE: leaving temporary files on disk at: /home/jenkins/workspace/Lucene-Solr-trunk-Linux/lucene/build/core/test/J1/temp/lucene.index.TestDuelingCodecs_9E79CC7DFB2A1B66-001
   [junit4]   2> NOTE: test params are: codec=Asserting(Lucene60): {}, docValues:{}, maxPointsInLeafNode=1696,
maxMBSortInHeap=4.335869638266186, sim=RandomSimilarity(queryNorm=false,coord=crazy): {titleTokenized=DFR
I(ne)Z(0.3), body=IB LL-L1}, locale=sk, timezone=Asia/Dushanbe
   [junit4]   2> NOTE: Linux 3.19.0-51-generic amd64/Oracle Corporation 9-ea (64-bit)/cpus=12,threads=1,free=380638512,total=508887040
   [junit4]   2> NOTE: All tests run in this JVM: [TestAllFilesHaveCodecHeader, TestSpanNotQuery,
TestNotDocIdSet, TestBooleanCoord, TestLevenshteinAutomata, TestPerFieldDocValuesFormat, TestConjunctionDISI,
TestAssertions, TestRecyclingIntBlockAllocator, TestTimSorter, TestBooleanQuery, TestOrdinalMap,
TestRAMDirectory, TestLucene50StoredFieldsFormatHighCompression, TestStressIndexing, TestMergePolicyWrapper,
TestAutomatonQueryUnicode, TestCompiledAutomaton, Test2BSortedDocValuesFixedSorted, TestMultiCollector,
TestNamedSPILoader, TestIndexWriterNRTIsCurrent, TestOmitNorms, TestBoolean2, TestLogMergePolicy,
TestRoaringDocIdSet, TestRateLimiter, MultiCollectorTest, TestPostingsOffsets, TestStressNRT,
TestOmitPositions, TestPositiveScoresOnlyCollector, TestCollectionUtil, TestSameTokenSamePosition,
TestCodecUtil, TestSparseFixedBitDocIdSet, TestQueryRescorer, TestRollingBuffer, TestClassicSimilarity,
TestPerFieldPostingsFormat2, TestAllFilesDetectTruncation, TestFieldsReader, TestFieldCacheRewriteMethod,
TestByteSlices, TestPayloadsOnVectors, TestDirectoryReaderReopen, TestStressAdvance, TestBytesRefArray,
TestDocumentsWriterStallControl, TestPayloads, TestIndexWriterOutOfFileDescriptors, TestPrefixInBooleanQuery,
TestMmapDirectory, TestHugeRamFile, TestBooleanScorer, TestMultiTermsEnum, TestReaderWrapperDVTypeCheck,
TestSpanMultiTermQueryWrapper, TestFixedBitDocIdSet, TestNRTCachingDirectory, TestBlockPostingsFormat3,
TestSnapshotDeletionPolicy, TestBasics, TestSmallFloat, TestIndexReaderClose, TestAddIndexes,
TestDocValues, TestBagOfPostings, TestIndexWriterExceptions, TestFlushByRamOrCountsPolicy,
TestDuelingCodecs]
   [junit4] Completed [203/411 (2!)] on J1 in 11.64s, 2 tests, 1 error <<< FAILURES!

[...truncated 175 lines...]
   [junit4] Suite: org.apache.lucene.util.automaton.TestUTF32ToUTF8
   [junit4]   2> NOTE: reproduce with: ant test  -Dtestcase=TestUTF32ToUTF8 -Dtests.method=testRandomRegexes
-Dtests.seed=9E79CC7DFB2A1B66 -Dtests.multiplier=3 -Dtests.slow=true -Dtests.locale=nyn-UG
-Dtests.timezone=ACT -Dtests.asserts=true -Dtests.file.encoding=US-ASCII
   [junit4] ERROR   2.84s J2 | TestUTF32ToUTF8.testRandomRegexes <<<
   [junit4]    > Throwable #1: java.lang.IllegalArgumentException: source=3 is out of bounds
(maxState is 2)
   [junit4]    > 	at __randomizedtesting.SeedInfo.seed([9E79CC7DFB2A1B66:62DDB97E9243050F]:0)
   [junit4]    > 	at org.apache.lucene.util.automaton.Automaton.addTransition(Automaton.java:165)
   [junit4]    > 	at org.apache.lucene.util.automaton.MinimizationOperations.minimize(MinimizationOperations.java:245)
   [junit4]    > 	at org.apache.lucene.util.automaton.RegExp.toAutomatonInternal(RegExp.java:537)
   [junit4]    > 	at org.apache.lucene.util.automaton.RegExp.findLeaves(RegExp.java:617)
   [junit4]    > 	at org.apache.lucene.util.automaton.RegExp.findLeaves(RegExp.java:614)
   [junit4]    > 	at org.apache.lucene.util.automaton.RegExp.findLeaves(RegExp.java:614)
   [junit4]    > 	at org.apache.lucene.util.automaton.RegExp.toAutomatonInternal(RegExp.java:521)
   [junit4]    > 	at org.apache.lucene.util.automaton.RegExp.toAutomaton(RegExp.java:495)
   [junit4]    > 	at org.apache.lucene.util.automaton.RegExp.toAutomaton(RegExp.java:426)
   [junit4]    > 	at org.apache.lucene.util.automaton.TestUTF32ToUTF8.testRandomRegexes(TestUTF32ToUTF8.java:207)
   [junit4]    > 	at java.lang.Thread.run(Thread.java:804)
   [junit4]   2> NOTE: test params are: codec=Asserting(Lucene60): {}, docValues:{}, maxPointsInLeafNode=519,
maxMBSortInHeap=5.1728852863549255, sim=ClassicSimilarity, locale=nyn-UG, timezone=ACT
   [junit4]   2> NOTE: Linux 3.19.0-51-generic amd64/Oracle Corporation 9-ea (64-bit)/cpus=12,threads=1,free=482630368,total=508952576
   [junit4]   2> NOTE: All tests run in this JVM: [TestNoMergeScheduler, TestNRTThreads,
Test2BSortedDocValuesOrds, TestPrefixCodedTerms, TestTryDelete, TestBytesRefHash, TestIndexWriterMaxDocs,
TestSortedSetSelector, TestSpanOrQuery, TestCodecHoldsOpenFiles, TestSearchWithThreads, TestTopDocsCollector,
TestControlledRealTimeReopenThread, TestIndexWriterMerging, TestMergeRateLimiter, TestDirectory,
TestConjunctions, TestApproximationSearchEquivalence, TestLiveFieldValues, TestSpanFirstQuery,
TestSpanContainQuery, TestOfflineSorter, TestIndexInput, TestSleepingLockWrapper, TestAttributeSource,
TestTwoPhaseCommitTool, TestIndexWriterDeleteByQuery, TestCharsRef, TestMathUtil, TestDocValuesScoring,
TestTimSorterWorstCase, TestDemo, TestFrequencyTrackingRingBuffer, Test2BNumericDocValues,
TestDocBoost, TestPointValues, TestSearchForDuplicates, TestBufferedIndexInput, TestPhrasePrefixQuery,
TestIntBlockPool, TestLucene50TermVectorsFormat, TestSpans, TestCharTermAttributeImpl, TestSimpleFSDirectory,
TestNIOFSDirectory, TestIndexWriterOnDiskFull, TestConcurrentMergeScheduler, TestBufferedChecksum,
TestFilterSpans, TestDirectoryReader, TestConsistentFieldNumbers, TestDuelingCodecsAtNight,
TestWildcard, TestForUtil, TestRollingUpdates, TestNumericTokenStream, TestNorms, TestNumericRangeQuery32,
TestSpanExplanationsOfNonMatches, TestArrayUtil, TestNot, TestLazyProxSkipping, TestParallelReaderEmptyIndex,
TestIndexCommit, TestIndexableField, TestCachingCollector, TestTermVectors, TestSearch, TestComplexExplanations,
TestSort, TestIndexWriter, TestIndexWriterReader, TestFSTs, TestNumericRangeQuery64, TestBytesStore,
TestPackedInts, TestShardSearching, TestMultiMMap, TestSearcherManager, TestDeletionPolicy,
TestBooleanOr, TestSloppyPhraseQuery, TestPersistentSnapshotDeletionPolicy, TestAtomicUpdate,
TestIndexWriterCommit, TestSearchAfter, TestHighCompressionMode, TestTopDocsMerge, TestLongPostings,
TestNRTReaderWithThreads, TestTieredMergePolicy, TestWeakIdentityMap, TestRegexpRandom2, TestParallelCompositeReader,
TestTransactions, TestMultiThreadTermVectors, TestMultiDocValues, TestSimpleSearchEquivalence,
TestDocValuesIndexing, TestSimilarityBase, TestMixedCodecs, TestFlex, TestUTF32ToUTF8]
   [junit4] Completed [258/411 (3!)] on J2 in 2.90s, 6 tests, 1 error <<< FAILURES!

[...truncated 68 lines...]
   [junit4] Suite: org.apache.lucene.search.TestRegexpQuery
   [junit4]   2> NOTE: reproduce with: ant test  -Dtestcase=TestRegexpQuery -Dtests.method=testRegexComplement
-Dtests.seed=9E79CC7DFB2A1B66 -Dtests.multiplier=3 -Dtests.slow=true -Dtests.locale=shi -Dtests.timezone=Canada/Mountain
-Dtests.asserts=true -Dtests.file.encoding=US-ASCII
   [junit4] ERROR   0.00s J2 | TestRegexpQuery.testRegexComplement <<<
   [junit4]    > Throwable #1: java.lang.ArrayIndexOutOfBoundsException: 8
   [junit4]    > 	at __randomizedtesting.SeedInfo.seed([9E79CC7DFB2A1B66:70F86E33BE767D9B]:0)
   [junit4]    > 	at org.apache.lucene.util.automaton.MinimizationOperations.minimize(MinimizationOperations.java:235)
   [junit4]    > 	at org.apache.lucene.util.automaton.RegExp.toAutomatonInternal(RegExp.java:524)
   [junit4]    > 	at org.apache.lucene.util.automaton.RegExp.toAutomaton(RegExp.java:495)
   [junit4]    > 	at org.apache.lucene.util.automaton.RegExp.toAutomaton(RegExp.java:466)
   [junit4]    > 	at org.apache.lucene.search.RegexpQuery.<init>(RegexpQuery.java:109)
   [junit4]    > 	at org.apache.lucene.search.RegexpQuery.<init>(RegexpQuery.java:79)
   [junit4]    > 	at org.apache.lucene.search.RegexpQuery.<init>(RegexpQuery.java:69)
   [junit4]    > 	at org.apache.lucene.search.TestRegexpQuery.regexQueryNrHits(TestRegexpQuery.java:72)
   [junit4]    > 	at org.apache.lucene.search.TestRegexpQuery.testRegexComplement(TestRegexpQuery.java:94)
   [junit4]    > 	at java.lang.Thread.run(Thread.java:804)
   [junit4]   2> NOTE: test params are: codec=Asserting(Lucene60), sim=RandomSimilarity(queryNorm=false,coord=no):
{field=IB SPL-DZ(0.3)}, locale=shi, timezone=Canada/Mountain
   [junit4]   2> NOTE: Linux 3.19.0-51-generic amd64/Oracle Corporation 9-ea (64-bit)/cpus=12,threads=1,free=409015120,total=508952576
   [junit4]   2> NOTE: All tests run in this JVM: [TestNoMergeScheduler, TestNRTThreads,
Test2BSortedDocValuesOrds, TestPrefixCodedTerms, TestTryDelete, TestBytesRefHash, TestIndexWriterMaxDocs,
TestSortedSetSelector, TestSpanOrQuery, TestCodecHoldsOpenFiles, TestSearchWithThreads, TestTopDocsCollector,
TestControlledRealTimeReopenThread, TestIndexWriterMerging, TestMergeRateLimiter, TestDirectory,
TestConjunctions, TestApproximationSearchEquivalence, TestLiveFieldValues, TestSpanFirstQuery,
TestSpanContainQuery, TestOfflineSorter, TestIndexInput, TestSleepingLockWrapper, TestAttributeSource,
TestTwoPhaseCommitTool, TestIndexWriterDeleteByQuery, TestCharsRef, TestMathUtil, TestDocValuesScoring,
TestTimSorterWorstCase, TestDemo, TestFrequencyTrackingRingBuffer, Test2BNumericDocValues,
TestDocBoost, TestPointValues, TestSearchForDuplicates, TestBufferedIndexInput, TestPhrasePrefixQuery,
TestIntBlockPool, TestLucene50TermVectorsFormat, TestSpans, TestCharTermAttributeImpl, TestSimpleFSDirectory,
TestNIOFSDirectory, TestIndexWriterOnDiskFull, TestConcurrentMergeScheduler, TestBufferedChecksum,
TestFilterSpans, TestDirectoryReader, TestConsistentFieldNumbers, TestDuelingCodecsAtNight,
TestWildcard, TestForUtil, TestRollingUpdates, TestNumericTokenStream, TestNorms, TestNumericRangeQuery32,
TestSpanExplanationsOfNonMatches, TestArrayUtil, TestNot, TestLazyProxSkipping, TestParallelReaderEmptyIndex,
TestIndexCommit, TestIndexableField, TestCachingCollector, TestTermVectors, TestSearch, TestComplexExplanations,
TestSort, TestIndexWriter, TestIndexWriterReader, TestFSTs, TestNumericRangeQuery64, TestBytesStore,
TestPackedInts, TestShardSearching, TestMultiMMap, TestSearcherManager, TestDeletionPolicy,
TestBooleanOr, TestSloppyPhraseQuery, TestPersistentSnapshotDeletionPolicy, TestAtomicUpdate,
TestIndexWriterCommit, TestSearchAfter, TestHighCompressionMode, TestTopDocsMerge, TestLongPostings,
TestNRTReaderWithThreads, TestTieredMergePolicy, TestWeakIdentityMap, TestRegexpRandom2, TestParallelCompositeReader,
TestTransactions, TestMultiThreadTermVectors, TestMultiDocValues, TestSimpleSearchEquivalence,
TestDocValuesIndexing, TestSimilarityBase, TestMixedCodecs, TestFlex, TestUTF32ToUTF8, TestMergeSchedulerExternal,
TestDisjunctionMaxQuery, TestOmitTf, TestSameScoresWithThreads, TestCrashCausesCorruptIndex,
TestMultiTermConstantScore, TestSpanSearchEquivalence, TestFuzzyQuery, TestDoc, TestSimilarity2,
TestFieldMaskingSpanQuery, TestExternalCodecs, TestSimpleExplanationsOfNonMatches, TestRegexpQuery]
   [junit4] Completed [280/411 (4!)] on J2 in 0.03s, 7 tests, 1 error <<< FAILURES!

[...truncated 449 lines...]
BUILD FAILED
/home/jenkins/workspace/Lucene-Solr-trunk-Linux/build.xml:740: The following error occurred
while executing this line:
/home/jenkins/workspace/Lucene-Solr-trunk-Linux/build.xml:684: The following error occurred
while executing this line:
/home/jenkins/workspace/Lucene-Solr-trunk-Linux/build.xml:59: The following error occurred
while executing this line:
/home/jenkins/workspace/Lucene-Solr-trunk-Linux/lucene/build.xml:50: The following error occurred
while executing this line:
/home/jenkins/workspace/Lucene-Solr-trunk-Linux/lucene/common-build.xml:1457: The following
error occurred while executing this line:
/home/jenkins/workspace/Lucene-Solr-trunk-Linux/lucene/common-build.xml:1014: There were test
failures: 411 suites (1 ignored), 3423 tests, 4 errors, 60 ignored (56 assumptions) [seed:
9E79CC7DFB2A1B66]

Total time: 5 minutes 59 seconds
Build step 'Invoke Ant' marked build as failure
Archiving artifacts
[WARNINGS] Skipping publisher since build result is FAILURE
Recording test results
Email was triggered for: Failure - Any
Sending email for trigger: Failure - Any



Mime
View raw message