lucene-dev mailing list archives

Site index · List index
Message view « Date » · « Thread »
Top « Date » · « Thread »
From Policeman Jenkins Server <jenk...@thetaphi.de>
Subject [JENKINS-EA] Lucene-Solr-trunk-Linux (64bit/jdk-9-ea+107) - Build # 16080 - Still Failing!
Date Thu, 03 Mar 2016 00:41:38 GMT
Build: http://jenkins.thetaphi.de/job/Lucene-Solr-trunk-Linux/16080/
Java: 64bit/jdk-9-ea+107 -XX:+UseCompressedOops -XX:+UseConcMarkSweepGC

4 tests failed.
FAILED:  junit.framework.TestSuite.org.apache.lucene.codecs.perfield.TestPerFieldPostingsFormat

Error Message:
The test or suite printed 10214 bytes to stdout and stderr, even though the limit was set
to 8192 bytes. Increase the limit with @Limit, ignore it completely with @SuppressSysoutChecks
or run with -Dtests.verbose=true

Stack Trace:
java.lang.AssertionError: The test or suite printed 10214 bytes to stdout and stderr, even
though the limit was set to 8192 bytes. Increase the limit with @Limit, ignore it completely
with @SuppressSysoutChecks or run with -Dtests.verbose=true
	at __randomizedtesting.SeedInfo.seed([37B8DA690196F95D]:0)
	at org.apache.lucene.util.TestRuleLimitSysouts.afterIfSuccessful(TestRuleLimitSysouts.java:211)
	at com.carrotsearch.randomizedtesting.rules.TestRuleAdapter$1.afterIfSuccessful(TestRuleAdapter.java:36)
	at com.carrotsearch.randomizedtesting.rules.StatementAdapter.evaluate(StatementAdapter.java:37)
	at org.apache.lucene.util.TestRuleAssertionsRequired$1.evaluate(TestRuleAssertionsRequired.java:53)
	at org.apache.lucene.util.TestRuleMarkFailure$1.evaluate(TestRuleMarkFailure.java:47)
	at org.apache.lucene.util.TestRuleIgnoreAfterMaxFailures$1.evaluate(TestRuleIgnoreAfterMaxFailures.java:64)
	at org.apache.lucene.util.TestRuleIgnoreTestSuites$1.evaluate(TestRuleIgnoreTestSuites.java:54)
	at com.carrotsearch.randomizedtesting.rules.StatementAdapter.evaluate(StatementAdapter.java:36)
	at com.carrotsearch.randomizedtesting.ThreadLeakControl$StatementRunner.run(ThreadLeakControl.java:367)
	at java.lang.Thread.run(Thread.java:804)


FAILED:  org.apache.lucene.codecs.lucene50.TestBlockPostingsFormat3.test

Error Message:
7

Stack Trace:
java.lang.ArrayIndexOutOfBoundsException: 7
	at __randomizedtesting.SeedInfo.seed([37B8DA690196F95D:BFECE5B3AF6A94A5]:0)
	at org.apache.lucene.util.automaton.MinimizationOperations.minimize(MinimizationOperations.java:235)
	at org.apache.lucene.util.automaton.RegExp.toAutomatonInternal(RegExp.java:524)
	at org.apache.lucene.util.automaton.RegExp.toAutomaton(RegExp.java:495)
	at org.apache.lucene.util.automaton.RegExp.toAutomaton(RegExp.java:426)
	at org.apache.lucene.codecs.lucene50.TestBlockPostingsFormat3.assertTerms(TestBlockPostingsFormat3.java:186)
	at org.apache.lucene.codecs.lucene50.TestBlockPostingsFormat3.verify(TestBlockPostingsFormat3.java:153)
	at org.apache.lucene.codecs.lucene50.TestBlockPostingsFormat3.test(TestBlockPostingsFormat3.java:137)
	at sun.reflect.NativeMethodAccessorImpl.invoke0(Native Method)
	at sun.reflect.NativeMethodAccessorImpl.invoke(NativeMethodAccessorImpl.java:62)
	at sun.reflect.DelegatingMethodAccessorImpl.invoke(DelegatingMethodAccessorImpl.java:43)
	at java.lang.reflect.Method.invoke(Method.java:520)
	at com.carrotsearch.randomizedtesting.RandomizedRunner.invoke(RandomizedRunner.java:1764)
	at com.carrotsearch.randomizedtesting.RandomizedRunner$8.evaluate(RandomizedRunner.java:871)
	at com.carrotsearch.randomizedtesting.RandomizedRunner$9.evaluate(RandomizedRunner.java:907)
	at com.carrotsearch.randomizedtesting.RandomizedRunner$10.evaluate(RandomizedRunner.java:921)
	at org.apache.lucene.util.TestRuleSetupTeardownChained$1.evaluate(TestRuleSetupTeardownChained.java:49)
	at org.apache.lucene.util.AbstractBeforeAfterRule$1.evaluate(AbstractBeforeAfterRule.java:45)
	at org.apache.lucene.util.TestRuleThreadAndTestName$1.evaluate(TestRuleThreadAndTestName.java:48)
	at org.apache.lucene.util.TestRuleIgnoreAfterMaxFailures$1.evaluate(TestRuleIgnoreAfterMaxFailures.java:64)
	at org.apache.lucene.util.TestRuleMarkFailure$1.evaluate(TestRuleMarkFailure.java:47)
	at com.carrotsearch.randomizedtesting.rules.StatementAdapter.evaluate(StatementAdapter.java:36)
	at com.carrotsearch.randomizedtesting.ThreadLeakControl$StatementRunner.run(ThreadLeakControl.java:367)
	at com.carrotsearch.randomizedtesting.ThreadLeakControl.forkTimeoutingTask(ThreadLeakControl.java:809)
	at com.carrotsearch.randomizedtesting.ThreadLeakControl$3.evaluate(ThreadLeakControl.java:460)
	at com.carrotsearch.randomizedtesting.RandomizedRunner.runSingleTest(RandomizedRunner.java:880)
	at com.carrotsearch.randomizedtesting.RandomizedRunner$5.evaluate(RandomizedRunner.java:781)
	at com.carrotsearch.randomizedtesting.RandomizedRunner$6.evaluate(RandomizedRunner.java:816)
	at com.carrotsearch.randomizedtesting.RandomizedRunner$7.evaluate(RandomizedRunner.java:827)
	at org.apache.lucene.util.AbstractBeforeAfterRule$1.evaluate(AbstractBeforeAfterRule.java:45)
	at com.carrotsearch.randomizedtesting.rules.StatementAdapter.evaluate(StatementAdapter.java:36)
	at org.apache.lucene.util.TestRuleStoreClassName$1.evaluate(TestRuleStoreClassName.java:41)
	at com.carrotsearch.randomizedtesting.rules.NoShadowingOrOverridesOnMethodsRule$1.evaluate(NoShadowingOrOverridesOnMethodsRule.java:40)
	at com.carrotsearch.randomizedtesting.rules.NoShadowingOrOverridesOnMethodsRule$1.evaluate(NoShadowingOrOverridesOnMethodsRule.java:40)
	at com.carrotsearch.randomizedtesting.rules.StatementAdapter.evaluate(StatementAdapter.java:36)
	at com.carrotsearch.randomizedtesting.rules.StatementAdapter.evaluate(StatementAdapter.java:36)
	at com.carrotsearch.randomizedtesting.rules.StatementAdapter.evaluate(StatementAdapter.java:36)
	at org.apache.lucene.util.TestRuleAssertionsRequired$1.evaluate(TestRuleAssertionsRequired.java:53)
	at org.apache.lucene.util.TestRuleMarkFailure$1.evaluate(TestRuleMarkFailure.java:47)
	at org.apache.lucene.util.TestRuleIgnoreAfterMaxFailures$1.evaluate(TestRuleIgnoreAfterMaxFailures.java:64)
	at org.apache.lucene.util.TestRuleIgnoreTestSuites$1.evaluate(TestRuleIgnoreTestSuites.java:54)
	at com.carrotsearch.randomizedtesting.rules.StatementAdapter.evaluate(StatementAdapter.java:36)
	at com.carrotsearch.randomizedtesting.ThreadLeakControl$StatementRunner.run(ThreadLeakControl.java:367)
	at java.lang.Thread.run(Thread.java:804)


FAILED:  org.apache.lucene.codecs.perfield.TestPerFieldPostingsFormat.testDocsAndFreqsAndPositionsAndOffsetsAndPayloads

Error Message:
Captured an uncaught exception in thread: Thread[id=222, name=Thread-144, state=RUNNABLE,
group=TGRP-TestPerFieldPostingsFormat]

Stack Trace:
com.carrotsearch.randomizedtesting.UncaughtExceptionError: Captured an uncaught exception
in thread: Thread[id=222, name=Thread-144, state=RUNNABLE, group=TGRP-TestPerFieldPostingsFormat]
Caused by: java.lang.RuntimeException: java.lang.IllegalArgumentException: source=3 is out
of bounds (maxState is 2)
	at __randomizedtesting.SeedInfo.seed([37B8DA690196F95D]:0)
	at org.apache.lucene.index.RandomPostingsTester$TestThread.run(RandomPostingsTester.java:1006)
Caused by: java.lang.IllegalArgumentException: source=3 is out of bounds (maxState is 2)
	at org.apache.lucene.util.automaton.Automaton.addTransition(Automaton.java:165)
	at org.apache.lucene.util.automaton.MinimizationOperations.minimize(MinimizationOperations.java:245)
	at org.apache.lucene.util.automaton.RegExp.toAutomatonInternal(RegExp.java:537)
	at org.apache.lucene.util.automaton.RegExp.findLeaves(RegExp.java:617)
	at org.apache.lucene.util.automaton.RegExp.toAutomatonInternal(RegExp.java:519)
	at org.apache.lucene.util.automaton.RegExp.findLeaves(RegExp.java:617)
	at org.apache.lucene.util.automaton.RegExp.toAutomatonInternal(RegExp.java:512)
	at org.apache.lucene.util.automaton.RegExp.toAutomaton(RegExp.java:495)
	at org.apache.lucene.util.automaton.RegExp.toAutomaton(RegExp.java:426)
	at org.apache.lucene.util.automaton.AutomatonTestUtil.randomSingleAutomaton(AutomatonTestUtil.java:262)
	at org.apache.lucene.util.automaton.AutomatonTestUtil.randomAutomaton(AutomatonTestUtil.java:276)
	at org.apache.lucene.index.RandomPostingsTester.testTermsOneThread(RandomPostingsTester.java:1167)
	at org.apache.lucene.index.RandomPostingsTester.access$000(RandomPostingsTester.java:61)
	at org.apache.lucene.index.RandomPostingsTester$TestThread.run(RandomPostingsTester.java:1004)


FAILED:  org.apache.lucene.search.TestRegexpRandom2.testRegexps

Error Message:
6

Stack Trace:
java.lang.ArrayIndexOutOfBoundsException: 6
	at __randomizedtesting.SeedInfo.seed([37B8DA690196F95D:D6E49B78DF3CAED5]:0)
	at org.apache.lucene.util.automaton.MinimizationOperations.minimize(MinimizationOperations.java:235)
	at org.apache.lucene.util.automaton.RegExp.toAutomatonInternal(RegExp.java:524)
	at org.apache.lucene.util.automaton.RegExp.findLeaves(RegExp.java:617)
	at org.apache.lucene.util.automaton.RegExp.toAutomatonInternal(RegExp.java:512)
	at org.apache.lucene.util.automaton.RegExp.toAutomaton(RegExp.java:495)
	at org.apache.lucene.util.automaton.RegExp.toAutomaton(RegExp.java:466)
	at org.apache.lucene.search.RegexpQuery.<init>(RegexpQuery.java:109)
	at org.apache.lucene.search.RegexpQuery.<init>(RegexpQuery.java:79)
	at org.apache.lucene.search.TestRegexpRandom2.assertSame(TestRegexpRandom2.java:168)
	at org.apache.lucene.search.TestRegexpRandom2.testRegexps(TestRegexpRandom2.java:160)
	at sun.reflect.NativeMethodAccessorImpl.invoke0(Native Method)
	at sun.reflect.NativeMethodAccessorImpl.invoke(NativeMethodAccessorImpl.java:62)
	at sun.reflect.DelegatingMethodAccessorImpl.invoke(DelegatingMethodAccessorImpl.java:43)
	at java.lang.reflect.Method.invoke(Method.java:520)
	at com.carrotsearch.randomizedtesting.RandomizedRunner.invoke(RandomizedRunner.java:1764)
	at com.carrotsearch.randomizedtesting.RandomizedRunner$8.evaluate(RandomizedRunner.java:871)
	at com.carrotsearch.randomizedtesting.RandomizedRunner$9.evaluate(RandomizedRunner.java:907)
	at com.carrotsearch.randomizedtesting.RandomizedRunner$10.evaluate(RandomizedRunner.java:921)
	at org.apache.lucene.util.TestRuleSetupTeardownChained$1.evaluate(TestRuleSetupTeardownChained.java:49)
	at org.apache.lucene.util.AbstractBeforeAfterRule$1.evaluate(AbstractBeforeAfterRule.java:45)
	at org.apache.lucene.util.TestRuleThreadAndTestName$1.evaluate(TestRuleThreadAndTestName.java:48)
	at org.apache.lucene.util.TestRuleIgnoreAfterMaxFailures$1.evaluate(TestRuleIgnoreAfterMaxFailures.java:64)
	at org.apache.lucene.util.TestRuleMarkFailure$1.evaluate(TestRuleMarkFailure.java:47)
	at com.carrotsearch.randomizedtesting.rules.StatementAdapter.evaluate(StatementAdapter.java:36)
	at com.carrotsearch.randomizedtesting.ThreadLeakControl$StatementRunner.run(ThreadLeakControl.java:367)
	at com.carrotsearch.randomizedtesting.ThreadLeakControl.forkTimeoutingTask(ThreadLeakControl.java:809)
	at com.carrotsearch.randomizedtesting.ThreadLeakControl$3.evaluate(ThreadLeakControl.java:460)
	at com.carrotsearch.randomizedtesting.RandomizedRunner.runSingleTest(RandomizedRunner.java:880)
	at com.carrotsearch.randomizedtesting.RandomizedRunner$5.evaluate(RandomizedRunner.java:781)
	at com.carrotsearch.randomizedtesting.RandomizedRunner$6.evaluate(RandomizedRunner.java:816)
	at com.carrotsearch.randomizedtesting.RandomizedRunner$7.evaluate(RandomizedRunner.java:827)
	at org.apache.lucene.util.AbstractBeforeAfterRule$1.evaluate(AbstractBeforeAfterRule.java:45)
	at com.carrotsearch.randomizedtesting.rules.StatementAdapter.evaluate(StatementAdapter.java:36)
	at org.apache.lucene.util.TestRuleStoreClassName$1.evaluate(TestRuleStoreClassName.java:41)
	at com.carrotsearch.randomizedtesting.rules.NoShadowingOrOverridesOnMethodsRule$1.evaluate(NoShadowingOrOverridesOnMethodsRule.java:40)
	at com.carrotsearch.randomizedtesting.rules.NoShadowingOrOverridesOnMethodsRule$1.evaluate(NoShadowingOrOverridesOnMethodsRule.java:40)
	at com.carrotsearch.randomizedtesting.rules.StatementAdapter.evaluate(StatementAdapter.java:36)
	at com.carrotsearch.randomizedtesting.rules.StatementAdapter.evaluate(StatementAdapter.java:36)
	at com.carrotsearch.randomizedtesting.rules.StatementAdapter.evaluate(StatementAdapter.java:36)
	at org.apache.lucene.util.TestRuleAssertionsRequired$1.evaluate(TestRuleAssertionsRequired.java:53)
	at org.apache.lucene.util.TestRuleMarkFailure$1.evaluate(TestRuleMarkFailure.java:47)
	at org.apache.lucene.util.TestRuleIgnoreAfterMaxFailures$1.evaluate(TestRuleIgnoreAfterMaxFailures.java:64)
	at org.apache.lucene.util.TestRuleIgnoreTestSuites$1.evaluate(TestRuleIgnoreTestSuites.java:54)
	at com.carrotsearch.randomizedtesting.rules.StatementAdapter.evaluate(StatementAdapter.java:36)
	at com.carrotsearch.randomizedtesting.ThreadLeakControl$StatementRunner.run(ThreadLeakControl.java:367)
	at java.lang.Thread.run(Thread.java:804)




Build Log:
[...truncated 522 lines...]
   [junit4] Suite: org.apache.lucene.codecs.perfield.TestPerFieldPostingsFormat
   [junit4]   2> mars 02, 2016 8:36:48 PM com.carrotsearch.randomizedtesting.RandomizedRunner$QueueUncaughtExceptionsHandler
uncaughtException
   [junit4]   2> WARNING: Uncaught exception in thread: Thread[Thread-144,5,TGRP-TestPerFieldPostingsFormat]
   [junit4]   2> java.lang.RuntimeException: java.lang.IllegalArgumentException: source=3
is out of bounds (maxState is 2)
   [junit4]   2> 	at __randomizedtesting.SeedInfo.seed([37B8DA690196F95D]:0)
   [junit4]   2> 	at org.apache.lucene.index.RandomPostingsTester$TestThread.run(RandomPostingsTester.java:1006)
   [junit4]   2> Caused by: java.lang.IllegalArgumentException: source=3 is out of bounds
(maxState is 2)
   [junit4]   2> 	at org.apache.lucene.util.automaton.Automaton.addTransition(Automaton.java:165)
   [junit4]   2> 	at org.apache.lucene.util.automaton.MinimizationOperations.minimize(MinimizationOperations.java:245)
   [junit4]   2> 	at org.apache.lucene.util.automaton.RegExp.toAutomatonInternal(RegExp.java:537)
   [junit4]   2> 	at org.apache.lucene.util.automaton.RegExp.findLeaves(RegExp.java:617)
   [junit4]   2> 	at org.apache.lucene.util.automaton.RegExp.toAutomatonInternal(RegExp.java:519)
   [junit4]   2> 	at org.apache.lucene.util.automaton.RegExp.findLeaves(RegExp.java:617)
   [junit4]   2> 	at org.apache.lucene.util.automaton.RegExp.toAutomatonInternal(RegExp.java:512)
   [junit4]   2> 	at org.apache.lucene.util.automaton.RegExp.toAutomaton(RegExp.java:495)
   [junit4]   2> 	at org.apache.lucene.util.automaton.RegExp.toAutomaton(RegExp.java:426)
   [junit4]   2> 	at org.apache.lucene.util.automaton.AutomatonTestUtil.randomSingleAutomaton(AutomatonTestUtil.java:262)
   [junit4]   2> 	at org.apache.lucene.util.automaton.AutomatonTestUtil.randomAutomaton(AutomatonTestUtil.java:276)
   [junit4]   2> 	at org.apache.lucene.index.RandomPostingsTester.testTermsOneThread(RandomPostingsTester.java:1167)
   [junit4]   2> 	at org.apache.lucene.index.RandomPostingsTester.access$000(RandomPostingsTester.java:61)
   [junit4]   2> 	at org.apache.lucene.index.RandomPostingsTester$TestThread.run(RandomPostingsTester.java:1004)
   [junit4]   2> 
   [junit4]   2> mars 02, 2016 8:36:48 PM com.carrotsearch.randomizedtesting.RandomizedRunner$QueueUncaughtExceptionsHandler
uncaughtException
   [junit4]   2> WARNING: Uncaught exception in thread: Thread[Thread-145,5,TGRP-TestPerFieldPostingsFormat]
   [junit4]   2> java.lang.RuntimeException: java.lang.ArrayIndexOutOfBoundsException:
10
   [junit4]   2> 	at __randomizedtesting.SeedInfo.seed([37B8DA690196F95D]:0)
   [junit4]   2> 	at org.apache.lucene.index.RandomPostingsTester$TestThread.run(RandomPostingsTester.java:1006)
   [junit4]   2> Caused by: java.lang.ArrayIndexOutOfBoundsException: 10
   [junit4]   2> 	at org.apache.lucene.util.automaton.MinimizationOperations.minimize(MinimizationOperations.java:235)
   [junit4]   2> 	at org.apache.lucene.util.automaton.RegExp.toAutomatonInternal(RegExp.java:524)
   [junit4]   2> 	at org.apache.lucene.util.automaton.RegExp.toAutomaton(RegExp.java:495)
   [junit4]   2> 	at org.apache.lucene.util.automaton.RegExp.toAutomaton(RegExp.java:426)
   [junit4]   2> 	at org.apache.lucene.util.automaton.AutomatonTestUtil.randomSingleAutomaton(AutomatonTestUtil.java:262)
   [junit4]   2> 	at org.apache.lucene.util.automaton.AutomatonTestUtil.randomAutomaton(AutomatonTestUtil.java:277)
   [junit4]   2> 	at org.apache.lucene.index.RandomPostingsTester.testTermsOneThread(RandomPostingsTester.java:1167)
   [junit4]   2> 	at org.apache.lucene.index.RandomPostingsTester.access$000(RandomPostingsTester.java:61)
   [junit4]   2> 	at org.apache.lucene.index.RandomPostingsTester$TestThread.run(RandomPostingsTester.java:1004)
   [junit4]   2> 
   [junit4]   2> mars 02, 2016 8:36:48 PM com.carrotsearch.randomizedtesting.RandomizedRunner$QueueUncaughtExceptionsHandler
uncaughtException
   [junit4]   2> WARNING: Uncaught exception in thread: Thread[Thread-142,5,TGRP-TestPerFieldPostingsFormat]
   [junit4]   2> java.lang.RuntimeException: java.lang.IllegalArgumentException: source=3
is out of bounds (maxState is 2)
   [junit4]   2> 	at __randomizedtesting.SeedInfo.seed([37B8DA690196F95D]:0)
   [junit4]   2> 	at org.apache.lucene.index.RandomPostingsTester$TestThread.run(RandomPostingsTester.java:1006)
   [junit4]   2> Caused by: java.lang.IllegalArgumentException: source=3 is out of bounds
(maxState is 2)
   [junit4]   2> 	at org.apache.lucene.util.automaton.Automaton.addTransition(Automaton.java:165)
   [junit4]   2> 	at org.apache.lucene.util.automaton.MinimizationOperations.minimize(MinimizationOperations.java:245)
   [junit4]   2> 	at org.apache.lucene.util.automaton.RegExp.toAutomatonInternal(RegExp.java:537)
   [junit4]   2> 	at org.apache.lucene.util.automaton.RegExp.findLeaves(RegExp.java:617)
   [junit4]   2> 	at org.apache.lucene.util.automaton.RegExp.findLeaves(RegExp.java:612)
   [junit4]   2> 	at org.apache.lucene.util.automaton.RegExp.toAutomatonInternal(RegExp.java:521)
   [junit4]   2> 	at org.apache.lucene.util.automaton.RegExp.toAutomaton(RegExp.java:495)
   [junit4]   2> 	at org.apache.lucene.util.automaton.RegExp.toAutomaton(RegExp.java:426)
   [junit4]   2> 	at org.apache.lucene.util.automaton.AutomatonTestUtil.randomSingleAutomaton(AutomatonTestUtil.java:262)
   [junit4]   2> 	at org.apache.lucene.util.automaton.AutomatonTestUtil.randomAutomaton(AutomatonTestUtil.java:276)
   [junit4]   2> 	at org.apache.lucene.index.RandomPostingsTester.testTermsOneThread(RandomPostingsTester.java:1167)
   [junit4]   2> 	at org.apache.lucene.index.RandomPostingsTester.access$000(RandomPostingsTester.java:61)
   [junit4]   2> 	at org.apache.lucene.index.RandomPostingsTester$TestThread.run(RandomPostingsTester.java:1004)
   [junit4]   2> 
   [junit4]   2> NOTE: reproduce with: ant test  -Dtestcase=TestPerFieldPostingsFormat
-Dtests.method=testDocsAndFreqsAndPositionsAndOffsetsAndPayloads -Dtests.seed=37B8DA690196F95D
-Dtests.multiplier=3 -Dtests.slow=true -Dtests.locale=fr-MF -Dtests.timezone=America/Dominica
-Dtests.asserts=true -Dtests.file.encoding=ISO-8859-1
   [junit4] ERROR   1.73s J0 | TestPerFieldPostingsFormat.testDocsAndFreqsAndPositionsAndOffsetsAndPayloads
<<<
   [junit4]    > Throwable #1: com.carrotsearch.randomizedtesting.UncaughtExceptionError:
Captured an uncaught exception in thread: Thread[id=222, name=Thread-144, state=RUNNABLE,
group=TGRP-TestPerFieldPostingsFormat]
   [junit4]    > Caused by: java.lang.RuntimeException: java.lang.IllegalArgumentException:
source=3 is out of bounds (maxState is 2)
   [junit4]    > 	at __randomizedtesting.SeedInfo.seed([37B8DA690196F95D]:0)
   [junit4]    > 	at org.apache.lucene.index.RandomPostingsTester$TestThread.run(RandomPostingsTester.java:1006)
   [junit4]    > Caused by: java.lang.IllegalArgumentException: source=3 is out of bounds
(maxState is 2)
   [junit4]    > 	at org.apache.lucene.util.automaton.Automaton.addTransition(Automaton.java:165)
   [junit4]    > 	at org.apache.lucene.util.automaton.MinimizationOperations.minimize(MinimizationOperations.java:245)
   [junit4]    > 	at org.apache.lucene.util.automaton.RegExp.toAutomatonInternal(RegExp.java:537)
   [junit4]    > 	at org.apache.lucene.util.automaton.RegExp.findLeaves(RegExp.java:617)
   [junit4]    > 	at org.apache.lucene.util.automaton.RegExp.toAutomatonInternal(RegExp.java:519)
   [junit4]    > 	at org.apache.lucene.util.automaton.RegExp.findLeaves(RegExp.java:617)
   [junit4]    > 	at org.apache.lucene.util.automaton.RegExp.toAutomatonInternal(RegExp.java:512)
   [junit4]    > 	at org.apache.lucene.util.automaton.RegExp.toAutomaton(RegExp.java:495)
   [junit4]    > 	at org.apache.lucene.util.automaton.RegExp.toAutomaton(RegExp.java:426)
   [junit4]    > 	at org.apache.lucene.util.automaton.AutomatonTestUtil.randomSingleAutomaton(AutomatonTestUtil.java:262)
   [junit4]    > 	at org.apache.lucene.util.automaton.AutomatonTestUtil.randomAutomaton(AutomatonTestUtil.java:276)
   [junit4]    > 	at org.apache.lucene.index.RandomPostingsTester.testTermsOneThread(RandomPostingsTester.java:1167)
   [junit4]    > 	at org.apache.lucene.index.RandomPostingsTester.access$000(RandomPostingsTester.java:61)
   [junit4]    > 	at org.apache.lucene.index.RandomPostingsTester$TestThread.run(RandomPostingsTester.java:1004)Throwable
#2: com.carrotsearch.randomizedtesting.UncaughtExceptionError: Captured an uncaught exception
in thread: Thread[id=220, name=Thread-142, state=RUNNABLE, group=TGRP-TestPerFieldPostingsFormat]
   [junit4]    > Caused by: java.lang.RuntimeException: java.lang.IllegalArgumentException:
source=3 is out of bounds (maxState is 2)
   [junit4]    > 	at __randomizedtesting.SeedInfo.seed([37B8DA690196F95D]:0)
   [junit4]    > 	at org.apache.lucene.index.RandomPostingsTester$TestThread.run(RandomPostingsTester.java:1006)
   [junit4]    > Caused by: java.lang.IllegalArgumentException: source=3 is out of bounds
(maxState is 2)
   [junit4]    > 	at org.apache.lucene.util.automaton.Automaton.addTransition(Automaton.java:165)
   [junit4]    > 	at org.apache.lucene.util.automaton.MinimizationOperations.minimize(MinimizationOperations.java:245)
   [junit4]    > 	at org.apache.lucene.util.automaton.RegExp.toAutomatonInternal(RegExp.java:537)
   [junit4]    > 	at org.apache.lucene.util.automaton.RegExp.findLeaves(RegExp.java:617)
   [junit4]    > 	at org.apache.lucene.util.automaton.RegExp.findLeaves(RegExp.java:612)
   [junit4]    > 	at org.apache.lucene.util.automaton.RegExp.toAutomatonInternal(RegExp.java:521)
   [junit4]    > 	at org.apache.lucene.util.automaton.RegExp.toAutomaton(RegExp.java:495)
   [junit4]    > 	at org.apache.lucene.util.automaton.RegExp.toAutomaton(RegExp.java:426)
   [junit4]    > 	at org.apache.lucene.util.automaton.AutomatonTestUtil.randomSingleAutomaton(AutomatonTestUtil.java:262)
   [junit4]    > 	at org.apache.lucene.util.automaton.AutomatonTestUtil.randomAutomaton(AutomatonTestUtil.java:276)
   [junit4]    > 	at org.apache.lucene.index.RandomPostingsTester.testTermsOneThread(RandomPostingsTester.java:1167)
   [junit4]    > 	at org.apache.lucene.index.RandomPostingsTester.access$000(RandomPostingsTester.java:61)
   [junit4]    > 	at org.apache.lucene.index.RandomPostingsTester$TestThread.run(RandomPostingsTester.java:1004)Throwable
#3: com.carrotsearch.randomizedtesting.UncaughtExceptionError: Captured an uncaught exception
in thread: Thread[id=223, name=Thread-145, state=RUNNABLE, group=TGRP-TestPerFieldPostingsFormat]
   [junit4]    > Caused by: java.lang.RuntimeException: java.lang.ArrayIndexOutOfBoundsException:
10
   [junit4]    > 	at __randomizedtesting.SeedInfo.seed([37B8DA690196F95D]:0)
   [junit4]    > 	at org.apache.lucene.index.RandomPostingsTester$TestThread.run(RandomPostingsTester.java:1006)
   [junit4]    > Caused by: java.lang.ArrayIndexOutOfBoundsException: 10
   [junit4]    > 	at org.apache.lucene.util.automaton.MinimizationOperations.minimize(MinimizationOperations.java:235)
   [junit4]    > 	at org.apache.lucene.util.automaton.RegExp.toAutomatonInternal(RegExp.java:524)
   [junit4]    > 	at org.apache.lucene.util.automaton.RegExp.toAutomaton(RegExp.java:495)
   [junit4]    > 	at org.apache.lucene.util.automaton.RegExp.toAutomaton(RegExp.java:426)
   [junit4]    > 	at org.apache.lucene.util.automaton.AutomatonTestUtil.randomSingleAutomaton(AutomatonTestUtil.java:262)
   [junit4]    > 	at org.apache.lucene.util.automaton.AutomatonTestUtil.randomAutomaton(AutomatonTestUtil.java:277)
   [junit4]    > 	at org.apache.lucene.index.RandomPostingsTester.testTermsOneThread(RandomPostingsTester.java:1167)
   [junit4]    > 	at org.apache.lucene.index.RandomPostingsTester.access$000(RandomPostingsTester.java:61)
   [junit4]    > 	at org.apache.lucene.index.RandomPostingsTester$TestThread.run(RandomPostingsTester.java:1004)
   [junit4] IGNOR/A 0.00s J0 | TestPerFieldPostingsFormat.testPostingsEnumReuse
   [junit4]    > Assumption #1: The MockRandom PF randomizes content on the fly, so we
can't check it
   [junit4] IGNOR/A 0.00s J0 | TestPerFieldPostingsFormat.testMergeStability
   [junit4]    > Assumption #1: The MockRandom PF randomizes content on the fly, so we
can't check it
   [junit4]   2> NOTE: test params are: codec=Asserting(Lucene60): {}, docValues:{}, maxPointsInLeafNode=938,
maxMBSortInHeap=4.112648121746213, sim=RandomSimilarity(queryNorm=true,coord=crazy): {f_DOCS_AND_FREQS=DFR
G1, field=IB LL-L2, f_DOCS_AND_FREQS_AND_POSITIONS_AND_OFFSETS=DFR GB1, f_DOCS_AND_FREQS_AND_POSITIONS=DFR
I(F)LZ(0.3), titleTokenized=DFR I(ne)Z(0.3), body=IB SPL-D2, f_DOCS=DFR I(n)L2}, locale=fr-MF,
timezone=America/Dominica
   [junit4]   2> NOTE: Linux 3.19.0-51-generic amd64/Oracle Corporation 9-ea (64-bit)/cpus=12,threads=1,free=348448136,total=508887040
   [junit4]   2> NOTE: All tests run in this JVM: [TestUniqueTermCount, TestMinShouldMatch2,
TestOperations, TestQueryBuilder, TestDoc, TestSpanNearQuery, TestLockFactory, TestFilterDirectory,
TestBinaryDocument, TestIndexWriterLockRelease, TestBM25Similarity, TestThreadedForceMerge,
TestMinimize, TestSubScorerFreqs, TestTermRangeQuery, TestDocValuesRewriteMethod, TestSimilarity2,
TestSortedSetSortField, TestMultiTermQueryRewrites, TestMixedDocValuesUpdates, TestSortRandom,
TestInfoStream, TestDocCount, TestStressDeletes, TestNoDeletionPolicy, Test2BTerms, TestIsCurrent,
TestCheckIndex, TestSimpleAttributeImpl, TestTermsEnum, TestPerFieldPostingsFormat]
   [junit4]   2> NOTE: reproduce with: ant test  -Dtestcase=TestPerFieldPostingsFormat
-Dtests.seed=37B8DA690196F95D -Dtests.multiplier=3 -Dtests.slow=true -Dtests.locale=fr-MF
-Dtests.timezone=America/Dominica -Dtests.asserts=true -Dtests.file.encoding=ISO-8859-1
   [junit4] ERROR   0.00s J0 | TestPerFieldPostingsFormat (suite) <<<
   [junit4]    > Throwable #1: java.lang.AssertionError: The test or suite printed 10214
bytes to stdout and stderr, even though the limit was set to 8192 bytes. Increase the limit
with @Limit, ignore it completely with @SuppressSysoutChecks or run with -Dtests.verbose=true
   [junit4]    > 	at __randomizedtesting.SeedInfo.seed([37B8DA690196F95D]:0)
   [junit4]    > 	at java.lang.Thread.run(Thread.java:804)
   [junit4] Completed [96/411 (1!)] on J0 in 11.89s, 24 tests, 1 failure, 1 error, 2 skipped
<<< FAILURES!

[...truncated 338 lines...]
   [junit4] Suite: org.apache.lucene.codecs.lucene50.TestBlockPostingsFormat3
   [junit4]   2> NOTE: reproduce with: ant test  -Dtestcase=TestBlockPostingsFormat3 -Dtests.method=test
-Dtests.seed=37B8DA690196F95D -Dtests.multiplier=3 -Dtests.slow=true -Dtests.locale=fa -Dtests.timezone=Pacific/Enderbury
-Dtests.asserts=true -Dtests.file.encoding=ISO-8859-1
   [junit4] ERROR   0.19s J1 | TestBlockPostingsFormat3.test <<<
   [junit4]    > Throwable #1: java.lang.ArrayIndexOutOfBoundsException: 7
   [junit4]    > 	at __randomizedtesting.SeedInfo.seed([37B8DA690196F95D:BFECE5B3AF6A94A5]:0)
   [junit4]    > 	at org.apache.lucene.util.automaton.MinimizationOperations.minimize(MinimizationOperations.java:235)
   [junit4]    > 	at org.apache.lucene.util.automaton.RegExp.toAutomatonInternal(RegExp.java:524)
   [junit4]    > 	at org.apache.lucene.util.automaton.RegExp.toAutomaton(RegExp.java:495)
   [junit4]    > 	at org.apache.lucene.util.automaton.RegExp.toAutomaton(RegExp.java:426)
   [junit4]    > 	at org.apache.lucene.codecs.lucene50.TestBlockPostingsFormat3.assertTerms(TestBlockPostingsFormat3.java:186)
   [junit4]    > 	at org.apache.lucene.codecs.lucene50.TestBlockPostingsFormat3.verify(TestBlockPostingsFormat3.java:153)
   [junit4]    > 	at org.apache.lucene.codecs.lucene50.TestBlockPostingsFormat3.test(TestBlockPostingsFormat3.java:137)
   [junit4]    > 	at java.lang.Thread.run(Thread.java:804)
   [junit4]   2> NOTE: test params are: codec=Asserting(Lucene60): {}, docValues:{}, maxPointsInLeafNode=1653,
maxMBSortInHeap=4.810319214283476, sim=RandomSimilarity(queryNorm=true,coord=crazy): {field1docs=IB
LL-D1, field5payloadsFixed=DFR I(n)B1, field6payloadsVariable=DFR I(n)3(800.0), field2freqs=DFR
I(n)B1, field4offsets=DFR I(F)2, field8payloadsVariableOffsets=LM Jelinek-Mercer(0.700000),
field7payloadsFixedOffsets=DFR I(ne)B2, field3positions=DFR I(n)B3(800.0)}, locale=fa, timezone=Pacific/Enderbury
   [junit4]   2> NOTE: Linux 3.19.0-51-generic amd64/Oracle Corporation 9-ea (64-bit)/cpus=12,threads=1,free=379689448,total=508952576
   [junit4]   2> NOTE: All tests run in this JVM: [TestBooleanQuery, TestPrefixRandom,
TestFSTs, TestRecyclingIntBlockAllocator, TestDocumentsWriterDeleteQueue, TestFileSwitchDirectory,
TestNRTCachingDirectory, TestMmapDirectory, Test2BPostings, TestLogMergePolicy, TestSpanSearchEquivalence,
TestBoolean2, TestRegExp, TestSpanCollection, TestSpanExplanations, TestPositiveScoresOnlyCollector,
TestSpansEnum, TestFieldMaskingSpanQuery, TestSameScoresWithThreads, TestParallelLeafReader,
TestSimilarityBase, TestOmitPositions, TestDocumentsWriterStallControl, TestSwappedIndexFiles,
TestReaderWrapperDVTypeCheck, Test2BSortedDocValuesFixedSorted, TestOmitTf, TestByteSlices,
TestGrowableByteArrayDataOutput, TestAutomatonQueryUnicode, TestDocument, TestFieldCacheRewriteMethod,
TestIndexWriterFromReader, TestStressIndexing, TestLRUQueryCache, TestSnapshotDeletionPolicy,
TestTermdocPerf, TestRollback, TestRateLimiter, TestOmitNorms, TestVersion, TestSparseFixedBitDocIdSet,
TestPayloads, TestPositionIncrement, TestNRTReaderWithThreads, TestFieldsReader, TestPackedInts,
TestLongBitSet, TestBytesRefArray, TestByteArrayDataInput, TestAddIndexes, LimitedFiniteStringsIteratorTest,
TestQueryRescorer, TestSimilarity, TestStressAdvance, TestDirectMonotonic, TestSimpleExplanationsOfNonMatches,
TestBlockPostingsFormat3]
   [junit4] Completed [201/411 (2!)] on J1 in 0.20s, 1 test, 1 error <<< FAILURES!

[...truncated 127 lines...]
   [junit4] Suite: org.apache.lucene.search.TestRegexpRandom2
   [junit4]   2> NOTE: reproduce with: ant test  -Dtestcase=TestRegexpRandom2 -Dtests.method=testRegexps
-Dtests.seed=37B8DA690196F95D -Dtests.multiplier=3 -Dtests.slow=true -Dtests.locale=nus-SD
-Dtests.timezone=Brazil/East -Dtests.asserts=true -Dtests.file.encoding=ISO-8859-1
   [junit4] ERROR   1.18s J2 | TestRegexpRandom2.testRegexps <<<
   [junit4]    > Throwable #1: java.lang.ArrayIndexOutOfBoundsException: 6
   [junit4]    > 	at __randomizedtesting.SeedInfo.seed([37B8DA690196F95D:D6E49B78DF3CAED5]:0)
   [junit4]    > 	at org.apache.lucene.util.automaton.MinimizationOperations.minimize(MinimizationOperations.java:235)
   [junit4]    > 	at org.apache.lucene.util.automaton.RegExp.toAutomatonInternal(RegExp.java:524)
   [junit4]    > 	at org.apache.lucene.util.automaton.RegExp.findLeaves(RegExp.java:617)
   [junit4]    > 	at org.apache.lucene.util.automaton.RegExp.toAutomatonInternal(RegExp.java:512)
   [junit4]    > 	at org.apache.lucene.util.automaton.RegExp.toAutomaton(RegExp.java:495)
   [junit4]    > 	at org.apache.lucene.util.automaton.RegExp.toAutomaton(RegExp.java:466)
   [junit4]    > 	at org.apache.lucene.search.RegexpQuery.<init>(RegexpQuery.java:109)
   [junit4]    > 	at org.apache.lucene.search.RegexpQuery.<init>(RegexpQuery.java:79)
   [junit4]    > 	at org.apache.lucene.search.TestRegexpRandom2.assertSame(TestRegexpRandom2.java:168)
   [junit4]    > 	at org.apache.lucene.search.TestRegexpRandom2.testRegexps(TestRegexpRandom2.java:160)
   [junit4]    > 	at java.lang.Thread.run(Thread.java:804)
   [junit4]   2> NOTE: test params are: codec=Asserting(Lucene60): {=PostingsFormat(name=MockRandom)},
docValues:{=DocValuesFormat(name=Lucene54)}, maxPointsInLeafNode=1823, maxMBSortInHeap=6.874155591620384,
sim=RandomSimilarity(queryNorm=false,coord=yes): {}, locale=nus-SD, timezone=Brazil/East
   [junit4]   2> NOTE: Linux 3.19.0-51-generic amd64/Oracle Corporation 9-ea (64-bit)/cpus=12,threads=1,free=284280432,total=518979584
   [junit4]   2> NOTE: All tests run in this JVM: [TestDemoParallelLeafReader, TestTwoPhaseCommitTool,
TestSparseFixedBitSet, TestTryDelete, TestMultiPhraseEnum, TestIndexableField, TestSloppyPhraseQuery,
TestConjunctions, TestOfflineSorter, TestIOUtils, TestCharsRef, Test2BBinaryDocValues, TestSpanFirstQuery,
TestDocumentWriter, TestNearSpansOrdered, TestIndexWriterMerging, TestMaxTermFrequency, TestWildcard,
TestBagOfPositions, TestFastDecompressionMode, TestMultiThreadTermVectors, TestNRTReaderCleanup,
TestConcurrentMergeScheduler, Test2BPagedBytes, TestBKD, TestPrefixCodedTerms, TestNoMergeScheduler,
TestPrefixQuery, TestSpanContainQuery, TestTopDocsMerge, TestDateTools, TestCachingCollector,
TestElevationComparator, TestPointQueries, TestMixedCodecs, TestPhrasePrefixQuery, TestNorms,
TestForceMergeForever, TestExternalCodecs, TestComplexExplanations, TestManyFields, TestMultiMMap,
TestLongPostings, TestBufferedChecksum, TestDemo, TestSleepingLockWrapper, TestSPIClassIterator,
TestDocBoost, TestCharTermAttributeImpl, TestMergeSchedulerExternal, TestFuzzyQuery, TestDirectPacked,
TestIndexFileDeleter, TestFieldValueQuery, TestAutomaton, TestRollingUpdates, TestCharsRefBuilder,
TestIndexWriterOnDiskFull, Test2BSortedDocValuesOrds, TestSort, Test2BPositions, TestDuelingCodecsAtNight,
TestDirectoryReader, TestTermVectorsReader, TestIndexWriterMaxDocs, TestSegmentInfos, TestNIOFSDirectory,
TestLazyProxSkipping, TestIndexWriterDeleteByQuery, TestIndexWriter, TestPerFieldDocValuesFormat,
TestBytesStore, TestNumericRangeQuery32, TestIndexWriterExceptions, TestDeletionPolicy, TestFlushByRamOrCountsPolicy,
TestSearchAfter, TestNeverDelete, TestIndexWriterForceMerge, TestArrayUtil, TestSegmentMerger,
TestRegexpRandom2]
   [junit4] Completed [240/411 (3!)] on J2 in 1.19s, 1 test, 1 error <<< FAILURES!

[...truncated 559 lines...]
BUILD FAILED
/home/jenkins/workspace/Lucene-Solr-trunk-Linux/build.xml:740: The following error occurred
while executing this line:
/home/jenkins/workspace/Lucene-Solr-trunk-Linux/build.xml:684: The following error occurred
while executing this line:
/home/jenkins/workspace/Lucene-Solr-trunk-Linux/build.xml:59: The following error occurred
while executing this line:
/home/jenkins/workspace/Lucene-Solr-trunk-Linux/lucene/build.xml:50: The following error occurred
while executing this line:
/home/jenkins/workspace/Lucene-Solr-trunk-Linux/lucene/common-build.xml:1457: The following
error occurred while executing this line:
/home/jenkins/workspace/Lucene-Solr-trunk-Linux/lucene/common-build.xml:1014: There were test
failures: 411 suites (1 ignored), 3425 tests, 1 suite-level error, 3 errors, 58 ignored (54
assumptions) [seed: 37B8DA690196F95D]

Total time: 6 minutes 37 seconds
Build step 'Invoke Ant' marked build as failure
Archiving artifacts
[WARNINGS] Skipping publisher since build result is FAILURE
Recording test results
Email was triggered for: Failure - Any
Sending email for trigger: Failure - Any



Mime
View raw message