lucene-dev mailing list archives

Site index · List index
Message view « Date » · « Thread »
Top « Date » · « Thread »
From Policeman Jenkins Server <jenk...@thetaphi.de>
Subject [JENKINS] Lucene-Solr-master-Windows (64bit/jdk1.8.0_72) - Build # 5743 - Failure!
Date Tue, 29 Mar 2016 13:45:27 GMT
Build: http://jenkins.thetaphi.de/job/Lucene-Solr-master-Windows/5743/
Java: 64bit/jdk1.8.0_72 -XX:-UseCompressedOops -XX:+UseG1GC

1 tests failed.
FAILED:  org.apache.solr.morphlines.solr.SolrMorphlineZkTest.test

Error Message:
Cannot download schema.xml from ZooKeeper near: {     # String: 1     "solrUrl" : "",     # String: 1     "collection" : "collection1",     # String: 1     "zkHost" : "127.0.0.1:65194/solr",     # String: 1     "batchSize" : "1000",     # String: 1     "solrHomeDir" : "" }

Stack Trace:
org.kitesdk.morphline.api.MorphlineCompilationException: Cannot download schema.xml from ZooKeeper near: {
    # String: 1
    "solrUrl" : "",
    # String: 1
    "collection" : "collection1",
    # String: 1
    "zkHost" : "127.0.0.1:65194/solr",
    # String: 1
    "batchSize" : "1000",
    # String: 1
    "solrHomeDir" : ""
}
	at __randomizedtesting.SeedInfo.seed([BED8F84E04765A7B:368CC794AA8A3783]:0)
	at org.apache.solr.morphlines.solr.SolrLocator.getIndexSchema(SolrLocator.java:146)
	at org.apache.solr.morphlines.solr.SanitizeUnknownSolrFieldsBuilder$SanitizeUnknownSolrFields.<init>(SanitizeUnknownSolrFieldsBuilder.java:71)
	at org.apache.solr.morphlines.solr.SanitizeUnknownSolrFieldsBuilder.build(SanitizeUnknownSolrFieldsBuilder.java:53)
	at org.kitesdk.morphline.base.AbstractCommand.buildCommand(AbstractCommand.java:302)
	at org.kitesdk.morphline.base.AbstractCommand.buildCommandChain(AbstractCommand.java:249)
	at org.kitesdk.morphline.stdlib.Pipe.<init>(Pipe.java:46)
	at org.kitesdk.morphline.stdlib.PipeBuilder.build(PipeBuilder.java:40)
	at org.apache.solr.morphlines.solr.AbstractSolrMorphlineZkTestBase.createMorphline(AbstractSolrMorphlineZkTestBase.java:119)
	at org.apache.solr.morphlines.solr.AbstractSolrMorphlineZkTestBase.parse(AbstractSolrMorphlineZkTestBase.java:115)
	at org.apache.solr.morphlines.solr.AbstractSolrMorphlineZkTestBase.parse(AbstractSolrMorphlineZkTestBase.java:104)
	at org.apache.solr.morphlines.solr.SolrMorphlineZkTest.test(SolrMorphlineZkTest.java:46)
	at sun.reflect.NativeMethodAccessorImpl.invoke0(Native Method)
	at sun.reflect.NativeMethodAccessorImpl.invoke(NativeMethodAccessorImpl.java:62)
	at sun.reflect.DelegatingMethodAccessorImpl.invoke(DelegatingMethodAccessorImpl.java:43)
	at java.lang.reflect.Method.invoke(Method.java:498)
	at com.carrotsearch.randomizedtesting.RandomizedRunner.invoke(RandomizedRunner.java:1764)
	at com.carrotsearch.randomizedtesting.RandomizedRunner$8.evaluate(RandomizedRunner.java:871)
	at com.carrotsearch.randomizedtesting.RandomizedRunner$9.evaluate(RandomizedRunner.java:907)
	at com.carrotsearch.randomizedtesting.RandomizedRunner$10.evaluate(RandomizedRunner.java:921)
	at org.apache.solr.BaseDistributedSearchTestCase$ShardsRepeatRule$ShardsFixedStatement.callStatement(BaseDistributedSearchTestCase.java:996)
	at org.apache.solr.BaseDistributedSearchTestCase$ShardsRepeatRule$ShardsStatement.evaluate(BaseDistributedSearchTestCase.java:971)
	at com.carrotsearch.randomizedtesting.rules.SystemPropertiesRestoreRule$1.evaluate(SystemPropertiesRestoreRule.java:57)
	at org.apache.lucene.util.TestRuleSetupTeardownChained$1.evaluate(TestRuleSetupTeardownChained.java:49)
	at org.apache.lucene.util.AbstractBeforeAfterRule$1.evaluate(AbstractBeforeAfterRule.java:45)
	at org.apache.lucene.util.TestRuleThreadAndTestName$1.evaluate(TestRuleThreadAndTestName.java:48)
	at org.apache.lucene.util.TestRuleIgnoreAfterMaxFailures$1.evaluate(TestRuleIgnoreAfterMaxFailures.java:64)
	at org.apache.lucene.util.TestRuleMarkFailure$1.evaluate(TestRuleMarkFailure.java:47)
	at com.carrotsearch.randomizedtesting.rules.StatementAdapter.evaluate(StatementAdapter.java:36)
	at com.carrotsearch.randomizedtesting.ThreadLeakControl$StatementRunner.run(ThreadLeakControl.java:367)
	at com.carrotsearch.randomizedtesting.ThreadLeakControl.forkTimeoutingTask(ThreadLeakControl.java:809)
	at com.carrotsearch.randomizedtesting.ThreadLeakControl$3.evaluate(ThreadLeakControl.java:460)
	at com.carrotsearch.randomizedtesting.RandomizedRunner.runSingleTest(RandomizedRunner.java:880)
	at com.carrotsearch.randomizedtesting.RandomizedRunner$5.evaluate(RandomizedRunner.java:781)
	at com.carrotsearch.randomizedtesting.RandomizedRunner$6.evaluate(RandomizedRunner.java:816)
	at com.carrotsearch.randomizedtesting.RandomizedRunner$7.evaluate(RandomizedRunner.java:827)
	at com.carrotsearch.randomizedtesting.rules.StatementAdapter.evaluate(StatementAdapter.java:36)
	at com.carrotsearch.randomizedtesting.rules.SystemPropertiesRestoreRule$1.evaluate(SystemPropertiesRestoreRule.java:57)
	at org.apache.lucene.util.AbstractBeforeAfterRule$1.evaluate(AbstractBeforeAfterRule.java:45)
	at com.carrotsearch.randomizedtesting.rules.StatementAdapter.evaluate(StatementAdapter.java:36)
	at org.apache.lucene.util.TestRuleStoreClassName$1.evaluate(TestRuleStoreClassName.java:41)
	at com.carrotsearch.randomizedtesting.rules.NoShadowingOrOverridesOnMethodsRule$1.evaluate(NoShadowingOrOverridesOnMethodsRule.java:40)
	at com.carrotsearch.randomizedtesting.rules.NoShadowingOrOverridesOnMethodsRule$1.evaluate(NoShadowingOrOverridesOnMethodsRule.java:40)
	at com.carrotsearch.randomizedtesting.rules.StatementAdapter.evaluate(StatementAdapter.java:36)
	at com.carrotsearch.randomizedtesting.rules.StatementAdapter.evaluate(StatementAdapter.java:36)
	at com.carrotsearch.randomizedtesting.rules.StatementAdapter.evaluate(StatementAdapter.java:36)
	at org.apache.lucene.util.TestRuleAssertionsRequired$1.evaluate(TestRuleAssertionsRequired.java:53)
	at org.apache.lucene.util.TestRuleMarkFailure$1.evaluate(TestRuleMarkFailure.java:47)
	at org.apache.lucene.util.TestRuleIgnoreAfterMaxFailures$1.evaluate(TestRuleIgnoreAfterMaxFailures.java:64)
	at org.apache.lucene.util.TestRuleIgnoreTestSuites$1.evaluate(TestRuleIgnoreTestSuites.java:54)
	at com.carrotsearch.randomizedtesting.rules.StatementAdapter.evaluate(StatementAdapter.java:36)
	at com.carrotsearch.randomizedtesting.ThreadLeakControl$StatementRunner.run(ThreadLeakControl.java:367)
	at java.lang.Thread.run(Thread.java:745)
Caused by: java.io.FileNotFoundException: .\temp\1459259080277-0 (Access is denied)
	at java.io.FileInputStream.open0(Native Method)
	at java.io.FileInputStream.open(FileInputStream.java:195)
	at java.io.FileInputStream.<init>(FileInputStream.java:138)
	at com.google.common.io.Files$FileByteSource.openStream(Files.java:124)
	at com.google.common.io.Files$FileByteSource.openStream(Files.java:114)
	at com.google.common.io.ByteSource.copyTo(ByteSource.java:202)
	at com.google.common.io.Files.copy(Files.java:436)
	at com.google.common.io.Files.move(Files.java:651)
	at org.apache.solr.morphlines.solr.ZooKeeperDownloader.downloadConfigDir(ZooKeeperDownloader.java:120)
	at org.apache.solr.morphlines.solr.SolrLocator.getIndexSchema(SolrLocator.java:143)
	... 51 more




Build Log:
[...truncated 21664 lines...]
   [junit4] Suite: org.apache.solr.morphlines.solr.SolrMorphlineZkTest
   [junit4]   2> Creating dataDir: C:\Users\jenkins\workspace\Lucene-Solr-master-Windows\solr\build\contrib\solr-morphlines-core\test\J1\temp\solr.morphlines.solr.SolrMorphlineZkTest_BED8F84E04765A7B-001\init-core-data-001
   [junit4]   2> 0    INFO  (SUITE-SolrMorphlineZkTest-seed#[BED8F84E04765A7B]-worker) [    ] o.a.s.SolrTestCaseJ4 Randomized ssl (false) and clientAuth (true)
   [junit4]   2> 103  INFO  (SUITE-SolrMorphlineZkTest-seed#[BED8F84E04765A7B]-worker) [    ] o.a.s.BaseDistributedSearchTestCase Setting hostContext system property: /
   [junit4]   2> 1081 INFO  (TEST-SolrMorphlineZkTest.test-seed#[BED8F84E04765A7B]) [    ] o.a.s.c.ZkTestServer STARTING ZK TEST SERVER
   [junit4]   2> 1085 INFO  (Thread-1) [    ] o.a.s.c.ZkTestServer client port:0.0.0.0/0.0.0.0:0
   [junit4]   2> 1086 INFO  (Thread-1) [    ] o.a.s.c.ZkTestServer Starting server
   [junit4]   2> 1215 INFO  (Thread-1) [    ] o.a.z.s.ZooKeeperServer Server environment:zookeeper.version=3.4.6-1569965, built on 02/20/2014 09:09 GMT
   [junit4]   2> 1215 INFO  (Thread-1) [    ] o.a.z.s.ZooKeeperServer Server environment:host.name=windows-vm.local
   [junit4]   2> 1215 INFO  (Thread-1) [    ] o.a.z.s.ZooKeeperServer Server environment:java.version=1.8.0_72
   [junit4]   2> 1216 INFO  (Thread-1) [    ] o.a.z.s.ZooKeeperServer Server environment:java.vendor=Oracle Corporation
   [junit4]   2> 1216 INFO  (Thread-1) [    ] o.a.z.s.ZooKeeperServer Server environment:java.home=C:\Users\jenkins\tools\java\64bit\jdk1.8.0_72\jre
   [junit4]   2> 1216 INFO  (Thread-1) [    ] o.a.z.s.ZooKeeperServer Server environment:java.class.path=C:\Users\jenkins\workspace\Lucene-Solr-master-Windows\solr\build\contrib\solr-morphlines-core\classes\test;C:\Users\jenkins\workspace\Lucene-Solr-master-Windows\solr\build\solr-test-framework\classes\java;C:\Users\jenkins\workspace\Lucene-Solr-master-Windows\solr\test-framework\lib\junit4-ant-2.3.2.jar;C:\Users\jenkins\workspace\Lucene-Solr-master-Windows\solr\contrib\morphlines-core\src\test-files;C:\Users\jenkins\workspace\Lucene-Solr-master-Windows\lucene\build\test-framework\classes\java;C:\Users\jenkins\workspace\Lucene-Solr-master-Windows\lucene\build\codecs\classes\java;C:\Users\jenkins\workspace\Lucene-Solr-master-Windows\solr\build\solr-solrj\classes\java;C:\Users\jenkins\workspace\Lucene-Solr-master-Windows\solr\build\solr-core\classes\java;C:\Users\jenkins\workspace\Lucene-Solr-master-Windows\lucene\build\analysis\common\lucene-analyzers-common-7.0.0-SNAPSHOT.jar;C:\Users\jenkins\workspace\Lucene-Solr-master-Windows\lucene\build\analysis\kuromoji\lucene-analyzers-kuromoji-7.0.0-SNAPSHOT.jar;C:\Users\jenkins\workspace\Lucene-Solr-master-Windows\lucene\build\analysis\phonetic\lucene-analyzers-phonetic-7.0.0-SNAPSHOT.jar;C:\Users\jenkins\workspace\Lucene-Solr-master-Windows\lucene\build\codecs\lucene-codecs-7.0.0-SNAPSHOT.jar;C:\Users\jenkins\workspace\Lucene-Solr-master-Windows\lucene\build\backward-codecs\lucene-backward-codecs-7.0.0-SNAPSHOT.jar;C:\Users\jenkins\workspace\Lucene-Solr-master-Windows\lucene\build\highlighter\lucene-highlighter-7.0.0-SNAPSHOT.jar;C:\Users\jenkins\workspace\Lucene-Solr-master-Windows\lucene\build\memory\lucene-memory-7.0.0-SNAPSHOT.jar;C:\Users\jenkins\workspace\Lucene-Solr-master-Windows\lucene\build\misc\lucene-misc-7.0.0-SNAPSHOT.jar;C:\Users\jenkins\workspace\Lucene-Solr-master-Windows\lucene\build\spatial-extras\lucene-spatial-extras-7.0.0-SNAPSHOT.jar;C:\Users\jenkins\workspace\Lucene-Solr-master-Windows\lucene\build\expressions\lucene-expressions-7.0.0-SNAPSHOT.jar;C:\Users\jenkins\workspace\Lucene-Solr-master-Windows\lucene\build\suggest\lucene-suggest-7.0.0-SNAPSHOT.jar;C:\Users\jenkins\workspace\Lucene-Solr-master-Windows\lucene\build\grouping\lucene-grouping-7.0.0-SNAPSHOT.jar;C:\Users\jenkins\workspace\Lucene-Solr-master-Windows\lucene\build\queries\lucene-queries-7.0.0-SNAPSHOT.jar;C:\Users\jenkins\workspace\Lucene-Solr-master-Windows\lucene\build\queryparser\lucene-queryparser-7.0.0-SNAPSHOT.jar;C:\Users\jenkins\workspace\Lucene-Solr-master-Windows\lucene\build\join\lucene-join-7.0.0-SNAPSHOT.jar;C:\Users\jenkins\workspace\Lucene-Solr-master-Windows\lucene\build\sandbox\lucene-sandbox-7.0.0-SNAPSHOT.jar;C:\Users\jenkins\workspace\Lucene-Solr-master-Windows\lucene\build\classification\lucene-classification-7.0.0-SNAPSHOT.jar;C:\Users\jenkins\workspace\Lucene-Solr-master-Windows\solr\core\lib\antlr4-runtime-4.5.1-1.jar;C:\Users\jenkins\workspace\Lucene-Solr-master-Windows\solr\core\lib\asm-5.0.4.jar;C:\Users\jenkins\workspace\Lucene-Solr-master-Windows\solr\core\lib\asm-commons-5.0.4.jar;C:\Users\jenkins\workspace\Lucene-Solr-master-Windows\solr\core\lib\caffeine-1.0.1.jar;C:\Users\jenkins\workspace\Lucene-Solr-master-Windows\solr\core\lib\commons-cli-1.2.jar;C:\Users\jenkins\workspace\Lucene-Solr-master-Windows\solr\core\lib\commons-codec-1.10.jar;C:\Users\jenkins\workspace\Lucene-Solr-master-Windows\solr\core\lib\commons-collections-3.2.2.jar;C:\Users\jenkins\workspace\Lucene-Solr-master-Windows\solr\core\lib\commons-configuration-1.6.jar;C:\Users\jenkins\workspace\Lucene-Solr-master-Windows\solr\core\lib\commons-exec-1.3.jar;C:\Users\jenkins\workspace\Lucene-Solr-master-Windows\solr\core\lib\commons-fileupload-1.2.1.jar;C:\Users\jenkins\workspace\Lucene-Solr-master-Windows\solr\core\lib\commons-lang-2.6.jar;C:\Users\jenkins\workspace\Lucene-Solr-master-Windows\solr\core\lib\dom4j-1.6.1.jar;C:\Users\jenkins\workspace\Lucene-Solr-master-Windows\solr\core\lib\guava-14.0.1.jar;C:\Users\jenkins\workspace\Lucene-Solr-master-Windows\solr\core\lib\hadoop-annotations-2.6.0.jar;C:\Users\jenkins\workspace\Lucene-Solr-master-Windows\solr\core\lib\hadoop-auth-2.6.0.jar;C:\Users\jenkins\workspace\Lucene-Solr-master-Windows\solr\core\lib\hadoop-common-2.6.0.jar;C:\Users\jenkins\workspace\Lucene-Solr-master-Windows\solr\core\lib\hadoop-hdfs-2.6.0.jar;C:\Users\jenkins\workspace\Lucene-Solr-master-Windows\solr\core\lib\hppc-0.7.1.jar;C:\Users\jenkins\workspace\Lucene-Solr-master-Windows\solr\core\lib\htrace-core-3.0.4.jar;C:\Users\jenkins\workspace\Lucene-Solr-master-Windows\solr\core\lib\jackson-core-2.5.4.jar;C:\Users\jenkins\workspace\Lucene-Solr-master-Windows\solr\core\lib\jackson-dataformat-smile-2.5.4.jar;C:\Users\jenkins\workspace\Lucene-Solr-master-Windows\solr\core\lib\jcl-over-slf4j-1.7.7.jar;C:\Users\jenkins\workspace\Lucene-Solr-master-Windows\solr\core\lib\joda-time-2.2.jar;C:\Users\jenkins\workspace\Lucene-Solr-master-Windows\solr\core\lib\log4j-1.2.17.jar;C:\Users\jenkins\workspace\Lucene-Solr-master-Windows\solr\core\lib\org.restlet-2.3.0.jar;C:\Users\jenkins\workspace\Lucene-Solr-master-Windows\solr\core\lib\org.restlet.ext.servlet-2.3.0.jar;C:\Users\jenkins\workspace\Lucene-Solr-master-Windows\solr\core\lib\presto-parser-0.122.jar;C:\Users\jenkins\workspace\Lucene-Solr-master-Windows\solr\core\lib\protobuf-java-2.5.0.jar;C:\Users\jenkins\workspace\Lucene-Solr-master-Windows\solr\core\lib\slf4j-log4j12-1.7.7.jar;C:\Users\jenkins\workspace\Lucene-Solr-master-Windows\solr\core\lib\slice-0.10.jar;C:\Users\jenkins\workspace\Lucene-Solr-master-Windows\solr\core\lib\spatial4j-0.6.jar;C:\Users\jenkins\workspace\Lucene-Solr-master-Windows\solr\core\lib\t-digest-3.1.jar;C:\Users\jenkins\workspace\Lucene-Solr-master-Windows\solr\solrj\lib\commons-io-2.4.jar;C:\Users\jenkins\workspace\Lucene-Solr-master-Windows\solr\solrj\lib\httpclient-4.4.1.jar;C:\Users\jenkins\workspace\Lucene-Solr-master-Windows\solr\solrj\lib\httpcore-4.4.1.jar;C:\Users\jenkins\workspace\Lucene-Solr-master-Windows\solr\solrj\lib\httpmime-4.4.1.jar;C:\Users\jenkins\workspace\Lucene-Solr-master-Windows\solr\solrj\lib\jcl-over-slf4j-1.7.7.jar;C:\Users\jenkins\workspace\Lucene-Solr-master-Windows\solr\solrj\lib\noggit-0.6.jar;C:\Users\jenkins\workspace\Lucene-Solr-master-Windows\solr\solrj\lib\slf4j-api-1.7.7.jar;C:\Users\jenkins\workspace\Lucene-Solr-master-Windows\solr\solrj\lib\stax2-api-3.1.4.jar;C:\Users\jenkins\workspace\Lucene-Solr-master-Windows\solr\solrj\lib\woodstox-core-asl-4.4.1.jar;C:\Users\jenkins\workspace\Lucene-Solr-master-Windows\solr\solrj\lib\zookeeper-3.4.6.jar;C:\Users\jenkins\workspace\Lucene-Solr-master-Windows\solr\server\lib\javax.servlet-api-3.1.0.jar;C:\Users\jenkins\workspace\Lucene-Solr-master-Windows\solr\server\lib\jetty-continuation-9.3.8.v20160314.jar;C:\Users\jenkins\workspace\Lucene-Solr-master-Windows\solr\server\lib\jetty-deploy-9.3.8.v20160314.jar;C:\Users\jenkins\workspace\Lucene-Solr-master-Windows\solr\server\lib\jetty-http-9.3.8.v20160314.jar;C:\Users\jenkins\workspace\Lucene-Solr-master-Windows\solr\server\lib\jetty-io-9.3.8.v20160314.jar;C:\Users\jenkins\workspace\Lucene-Solr-master-Windows\solr\server\lib\jetty-jmx-9.3.8.v20160314.jar;C:\Users\jenkins\workspace\Lucene-Solr-master-Windows\solr\server\lib\jetty-rewrite-9.3.8.v20160314.jar;C:\Users\jenkins\workspace\Lucene-Solr-master-Windows\solr\server\lib\jetty-security-9.3.8.v20160314.jar;C:\Users\jenkins\workspace\Lucene-Solr-master-Windows\solr\server\lib\jetty-server-9.3.8.v20160314.jar;C:\Users\jenkins\workspace\Lucene-Solr-master-Windows\solr\server\lib\jetty-servlet-9.3.8.v20160314.jar;C:\Users\jenkins\workspace\Lucene-Solr-master-Windows\solr\server\lib\jetty-servlets-9.3.8.v20160314.jar;C:\Users\jenkins\workspace\Lucene-Solr-master-Windows\solr\server\lib\jetty-util-9.3.8.v20160314.jar;C:\Users\jenkins\workspace\Lucene-Solr-master-Windows\solr\server\lib\jetty-webapp-9.3.8.v20160314.jar;C:\Users\jenkins\workspace\Lucene-Solr-master-Windows\solr\server\lib\jetty-xml-9.3.8.v20160314.jar;C:\Users\jenkins\workspace\Lucene-Solr-master-Windows\solr\example\example-DIH\solr\db\lib\derby-10.9.1.0.jar;C:\Users\jenkins\workspace\Lucene-Solr-master-Windows\solr\example\example-DIH\solr\db\lib\hsqldb-1.8.0.10.jar;C:\Users\jenkins\workspace\Lucene-Solr-master-Windows\solr\contrib\morphlines-core\lib\config-1.0.2.jar;C:\Users\jenkins\workspace\Lucene-Solr-master-Windows\solr\contrib\morphlines-core\lib\kite-morphlines-avro-1.1.0.jar;C:\Users\jenkins\workspace\Lucene-Solr-master-Windows\solr\contrib\morphlines-core\lib\kite-morphlines-core-1.1.0.jar;C:\Users\jenkins\workspace\Lucene-Solr-master-Windows\solr\contrib\morphlines-core\lib\metrics-core-3.0.1.jar;C:\Users\jenkins\workspace\Lucene-Solr-master-Windows\solr\contrib\morphlines-core\lib\metrics-healthchecks-3.0.1.jar;C:\Users\jenkins\workspace\Lucene-Solr-master-Windows\lucene\build\core\classes\java;C:\Users\jenkins\workspace\Lucene-Solr-master-Windows\solr\build\contrib\solr-cell\classes\java;C:\Users\jenkins\workspace\Lucene-Solr-master-Windows\solr\contrib\extraction\lib\apache-mime4j-core-0.7.2.jar;C:\Users\jenkins\workspace\Lucene-Solr-master-Windows\solr\contrib\extraction\lib\apache-mime4j-dom-0.7.2.jar;C:\Users\jenkins\workspace\Lucene-Solr-master-Windows\solr\contrib\extraction\lib\aspectjrt-1.8.0.jar;C:\Users\jenkins\workspace\Lucene-Solr-master-Windows\solr\contrib\extraction\lib\bcmail-jdk15-1.45.jar;C:\Users\jenkins\workspace\Lucene-Solr-master-Windows\solr\contrib\extraction\lib\bcprov-jdk15-1.45.jar;C:\Users\jenkins\workspace\Lucene-Solr-master-Windows\solr\contrib\extraction\lib\boilerpipe-1.1.0.jar;C:\Users\jenkins\workspace\Lucene-Solr-master-Windows\solr\contrib\extraction\lib\commons-compress-1.8.1.jar;C:\Users\jenkins\workspace\Lucene-Solr-master-Windows\solr\contrib\extraction\lib\fontbox-1.8.8.jar;C:\Users\jenkins\workspace\Lucene-Solr-master-Windows\solr\contrib\extraction\lib\icu4j-56.1.jar;C:\Users\jenkins\workspace\Lucene-Solr-master-Windows\solr\contrib\extraction\lib\isoparser-1.0.2.jar;C:\Users\jenkins\workspace\Lucene-Solr-master-Windows\solr\contrib\extraction\lib\java-libpst-0.8.1.jar;C:\Users\jenkins\workspace\Lucene-Solr-master-Windows\solr\contrib\extraction\lib\jdom-1.0.jar;C:\Users\jenkins\workspace\Lucene-Solr-master-Windows\solr\contrib\extraction\lib\jempbox-1.8.8.jar;C:\Users\jenkins\workspace\Lucene-Solr-master-Windows\solr\contrib\extraction\lib\jmatio-1.0.jar;C:\Users\jenkins\workspace\Lucene-Solr-master-Windows\solr\contrib\extraction\lib\juniversalchardet-1.0.3.jar;C:\Users\jenkins\workspace\Lucene-Solr-master-Windows\solr\contrib\extraction\lib\metadata-extractor-2.6.2.jar;C:\Users\jenkins\workspace\Lucene-Solr-master-Windows\solr\contrib\extraction\lib\pdfbox-1.8.8.jar;C:\Users\jenkins\workspace\Lucene-Solr-master-Windows\solr\contrib\extraction\lib\poi-3.11.jar;C:\Users\jenkins\workspace\Lucene-Solr-master-Windows\solr\contrib\extraction\lib\poi-ooxml-3.11.jar;C:\Users\jenkins\workspace\Lucene-Solr-master-Windows\solr\contrib\extraction\lib\poi-ooxml-schemas-3.11.jar;C:\Users\jenkins\workspace\Lucene-Solr-master-Windows\solr\contrib\extraction\lib\poi-scratchpad-3.11.jar;C:\Users\jenkins\workspace\Lucene-Solr-master-Windows\solr\contrib\extraction\lib\rome-1.0.jar;C:\Users\jenkins\workspace\Lucene-Solr-master-Windows\solr\contrib\extraction\lib\tagsoup-1.2.1.jar;C:\Users\jenkins\workspace\Lucene-Solr-master-Windows\solr\contrib\extraction\lib\tika-core-1.7.jar;C:\Users\jenkins\workspace\Lucene-Solr-master-Windows\solr\contrib\extraction\lib\tika-java7-1.7.jar;C:\Users\jenkins\workspace\Lucene-Solr-master-Windows\solr\contrib\extraction\lib\tika-parsers-1.7.jar;C:\Users\jenkins\workspace\Lucene-Solr-master-Windows\solr\contrib\extraction\lib\tika-xmp-1.7.jar;C:\Users\jenkins\workspace\Lucene-Solr-master-Windows\solr\contrib\extraction\lib\vorbis-java-core-0.6.jar;C:\Users\jenkins\workspace\Lucene-Solr-master-Windows\solr\contrib\extraction\lib\vorbis-java-tika-0.6.jar;C:\Users\jenkins\workspace\Lucene-Solr-master-Windows\solr\contrib\extraction\lib\xercesImpl-2.9.1.jar;C:\Users\jenkins\workspace\Lucene-Solr-master-Windows\solr\contrib\extraction\lib\xmlbeans-2.6.0.jar;C:\Users\jenkins\workspace\Lucene-Solr-master-Windows\solr\contrib\extraction\lib\xmpcore-5.1.2.jar;C:\Users\jenkins\workspace\Lucene-Solr-master-Windows\solr\contrib\extraction\lib\xz-1.5.jar;C:\Users\jenkins\workspace\Lucene-Solr-master-Windows\lucene\test-framework\lib\junit-4.10.jar;C:\Users\jenkins\workspace\Lucene-Solr-master-Windows\lucene\test-framework\lib\randomizedtesting-runner-2.3.2.jar;C:\Users\jenkins\workspace\Lucene-Solr-master-Windows\solr\build\contrib\solr-morphlines-core\classes\java;C:\Users\jenkins\workspace\Lucene-Solr-master-Windows\solr\contrib\morphlines-core\test-lib\aopalliance-1.0.jar;C:\Users\jenkins\workspace\Lucene-Solr-master-Windows\solr\contrib\morphlines-core\test-lib\avro-1.7.5.jar;C:\Users\jenkins\workspace\Lucene-Solr-master-Windows\solr\contrib\morphlines-core\test-lib\commons-collections-3.2.2.jar;C:\Users\jenkins\workspace\Lucene-Solr-master-Windows\solr\contrib\morphlines-core\test-lib\curator-client-2.8.0.jar;C:\Users\jenkins\workspace\Lucene-Solr-master-Windows\solr\contrib\morphlines-core\test-lib\curator-framework-2.8.0.jar;C:\Users\jenkins\workspace\Lucene-Solr-master-Windows\solr\contrib\morphlines-core\test-lib\guice-3.0.jar;C:\Users\jenkins\workspace\Lucene-Solr-master-Windows\solr\contrib\morphlines-core\test-lib\guice-servlet-3.0.jar;C:\Users\jenkins\workspace\Lucene-Solr-master-Windows\solr\contrib\morphlines-core\test-lib\hadoop-common-2.6.0-tests.jar;C:\Users\jenkins\workspace\Lucene-Solr-master-Windows\solr\contrib\morphlines-core\test-lib\hadoop-common-2.6.0.jar;C:\Users\jenkins\workspace\Lucene-Solr-master-Windows\solr\contrib\morphlines-core\test-lib\hadoop-hdfs-2.6.0-tests.jar;C:\Users\jenkins\workspace\Lucene-Solr-master-Windows\solr\contrib\morphlines-core\test-lib\hadoop-mapreduce-client-app-2.6.0.jar;C:\Users\jenkins\workspace\Lucene-Solr-master-Windows\solr\contrib\morphlines-core\test-lib\hadoop-mapreduce-client-common-2.6.0.jar;C:\Users\jenkins\workspace\Lucene-Solr-master-Windows\solr\contrib\morphlines-core\test-lib\hadoop-mapreduce-client-core-2.6.0.jar;C:\Users\jenkins\workspace\Lucene-Solr-master-Windows\solr\contrib\morphlines-core\test-lib\hadoop-mapreduce-client-hs-2.6.0.jar;C:\Users\jenkins\workspace\Lucene-Solr-master-Windows\solr\contrib\morphlines-core\test-lib\hadoop-mapreduce-client-jobclient-2.6.0-tests.jar;C:\Users\jenkins\workspace\Lucene-Solr-master-Windows\solr\contrib\morphlines-core\test-lib\hadoop-mapreduce-client-jobclient-2.6.0.jar;C:\Users\jenkins\workspace\Lucene-Solr-master-Windows\solr\contrib\morphlines-core\test-lib\hadoop-mapreduce-client-shuffle-2.6.0.jar;C:\Users\jenkins\workspace\Lucene-Solr-master-Windows\solr\contrib\morphlines-core\test-lib\hadoop-yarn-api-2.6.0.jar;C:\Users\jenkins\workspace\Lucene-Solr-master-Windows\solr\contrib\morphlines-core\test-lib\hadoop-yarn-client-2.6.0.jar;C:\Users\jenkins\workspace\Lucene-Solr-master-Windows\solr\contrib\morphlines-core\test-lib\hadoop-yarn-common-2.6.0.jar;C:\Users\jenkins\workspace\Lucene-Solr-master-Windows\solr\contrib\morphlines-core\test-lib\hadoop-yarn-server-applicationhistoryservice-2.6.0.jar;C:\Users\jenkins\workspace\Lucene-Solr-master-Windows\solr\contrib\morphlines-core\test-lib\hadoop-yarn-server-common-2.6.0.jar;C:\Users\jenkins\workspace\Lucene-Solr-master-Windows\solr\contrib\morphlines-core\test-lib\hadoop-yarn-server-nodemanager-2.6.0.jar;C:\Users\jenkins\workspace\Lucene-Solr-master-Windows\solr\contrib\morphlines-core\test-lib\hadoop-yarn-server-resourcemanager-2.6.0.jar;C:\Users\jenkins\workspace\Lucene-Solr-master-Windows\solr\contrib\morphlines-core\test-lib\hadoop-yarn-server-tests-2.6.0-tests.jar;C:\Users\jenkins\workspace\Lucene-Solr-master-Windows\solr\contrib\morphlines-core\test-lib\hadoop-yarn-server-web-proxy-2.6.0.jar;C:\Users\jenkins\workspace\Lucene-Solr-master-Windows\solr\contrib\morphlines-core\test-lib\jackson-annotations-2.5.4.jar;C:\Users\jenkins\workspace\Lucene-Solr-master-Windows\solr\contrib\morphlines-core\test-lib\jackson-core-2.5.4.jar;C:\Users\jenkins\workspace\Lucene-Solr-master-Windows\solr\contrib\morphlines-core\test-lib\jackson-core-asl-1.9.13.jar;C:\Users\jenkins\workspace\Lucene-Solr-master-Windows\solr\co
   [junit4]   2> ntrib\morphlines-core\test-lib\jackson-databind-2.5.4.jar;C:\Users\jenkins\workspace\Lucene-Solr-master-Windows\solr\contrib\morphlines-core\test-lib\jackson-jaxrs-1.9.13.jar;C:\Users\jenkins\workspace\Lucene-Solr-master-Windows\solr\contrib\morphlines-core\test-lib\jackson-mapper-asl-1.9.13.jar;C:\Users\jenkins\workspace\Lucene-Solr-master-Windows\solr\contrib\morphlines-core\test-lib\javax.inject-1.jar;C:\Users\jenkins\workspace\Lucene-Solr-master-Windows\solr\contrib\morphlines-core\test-lib\jaxb-impl-2.2.3-1.jar;C:\Users\jenkins\workspace\Lucene-Solr-master-Windows\solr\contrib\morphlines-core\test-lib\jersey-bundle-1.9.jar;C:\Users\jenkins\workspace\Lucene-Solr-master-Windows\solr\contrib\morphlines-core\test-lib\jersey-core-1.9.jar;C:\Users\jenkins\workspace\Lucene-Solr-master-Windows\solr\contrib\morphlines-core\test-lib\jersey-guice-1.9.jar;C:\Users\jenkins\workspace\Lucene-Solr-master-Windows\solr\contrib\morphlines-core\test-lib\jersey-json-1.9.jar;C:\Users\jenkins\workspace\Lucene-Solr-master-Windows\solr\contrib\morphlines-core\test-lib\jersey-server-1.9.jar;C:\Users\jenkins\workspace\Lucene-Solr-master-Windows\solr\contrib\morphlines-core\test-lib\jetty-6.1.26.jar;C:\Users\jenkins\workspace\Lucene-Solr-master-Windows\solr\contrib\morphlines-core\test-lib\jetty-util-6.1.26.jar;C:\Users\jenkins\workspace\Lucene-Solr-master-Windows\solr\contrib\morphlines-core\test-lib\kite-morphlines-core-1.1.0-tests.jar;C:\Users\jenkins\workspace\Lucene-Solr-master-Windows\solr\contrib\morphlines-core\test-lib\kite-morphlines-core-1.1.0.jar;C:\Users\jenkins\workspace\Lucene-Solr-master-Windows\solr\contrib\morphlines-core\test-lib\leveldb-0.7.jar;C:\Users\jenkins\workspace\Lucene-Solr-master-Windows\solr\contrib\morphlines-core\test-lib\leveldb-api-0.7.jar;C:\Users\jenkins\workspace\Lucene-Solr-master-Windows\solr\contrib\morphlines-core\test-lib\leveldbjni-1.8.jar;C:\Users\jenkins\workspace\Lucene-Solr-master-Windows\solr\contrib\morphlines-core\test-lib\mockito-core-1.9.5.jar;C:\Users\jenkins\workspace\Lucene-Solr-master-Windows\solr\contrib\morphlines-core\test-lib\mrunit-1.0.0-hadoop2.jar;C:\Users\jenkins\workspace\Lucene-Solr-master-Windows\solr\contrib\morphlines-core\test-lib\netty-3.7.0.Final.jar;C:\Users\jenkins\workspace\Lucene-Solr-master-Windows\solr\contrib\morphlines-core\test-lib\objenesis-1.2.jar;C:\Users\jenkins\workspace\Lucene-Solr-master-Windows\solr\contrib\morphlines-core\test-lib\paranamer-2.3.jar;C:\Users\jenkins\workspace\Lucene-Solr-master-Windows\solr\contrib\morphlines-core\test-lib\snappy-java-1.0.5.jar;C:\Users\jenkins\tools\hudson.tasks.Ant_AntInstallation\ANT_1.8.2\lib\ant-launcher.jar;C:\Users\jenkins\.ant\lib\ivy-2.3.0.jar;C:\Users\jenkins\tools\hudson.tasks.Ant_AntInstallation\ANT_1.8.2\lib\ant-antlr.jar;C:\Users\jenkins\tools\hudson.tasks.Ant_AntInstallation\ANT_1.8.2\lib\ant-apache-bcel.jar;C:\Users\jenkins\tools\hudson.tasks.Ant_AntInstallation\ANT_1.8.2\lib\ant-apache-bsf.jar;C:\Users\jenkins\tools\hudson.tasks.Ant_AntInstallation\ANT_1.8.2\lib\ant-apache-log4j.jar;C:\Users\jenkins\tools\hudson.tasks.Ant_AntInstallation\ANT_1.8.2\lib\ant-apache-oro.jar;C:\Users\jenkins\tools\hudson.tasks.Ant_AntInstallation\ANT_1.8.2\lib\ant-apache-regexp.jar;C:\Users\jenkins\tools\hudson.tasks.Ant_AntInstallation\ANT_1.8.2\lib\ant-apache-resolver.jar;C:\Users\jenkins\tools\hudson.tasks.Ant_AntInstallation\ANT_1.8.2\lib\ant-apache-xalan2.jar;C:\Users\jenkins\tools\hudson.tasks.Ant_AntInstallation\ANT_1.8.2\lib\ant-commons-logging.jar;C:\Users\jenkins\tools\hudson.tasks.Ant_AntInstallation\ANT_1.8.2\lib\ant-commons-net.jar;C:\Users\jenkins\tools\hudson.tasks.Ant_AntInstallation\ANT_1.8.2\lib\ant-jai.jar;C:\Users\jenkins\tools\hudson.tasks.Ant_AntInstallation\ANT_1.8.2\lib\ant-javamail.jar;C:\Users\jenkins\tools\hudson.tasks.Ant_AntInstallation\ANT_1.8.2\lib\ant-jdepend.jar;C:\Users\jenkins\tools\hudson.tasks.Ant_AntInstallation\ANT_1.8.2\lib\ant-jmf.jar;C:\Users\jenkins\tools\hudson.tasks.Ant_AntInstallation\ANT_1.8.2\lib\ant-jsch.jar;C:\Users\jenkins\tools\hudson.tasks.Ant_AntInstallation\ANT_1.8.2\lib\ant-junit.jar;C:\Users\jenkins\tools\hudson.tasks.Ant_AntInstallation\ANT_1.8.2\lib\ant-junit4.jar;C:\Users\jenkins\tools\hudson.tasks.Ant_AntInstallation\ANT_1.8.2\lib\ant-netrexx.jar;C:\Users\jenkins\tools\hudson.tasks.Ant_AntInstallation\ANT_1.8.2\lib\ant-swing.jar;C:\Users\jenkins\tools\hudson.tasks.Ant_AntInstallation\ANT_1.8.2\lib\ant-testutil.jar;C:\Users\jenkins\tools\hudson.tasks.Ant_AntInstallation\ANT_1.8.2\lib\ant.jar;C:\Users\jenkins\tools\java\64bit\jdk1.8.0_72\lib\tools.jar;C:\Users\jenkins\.ivy2\cache\com.carrotsearch.randomizedtesting\junit4-ant\jars\junit4-ant-2.3.2.jar
   [junit4]   2> 1220 INFO  (Thread-1) [    ] o.a.z.s.ZooKeeperServer Server environment:java.library.path=C:\Users\jenkins\tools\java\64bit\jdk1.8.0_72\jre\bin;C:\Windows\Sun\Java\bin;C:\Windows\system32;C:\Windows;C:\Users\jenkins\tools\java\64bit\jdk1.8.0_72\bin;C:\ProgramData\Oracle\Java\javapath;C:\Python35\Scripts\;C:\Python35\;C:\Perl64\site\bin;C:\Perl64\bin;C:\Windows\system32;C:\Windows;C:\Windows\System32\Wbem;C:\Windows\System32\WindowsPowerShell\v1.0\;.
   [junit4]   2> 1221 INFO  (Thread-1) [    ] o.a.z.s.ZooKeeperServer Server environment:java.io.tmpdir=./temp
   [junit4]   2> 1221 INFO  (Thread-1) [    ] o.a.z.s.ZooKeeperServer Server environment:java.compiler=<NA>
   [junit4]   2> 1222 INFO  (Thread-1) [    ] o.a.z.s.ZooKeeperServer Server environment:os.name=Windows 10
   [junit4]   2> 1222 INFO  (Thread-1) [    ] o.a.z.s.ZooKeeperServer Server environment:os.arch=amd64
   [junit4]   2> 1222 INFO  (Thread-1) [    ] o.a.z.s.ZooKeeperServer Server environment:os.version=10.0
   [junit4]   2> 1223 INFO  (Thread-1) [    ] o.a.z.s.ZooKeeperServer Server environment:user.name=jenkins
   [junit4]   2> 1223 INFO  (Thread-1) [    ] o.a.z.s.ZooKeeperServer Server environment:user.home=C:\Users\jenkins
   [junit4]   2> 1223 INFO  (Thread-1) [    ] o.a.z.s.ZooKeeperServer Server environment:user.dir=C:\Users\jenkins\workspace\Lucene-Solr-master-Windows\solr\build\contrib\solr-morphlines-core\test\J1
   [junit4]   2> 1266 INFO  (Thread-1) [    ] o.a.z.s.ZooKeeperServer Created server with tickTime 1000 minSessionTimeout 2000 maxSessionTimeout 20000 datadir C:\Users\jenkins\workspace\Lucene-Solr-master-Windows\solr\build\contrib\solr-morphlines-core\test\J1\temp\solr.morphlines.solr.SolrMorphlineZkTest_BED8F84E04765A7B-001\tempDir-002\zookeeper\server1\data\version-2 snapdir C:\Users\jenkins\workspace\Lucene-Solr-master-Windows\solr\build\contrib\solr-morphlines-core\test\J1\temp\solr.morphlines.solr.SolrMorphlineZkTest_BED8F84E04765A7B-001\tempDir-002\zookeeper\server1\data\version-2
   [junit4]   2> 1270 INFO  (Thread-1) [    ] o.a.z.s.NIOServerCnxnFactory binding to port 0.0.0.0/0.0.0.0:0
   [junit4]   2> 1301 INFO  (TEST-SolrMorphlineZkTest.test-seed#[BED8F84E04765A7B]) [    ] o.a.s.c.ZkTestServer start zk server on port:65194
   [junit4]   2> 1527 INFO  (TEST-SolrMorphlineZkTest.test-seed#[BED8F84E04765A7B]) [    ] o.a.s.c.c.SolrZkClient Using default ZkCredentialsProvider
   [junit4]   2> 1591 INFO  (TEST-SolrMorphlineZkTest.test-seed#[BED8F84E04765A7B]) [    ] o.a.z.ZooKeeper Client environment:zookeeper.version=3.4.6-1569965, built on 02/20/2014 09:09 GMT
   [junit4]   2> 1591 INFO  (TEST-SolrMorphlineZkTest.test-seed#[BED8F84E04765A7B]) [    ] o.a.z.ZooKeeper Client environment:host.name=windows-vm.local
   [junit4]   2> 1592 INFO  (TEST-SolrMorphlineZkTest.test-seed#[BED8F84E04765A7B]) [    ] o.a.z.ZooKeeper Client environment:java.version=1.8.0_72
   [junit4]   2> 1592 INFO  (TEST-SolrMorphlineZkTest.test-seed#[BED8F84E04765A7B]) [    ] o.a.z.ZooKeeper Client environment:java.vendor=Oracle Corporation
   [junit4]   2> 1592 INFO  (TEST-SolrMorphlineZkTest.test-seed#[BED8F84E04765A7B]) [    ] o.a.z.ZooKeeper Client environment:java.home=C:\Users\jenkins\tools\java\64bit\jdk1.8.0_72\jre
   [junit4]   2> 1593 INFO  (TEST-SolrMorphlineZkTest.test-seed#[BED8F84E04765A7B]) [    ] o.a.z.ZooKeeper Client environment:java.class.path=C:\Users\jenkins\workspace\Lucene-Solr-master-Windows\solr\build\contrib\solr-morphlines-core\classes\test;C:\Users\jenkins\workspace\Lucene-Solr-master-Windows\solr\build\solr-test-framework\classes\java;C:\Users\jenkins\workspace\Lucene-Solr-master-Windows\solr\test-framework\lib\junit4-ant-2.3.2.jar;C:\Users\jenkins\workspace\Lucene-Solr-master-Windows\solr\contrib\morphlines-core\src\test-files;C:\Users\jenkins\workspace\Lucene-Solr-master-Windows\lucene\build\test-framework\classes\java;C:\Users\jenkins\workspace\Lucene-Solr-master-Windows\lucene\build\codecs\classes\java;C:\Users\jenkins\workspace\Lucene-Solr-master-Windows\solr\build\solr-solrj\classes\java;C:\Users\jenkins\workspace\Lucene-Solr-master-Windows\solr\build\solr-core\classes\java;C:\Users\jenkins\workspace\Lucene-Solr-master-Windows\lucene\build\analysis\common\lucene-analyzers-common-7.0.0-SNAPSHOT.jar;C:\Users\jenkins\workspace\Lucene-Solr-master-Windows\lucene\build\analysis\kuromoji\lucene-analyzers-kuromoji-7.0.0-SNAPSHOT.jar;C:\Users\jenkins\workspace\Lucene-Solr-master-Windows\lucene\build\analysis\phonetic\lucene-analyzers-phonetic-7.0.0-SNAPSHOT.jar;C:\Users\jenkins\workspace\Lucene-Solr-master-Windows\lucene\build\codecs\lucene-codecs-7.0.0-SNAPSHOT.jar;C:\Users\jenkins\workspace\Lucene-Solr-master-Windows\lucene\build\backward-codecs\lucene-backward-codecs-7.0.0-SNAPSHOT.jar;C:\Users\jenkins\workspace\Lucene-Solr-master-Windows\lucene\build\highlighter\lucene-highlighter-7.0.0-SNAPSHOT.jar;C:\Users\jenkins\workspace\Lucene-Solr-master-Windows\lucene\build\memory\lucene-memory-7.0.0-SNAPSHOT.jar;C:\Users\jenkins\workspace\Lucene-Solr-master-Windows\lucene\build\misc\lucene-misc-7.0.0-SNAPSHOT.jar;C:\Users\jenkins\workspace\Lucene-Solr-master-Windows\lucene\build\spatial-extras\lucene-spatial-extras-7.0.0-SNAPSHOT.jar;C:\Users\jenkins\workspace\Lucene-Solr-master-Windows\lucene\build\expressions\lucene-expressions-7.0.0-SNAPSHOT.jar;C:\Users\jenkins\workspace\Lucene-Solr-master-Windows\lucene\build\suggest\lucene-suggest-7.0.0-SNAPSHOT.jar;C:\Users\jenkins\workspace\Lucene-Solr-master-Windows\lucene\build\grouping\lucene-grouping-7.0.0-SNAPSHOT.jar;C:\Users\jenkins\workspace\Lucene-Solr-master-Windows\lucene\build\queries\lucene-queries-7.0.0-SNAPSHOT.jar;C:\Users\jenkins\workspace\Lucene-Solr-master-Windows\lucene\build\queryparser\lucene-queryparser-7.0.0-SNAPSHOT.jar;C:\Users\jenkins\workspace\Lucene-Solr-master-Windows\lucene\build\join\lucene-join-7.0.0-SNAPSHOT.jar;C:\Users\jenkins\workspace\Lucene-Solr-master-Windows\lucene\build\sandbox\lucene-sandbox-7.0.0-SNAPSHOT.jar;C:\Users\jenkins\workspace\Lucene-Solr-master-Windows\lucene\build\classification\lucene-classification-7.0.0-SNAPSHOT.jar;C:\Users\jenkins\workspace\Lucene-Solr-master-Windows\solr\core\lib\antlr4-runtime-4.5.1-1.jar;C:\Users\jenkins\workspace\Lucene-Solr-master-Windows\solr\core\lib\asm-5.0.4.jar;C:\Users\jenkins\workspace\Lucene-Solr-master-Windows\solr\core\lib\asm-commons-5.0.4.jar;C:\Users\jenkins\workspace\Lucene-Solr-master-Windows\solr\core\lib\caffeine-1.0.1.jar;C:\Users\jenkins\workspace\Lucene-Solr-master-Windows\solr\core\lib\commons-cli-1.2.jar;C:\Users\jenkins\workspace\Lucene-Solr-master-Windows\solr\core\lib\commons-codec-1.10.jar;C:\Users\jenkins\workspace\Lucene-Solr-master-Windows\solr\core\lib\commons-collections-3.2.2.jar;C:\Users\jenkins\workspace\Lucene-Solr-master-Windows\solr\core\lib\commons-configuration-1.6.jar;C:\Users\jenkins\workspace\Lucene-Solr-master-Windows\solr\core\lib\commons-exec-1.3.jar;C:\Users\jenkins\workspace\Lucene-Solr-master-Windows\solr\core\lib\commons-fileupload-1.2.1.jar;C:\Users\jenkins\workspace\Lucene-Solr-master-Windows\solr\core\lib\commons-lang-2.6.jar;C:\Users\jenkins\workspace\Lucene-Solr-master-Windows\solr\core\lib\dom4j-1.6.1.jar;C:\Users\jenkins\workspace\Lucene-Solr-master-Windows\solr\core\lib\guava-14.0.1.jar;C:\Users\jenkins\workspace\Lucene-Solr-master-Windows\solr\core\lib\hadoop-annotations-2.6.0.jar;C:\Users\jenkins\workspace\Lucene-Solr-master-Windows\solr\core\lib\hadoop-auth-2.6.0.jar;C:\Users\jenkins\workspace\Lucene-Solr-master-Windows\solr\core\lib\hadoop-common-2.6.0.jar;C:\Users\jenkins\workspace\Lucene-Solr-master-Windows\solr\core\lib\hadoop-hdfs-2.6.0.jar;C:\Users\jenkins\workspace\Lucene-Solr-master-Windows\solr\core\lib\hppc-0.7.1.jar;C:\Users\jenkins\workspace\Lucene-Solr-master-Windows\solr\core\lib\htrace-core-3.0.4.jar;C:\Users\jenkins\workspace\Lucene-Solr-master-Windows\solr\core\lib\jackson-core-2.5.4.jar;C:\Users\jenkins\workspace\Lucene-Solr-master-Windows\solr\core\lib\jackson-dataformat-smile-2.5.4.jar;C:\Users\jenkins\workspace\Lucene-Solr-master-Windows\solr\core\lib\jcl-over-slf4j-1.7.7.jar;C:\Users\jenkins\workspace\Lucene-Solr-master-Windows\solr\core\lib\joda-time-2.2.jar;C:\Users\jenkins\workspace\Lucene-Solr-master-Windows\solr\core\lib\log4j-1.2.17.jar;C:\Users\jenkins\workspace\Lucene-Solr-master-Windows\solr\core\lib\org.restlet-2.3.0.jar;C:\Users\jenkins\workspace\Lucene-Solr-master-Windows\solr\core\lib\org.restlet.ext.servlet-2.3.0.jar;C:\Users\jenkins\workspace\Lucene-Solr-master-Windows\solr\core\lib\presto-parser-0.122.jar;C:\Users\jenkins\workspace\Lucene-Solr-master-Windows\solr\core\lib\protobuf-java-2.5.0.jar;C:\Users\jenkins\workspace\Lucene-Solr-master-Windows\solr\core\lib\slf4j-log4j12-1.7.7.jar;C:\Users\jenkins\workspace\Lucene-Solr-master-Windows\solr\core\lib\slice-0.10.jar;C:\Users\jenkins\workspace\Lucene-Solr-master-Windows\solr\core\lib\spatial4j-0.6.jar;C:\Users\jenkins\workspace\Lucene-Solr-master-Windows\solr\core\lib\t-digest-3.1.jar;C:\Users\jenkins\workspace\Lucene-Solr-master-Windows\solr\solrj\lib\commons-io-2.4.jar;C:\Users\jenkins\workspace\Lucene-Solr-master-Windows\solr\solrj\lib\httpclient-4.4.1.jar;C:\Users\jenkins\workspace\Lucene-Solr-master-Windows\solr\solrj\lib\httpcore-4.4.1.jar;C:\Users\jenkins\workspace\Lucene-Solr-master-Windows\solr\solrj\lib\httpmime-4.4.1.jar;C:\Users\jenkins\workspace\Lucene-Solr-master-Windows\solr\solrj\lib\jcl-over-slf4j-1.7.7.jar;C:\Users\jenkins\workspace\Lucene-Solr-master-Windows\solr\solrj\lib\noggit-0.6.jar;C:\Users\jenkins\workspace\Lucene-Solr-master-Windows\solr\solrj\lib\slf4j-api-1.7.7.jar;C:\Users\jenkins\workspace\Lucene-Solr-master-Windows\solr\solrj\lib\stax2-api-3.1.4.jar;C:\Users\jenkins\workspace\Lucene-Solr-master-Windows\solr\solrj\lib\woodstox-core-asl-4.4.1.jar;C:\Users\jenkins\workspace\Lucene-Solr-master-Windows\solr\solrj\lib\zookeeper-3.4.6.jar;C:\Users\jenkins\workspace\Lucene-Solr-master-Windows\solr\server\lib\javax.servlet-api-3.1.0.jar;C:\Users\jenkins\workspace\Lucene-Solr-master-Windows\solr\server\lib\jetty-continuation-9.3.8.v20160314.jar;C:\Users\jenkins\workspace\Lucene-Solr-master-Windows\solr\server\lib\jetty-deploy-9.3.8.v20160314.jar;C:\Users\jenkins\workspace\Lucene-Solr-master-Windows\solr\server\lib\jetty-http-9.3.8.v20160314.jar;C:\Users\jenkins\workspace\Lucene-Solr-master-Windows\solr\server\lib\jetty-io-9.3.8.v20160314.jar;C:\Users\jenkins\workspace\Lucene-Solr-master-Windows\solr\server\lib\jetty-jmx-9.3.8.v20160314.jar;C:\Users\jenkins\workspace\Lucene-Solr-master-Windows\solr\server\lib\jetty-rewrite-9.3.8.v20160314.jar;C:\Users\jenkins\workspace\Lucene-Solr-master-Windows\solr\server\lib\jetty-security-9.3.8.v20160314.jar;C:\Users\jenkins\workspace\Lucene-Solr-master-Windows\solr\server\lib\jetty-server-9.3.8.v20160314.jar;C:\Users\jenkins\workspace\Lucene-Solr-master-Windows\solr\server\lib\jetty-servlet-9.3.8.v20160314.jar;C:\Users\jenkins\workspace\Lucene-Solr-master-Windows\solr\server\lib\jetty-servlets-9.3.8.v20160314.jar;C:\Users\jenkins\workspace\Lucene-Solr-master-Windows\solr\server\lib\jetty-util-9.3.8.v20160314.jar;C:\Users\jenkins\workspace\Lucene-Solr-master-Windows\solr\server\lib\jetty-webapp-9.3.8.v20160314.jar;C:\Users\jenkins\workspace\Lucene-Solr-master-Windows\solr\server\lib\jetty-xml-9.3.8.v20160314.jar;C:\Users\jenkins\workspace\Lucene-Solr-master-Windows\solr\example\example-DIH\solr\db\lib\derby-10.9.1.0.jar;C:\Users\jenkins\workspace\Lucene-Solr-master-Windows\solr\example\example-DIH\solr\db\lib\hsqldb-1.8.0.10.jar;C:\Users\jenkins\workspace\Lucene-Solr-master-Windows\solr\contrib\morphlines-core\lib\config-1.0.2.jar;C:\Users\jenkins\workspace\Lucene-Solr-master-Windows\solr\contrib\morphlines-core\lib\kite-morphlines-avro-1.1.0.jar;C:\Users\jenkins\workspace\Lucene-Solr-master-Windows\solr\contrib\morphlines-core\lib\kite-morphlines-core-1.1.0.jar;C:\Users\jenkins\workspace\Lucene-Solr-master-Windows\solr\contrib\morphlines-core\lib\metrics-core-3.0.1.jar;C:\Users\jenkins\workspace\Lucene-Solr-master-Windows\solr\contrib\morphlines-core\lib\metrics-healthchecks-3.0.1.jar;C:\Users\jenkins\workspace\Lucene-Solr-master-Windows\lucene\build\core\classes\java;C:\Users\jenkins\workspace\Lucene-Solr-master-Windows\solr\build\contrib\solr-cell\classes\java;C:\Users\jenkins\workspace\Lucene-Solr-master-Windows\solr\contrib\extraction\lib\apache-mime4j-core-0.7.2.jar;C:\Users\jenkins\workspace\Lucene-Solr-master-Windows\solr\contrib\extraction\lib\apache-mime4j-dom-0.7.2.jar;C:\Users\jenkins\workspace\Lucene-Solr-master-Windows\solr\contrib\extraction\lib\aspectjrt-1.8.0.jar;C:\Users\jenkins\workspace\Lucene-Solr-master-Windows\solr\contrib\extraction\lib\bcmail-jdk15-1.45.jar;C:\Users\jenkins\workspace\Lucene-Solr-master-Windows\solr\contrib\extraction\lib\bcprov-jdk15-1.45.jar;C:\Users\jenkins\workspace\Lucene-Solr-master-Windows\solr\contrib\extraction\lib\boilerpipe-1.1.0.jar;C:\Users\jenkins\workspace\Lucene-Solr-master-Windows\solr\contrib\extraction\lib\commons-compress-1.8.1.jar;C:\Users\jenkins\workspace\Lucene-Solr-master-Windows\solr\contrib\extraction\lib\fontbox-1.8.8.jar;C:\Users\jenkins\workspace\Lucene-Solr-master-Windows\solr\contrib\extraction\lib\icu4j-56.1.jar;C:\Users\jenkins\workspace\Lucene-Solr-master-Windows\solr\contrib\extraction\lib\isoparser-1.0.2.jar;C:\Users\jenkins\workspace\Lucene-Solr-master-Windows\solr\contrib\extraction\lib\java-libpst-0.8.1.jar;C:\Users\jenkins\workspace\Lucene-Solr-master-Windows\solr\contrib\extraction\lib\jdom-1.0.jar;C:\Users\jenkins\workspace\Lucene-Solr-master-Windows\solr\contrib\extraction\lib\jempbox-1.8.8.jar;C:\Users\jenkins\workspace\Lucene-Solr-master-Windows\solr\contrib\extraction\lib\jmatio-1.0.jar;C:\Users\jenkins\workspace\Lucene-Solr-master-Windows\solr\contrib\extraction\lib\juniversalchardet-1.0.3.jar;C:\Users\jenkins\workspace\Lucene-Solr-master-Windows\solr\contrib\extraction\lib\metadata-extractor-2.6.2.jar;C:\Users\jenkins\workspace\Lucene-Solr-master-Windows\solr\contrib\extraction\lib\pdfbox-1.8.8.jar;C:\Users\jenkins\workspace\Lucene-Solr-master-Windows\solr\contrib\extraction\lib\poi-3.11.jar;C:\Users\jenkins\workspace\Lucene-Solr-master-Windows\solr\contrib\extraction\lib\poi-ooxml-3.11.jar;C:\Users\jenkins\workspace\Lucene-Solr-master-Windows\solr\contrib\extraction\lib\poi-ooxml-schemas-3.11.jar;C:\Users\jenkins\workspace\Lucene-Solr-master-Windows\solr\contrib\extraction\lib\poi-scratchpad-3.11.jar;C:\Users\jenkins\workspace\Lucene-Solr-master-Windows\solr\contrib\extraction\lib\rome-1.0.jar;C:\Users\jenkins\workspace\Lucene-Solr-master-Windows\solr\contrib\extraction\lib\tagsoup-1.2.1.jar;C:\Users\jenkins\workspace\Lucene-Solr-master-Windows\solr\contrib\extraction\lib\tika-core-1.7.jar;C:\Users\jenkins\workspace\Lucene-Solr-master-Windows\solr\contrib\extraction\lib\tika-java7-1.7.jar;C:\Users\jenkins\workspace\Lucene-Solr-master-Windows\solr\contrib\extraction\lib\tika-parsers-1.7.jar;C:\Users\jenkins\workspace\Lucene-Solr-master-Windows\solr\contrib\extraction\lib\tika-xmp-1.7.jar;C:\Users\jenkins\workspace\Lucene-Solr-master-Windows\solr\contrib\extraction\lib\vorbis-java-core-0.6.jar;C:\Users\jenkins\workspace\Lucene-Solr-master-Windows\solr\contrib\extraction\lib\vorbis-java-tika-0.6.jar;C:\Users\jenkins\workspace\Lucene-Solr-master-Windows\solr\contrib\extraction\lib\xercesImpl-2.9.1.jar;C:\Users\jenkins\workspace\Lucene-Solr-master-Windows\solr\contrib\extraction\lib\xmlbeans-2.6.0.jar;C:\Users\jenkins\workspace\Lucene-Solr-master-Windows\solr\contrib\extraction\lib\xmpcore-5.1.2.jar;C:\Users\jenkins\workspace\Lucene-Solr-master-Windows\solr\contrib\extraction\lib\xz-1.5.jar;C:\Users\jenkins\workspace\Lucene-Solr-master-Windows\lucene\test-framework\lib\junit-4.10.jar;C:\Users\jenkins\workspace\Lucene-Solr-master-Windows\lucene\test-framework\lib\randomizedtesting-runner-2.3.2.jar;C:\Users\jenkins\workspace\Lucene-Solr-master-Windows\solr\build\contrib\solr-morphlines-core\classes\java;C:\Users\jenkins\workspace\Lucene-Solr-master-Windows\solr\contrib\morphlines-core\test-lib\aopalliance-1.0.jar;C:\Users\jenkins\workspace\Lucene-Solr-master-Windows\solr\contrib\morphlines-core\test-lib\avro-1.7.5.jar;C:\Users\jenkins\workspace\Lucene-Solr-master-Windows\solr\contrib\morphlines-core\test-lib\commons-collections-3.2.2.jar;C:\Users\jenkins\workspace\Lucene-Solr-master-Windows\solr\contrib\morphlines-core\test-lib\curator-client-2.8.0.jar;C:\Users\jenkins\workspace\Lucene-Solr-master-Windows\solr\contrib\morphlines-core\test-lib\curator-framework-2.8.0.jar;C:\Users\jenkins\workspace\Lucene-Solr-master-Windows\solr\contrib\morphlines-core\test-lib\guice-3.0.jar;C:\Users\jenkins\workspace\Lucene-Solr-master-Windows\solr\contrib\morphlines-core\test-lib\guice-servlet-3.0.jar;C:\Users\jenkins\workspace\Lucene-Solr-master-Windows\solr\contrib\morphlines-core\test-lib\hadoop-common-2.6.0-tests.jar;C:\Users\jenkins\workspace\Lucene-Solr-master-Windows\solr\contrib\morphlines-core\test-lib\hadoop-common-2.6.0.jar;C:\Users\jenkins\workspace\Lucene-Solr-master-Windows\solr\contrib\morphlines-core\test-lib\hadoop-hdfs-2.6.0-tests.jar;C:\Users\jenkins\workspace\Lucene-Solr-master-Windows\solr\contrib\morphlines-core\test-lib\hadoop-mapreduce-client-app-2.6.0.jar;C:\Users\jenkins\workspace\Lucene-Solr-master-Windows\solr\contrib\morphlines-core\test-lib\hadoop-mapreduce-client-common-2.6.0.jar;C:\Users\jenkins\workspace\Lucene-Solr-master-Windows\solr\contrib\morphlines-core\test-lib\hadoop-mapreduce-client-core-2.6.0.jar;C:\Users\jenkins\workspace\Lucene-Solr-master-Windows\solr\contrib\morphlines-core\test-lib\hadoop-mapreduce-client-hs-2.6.0.jar;C:\Users\jenkins\workspace\Lucene-Solr-master-Windows\solr\contrib\morphlines-core\test-lib\hadoop-mapreduce-client-jobclient-2.6.0-tests.jar;C:\Users\jenkins\workspace\Lucene-Solr-master-Windows\solr\contrib\morphlines-core\test-lib\hadoop-mapreduce-client-jobclient-2.6.0.jar;C:\Users\jenkins\workspace\Lucene-Solr-master-Windows\solr\contrib\morphlines-core\test-lib\hadoop-mapreduce-client-shuffle-2.6.0.jar;C:\Users\jenkins\workspace\Lucene-Solr-master-Windows\solr\contrib\morphlines-core\test-lib\hadoop-yarn-api-2.6.0.jar;C:\Users\jenkins\workspace\Lucene-Solr-master-Windows\solr\contrib\morphlines-core\test-lib\hadoop-yarn-client-2.6.0.jar;C:\Users\jenkins\workspace\Lucene-Solr-master-Windows\solr\contrib\morphlines-core\test-lib\hadoop-yarn-common-2.6.0.jar;C:\Users\jenkins\workspace\Lucene-Solr-master-Windows\solr\contrib\morphlines-core\test-lib\hadoop-yarn-server-applicationhistoryservice-2.6.0.jar;C:\Users\jenkins\workspace\Lucene-Solr-master-Windows\solr\contrib\morphlines-core\test-lib\hadoop-yarn-server-common-2.6.0.jar;C:\Users\jenkins\workspace\Lucene-Solr-master-Windows\solr\contrib\morphlines-core\test-lib\hadoop-yarn-server-nodemanager-2.6.0.jar;C:\Users\jenkins\workspace\Lucene-Solr-master-Windows\solr\contrib\morphlines-core\test-lib\hadoop-yarn-server-resourcemanager-2.6.0.jar;C:\Users\jenkins\workspace\Lucene-Solr-master-Windows\solr\contrib\morphlines-core\test-lib\hadoop-yarn-server-tests-2.6.0-tests.jar;C:\Users\jenkins\workspace\Lucene-Solr-master-Windows\solr\contrib\morphlines-core\test-lib\hadoop-yarn-server-web-proxy-2.6.0.jar;C:\Users\jenkins\workspace\Lucene-Solr-master-Windows\solr\contrib\morphlines-core\test-lib\jackson-annotations-2.5.4.jar;C:\Users\jenkins\workspace\Lucene-Solr-master-Windows\solr\contrib\morphlines-core\test-lib\jackson-core-2.5.4.jar;C:\Users\jenkins\workspace\Lucene-Solr-master-Windows\solr\contrib\morphlines-core\test-lib\jackson-core-asl-1.9.13.jar;C:\Users\jenkins\workspa
   [junit4]   2> ce\Lucene-Solr-master-Windows\solr\contrib\morphlines-core\test-lib\jackson-databind-2.5.4.jar;C:\Users\jenkins\workspace\Lucene-Solr-master-Windows\solr\contrib\morphlines-core\test-lib\jackson-jaxrs-1.9.13.jar;C:\Users\jenkins\workspace\Lucene-Solr-master-Windows\solr\contrib\morphlines-core\test-lib\jackson-mapper-asl-1.9.13.jar;C:\Users\jenkins\workspace\Lucene-Solr-master-Windows\solr\contrib\morphlines-core\test-lib\javax.inject-1.jar;C:\Users\jenkins\workspace\Lucene-Solr-master-Windows\solr\contrib\morphlines-core\test-lib\jaxb-impl-2.2.3-1.jar;C:\Users\jenkins\workspace\Lucene-Solr-master-Windows\solr\contrib\morphlines-core\test-lib\jersey-bundle-1.9.jar;C:\Users\jenkins\workspace\Lucene-Solr-master-Windows\solr\contrib\morphlines-core\test-lib\jersey-core-1.9.jar;C:\Users\jenkins\workspace\Lucene-Solr-master-Windows\solr\contrib\morphlines-core\test-lib\jersey-guice-1.9.jar;C:\Users\jenkins\workspace\Lucene-Solr-master-Windows\solr\contrib\morphlines-core\test-lib\jersey-json-1.9.jar;C:\Users\jenkins\workspace\Lucene-Solr-master-Windows\solr\contrib\morphlines-core\test-lib\jersey-server-1.9.jar;C:\Users\jenkins\workspace\Lucene-Solr-master-Windows\solr\contrib\morphlines-core\test-lib\jetty-6.1.26.jar;C:\Users\jenkins\workspace\Lucene-Solr-master-Windows\solr\contrib\morphlines-core\test-lib\jetty-util-6.1.26.jar;C:\Users\jenkins\workspace\Lucene-Solr-master-Windows\solr\contrib\morphlines-core\test-lib\kite-morphlines-core-1.1.0-tests.jar;C:\Users\jenkins\workspace\Lucene-Solr-master-Windows\solr\contrib\morphlines-core\test-lib\kite-morphlines-core-1.1.0.jar;C:\Users\jenkins\workspace\Lucene-Solr-master-Windows\solr\contrib\morphlines-core\test-lib\leveldb-0.7.jar;C:\Users\jenkins\workspace\Lucene-Solr-master-Windows\solr\contrib\morphlines-core\test-lib\leveldb-api-0.7.jar;C:\Users\jenkins\workspace\Lucene-Solr-master-Windows\solr\contrib\morphlines-core\test-lib\leveldbjni-1.8.jar;C:\Users\jenkins\workspace\Lucene-Solr-master-Windows\solr\contrib\morphlines-core\test-lib\mockito-core-1.9.5.jar;C:\Users\jenkins\workspace\Lucene-Solr-master-Windows\solr\contrib\morphlines-core\test-lib\mrunit-1.0.0-hadoop2.jar;C:\Users\jenkins\workspace\Lucene-Solr-master-Windows\solr\contrib\morphlines-core\test-lib\netty-3.7.0.Final.jar;C:\Users\jenkins\workspace\Lucene-Solr-master-Windows\solr\contrib\morphlines-core\test-lib\objenesis-1.2.jar;C:\Users\jenkins\workspace\Lucene-Solr-master-Windows\solr\contrib\morphlines-core\test-lib\paranamer-2.3.jar;C:\Users\jenkins\workspace\Lucene-Solr-master-Windows\solr\contrib\morphlines-core\test-lib\snappy-java-1.0.5.jar;C:\Users\jenkins\tools\hudson.tasks.Ant_AntInstallation\ANT_1.8.2\lib\ant-launcher.jar;C:\Users\jenkins\.ant\lib\ivy-2.3.0.jar;C:\Users\jenkins\tools\hudson.tasks.Ant_AntInstallation\ANT_1.8.2\lib\ant-antlr.jar;C:\Users\jenkins\tools\hudson.tasks.Ant_AntInstallation\ANT_1.8.2\lib\ant-apache-bcel.jar;C:\Users\jenkins\tools\hudson.tasks.Ant_AntInstallation\ANT_1.8.2\lib\ant-apache-bsf.jar;C:\Users\jenkins\tools\hudson.tasks.Ant_AntInstallation\ANT_1.8.2\lib\ant-apache-log4j.jar;C:\Users\jenkins\tools\hudson.tasks.Ant_AntInstallation\ANT_1.8.2\lib\ant-apache-oro.jar;C:\Users\jenkins\tools\hudson.tasks.Ant_AntInstallation\ANT_1.8.2\lib\ant-apache-regexp.jar;C:\Users\jenkins\tools\hudson.tasks.Ant_AntInstallation\ANT_1.8.2\lib\ant-apache-resolver.jar;C:\Users\jenkins\tools\hudson.tasks.Ant_AntInstallation\ANT_1.8.2\lib\ant-apache-xalan2.jar;C:\Users\jenkins\tools\hudson.tasks.Ant_AntInstallation\ANT_1.8.2\lib\ant-commons-logging.jar;C:\Users\jenkins\tools\hudson.tasks.Ant_AntInstallation\ANT_1.8.2\lib\ant-commons-net.jar;C:\Users\jenkins\tools\hudson.tasks.Ant_AntInstallation\ANT_1.8.2\lib\ant-jai.jar;C:\Users\jenkins\tools\hudson.tasks.Ant_AntInstallation\ANT_1.8.2\lib\ant-javamail.jar;C:\Users\jenkins\tools\hudson.tasks.Ant_AntInstallation\ANT_1.8.2\lib\ant-jdepend.jar;C:\Users\jenkins\tools\hudson.tasks.Ant_AntInstallation\ANT_1.8.2\lib\ant-jmf.jar;C:\Users\jenkins\tools\hudson.tasks.Ant_AntInstallation\ANT_1.8.2\lib\ant-jsch.jar;C:\Users\jenkins\tools\hudson.tasks.Ant_AntInstallation\ANT_1.8.2\lib\ant-junit.jar;C:\Users\jenkins\tools\hudson.tasks.Ant_AntInstallation\ANT_1.8.2\lib\ant-junit4.jar;C:\Users\jenkins\tools\hudson.tasks.Ant_AntInstallation\ANT_1.8.2\lib\ant-netrexx.jar;C:\Users\jenkins\tools\hudson.tasks.Ant_AntInstallation\ANT_1.8.2\lib\ant-swing.jar;C:\Users\jenkins\tools\hudson.tasks.Ant_AntInstallation\ANT_1.8.2\lib\ant-testutil.jar;C:\Users\jenkins\tools\hudson.tasks.Ant_AntInstallation\ANT_1.8.2\lib\ant.jar;C:\Users\jenkins\tools\java\64bit\jdk1.8.0_72\lib\tools.jar;C:\Users\jenkins\.ivy2\cache\com.carrotsearch.randomizedtesting\junit4-ant\jars\junit4-ant-2.3.2.jar
   [junit4]   2> 1598 INFO  (TEST-SolrMorphlineZkTest.test-seed#[BED8F84E04765A7B]) [    ] o.a.z.ZooKeeper Client environment:java.library.path=C:\Users\jenkins\tools\java\64bit\jdk1.8.0_72\jre\bin;C:\Windows\Sun\Java\bin;C:\Windows\system32;C:\Windows;C:\Users\jenkins\tools\java\64bit\jdk1.8.0_72\bin;C:\ProgramData\Oracle\Java\javapath;C:\Python35\Scripts\;C:\Python35\;C:\Perl64\site\bin;C:\Perl64\bin;C:\Windows\system32;C:\Windows;C:\Windows\System32\Wbem;C:\Windows\System32\WindowsPowerShell\v1.0\;.
   [junit4]   2> 1598 INFO  (TEST-SolrMorphlineZkTest.test-seed#[BED8F84E04765A7B]) [    ] o.a.z.ZooKeeper Client environment:java.io.tmpdir=./temp
   [junit4]   2> 1598 INFO  (TEST-SolrMorphlineZkTest.test-seed#[BED8F84E04765A7B]) [    ] o.a.z.ZooKeeper Client environment:java.compiler=<NA>
   [junit4]   2> 1598 INFO  (TEST-SolrMorphlineZkTest.test-seed#[BED8F84E04765A7B]) [    ] o.a.z.ZooKeeper Client environment:os.name=Windows 10
   [junit4]   2> 1598 INFO  (TEST-SolrMorphlineZkTest.test-seed#[BED8F84E04765A7B]) [    ] o.a.z.ZooKeeper Client environment:os.arch=amd64
   [junit4]   2> 1598 INFO  (TEST-SolrMorphlineZkTest.test-seed#[BED8F84E04765A7B]) [    ] o.a.z.ZooKeeper Client environment:os.version=10.0
   [junit4]   2> 1598 INFO  (TEST-SolrMorphlineZkTest.test-seed#[BED8F84E04765A7B]) [    ] o.a.z.ZooKeeper Client environment:user.name=jenkins
   [junit4]   2> 1598 INFO  (TEST-SolrMorphlineZkTest.test-seed#[BED8F84E04765A7B]) [    ] o.a.z.ZooKeeper Client environment:user.home=C:\Users\jenkins
   [junit4]   2> 1599 INFO  (TEST-SolrMorphlineZkTest.test-seed#[BED8F84E04765A7B]) [    ] o.a.z.ZooKeeper Client environment:user.dir=C:\Users\jenkins\workspace\Lucene-Solr-master-Windows\solr\build\contrib\solr-morphlines-core\test\J1
   [junit4]   2> 1603 INFO  (TEST-SolrMorphlineZkTest.test-seed#[BED8F84E04765A7B]) [    ] o.a.z.ZooKeeper Initiating client connection, connectString=127.0.0.1:65194 sessionTimeout=45000 watcher=org.apache.solr.common.cloud.SolrZkClient$3@1cfb633d
   [junit4]   2> 1678 INFO  (TEST-SolrMorphlineZkTest.test-seed#[BED8F84E04765A7B]) [    ] o.a.s.c.c.ConnectionManager Waiting for client to connect to ZooKeeper
   [junit4]   2> 1690 INFO  (TEST-SolrMorphlineZkTest.test-seed#[BED8F84E04765A7B]-SendThread(127.0.0.1:65194)) [    ] o.a.z.ClientCnxn Opening socket connection to server 127.0.0.1/127.0.0.1:65194. Will not attempt to authenticate using SASL (unknown error)
   [junit4]   2> 1692 INFO  (TEST-SolrMorphlineZkTest.test-seed#[BED8F84E04765A7B]-SendThread(127.0.0.1:65194)) [    ] o.a.z.ClientCnxn Socket connection established to 127.0.0.1/127.0.0.1:65194, initiating session
   [junit4]   2> 1692 INFO  (NIOServerCxn.Factory:0.0.0.0/0.0.0.0:0) [    ] o.a.z.s.NIOServerCnxnFactory Accepted socket connection from /127.0.0.1:65200
   [junit4]   2> 1718 INFO  (NIOServerCxn.Factory:0.0.0.0/0.0.0.0:0) [    ] o.a.z.s.ZooKeeperServer Client attempting to establish new session at /127.0.0.1:65200
   [junit4]   2> 1733 INFO  (SyncThread:0) [    ] o.a.z.s.p.FileTxnLog Creating new log file: log.1
   [junit4]   2> 1773 INFO  (TEST-SolrMorphlineZkTest.test-seed#[BED8F84E04765A7B]-SendThread(127.0.0.1:65194)) [    ] o.a.z.ClientCnxn Session establishment complete on server 127.0.0.1/127.0.0.1:65194, sessionid = 0x153c29df4030000, negotiated timeout = 20000
   [junit4]   2> 1777 INFO  (SyncThread:0) [    ] o.a.z.s.ZooKeeperServer Established session 0x153c29df4030000 with negotiated timeout 20000 for client /127.0.0.1:65200
   [junit4]   2> 1800 INFO  (zkCallback-1-thread-1) [    ] o.a.s.c.c.ConnectionManager Watcher org.apache.solr.common.cloud.ConnectionManager@3e7e53fa name:ZooKeeperConnection Watcher:127.0.0.1:65194 got event WatchedEvent state:SyncConnected type:None path:null path:null type:None
   [junit4]   2> 1801 INFO  (TEST-SolrMorphlineZkTest.test-seed#[BED8F84E04765A7B]) [    ] o.a.s.c.c.ConnectionManager Client is connected to ZooKeeper
   [junit4]   2> 1809 INFO  (TEST-SolrMorphlineZkTest.test-seed#[BED8F84E04765A7B]) [    ] o.a.s.c.c.SolrZkClient Using default ZkACLProvider
   [junit4]   2> 1818 INFO  (TEST-SolrMorphlineZkTest.test-seed#[BED8F84E04765A7B]) [    ] o.a.s.c.c.SolrZkClient makePath: /solr
   [junit4]   2> 1919 INFO  (ProcessThread(sid:0 cport:-1):) [    ] o.a.z.s.PrepRequestProcessor Processed session termination for sessionid: 0x153c29df4030000
   [junit4]   2> 1920 INFO  (TEST-SolrMorphlineZkTest.test-seed#[BED8F84E04765A7B]) [    ] o.a.z.ZooKeeper Session: 0x153c29df4030000 closed
   [junit4]   2> 1921 INFO  (TEST-SolrMorphlineZkTest.test-seed#[BED8F84E04765A7B]-EventThread) [    ] o.a.z.ClientCnxn EventThread shut down
   [junit4]   2> 1923 INFO  (NIOServerCxn.Factory:0.0.0.0/0.0.0.0:0) [    ] o.a.z.s.NIOServerCnxn Closed socket connection for client /127.0.0.1:65200 which had sessionid 0x153c29df4030000
   [junit4]   2> 1925 INFO  (TEST-SolrMorphlineZkTest.test-seed#[BED8F84E04765A7B]) [    ] o.a.s.c.c.SolrZkClient Using default ZkCredentialsProvider
   [junit4]   2> 1926 INFO  (TEST-SolrMorphlineZkTest.test-seed#[BED8F84E04765A7B]) [    ] o.a.z.ZooKeeper Initiating client connection, connectString=127.0.0.1:65194/solr sessionTimeout=45000 watcher=org.apache.solr.common.cloud.SolrZkClient$3@591dea72
   [junit4]   2> 1927 INFO  (TEST-SolrMorphlineZkTest.test-seed#[BED8F84E04765A7B]) [    ] o.a.s.c.c.ConnectionManager Waiting for client to connect to ZooKeeper
   [junit4]   2> 1931 INFO  (TEST-SolrMorphlineZkTest.test-seed#[BED8F84E04765A7B]-SendThread(127.0.0.1:65194)) [    ] o.a.z.ClientCnxn Opening socket connection to server 127.0.0.1/127.0.0.1:65194. Will not attempt to authenticate using SASL (unknown error)
   [junit4]   2> 1931 INFO  (TEST-SolrMorphlineZkTest.test-seed#[BED8F84E04765A7B]-SendThread(127.0.0.1:65194)) [    ] o.a.z.ClientCnxn Socket connection established to 127.0.0.1/127.0.0.1:65194, initiating session
   [junit4]   2> 1931 INFO  (NIOServerCxn.Factory:0.0.0.0/0.0.0.0:0) [    ] o.a.z.s.NIOServerCnxnFactory Accepted socket connection from /127.0.0.1:65209
   [junit4]   2> 1933 INFO  (NIOServerCxn.Factory:0.0.0.0/0.0.0.0:0) [    ] o.a.z.s.ZooKeeperServer Client attempting to establish new session at /127.0.0.1:65209
   [junit4]   2> 1933 INFO  (SyncThread:0) [    ] o.a.z.s.ZooKeeperServer Established session 0x153c29df4030001 with negotiated timeout 20000 for client /127.0.0.1:65209
   [junit4]   2> 1934 INFO  (TEST-SolrMorphlineZkTest.test-seed#[BED8F84E04765A7B]-SendThread(127.0.0.1:65194)) [    ] o.a.z.ClientCnxn Session establishment complete on server 127.0.0.1/127.0.0.1:65194, sessionid = 0x153c29df4030001, negotiated timeout = 20000
   [junit4]   2> 1934 INFO  (zkCallback-2-thread-1) [    ] o.a.s.c.c.ConnectionManager Watcher org.apache.solr.common.cloud.ConnectionManager@705cd228 name:ZooKeeperConnection Watcher:127.0.0.1:65194/solr got event WatchedEvent state:SyncConnected type:None path:null path:null type:None
   [junit4]   2> 1934 INFO  (TEST-SolrMorphlineZkTest.test-seed#[BED8F84E04765A7B]) [    ] o.a.s.c.c.ConnectionManager Client is connected to ZooKeeper
   [junit4]   2> 1935 INFO  (TEST-SolrMorphlineZkTest.test-seed#[BED8F84E04765A7B]) [    ] o.a.s.c.c.SolrZkClient Using default ZkACLProvider
   [junit4]   2> 1954 INFO  (TEST-SolrMorphlineZkTest.test-seed#[BED8F84E04765A7B]) [    ] o.a.s.c.c.SolrZkClient makePath: /collections/collection1
   [junit4]   2> 1961 INFO  (TEST-SolrMorphlineZkTest.test-seed#[BED8F84E04765A7B]) [    ] o.a.s.c.c.SolrZkClient makePath: /collections/collection1/shards
   [junit4]   2> 1968 INFO  (TEST-SolrMorphlineZkTest.test-seed#[BED8F84E04765A7B]) [    ] o.a.s.c.c.SolrZkClient makePath: /collections/control_collection
   [junit4]   2> 1974 INFO  (TEST-SolrMorphlineZkTest.test-seed#[BED8F84E04765A7B]) [    ] o.a.s.c.c.SolrZkClient makePath: /collections/control_collection/shards
   [junit4]   2> 1981 INFO  (TEST-SolrMorphlineZkTest.test-seed#[BED8F84E04765A7B]) [    ] o.a.s.c.AbstractZkTestCase skipping C:\Users\jenkins\workspace\Lucene-Solr-master-Windows\solr\build\contrib\solr-morphlines-core\test\J1\temp\solr.morphlines.solr.SolrMorphlineZkTest_BED8F84E04765A7B-001\tempDir-001\collection1\conf\solrconfig-tlog.xml because it doesn't exist
   [junit4]   2> 1982 INFO  (TEST-SolrMorphlineZkTest.test-seed#[BED8F84E04765A7B]) [    ] o.a.s.c.AbstractZkTestCase put C:\Users\jenkins\workspace\Lucene-Solr-master-Windows\solr\build\contrib\solr-morphlines-core\test\J1\temp\solr.morphlines.solr.SolrMorphlineZkTest_BED8F84E04765A7B-001\tempDir-001\collection1\conf\schema.xml to /configs/conf1/schema.xml
   [junit4]   2> 1982 INFO  (TEST-SolrMorphlineZkTest.test-seed#[BED8F84E04765A7B]) [    ] o.a.s.c.c.SolrZkClient makePath: /configs/conf1/schema.xml
   [junit4]   2> 1992 INFO  (TEST-SolrMorphlineZkTest.test-seed#[BED8F84E04765A7B]) [    ] o.a.s.c.AbstractZkTestCase skipping C:\Users\jenkins\workspace\Lucene-Solr-master-Windows\solr\build\contrib\solr-morphlines-core\test\J1\temp\solr.morphlines.solr.SolrMorphlineZkTest_BED8F84E04765A7B-001\tempDir-001\collection1\conf\solrconfig.snippet.randomindexconfig.xml because it doesn't exist
   [junit4]   2> 1992 INFO  (TEST-SolrMorphlineZkTest.test-seed#[BED8F84E04765A7B]) [    ] o.a.s.c.AbstractZkTestCase put C:\Users\jenkins\workspace\Lucene-Solr-master-Windows\solr\build\contrib\solr-morphlines-core\test\J1\temp\solr.morphlines.solr.SolrMorphlineZkTest_BED8F84E04765A7B-001\tempDir-001\collection1\conf\stopwords.txt to /configs/conf1/stopwords.txt
   [junit4]   2> 1993 INFO  (TEST-SolrMorphlineZkTest.test-seed#[BED8F84E04765A7B]) [    ] o.a.s.c.c.SolrZkClient makePath: /configs/conf1/stopwords.txt
   [junit4]   2> 1997 INFO  (TEST-SolrMorphlineZkTest.test-seed#[BED8F84E04765A7B]) [    ] o.a.s.c.AbstractZkTestCase put C:\Users\jenkins\workspace\Lucene-Solr-master-Windows\solr\build\contrib\solr-morphlines-core\test\J1\temp\solr.morphlines.solr.SolrMorphlineZkTest_BED8F84E04765A7B-001\tempDir-001\collection1\conf\protwords.txt to /configs/conf1/protwords.txt
   [junit4]   2> 1999 INFO  (TEST-SolrMorphlineZkTest.test-seed#[BED8F84E04765A7B]) [    ] o.a.s.c.c.SolrZkClient makePath: /configs/conf1/protwords.txt
   [junit4]   2> 2006 INFO  (TEST-SolrMorphlineZkTest.test-seed#[BED8F84E04765A7B]) [    ] o.a.s.c.AbstractZkTestCase put C:\Users\jenkins\workspace\Lucene-Solr-master-Windows\solr\build\contrib\solr-morphlines-core\test\J1\temp\solr.morphlines.solr.SolrMorphlineZkTest_BED8F84E04765A7B-001\tempDir-001\collection1\conf\currency.xml to /configs/conf1/currency.xml
   [junit4]   2> 2007 INFO  (TEST-SolrMorphlineZkTest.test-seed#[BED8F84E04765A7B]) [    ] o.a.s.c.c.SolrZkClient makePath: /configs/conf1/currency.xml
   [junit4]   2> 2015 INFO  (TEST-SolrMorphlineZkTest.test-seed#[BED8F84E04765A7B]) [    ] o.a.s.c.AbstractZkTestCase skipping C:\Users\jenkins\workspace\Lucene-Solr-master-Windows\solr\build\contrib\solr-morphlines-core\test\J1\temp\solr.morphlines.solr.SolrMorphlineZkTest_BED8F84E04765A7B-001\tempDir-001\collection1\conf\enumsConfig.xml because it doesn't exist
   [junit4]   2> 2015 INFO  (TEST-SolrMorphlineZkTest.test-seed#[BED8F84E04765A7B]) [    ] o.a.s.c.AbstractZkTestCase skipping C:\Users\jenkins\workspace\Lucene-Solr-master-Windows\solr\build\contrib\solr-morphlines-core\test\J1\temp\solr.morphlines.solr.SolrMorphlineZkTest_BED8F84E04765A7B-001\tempDir-001\collection1\conf\open-exchange-rates.json because it doesn't exist
   [junit4]   2> 2015 INFO  (TEST-SolrMorphlineZkTest.test-seed#[BED8F84E04765A7B]) [    ] o.a.s.c.AbstractZkTestCase skipping C:\Users\jenkins\workspace\Lucene-Solr-master-Windows\solr\build\contrib\solr-morphlines-core\test\J1\temp\solr.morphlines.solr.SolrMorphlineZkTest_BED8F84E04765A7B-001\tempDir-001\collection1\conf\mapping-ISOLatin1Accent.txt because it doesn't exist
   [junit4]   2> 2015 INFO  (TEST-SolrMorphlineZkTest.test-seed#[BED8F84E04765A7B]) [    ] o.a.s.c.AbstractZkTestCase skipping C:\Users\jenkins\workspace\Lucene-Solr-master-Windows\solr\build\contrib\solr-morphlines-core\test\J1\temp\solr.morphlines.solr.SolrMorphlineZkTest_BED8F84E04765A7B-001\tempDir-001\collection1\conf\old_synonyms.txt because it doesn't exist
   [junit4]   2> 2016 INFO  (TEST-SolrMorphlineZkTest.test-seed#[BED8F84E04765A7B]) [    ] o.a.s.c.AbstractZkTestCase put C:\Users\jenkins\workspace\Lucene-Solr-master-Windows\solr\build\contrib\solr-morphlines-core\test\J1\temp\solr.morphlines.solr.SolrMorphlineZkTest_BED8F84E04765A7B-001\tempDir-001\collection1\conf\synonyms.txt to /configs/conf1/synonyms.txt
   [junit4]   2> 2016 INFO  (TEST-SolrMorphlineZkTest.test-seed#[BED8F84E04765A7B]) [    ] o.a.s.c.c.SolrZkClient makePath: /configs/conf1/synonyms.txt
   [junit4]   2> 2024 INFO  (ProcessThread(sid:0 cport:-1):) [    ] o.a.z.s.PrepRequestProcessor Processed session termination for sessionid: 0x153c29df4030001
   [junit4]   2> 2025 INFO  (TEST-SolrMorphlineZkTest.test-seed#[BED8F84E04765A7B]) [    ] o.a.z.ZooKeeper Session: 0x153c29df4030001 closed
   [junit4]   2> 2025 INFO  (NIOServerCxn.Factory:0.0.0.0/0.0.0.0:0) [    ] o.a.z.s.NIOServerCnxn Closed socket connection for client /127.0.0.1:65209 which had sessionid 0x153c29df4030001
   [junit4]   2> 2025 INFO  (TEST-SolrMorphlineZkTest.test-seed#[BED8F84E04765A7B]-EventThread) [    ] o.a.z.ClientCnxn EventThread shut down
   [junit4]   2> 2027 INFO  (TEST-SolrMorphlineZkTest.test-seed#[BED8F84E04765A7B]) [    ] o.a.s.c.c.SolrZkClient Using default ZkCredentialsProvider
   [junit4]   2> 2027 INFO  (TEST-SolrMorphlineZkTest.test-seed#[BED8F84E04765A7B]) [    ] o.a.z.ZooKeeper Initiating client connection, connectString=127.0.0.1:65194/solr sessionTimeout=10000 watcher=org.apache.solr.common.cloud.SolrZkClient$3@7d558225
   [junit4]   2> 2029 INFO  (TEST-SolrMorphlineZkTest.test-seed#[BED8F84E04765A7B]) [    ] o.a.s.c.c.ConnectionManager Waiting for client to connect to ZooKeeper
   [junit4]   2> 2030 INFO  (TEST-SolrMorphlineZkTest.test-seed#[BED8F84E04765A7B]-SendThread(127.0.0.1:65194)) [    ] o.a.z.ClientCnxn Opening socket connection to server 127.0.0.1/127.0.0.1:65194. Will not attempt to authenticate using SASL (unknown error)
   [junit4]   2> 2031 INFO  (NIOServerCxn.Factory:0.0.0.0/0.0.0.0:0) [    ] o.a.z.s.NIOServerCnxnFactory Accepted socket connection from /127.0.0.1:65212
   [junit4]   2> 2031 INFO  (TEST-SolrMorphlineZkTest.test-seed#[BED8F84E04765A7B]-SendThread(127.0.0.1:65194)) [    ] o.a.z.ClientCnxn Socket connection established to 127.0.0.1/127.0.0.1:65194, initiating session
   [junit4]   2> 2032 INFO  (NIOServerCxn.Factory:0.0.0.0/0.0.0.0:0) [    ] o.a.z.s.ZooKeeperServer Client attempting to establish new session at /127.0.0.1:65212
   [junit4]   2> 2034 INFO  (SyncThread:0) [    ] o.a.z.s.ZooKeeperServer Established session 0x153c29df4030002 with negotiated timeout 10000 for client /127.0.0.1:65212
   [junit4]   2> 2034 INFO  (TEST-SolrMorphlineZkTest.test-seed#[BED8F84E04765A7B]-SendThread(127.0.0.1:65194)) [    ] o.a.z.ClientCnxn Session establishment complete on server 127.0.0.1/127.0.0.1:65194, sessionid = 0x153c29df4030002, negotiated timeout = 10000
   [junit4]   2> 2036 INFO  (zkCallback-3-thread-1) [    ] o.a.s.c.c.ConnectionManager Watcher org.apache.solr.common.cloud.ConnectionManager@7c94a50 name:ZooKeeperConnection Watcher:127.0.0.1:65194/solr got event WatchedEvent state:SyncConnected type:None path:null path:null type:None
   [junit4]   2> 2036 INFO  (TEST-SolrMorphlineZkTest.test-seed#[BED8F84E04765A7B]) [    ] o.a.s.c.c.ConnectionManager Client is connected to ZooKeeper
   [junit4]   2> 2037 INFO  (TEST-SolrMorphlineZkTest.test-seed#[BED8F84E04765A7B]) [    ] o.a.s.c.c.SolrZkClient Using default ZkACLProvider
   [junit4]   1> put C:\Users\jenkins\workspace\Lucene-Solr-master-Windows\solr\contrib\morphlines-core\src\test-files\solr\collection1\conf\currency.xml to /configs/conf1/currency.xml
   [junit4]   2> 2038 INFO  (TEST-SolrMorphlineZkTest.test-seed#[BED8F84E04765A7B]) [    ] o.a.s.c.c.SolrZkClient makePath: /configs/conf1/currency.xml
   [junit4]   1> put C:\Users\jenkins\workspace\Lucene-Solr-master-Windows\solr\contrib\morphlines-core\src\test-files\solr\collection1\conf\elevate.xml to /configs/conf1/elevate.xml
   [junit4]   2> 2060 INFO  (TEST-SolrMorphlineZkTest.test-seed#[BED8F84E04765A7B]) [    ] o.a.s.c.c.SolrZkClient makePath: /configs/conf1/elevate.xml
   [junit4]   1> put C:\Users\jenkins\workspace\Lucene-Solr-master-Windows\solr\contrib\morphlines-core\src\test-files\solr\collection1\conf\lang\contractions_ca.txt to /configs/conf1/lang/contractions_ca.txt
   [junit4]   2> 2069 INFO  (TEST-SolrMorphlineZkTest.test-seed#[BED8F84E04765A7B]) [    ] o.a.s.c.c.SolrZkClient makePath: /configs/conf1/lang/contractions_ca.txt
   [junit4]   1> put C:\Users\jenkins\workspace\Lucene-Solr-master-Windows\solr\contrib\morphlines-core\src\test-files\solr\collection1\conf\lang\contractions_fr.txt to /configs/conf1/lang/contractions_fr.txt
   [junit4]   2> 2076 INFO  (TEST-SolrMorphlineZkTest.test-seed#[BED8F84E04765A7B]) [    ] o.a.s.c.c.SolrZkClient makePath: /configs/conf1/lang/contractions_fr.txt
   [junit4]   1> put C:\Users\jenkins\workspace\Lucene-Solr-master-Windows\solr\contrib\morphlines-core\src\test-files\solr\collection1\conf\lang\contractions_ga.txt to /configs/conf1/lang/contractions_ga.txt
   [junit4]   2> 2081 INFO  (TEST-SolrMorphlineZkTest.test-seed#[BED8F84E04765A7B]) [    ] o.a.s.c.c.SolrZkClient makePath: /configs/conf1/lang/contractions_ga.txt
   [junit4]   1> put C:\Users\jenkins\workspace\Lucene-Solr-master-Windows\solr\contrib\morphlines-core\src\test-files\solr\collection1\conf\lang\contractions_it.txt to /configs/conf1/lang/contractions_it.txt
   [junit4]   2> 2086 INFO  (TEST-SolrMorphlineZkTest.test-seed#[BED8F84E04765A7B]) [    ] o.a.s.c.c.SolrZkClient makePath: /configs/conf1/lang/contractions_it.txt
   [junit4]   1> put C:\Users\jenkins\workspace\Lucene-Solr-master-Windows\solr\contrib\morphlines-core\src\test-files\solr\collection1\conf\lang\hyphenations_ga.txt to /configs/conf1/lang/hyphenations_ga.txt
   [junit4]   2> 2089 INFO  (TEST-SolrMorphlineZkTest.test-seed#[BED8F84E04765A7B]) [    ] o.a.s.c.c.SolrZkClient makePath: /configs/conf1/lang/hyphenations_ga.txt
   [junit4]   1> put C:\Users\jenkins\workspace\Lucene-Solr-master-Windows\solr\contrib\morphlines-core\src\test-files\solr\collection1\conf\lang\stemdict_nl.txt to /configs/conf1/lang/stemdict_nl.txt
   [junit4]   2> 2095 INFO  (TEST-SolrMorphlineZkTest.test-seed#[BED8F84E04765A7B]) [    ] o.a.s.c.c.SolrZkClient makePath: /configs/conf1/lang/stemdict_nl.txt
   [junit4]   1> put C:\Users\jenkins\workspace\Lucene-Solr-master-Windows\solr\contrib\morphlines-core\src\test-files\solr\collection1\conf\lang\stoptags_ja.txt to /configs/conf1/lang/stoptags_ja.txt
   [junit4]   2> 2099 INFO  (TEST-SolrMorphlineZkTest.test-seed#[BED8F84E04765A7B]) [    ] o.a.s.c.c.SolrZkClient makePath: /configs/conf1/lang/stoptags_ja.txt
   [junit4]   1> put C:\Users\jenkins\workspace\Lucene-Solr-master-Windows\solr\contrib\morphlines-core\src\test-files\solr\collection1\conf\lang\stopwords_ar.txt to /configs/conf1/lang/stopwords_ar.txt
   [junit4]   2> 2104 INFO  (TEST-SolrMorphlineZkTest.test-seed#[BED8F84E04765A7B]) [    ] o.a.s.c.c.SolrZkClient makePath: /configs/conf1/lang/stopwords_ar.txt
   [junit4]   1> put C:\Users\jenkins\workspace\Lucene-Solr-master-Windows\solr\contrib\morphlines-core\src\test-files\solr\collection1\conf\lang\stopwords_bg.txt to /configs/conf1/lang/stopwords_bg.txt
   [junit4]   2> 2113 INFO  (TEST-SolrMorphlineZkTest.test-seed#[BED8F84E04765A7B]) [    ] o.a.s.c.c.SolrZkClient makePath: /configs/conf1/lang/stopwords_bg.txt
   [junit4]   1> put C:\Users\jenkins\workspace\Lucene-Solr-master-Windows\solr\contrib\morphlines-core\src\test-files\solr\collection1\conf\lang\stopwords_ca.txt to /configs/conf1/lang/stopwords_ca.txt
   [junit4]   2> 2118 INFO  (TEST-SolrMorphlineZkTest.test-seed#[BED8F84E04765A7B]) [    ] o.a.s.c.c.SolrZkClient makePath: /configs/conf1/lang/stopwords_ca.txt
   [junit4]   1> put C:\Users\jenkins\workspace\Lucene-Solr-master-Windows\solr\contrib\morphlines-core\src\test-files\solr\collection1\conf\lang\stopwords_cz.txt to /configs/conf1/lang/stopwords_cz.txt
   [junit4]   2> 2124 INFO  (TEST-SolrMorphlineZkTest.test-seed#[BED8F84E04765A7B]) [    ] o.a.s.c.c.SolrZkClient makePath: /configs/conf1/lang/stopwords_cz.txt
   [junit4]   1> put C:\Users\jenkins\workspace\Lucene-Solr-master-Windows\solr\contrib\morphlines-core\src\test-files\solr\collection1\conf\lang\stopwords_da.txt to /configs/conf1/lang/stopwords_da.txt
   [junit4]   2> 2130 INFO  (TEST-SolrMorphlineZkTest.test-seed#[BED8F84E04765A7B]) [    ] o.a.s.c.c.SolrZkClient makePath: /configs/conf1/lang/stopwords_da.txt
   [junit4]   1> put C:\Users\jenkins\workspace\Lucene-Solr-master-Windows\solr\contrib\morphlines-core\src\test-files\solr\collection1\conf\lang\stopwords_de.txt to /configs/conf1/lang/stopwords_de.txt
   [junit4]   2> 2135 INFO  (TEST-SolrMorphlineZkTest.test-seed#[BED8F84E04765A7B]) [    ] o.a.s.c.c.SolrZkClient makePath: /configs/conf1/lang/stopwords_de.txt
   [junit4]   1> put C:\Users\jenkins\workspace\Lucene-Solr-master-Windows\solr\contrib\morphlines-core\src\test-files\solr\collection1\conf\lang\stopwords_el.txt to /configs/conf1/lang/stopwords_el.txt
   [junit4]   2> 2141 INFO  (TEST-SolrMorphlineZkTest.test-seed#[BED8F84E04765A7B]) [    ] o.a.s.c.c.SolrZkClient makePath: /configs/conf1/lang/stopwords_el.txt
   [junit4]   1> put C:\Users\jenkins\workspace\Lucene-Solr-master-Windows\solr\contrib\morphlines-core\src\test-files\solr\collection1\conf\lang\stopwords_en.txt to /configs/conf1/lang/stopwords_en.txt
   [junit4]   2> 2146 INFO  (TEST-SolrMorphlineZkTest.test-seed#[BED8F84E04765A7B]) [    ] o.a.s.c.c.SolrZkClient makePath: /configs/conf1/lang/stopwords_en.txt
   [junit4]   1> put C:\Users\jenkins\workspace\Lucene-Solr-master-Windows\solr\contrib\morphlines-core\src\test-files\solr\collection1\conf\lang\stopwords_es.txt to /configs/conf1/lang/stopwords_es.txt
   [junit4]   2> 2151 INFO  (TEST-SolrMorphlineZkTest.test-seed#[BED8F84E04765A7B]) [    ] o.a.s.c.c.SolrZkClient makePath: /configs/conf1/lang/stopwords_es.txt
   [junit4]   1> put C:\Users\jenkins\workspace\Lucene-Solr-master-Windows\solr\contrib\morphlines-core\src\test-files\solr\collection1\conf\lang\stopwords_eu.txt to /configs/conf1/lang/stopwords_eu.txt
   [junit4]   2> 2155 INFO  (TEST-SolrMorphlineZkTest.test-seed#[BED8F84E04765A7B]) [    ] o.a.s.c.c.SolrZkClient makePath: /configs/conf1/lang/stopwords_eu.txt
   [junit4]   1> put C:\Users\jenkins\workspace\Lucene-Solr-master-Windows\solr\contrib\morphlines-core\src\test-files\solr\collection1\conf\lang\stopwords_fa.txt to /configs/conf1/lang/stopwords_fa.txt
   [junit4]   2> 2160 INFO  (TEST-SolrMorphlineZkTest.test-seed#[BED8F84E04765A7B]) [    ] o.a.s.c.c.SolrZkClient makePath: /configs/conf1/lang/stopwords_fa.txt
   [junit4]   1> put C:\Users\jenkins\workspace\Lucene-Solr-master-Windows\solr\contrib\morphlines-core\src\test-files\solr\collection1\conf\lang\stopwords_fi.txt to /configs/conf1/lang/stopwords_fi.txt
   [junit4]   2> 2166 INFO  (TEST-SolrMorphlineZkTest.test-seed#[BED8F84E04765A7B]) [    ] o.a.s.c.c.SolrZkClient makePath: /configs/conf1/lang/stopwords_fi.txt
   [junit4]   1> put C:\Users\jenkins\workspace\Lucene-Solr-master-Windows\solr\contrib\morphlines-core\src\test-files\solr\collection1\conf\lang\stopwords_fr.txt to /configs/conf1/lang/stopwords_fr.txt
   [junit4]   2> 2169 INFO  (TEST-SolrMorphlineZkTest.test-seed#[BED8F84E04765A7B]) [    ] o.a.s.c.c.SolrZkClient makePath: /configs/conf1/lang/stopwords_fr.txt
   [junit4]   1> put C:\Users\jenkins\workspace\Lucene-Solr-master-Windows\solr\contrib\morphlines-core\src\test-files\solr\collection1\conf\lang\stopwords_ga.txt to /configs/conf1/lang/stopwords_ga.txt
   [junit4]   2> 2174 INFO  (TEST-SolrMorphlineZkTest.test-seed#[BED8F84E04765A7B]) [    ] o.a.s.c.c.SolrZkClient makePath: /configs/conf1/lang/stopwords_ga.txt
   [junit4]   1> put C:\Users\jenkins\workspace\Lucene-Solr-master-Windows\solr\contrib\morphlines-core\src\test-files\solr\collection1\conf\lang\stopwords_gl.txt to /configs/conf1/lang/stopwords_gl.txt
   [junit4]   2> 2185 INFO  (TEST-SolrMorphlineZkTest.test-seed#[BED8F84E04765A7B]) [    ] o.a.s.c.c.SolrZkClient makePath: /configs/conf1/lang/stopwords_gl.txt
   [junit4]   1> put C:\Users\jenkins\workspace\Lucene-Solr-master-Windows\solr\contrib\morphlines-core\src\test-files\solr\collection1\conf\lang\stopwords_hi.txt to /configs/conf1/lang/stopwords_hi.txt
   [junit4]   2> 2190 INFO  (TEST-SolrMorphlineZkTest.test-seed#[BED8F84E04765A7B]) [    ] o.a.s.c.c.SolrZkClient makePath: /configs/conf1/lang/stopwords_hi.txt
   [junit4]   1> put C:\Users\jenkins\workspace\Lucene-Solr-master-Windows\solr\contrib\morphlines-core\src\test-files\solr\collection1\conf\lang\stopwords_hu.txt to /configs/conf1/lang/stopwords_hu.txt
   [junit4]   2> 2195 INFO  (TEST-SolrMorphlineZkTest.test-seed#[BED8F84E04765A7B]) [    ] o.a.s.c.c.SolrZkClient makePath: /configs/conf1/lang/stopwords_hu.txt
   [junit4]   1> put C:\Users\jenkins\workspace\Lucene-Solr-master-Windows\solr\contrib\morphlines-core\src\test-files\solr\collection1\conf\lang\stopwords_hy.txt to /configs/conf1/lang/stopwords_hy.txt
   [junit4]   2> 2200 INFO  (TEST-SolrMorphlineZkTest.test-seed#[BED8F84E04765A7B]) [    ] o.a.s.c.c.SolrZkClient makePath: /configs/conf1/lang/stopwords_hy.txt
   [junit4]   1> put C:\Users\jenkins\workspace\Lucene-Solr-master-Windows\solr\contrib\morphlines-core\src\test-files\solr\collection1\conf\lang\stopwords_id.txt to /configs/conf1/lang/stopwords_id.txt
   [junit4]   2> 2206 INFO  (TEST-SolrMorphlineZkTest.test-seed#[BED8F84E04765A7B]) [    ] o.a.s.c.c.SolrZkClient makePath: /configs/conf1/lang/stopwords_id.txt
   [junit4]   1> put C:\Users\jenkins\workspace\Lucene-Solr-master-Windows\solr\contrib\morphlines-core\src\test-files\solr\collection1\conf\lang\stopwords_it.txt to /configs/conf1/lang/stopwords_it.txt
   [junit4]   2> 2211 INFO  (TEST-SolrMorphlineZkTest.test-seed#[BED8F84E04765A7B]) [    ] o.a.s.c.c.SolrZkClient makePath: /configs/conf1/lang/stopwords_it.txt
   [junit4]   1> put C:\Users\jenkins\workspace\Lucene-Solr-master-Windows\solr\contrib\morphlines-core\src\test-files\solr\collection1\conf\lang\stopwords_ja.txt to /configs/conf1/lang/stopwords_ja.txt
   [junit4]   2> 2215 INFO  (TEST-SolrMorphlineZkTest.test-seed#[BED8F84E04765A7B]) [    ] o.a.s.c.c.SolrZkClient makePath: /configs/conf1/lang/stopwords_ja.txt
   [junit4]   1> put C:\Users\jenkins\workspace\Lucene-Solr-master-Windows\solr\contrib\morphlines-core\src\test-files\solr\collection1\conf\lang\stopwords_lv.txt to /configs/conf1/lang/stopwords_lv.txt
   [junit4]   2> 2221 INFO  (TEST-SolrMorphlineZkTest.test-seed#[BED8F84E04765A7B]) [    ] o.a.s.c.c.SolrZkClient makePath: /configs/conf1/lang/stopwords_lv.txt
   [junit4]   1> put C:\Users\jenkins\workspace\Lucene-Solr-master-Windows\solr\contrib\morphlines-core\src\test-files\solr\collection1\conf\lang\stopwords_nl.txt to /configs/conf1/lang/stopwords_nl.txt
   [junit4]   2> 2226 INFO  (TEST-SolrMorphlineZkTest.test-seed#[BED8F84E04765A7B]) [    ] o.a.s.c.c.SolrZkClient makePath: /configs/conf1/lang/stopwords_nl.txt
   [junit4]   1> put C:\Users\jenkins\workspace\Lucene-Solr-master-Windows\solr\contrib\morphlines-core\src\test-files\solr\collection1\conf\lang\stopwords_no.txt to /configs/conf1/lang/stopwords_no.txt
   [junit4]   2> 2230 INFO  (TEST-SolrMorphlineZkTest.test-seed#[BED8F84E04765A7B]) [    ] o.a.s.c.c.SolrZkClient makePath: /configs/conf1/lang/stopwords_no.txt
   [junit4]   1> put C:\Users\jenkins\workspace\Lucene-Solr-master-Windows\solr\contrib\morphlines-core\src\test-files\solr\collection1\conf\lang\stopwords_pt.txt to /configs/conf1/lang/stopwords_pt.txt
   [junit4]   2> 2235 INFO  (TEST-SolrMorphlineZkTest.test-seed#[BED8F84E04765A7B]) [    ] o.a.s.c.c.SolrZkClient makePath: /configs/conf1/lang/stopwords_pt.txt
   [junit4]   1> put C:\Users\jenkins\workspace\Lucene-Solr-master-Windows\solr\contrib\morphlines-core\src\test-files\solr\collection1\conf\lang\stopwords_ro.txt to /configs/conf1/lang/stopwords_ro.txt
   [junit4]   2> 2252 INFO  (TEST-SolrMorphlineZkTest.test-seed#[BED8F84E04765A7B]) [    ] o.a.s.c.c.SolrZkClient makePath: /configs/conf1/lang/stopwords_ro.txt
   [junit4]   1> put C:\Users\jenkins\workspace\Lucene-Solr-master-Windows\solr\contrib\morphlines-core\src\test-files\solr\collection1\conf\lang\stopwords_ru.txt to /configs/conf1/lang/stopwords_ru.txt
   [junit4]   2> 2256 INFO  (TEST-SolrMorphlineZkTest.test-seed#[BED8F84E04765A7B]) [    ] o.a.s.c.c.SolrZkClient makePath: /configs/conf1/lang/stopwords_ru.txt
   [junit4]   1> put C:\Users\jenkins\workspace\Lucene-Solr-master-Windows\solr\contrib\morphlines-core\src\test-files\solr\collection1\conf\lang\stopwords_sv.txt to /configs/conf1/lang/stopwords_sv.txt
   [junit4]   2> 2259 INFO  (TEST-SolrMorphlineZkTest.test-seed#[BED8F84E04765A7B]) [    ] o.a.s.c.c.SolrZkClient makePath: /configs/conf1/lang/stopwords_sv.txt
   [junit4]   1> put C:\Users\jenkins\workspace\Lucene-Solr-master-Windows\solr\contrib\morphlines-core\src\test-files\solr\collection1\conf\lang\stopwords_th.txt to /configs/conf1/lang/stopwords_th.txt
   [junit4]   2> 2263 INFO  (TEST-SolrMorphlineZkTest.test-seed#[BED8F84E04765A7B]) [    ] o.a.s.c.c.SolrZkClient makePath: /configs/conf1/lang/stopwords_th.txt
   [junit4]   1> put C:\Users\jenkins\workspace\Lucene-Solr-master-Windows\solr\contrib\morphlines-core\src\test-files\solr\collection1\conf\lang\stopwords_tr.txt to /configs/conf1/lang/stopwords_tr.txt
   [junit4]   2> 2267 INFO  (TEST-SolrMorphlineZkTest.test-seed#[BED8F84E04765A7B]) [    ] o.a.s.c.c.SolrZkClient makePath: /configs/conf1/lang/stopwords_tr.txt
   [junit4]   1> put C:\Users\jenkins\workspace\Lucene-Solr-master-Windows\solr\contrib\morphlines-core\src\test-files\solr\collection1\conf\lang\userdict_ja.txt to /configs/conf1/lang/userdict_ja.txt
   [junit4]   2> 2273 INFO  (TEST-SolrMorphlineZkTest.test-seed#[BED8F84E04765A7B]) [    ] o.a.s.c.c.SolrZkClient makePath: /configs/conf1/lang/userdict_ja.txt
   [junit4]   1> put C:\Users\jenkins\workspace\Lucene-Solr-master-Windows\solr\contrib\morphlines-core\src\test-files\solr\collection1\conf\protwords.txt to /configs/conf1/protwords.txt
   [junit4]   2> 2277 INFO  (TEST-SolrMorphlineZkTest.test-seed#[BED8F84E04765A7B]) [    ] o.a.s.c.c.SolrZkClient makePath: /configs/conf1/protwords.txt
   [junit4]   1> put C:\Users\jenkins\workspace\Lucene-Solr-master-Windows\solr\contrib\morphlines-core\src\test-files\solr\collection1\conf\schema.xml to /configs/conf1/schema.xml
   [junit4]   2> 2281 INFO  (TEST-SolrMorphlineZkTest.test-seed#[BED8F84E04765A7B]) [    ] o.a.s.c.c.SolrZkClient makePath: /configs/conf1/schema.xml
   [junit4]   1> put C:\Users\jenkins\workspace\Lucene-Solr-master-Windows\solr\contrib\morphlines-core\src\test-files\solr\collection1\conf\solrconfig.xml to /configs/conf1/solrconfig.xml
   [junit4]   2> 2286 INFO  (TEST-SolrMorphlineZkTest.test-seed#[BED8F84E04765A7B]) [    ] o.a.s.c.c.SolrZkClient makePath: /configs/conf1/solrconfig.xml
   [junit4]   1> put C:\Users\jenkins\workspace\Lucene-Solr-master-Windows\solr\contrib\morphlines-core\src\test-files\solr\collection1\conf\stopwords.txt to /configs/conf1/stopwords.txt
   [junit4]   2> 2290 INFO  (TEST-SolrMorphlineZkTest.test-seed#[BED8F84E04765A7B]) [    ] o.a.s.c.c.SolrZkClient makePath: /configs/conf1/stopwords.txt
   [junit4]   1> put C:\Users\jenkins\workspace\Lucene-Solr-master-Windows\solr\contrib\morphlines-core\src\test-files\solr\collection1\conf\synonyms.txt to /configs/conf1/synonyms.txt
   [junit4]   2> 2299 INFO  (TEST-SolrMorphlineZkTest.test-seed#[BED8F84E04765A7B]) [    ] o.a.s.c.c.SolrZkClient makePath: /configs/conf1/synonyms.txt
   [junit4]   2> 2305 INFO  (ProcessThread(sid:0 cport:-1):) [    ] o.a.z.s.PrepRequestProcessor Processed session termination for sessionid: 0x153c29df4030002
   [junit4]   2> 2305 INFO  (TEST-SolrMorphlineZkTest.test-seed#[BED8F84E04765A7B]) [    ] o.a.z.ZooKeeper Session: 0x153c29df4030002 closed
   [junit4]   2> 2306 INFO  (TEST-SolrMorphlineZkTest.test-seed#[BED8F84E04765A7B]-EventThread) [    ] o.a.z.ClientCnxn EventThread shut down
   [junit4]   2> 2310 WARN  (NIOServerCxn.Factory:0.0.0.0/0.0.0.0:0) [    ] o.a.z.s.NIOServerCnxn caught end of stream exception
   [junit4]   2> EndOfStreamException: Unable to read additional data from client sessionid 0x153c29df4030002, likely client has closed socket
   [junit4]   2> 	at org.apache.zookeeper.server.NIOServerCnxn.doIO(NIOServerCnxn.java:228)
   [junit4]   2> 	at org.apache.zookeeper.server.NIOServerCnxnFactory.run(NIOServerCnxnFactory.java:208)
   [junit4]   2> 	at java.lang.Thread.run(Thread.java:745)
   [junit4]   2> 2319 INFO  (NIOServerCxn.Factory:0.0.0.0/0.0.0.0:0) [    ] o.a.z.s.NIOServerCnxn Closed socket connection for client /127.0.0.1:65212 which had sessionid 0x153c29df4030002
   [junit4]   2> 2672 INFO  (TEST-SolrMorphlineZkTest.test-seed#[BED8F84E04765A7B]) [    ] o.a.s.SolrTestCaseJ4 Writing core.properties file to C:\Users\jenkins\workspace\Lucene-Solr-master-Windows\solr\build\contrib\solr-morphlines-core\test\J1\temp\solr.morphlines.solr.SolrMorphlineZkTest_BED8F84E04765A7B-001\control-001\cores\collection1
   [junit4]   2> 2772 INFO  (TEST-SolrMorphlineZkTest.test-seed#[BED8F84E04765A7B]) [    ] o.e.j.u.log Logging initialized @8718ms
   [junit4]   2> 3390 INFO  (TEST-SolrMorphlineZkTest.test-seed#[BED8F84E04765A7B]) [    ] o.e.j.s.Server jetty-9.3.8.v20160314
   [junit4]   2> 3502 INFO  (TEST-SolrMorphlineZkTest.test-seed#[BED8F84E04765A7B]) [    ] o.e.j.s.h.ContextHandler Started o.e.j.s.ServletContextHandler@30bcba7a{/,null,AVAILABLE}
   [junit4]   2> 3541 INFO  (TEST-SolrMorphlineZkTest.test-seed#[BED8F84E04765A7B]) [    ] o.e.j.s.ServerConnector Started ServerConnector@4ae9ce3{HTTP/1.1,[http/1.1]}{127.0.0.1:65213}
   [junit4]   2> 3543 INFO  (TEST-SolrMorphlineZkTest.test-seed#[BED8F84E04765A7B]) [    ] o.e.j.s.Server Started @9491ms
   [junit4]   2> 3545 INFO  (TEST-SolrMorphlineZkTest.test-seed#[BED8F84E04765A7B]) [    ] o.a.s.c.s.e.JettySolrRunner Jetty properties: {solr.data.dir=C:\Users\jenkins\workspace\Lucene-Solr-master-Windows\solr\build\contrib\solr-morphlines-core\test\J1\temp\solr.morphlines.solr.SolrMorphlineZkTest_BED8F84E04765A7B-001\tempDir-002/control/data, hostContext=/, hostPort=65213, coreRootDirectory=C:\Users\jenkins\workspace\Lucene-Solr-master-Windows\solr\build\contrib\solr-morphlines-core\test\J1\..\..\..\..\..\..\..\..\..\..\Users\jenkins\workspace\Lucene-Solr-master-Windows\solr\build\contrib\solr-morphlines-core\test\J1\temp\solr.morphlines.solr.SolrMorphlineZkTest_BED8F84E04765A7B-001\control-001\cores}
   [junit4]   2> 3597 INFO  (TEST-SolrMorphlineZkTest.test-seed#[BED8F84E04765A7B]) [    ] o.a.s.s.SolrDispatchFilter SolrDispatchFilter.init(): sun.misc.Launcher$AppClassLoader@73d16e93
   [junit4]   2> 3700 INFO  (TEST-SolrMorphlineZkTest.test-seed#[BED8F84E04765A7B]) [    ] o.a.s.c.SolrResourceLoader new SolrResourceLoader for directory: 'C:\Users\jenkins\workspace\Lucene-Solr-master-Windows\solr\build\contrib\solr-morphlines-core\test\J1\temp\solr.morphlines.solr.SolrMorphlineZkTest_BED8F84E04765A7B-001\control-001'
   [junit4]   2> 3714 INFO  (TEST-SolrMorphlineZkTest.test-seed#[BED8F84E04765A7B]) [    ] o.a.s.c.SolrResourceLoader JNDI not configured for solr (NoInitialContextEx)
   [junit4]   2> 3714 INFO  (TEST-SolrMorphlineZkTest.test-seed#[BED8F84E04765A7B]) [    ] o.a.s.c.SolrResourceLoader solr home defaulted to 'solr/' (could not find system property or JNDI)
   [junit4]   2> 3724 INFO  (TEST-SolrMorphlineZkTest.test

[...truncated too long message...]

letContextHandler@59baf20b{/,null,UNAVAILABLE}
   [junit4]   2> 37646 INFO  (TEST-SolrMorphlineZkTest.test-seed#[BED8F84E04765A7B]) [    ] o.a.z.s.ZooKeeperServer shutting down
   [junit4]   2> 37646 INFO  (TEST-SolrMorphlineZkTest.test-seed#[BED8F84E04765A7B]) [    ] o.a.z.s.SessionTrackerImpl Shutting down
   [junit4]   2> 37646 INFO  (TEST-SolrMorphlineZkTest.test-seed#[BED8F84E04765A7B]) [    ] o.a.z.s.PrepRequestProcessor Shutting down
   [junit4]   2> 37646 INFO  (ProcessThread(sid:0 cport:-1):) [    ] o.a.z.s.PrepRequestProcessor PrepRequestProcessor exited loop!
   [junit4]   2> 37647 INFO  (TEST-SolrMorphlineZkTest.test-seed#[BED8F84E04765A7B]) [    ] o.a.z.s.SyncRequestProcessor Shutting down
   [junit4]   2> 37647 INFO  (SyncThread:0) [    ] o.a.z.s.SyncRequestProcessor SyncRequestProcessor exited!
   [junit4]   2> 37648 INFO  (TEST-SolrMorphlineZkTest.test-seed#[BED8F84E04765A7B]) [    ] o.a.z.s.FinalRequestProcessor shutdown of request processor complete
   [junit4]   2> 37650 INFO  (TEST-SolrMorphlineZkTest.test-seed#[BED8F84E04765A7B]) [    ] o.a.s.c.ZkTestServer connecting to 127.0.0.1:65194 65194
   [junit4]   2> 37655 INFO  (NIOServerCxn.Factory:0.0.0.0/0.0.0.0:0) [    ] o.a.z.s.NIOServerCnxnFactory NIOServerCnxn factory exited run method
   [junit4]   2> 37657 INFO  (Thread-1) [    ] o.a.z.s.ZooKeeperServer shutting down
   [junit4]   2> 37657 INFO  (Thread-1) [    ] o.a.z.s.SessionTrackerImpl Shutting down
   [junit4]   2> 37657 INFO  (Thread-1) [    ] o.a.z.s.PrepRequestProcessor Shutting down
   [junit4]   2> 37657 INFO  (TEST-SolrMorphlineZkTest.test-seed#[BED8F84E04765A7B]) [    ] o.a.z.s.ZooKeeperServer shutting down
   [junit4]   2> 37657 INFO  (TEST-SolrMorphlineZkTest.test-seed#[BED8F84E04765A7B]) [    ] o.a.z.s.SessionTrackerImpl Shutting down
   [junit4]   2> 37657 INFO  (Thread-1) [    ] o.a.z.s.SyncRequestProcessor Shutting down
   [junit4]   2> 37657 INFO  (TEST-SolrMorphlineZkTest.test-seed#[BED8F84E04765A7B]) [    ] o.a.z.s.PrepRequestProcessor Shutting down
   [junit4]   2> 37657 INFO  (Thread-1) [    ] o.a.z.s.FinalRequestProcessor shutdown of request processor complete
   [junit4]   2> 37657 INFO  (TEST-SolrMorphlineZkTest.test-seed#[BED8F84E04765A7B]) [    ] o.a.z.s.SyncRequestProcessor Shutting down
   [junit4]   2> 37657 INFO  (TEST-SolrMorphlineZkTest.test-seed#[BED8F84E04765A7B]) [    ] o.a.z.s.FinalRequestProcessor shutdown of request processor complete
   [junit4]   2> 37657 INFO  (Thread-1) [    ] o.a.s.c.ZkTestServer connecting to 127.0.0.1:65194 65194
   [junit4]   2> 37661 INFO  (Thread-1) [    ] o.a.z.s.ZooKeeperServer shutting down
   [junit4]   2> 37661 INFO  (Thread-1) [    ] o.a.z.s.SessionTrackerImpl Shutting down
   [junit4]   2> 37661 INFO  (Thread-1) [    ] o.a.z.s.PrepRequestProcessor Shutting down
   [junit4]   2> 37661 INFO  (Thread-1) [    ] o.a.z.s.SyncRequestProcessor Shutting down
   [junit4]   2> 37661 INFO  (Thread-1) [    ] o.a.z.s.FinalRequestProcessor shutdown of request processor complete
   [junit4]   2> 37663 WARN  (Thread-1) [    ] o.a.s.c.ZkTestServer Watch limit violations: 
   [junit4]   2> Maximum concurrent create/delete watches above limit:
   [junit4]   2> 
   [junit4]   2> 	5	/solr/aliases.json
   [junit4]   2> 	4	/solr/security.json
   [junit4]   2> 	4	/solr/configs/conf1
   [junit4]   2> 
   [junit4]   2> Maximum concurrent data watches above limit:
   [junit4]   2> 
   [junit4]   2> 	5	/solr/clusterstate.json
   [junit4]   2> 
   [junit4]   2> Maximum concurrent children watches above limit:
   [junit4]   2> 
   [junit4]   2> 	5	/solr/live_nodes
   [junit4]   2> 	5	/solr/collections
   [junit4]   2> 	4	/solr/overseer/queue
   [junit4]   2> 	4	/solr/overseer/collection-queue-work
   [junit4]   2> 
   [junit4]   2> NOTE: reproduce with: ant test  -Dtestcase=SolrMorphlineZkTest -Dtests.method=test -Dtests.seed=BED8F84E04765A7B -Dtests.slow=true -Dtests.locale=zh -Dtests.timezone=Asia/Jayapura -Dtests.asserts=true -Dtests.file.encoding=ISO-8859-1
   [junit4] ERROR   36.7s J1 | SolrMorphlineZkTest.test <<<
   [junit4]    > Throwable #1: org.kitesdk.morphline.api.MorphlineCompilationException: Cannot download schema.xml from ZooKeeper near: {
   [junit4]    >     # String: 1
   [junit4]    >     "solrUrl" : "",
   [junit4]    >     # String: 1
   [junit4]    >     "collection" : "collection1",
   [junit4]    >     # String: 1
   [junit4]    >     "zkHost" : "127.0.0.1:65194/solr",
   [junit4]    >     # String: 1
   [junit4]    >     "batchSize" : "1000",
   [junit4]    >     # String: 1
   [junit4]    >     "solrHomeDir" : ""
   [junit4]    > }
   [junit4]    > 	at __randomizedtesting.SeedInfo.seed([BED8F84E04765A7B:368CC794AA8A3783]:0)
   [junit4]    > 	at org.apache.solr.morphlines.solr.SolrLocator.getIndexSchema(SolrLocator.java:146)
   [junit4]    > 	at org.apache.solr.morphlines.solr.SanitizeUnknownSolrFieldsBuilder$SanitizeUnknownSolrFields.<init>(SanitizeUnknownSolrFieldsBuilder.java:71)
   [junit4]    > 	at org.apache.solr.morphlines.solr.SanitizeUnknownSolrFieldsBuilder.build(SanitizeUnknownSolrFieldsBuilder.java:53)
   [junit4]    > 	at org.kitesdk.morphline.base.AbstractCommand.buildCommand(AbstractCommand.java:302)
   [junit4]    > 	at org.kitesdk.morphline.base.AbstractCommand.buildCommandChain(AbstractCommand.java:249)
   [junit4]    > 	at org.kitesdk.morphline.stdlib.Pipe.<init>(Pipe.java:46)
   [junit4]    > 	at org.kitesdk.morphline.stdlib.PipeBuilder.build(PipeBuilder.java:40)
   [junit4]    > 	at org.apache.solr.morphlines.solr.AbstractSolrMorphlineZkTestBase.createMorphline(AbstractSolrMorphlineZkTestBase.java:119)
   [junit4]    > 	at org.apache.solr.morphlines.solr.AbstractSolrMorphlineZkTestBase.parse(AbstractSolrMorphlineZkTestBase.java:115)
   [junit4]    > 	at org.apache.solr.morphlines.solr.AbstractSolrMorphlineZkTestBase.parse(AbstractSolrMorphlineZkTestBase.java:104)
   [junit4]    > 	at org.apache.solr.morphlines.solr.SolrMorphlineZkTest.test(SolrMorphlineZkTest.java:46)
   [junit4]    > 	at org.apache.solr.BaseDistributedSearchTestCase$ShardsRepeatRule$ShardsFixedStatement.callStatement(BaseDistributedSearchTestCase.java:996)
   [junit4]    > 	at org.apache.solr.BaseDistributedSearchTestCase$ShardsRepeatRule$ShardsStatement.evaluate(BaseDistributedSearchTestCase.java:971)
   [junit4]    > 	at java.lang.Thread.run(Thread.java:745)
   [junit4]    > Caused by: java.io.FileNotFoundException: .\temp\1459259080277-0 (Access is denied)
   [junit4]    > 	at java.io.FileInputStream.open0(Native Method)
   [junit4]    > 	at java.io.FileInputStream.open(FileInputStream.java:195)
   [junit4]    > 	at java.io.FileInputStream.<init>(FileInputStream.java:138)
   [junit4]    > 	at com.google.common.io.Files$FileByteSource.openStream(Files.java:124)
   [junit4]    > 	at com.google.common.io.Files$FileByteSource.openStream(Files.java:114)
   [junit4]    > 	at com.google.common.io.ByteSource.copyTo(ByteSource.java:202)
   [junit4]    > 	at com.google.common.io.Files.copy(Files.java:436)
   [junit4]    > 	at com.google.common.io.Files.move(Files.java:651)
   [junit4]    > 	at org.apache.solr.morphlines.solr.ZooKeeperDownloader.downloadConfigDir(ZooKeeperDownloader.java:120)
   [junit4]    > 	at org.apache.solr.morphlines.solr.SolrLocator.getIndexSchema(SolrLocator.java:143)
   [junit4]    > 	... 51 more
   [junit4]   2> 37682 INFO  (SUITE-SolrMorphlineZkTest-seed#[BED8F84E04765A7B]-worker) [    ] o.a.s.SolrTestCaseJ4 ###deleteCore
   [junit4]   2> NOTE: leaving temporary files on disk at: C:\Users\jenkins\workspace\Lucene-Solr-master-Windows\solr\build\contrib\solr-morphlines-core\test\J1\temp\solr.morphlines.solr.SolrMorphlineZkTest_BED8F84E04765A7B-001
   [junit4]   2> Mar 29, 2016 1:44:41 PM com.carrotsearch.randomizedtesting.ThreadLeakControl checkThreadLeaks
   [junit4]   2> WARNING: Will linger awaiting termination of 1 leaked thread(s).
   [junit4]   2> 38439 INFO  (SessionTracker) [    ] o.a.z.s.SessionTrackerImpl SessionTrackerImpl exited loop!
   [junit4]   2> NOTE: test params are: codec=Asserting(Lucene60): {}, docValues:{}, maxPointsInLeafNode=861, maxMBSortInHeap=4.623116764748515, sim=RandomSimilarity(queryNorm=true,coord=yes): {}, locale=zh, timezone=Asia/Jayapura
   [junit4]   2> NOTE: Windows 10 10.0 amd64/Oracle Corporation 1.8.0_72 (64-bit)/cpus=3,threads=1,free=80283296,total=214958080
   [junit4]   2> NOTE: All tests run in this JVM: [SolrMorphlineZkTest]
   [junit4] Completed [1/4 (1!)] on J1 in 41.81s, 1 test, 1 error <<< FAILURES!

[...truncated 19 lines...]
BUILD FAILED
C:\Users\jenkins\workspace\Lucene-Solr-master-Windows\build.xml:740: The following error occurred while executing this line:
C:\Users\jenkins\workspace\Lucene-Solr-master-Windows\build.xml:684: The following error occurred while executing this line:
C:\Users\jenkins\workspace\Lucene-Solr-master-Windows\build.xml:59: The following error occurred while executing this line:
C:\Users\jenkins\workspace\Lucene-Solr-master-Windows\solr\build.xml:253: The following error occurred while executing this line:
C:\Users\jenkins\workspace\Lucene-Solr-master-Windows\solr\common-build.xml:464: The following error occurred while executing this line:
C:\Users\jenkins\workspace\Lucene-Solr-master-Windows\solr\common-build.xml:529: The following error occurred while executing this line:
C:\Users\jenkins\workspace\Lucene-Solr-master-Windows\lucene\common-build.xml:1457: The following error occurred while executing this line:
C:\Users\jenkins\workspace\Lucene-Solr-master-Windows\lucene\common-build.xml:1014: There were test failures: 4 suites, 5 tests, 1 error [seed: BED8F84E04765A7B]

Total time: 94 minutes 25 seconds
Build step 'Invoke Ant' marked build as failure
Archiving artifacts
[WARNINGS] Skipping publisher since build result is FAILURE
Recording test results
Email was triggered for: Failure - Any
Sending email for trigger: Failure - Any



Mime
View raw message