lucene-dev mailing list archives

Site index · List index
Message view « Date » · « Thread »
Top « Date » · « Thread »
From Policeman Jenkins Server <jenk...@thetaphi.de>
Subject [JENKINS] Lucene-Solr-6.x-Linux (32bit/jdk1.8.0_72) - Build # 188 - Failure!
Date Sun, 20 Mar 2016 13:06:31 GMT
Build: http://jenkins.thetaphi.de/job/Lucene-Solr-6.x-Linux/188/
Java: 32bit/jdk1.8.0_72 -server -XX:+UseParallelGC

1 tests failed.
FAILED:  org.apache.solr.cloud.UnloadDistributedZkTest.test

Error Message:
Captured an uncaught exception in thread: Thread[id=7366, name=testExecutor-3377-thread-2, state=RUNNABLE, group=TGRP-UnloadDistributedZkTest]

Stack Trace:
com.carrotsearch.randomizedtesting.UncaughtExceptionError: Captured an uncaught exception in thread: Thread[id=7366, name=testExecutor-3377-thread-2, state=RUNNABLE, group=TGRP-UnloadDistributedZkTest]
Caused by: java.lang.RuntimeException: org.apache.solr.client.solrj.SolrServerException: Timeout occured while waiting response from server at: http://127.0.0.1:39077
	at __randomizedtesting.SeedInfo.seed([E21E9796849CC2C2]:0)
	at org.apache.solr.cloud.BasicDistributedZkTest.lambda$createCores$0(BasicDistributedZkTest.java:583)
	at org.apache.solr.common.util.ExecutorUtil$MDCAwareThreadPoolExecutor.lambda$execute$0(ExecutorUtil.java:229)
	at java.util.concurrent.ThreadPoolExecutor.runWorker(ThreadPoolExecutor.java:1142)
	at java.util.concurrent.ThreadPoolExecutor$Worker.run(ThreadPoolExecutor.java:617)
	at java.lang.Thread.run(Thread.java:745)
Caused by: org.apache.solr.client.solrj.SolrServerException: Timeout occured while waiting response from server at: http://127.0.0.1:39077
	at org.apache.solr.client.solrj.impl.HttpSolrClient.executeMethod(HttpSolrClient.java:588)
	at org.apache.solr.client.solrj.impl.HttpSolrClient.request(HttpSolrClient.java:241)
	at org.apache.solr.client.solrj.impl.HttpSolrClient.request(HttpSolrClient.java:230)
	at org.apache.solr.client.solrj.SolrClient.request(SolrClient.java:1219)
	at org.apache.solr.cloud.BasicDistributedZkTest.lambda$createCores$0(BasicDistributedZkTest.java:581)
	... 4 more
Caused by: java.net.SocketTimeoutException: Read timed out
	at java.net.SocketInputStream.socketRead0(Native Method)
	at java.net.SocketInputStream.socketRead(SocketInputStream.java:116)
	at java.net.SocketInputStream.read(SocketInputStream.java:170)
	at java.net.SocketInputStream.read(SocketInputStream.java:141)
	at org.apache.http.impl.io.AbstractSessionInputBuffer.fillBuffer(AbstractSessionInputBuffer.java:160)
	at org.apache.http.impl.io.SocketInputBuffer.fillBuffer(SocketInputBuffer.java:84)
	at org.apache.http.impl.io.AbstractSessionInputBuffer.readLine(AbstractSessionInputBuffer.java:273)
	at org.apache.http.impl.conn.DefaultHttpResponseParser.parseHead(DefaultHttpResponseParser.java:140)
	at org.apache.http.impl.conn.DefaultHttpResponseParser.parseHead(DefaultHttpResponseParser.java:57)
	at org.apache.http.impl.io.AbstractMessageParser.parse(AbstractMessageParser.java:261)
	at org.apache.http.impl.AbstractHttpClientConnection.receiveResponseHeader(AbstractHttpClientConnection.java:283)
	at org.apache.http.impl.conn.DefaultClientConnection.receiveResponseHeader(DefaultClientConnection.java:251)
	at org.apache.http.impl.conn.ManagedClientConnectionImpl.receiveResponseHeader(ManagedClientConnectionImpl.java:197)
	at org.apache.http.protocol.HttpRequestExecutor.doReceiveResponse(HttpRequestExecutor.java:272)
	at org.apache.http.protocol.HttpRequestExecutor.execute(HttpRequestExecutor.java:124)
	at org.apache.http.impl.client.DefaultRequestDirector.tryExecute(DefaultRequestDirector.java:685)
	at org.apache.http.impl.client.DefaultRequestDirector.execute(DefaultRequestDirector.java:487)
	at org.apache.http.impl.client.AbstractHttpClient.doExecute(AbstractHttpClient.java:882)
	at org.apache.http.impl.client.CloseableHttpClient.execute(CloseableHttpClient.java:82)
	at org.apache.http.impl.client.CloseableHttpClient.execute(CloseableHttpClient.java:107)
	at org.apache.http.impl.client.CloseableHttpClient.execute(CloseableHttpClient.java:55)
	at org.apache.solr.client.solrj.impl.HttpSolrClient.executeMethod(HttpSolrClient.java:482)
	... 8 more




Build Log:
[...truncated 11374 lines...]
   [junit4] Suite: org.apache.solr.cloud.UnloadDistributedZkTest
   [junit4]   2> Creating dataDir: /home/jenkins/workspace/Lucene-Solr-6.x-Linux/solr/build/solr-core/test/J2/temp/solr.cloud.UnloadDistributedZkTest_E21E9796849CC2C2-001/init-core-data-001
   [junit4]   2> 868968 INFO  (SUITE-UnloadDistributedZkTest-seed#[E21E9796849CC2C2]-worker) [    ] o.a.s.BaseDistributedSearchTestCase Setting hostContext system property: /
   [junit4]   2> 868969 INFO  (TEST-UnloadDistributedZkTest.test-seed#[E21E9796849CC2C2]) [    ] o.a.s.c.ZkTestServer STARTING ZK TEST SERVER
   [junit4]   2> 868969 INFO  (Thread-2131) [    ] o.a.s.c.ZkTestServer client port:0.0.0.0/0.0.0.0:0
   [junit4]   2> 868969 INFO  (Thread-2131) [    ] o.a.s.c.ZkTestServer Starting server
   [junit4]   2> 869069 INFO  (TEST-UnloadDistributedZkTest.test-seed#[E21E9796849CC2C2]) [    ] o.a.s.c.ZkTestServer start zk server on port:42441
   [junit4]   2> 869070 INFO  (TEST-UnloadDistributedZkTest.test-seed#[E21E9796849CC2C2]) [    ] o.a.s.c.c.SolrZkClient Using default ZkCredentialsProvider
   [junit4]   2> 869070 INFO  (TEST-UnloadDistributedZkTest.test-seed#[E21E9796849CC2C2]) [    ] o.a.s.c.c.ConnectionManager Waiting for client to connect to ZooKeeper
   [junit4]   2> 869072 INFO  (zkCallback-1304-thread-1) [    ] o.a.s.c.c.ConnectionManager Watcher org.apache.solr.common.cloud.ConnectionManager@ff606c name:ZooKeeperConnection Watcher:127.0.0.1:42441 got event WatchedEvent state:SyncConnected type:None path:null path:null type:None
   [junit4]   2> 869072 INFO  (TEST-UnloadDistributedZkTest.test-seed#[E21E9796849CC2C2]) [    ] o.a.s.c.c.ConnectionManager Client is connected to ZooKeeper
   [junit4]   2> 869072 INFO  (TEST-UnloadDistributedZkTest.test-seed#[E21E9796849CC2C2]) [    ] o.a.s.c.c.SolrZkClient Using default ZkACLProvider
   [junit4]   2> 869072 INFO  (TEST-UnloadDistributedZkTest.test-seed#[E21E9796849CC2C2]) [    ] o.a.s.c.c.SolrZkClient makePath: /solr
   [junit4]   2> 869074 INFO  (TEST-UnloadDistributedZkTest.test-seed#[E21E9796849CC2C2]) [    ] o.a.s.c.c.SolrZkClient Using default ZkCredentialsProvider
   [junit4]   2> 869075 INFO  (TEST-UnloadDistributedZkTest.test-seed#[E21E9796849CC2C2]) [    ] o.a.s.c.c.ConnectionManager Waiting for client to connect to ZooKeeper
   [junit4]   2> 869075 INFO  (zkCallback-1305-thread-1) [    ] o.a.s.c.c.ConnectionManager Watcher org.apache.solr.common.cloud.ConnectionManager@213f3 name:ZooKeeperConnection Watcher:127.0.0.1:42441/solr got event WatchedEvent state:SyncConnected type:None path:null path:null type:None
   [junit4]   2> 869075 INFO  (TEST-UnloadDistributedZkTest.test-seed#[E21E9796849CC2C2]) [    ] o.a.s.c.c.ConnectionManager Client is connected to ZooKeeper
   [junit4]   2> 869076 INFO  (TEST-UnloadDistributedZkTest.test-seed#[E21E9796849CC2C2]) [    ] o.a.s.c.c.SolrZkClient Using default ZkACLProvider
   [junit4]   2> 869076 INFO  (TEST-UnloadDistributedZkTest.test-seed#[E21E9796849CC2C2]) [    ] o.a.s.c.c.SolrZkClient makePath: /collections/collection1
   [junit4]   2> 869090 INFO  (TEST-UnloadDistributedZkTest.test-seed#[E21E9796849CC2C2]) [    ] o.a.s.c.c.SolrZkClient makePath: /collections/collection1/shards
   [junit4]   2> 869090 INFO  (TEST-UnloadDistributedZkTest.test-seed#[E21E9796849CC2C2]) [    ] o.a.s.c.c.SolrZkClient makePath: /collections/control_collection
   [junit4]   2> 869091 INFO  (TEST-UnloadDistributedZkTest.test-seed#[E21E9796849CC2C2]) [    ] o.a.s.c.c.SolrZkClient makePath: /collections/control_collection/shards
   [junit4]   2> 869091 INFO  (TEST-UnloadDistributedZkTest.test-seed#[E21E9796849CC2C2]) [    ] o.a.s.c.AbstractZkTestCase put /home/jenkins/workspace/Lucene-Solr-6.x-Linux/solr/core/src/test-files/solr/collection1/conf/solrconfig-tlog.xml to /configs/conf1/solrconfig.xml
   [junit4]   2> 869091 INFO  (TEST-UnloadDistributedZkTest.test-seed#[E21E9796849CC2C2]) [    ] o.a.s.c.c.SolrZkClient makePath: /configs/conf1/solrconfig.xml
   [junit4]   2> 869092 INFO  (TEST-UnloadDistributedZkTest.test-seed#[E21E9796849CC2C2]) [    ] o.a.s.c.AbstractZkTestCase put /home/jenkins/workspace/Lucene-Solr-6.x-Linux/solr/core/src/test-files/solr/collection1/conf/schema.xml to /configs/conf1/schema.xml
   [junit4]   2> 869092 INFO  (TEST-UnloadDistributedZkTest.test-seed#[E21E9796849CC2C2]) [    ] o.a.s.c.c.SolrZkClient makePath: /configs/conf1/schema.xml
   [junit4]   2> 869093 INFO  (TEST-UnloadDistributedZkTest.test-seed#[E21E9796849CC2C2]) [    ] o.a.s.c.AbstractZkTestCase put /home/jenkins/workspace/Lucene-Solr-6.x-Linux/solr/core/src/test-files/solr/collection1/conf/solrconfig.snippet.randomindexconfig.xml to /configs/conf1/solrconfig.snippet.randomindexconfig.xml
   [junit4]   2> 869093 INFO  (TEST-UnloadDistributedZkTest.test-seed#[E21E9796849CC2C2]) [    ] o.a.s.c.c.SolrZkClient makePath: /configs/conf1/solrconfig.snippet.randomindexconfig.xml
   [junit4]   2> 869094 INFO  (TEST-UnloadDistributedZkTest.test-seed#[E21E9796849CC2C2]) [    ] o.a.s.c.AbstractZkTestCase put /home/jenkins/workspace/Lucene-Solr-6.x-Linux/solr/core/src/test-files/solr/collection1/conf/stopwords.txt to /configs/conf1/stopwords.txt
   [junit4]   2> 869094 INFO  (TEST-UnloadDistributedZkTest.test-seed#[E21E9796849CC2C2]) [    ] o.a.s.c.c.SolrZkClient makePath: /configs/conf1/stopwords.txt
   [junit4]   2> 869094 INFO  (TEST-UnloadDistributedZkTest.test-seed#[E21E9796849CC2C2]) [    ] o.a.s.c.AbstractZkTestCase put /home/jenkins/workspace/Lucene-Solr-6.x-Linux/solr/core/src/test-files/solr/collection1/conf/protwords.txt to /configs/conf1/protwords.txt
   [junit4]   2> 869094 INFO  (TEST-UnloadDistributedZkTest.test-seed#[E21E9796849CC2C2]) [    ] o.a.s.c.c.SolrZkClient makePath: /configs/conf1/protwords.txt
   [junit4]   2> 869095 INFO  (TEST-UnloadDistributedZkTest.test-seed#[E21E9796849CC2C2]) [    ] o.a.s.c.AbstractZkTestCase put /home/jenkins/workspace/Lucene-Solr-6.x-Linux/solr/core/src/test-files/solr/collection1/conf/currency.xml to /configs/conf1/currency.xml
   [junit4]   2> 869095 INFO  (TEST-UnloadDistributedZkTest.test-seed#[E21E9796849CC2C2]) [    ] o.a.s.c.c.SolrZkClient makePath: /configs/conf1/currency.xml
   [junit4]   2> 869095 INFO  (TEST-UnloadDistributedZkTest.test-seed#[E21E9796849CC2C2]) [    ] o.a.s.c.AbstractZkTestCase put /home/jenkins/workspace/Lucene-Solr-6.x-Linux/solr/core/src/test-files/solr/collection1/conf/enumsConfig.xml to /configs/conf1/enumsConfig.xml
   [junit4]   2> 869095 INFO  (TEST-UnloadDistributedZkTest.test-seed#[E21E9796849CC2C2]) [    ] o.a.s.c.c.SolrZkClient makePath: /configs/conf1/enumsConfig.xml
   [junit4]   2> 869096 INFO  (TEST-UnloadDistributedZkTest.test-seed#[E21E9796849CC2C2]) [    ] o.a.s.c.AbstractZkTestCase put /home/jenkins/workspace/Lucene-Solr-6.x-Linux/solr/core/src/test-files/solr/collection1/conf/open-exchange-rates.json to /configs/conf1/open-exchange-rates.json
   [junit4]   2> 869096 INFO  (TEST-UnloadDistributedZkTest.test-seed#[E21E9796849CC2C2]) [    ] o.a.s.c.c.SolrZkClient makePath: /configs/conf1/open-exchange-rates.json
   [junit4]   2> 869096 INFO  (TEST-UnloadDistributedZkTest.test-seed#[E21E9796849CC2C2]) [    ] o.a.s.c.AbstractZkTestCase put /home/jenkins/workspace/Lucene-Solr-6.x-Linux/solr/core/src/test-files/solr/collection1/conf/mapping-ISOLatin1Accent.txt to /configs/conf1/mapping-ISOLatin1Accent.txt
   [junit4]   2> 869096 INFO  (TEST-UnloadDistributedZkTest.test-seed#[E21E9796849CC2C2]) [    ] o.a.s.c.c.SolrZkClient makePath: /configs/conf1/mapping-ISOLatin1Accent.txt
   [junit4]   2> 869097 INFO  (TEST-UnloadDistributedZkTest.test-seed#[E21E9796849CC2C2]) [    ] o.a.s.c.AbstractZkTestCase put /home/jenkins/workspace/Lucene-Solr-6.x-Linux/solr/core/src/test-files/solr/collection1/conf/old_synonyms.txt to /configs/conf1/old_synonyms.txt
   [junit4]   2> 869097 INFO  (TEST-UnloadDistributedZkTest.test-seed#[E21E9796849CC2C2]) [    ] o.a.s.c.c.SolrZkClient makePath: /configs/conf1/old_synonyms.txt
   [junit4]   2> 869097 INFO  (TEST-UnloadDistributedZkTest.test-seed#[E21E9796849CC2C2]) [    ] o.a.s.c.AbstractZkTestCase put /home/jenkins/workspace/Lucene-Solr-6.x-Linux/solr/core/src/test-files/solr/collection1/conf/synonyms.txt to /configs/conf1/synonyms.txt
   [junit4]   2> 869097 INFO  (TEST-UnloadDistributedZkTest.test-seed#[E21E9796849CC2C2]) [    ] o.a.s.c.c.SolrZkClient makePath: /configs/conf1/synonyms.txt
   [junit4]   2> 869238 INFO  (TEST-UnloadDistributedZkTest.test-seed#[E21E9796849CC2C2]) [    ] o.a.s.SolrTestCaseJ4 Writing core.properties file to /home/jenkins/workspace/Lucene-Solr-6.x-Linux/solr/build/solr-core/test/J2/temp/solr.cloud.UnloadDistributedZkTest_E21E9796849CC2C2-001/control-001/cores/collection1
   [junit4]   2> 869239 INFO  (TEST-UnloadDistributedZkTest.test-seed#[E21E9796849CC2C2]) [    ] o.e.j.s.Server jetty-9.3.8.v20160314
   [junit4]   2> 869239 INFO  (TEST-UnloadDistributedZkTest.test-seed#[E21E9796849CC2C2]) [    ] o.e.j.s.h.ContextHandler Started o.e.j.s.ServletContextHandler@1c9f3ec{/,null,AVAILABLE}
   [junit4]   2> 869241 INFO  (TEST-UnloadDistributedZkTest.test-seed#[E21E9796849CC2C2]) [    ] o.e.j.s.ServerConnector Started ServerConnector@1824b03{HTTP/1.1,[http/1.1]}{127.0.0.1:42170}
   [junit4]   2> 869241 INFO  (TEST-UnloadDistributedZkTest.test-seed#[E21E9796849CC2C2]) [    ] o.e.j.s.Server Started @870915ms
   [junit4]   2> 869241 INFO  (TEST-UnloadDistributedZkTest.test-seed#[E21E9796849CC2C2]) [    ] o.a.s.c.s.e.JettySolrRunner Jetty properties: {solr.data.dir=/home/jenkins/workspace/Lucene-Solr-6.x-Linux/solr/build/solr-core/test/J2/temp/solr.cloud.UnloadDistributedZkTest_E21E9796849CC2C2-001/tempDir-001/control/data, hostContext=/, hostPort=42170, coreRootDirectory=/home/jenkins/workspace/Lucene-Solr-6.x-Linux/solr/build/solr-core/test/J2/temp/solr.cloud.UnloadDistributedZkTest_E21E9796849CC2C2-001/control-001/cores}
   [junit4]   2> 869241 INFO  (TEST-UnloadDistributedZkTest.test-seed#[E21E9796849CC2C2]) [    ] o.a.s.s.SolrDispatchFilter SolrDispatchFilter.init(): sun.misc.Launcher$AppClassLoader@1d16e93
   [junit4]   2> 869241 INFO  (TEST-UnloadDistributedZkTest.test-seed#[E21E9796849CC2C2]) [    ] o.a.s.c.SolrResourceLoader new SolrResourceLoader for directory: '/home/jenkins/workspace/Lucene-Solr-6.x-Linux/solr/build/solr-core/test/J2/temp/solr.cloud.UnloadDistributedZkTest_E21E9796849CC2C2-001/control-001'
   [junit4]   2> 869241 INFO  (TEST-UnloadDistributedZkTest.test-seed#[E21E9796849CC2C2]) [    ] o.a.s.c.SolrResourceLoader JNDI not configured for solr (NoInitialContextEx)
   [junit4]   2> 869241 INFO  (TEST-UnloadDistributedZkTest.test-seed#[E21E9796849CC2C2]) [    ] o.a.s.c.SolrResourceLoader solr home defaulted to 'solr/' (could not find system property or JNDI)
   [junit4]   2> 869241 INFO  (TEST-UnloadDistributedZkTest.test-seed#[E21E9796849CC2C2]) [    ] o.a.s.c.c.SolrZkClient Using default ZkCredentialsProvider
   [junit4]   2> 869242 INFO  (TEST-UnloadDistributedZkTest.test-seed#[E21E9796849CC2C2]) [    ] o.a.s.c.c.ConnectionManager Waiting for client to connect to ZooKeeper
   [junit4]   2> 869242 INFO  (zkCallback-1306-thread-1) [    ] o.a.s.c.c.ConnectionManager Watcher org.apache.solr.common.cloud.ConnectionManager@805a53 name:ZooKeeperConnection Watcher:127.0.0.1:42441/solr got event WatchedEvent state:SyncConnected type:None path:null path:null type:None
   [junit4]   2> 869242 INFO  (TEST-UnloadDistributedZkTest.test-seed#[E21E9796849CC2C2]) [    ] o.a.s.c.c.ConnectionManager Client is connected to ZooKeeper
   [junit4]   2> 869243 INFO  (TEST-UnloadDistributedZkTest.test-seed#[E21E9796849CC2C2]) [    ] o.a.s.c.c.SolrZkClient Using default ZkACLProvider
   [junit4]   2> 869243 INFO  (TEST-UnloadDistributedZkTest.test-seed#[E21E9796849CC2C2]) [    ] o.a.s.s.SolrDispatchFilter Loading solr.xml from SolrHome (not found in ZooKeeper)
   [junit4]   2> 869244 INFO  (TEST-UnloadDistributedZkTest.test-seed#[E21E9796849CC2C2]) [    ] o.a.s.c.SolrXmlConfig Loading container configuration from /home/jenkins/workspace/Lucene-Solr-6.x-Linux/solr/build/solr-core/test/J2/temp/solr.cloud.UnloadDistributedZkTest_E21E9796849CC2C2-001/control-001/solr.xml
   [junit4]   2> 869246 INFO  (TEST-UnloadDistributedZkTest.test-seed#[E21E9796849CC2C2]) [    ] o.a.s.c.CorePropertiesLocator Config-defined core root directory: /home/jenkins/workspace/Lucene-Solr-6.x-Linux/solr/build/solr-core/test/J2/temp/solr.cloud.UnloadDistributedZkTest_E21E9796849CC2C2-001/control-001/cores
   [junit4]   2> 869246 INFO  (TEST-UnloadDistributedZkTest.test-seed#[E21E9796849CC2C2]) [    ] o.a.s.c.CoreContainer New CoreContainer 13099677
   [junit4]   2> 869247 INFO  (TEST-UnloadDistributedZkTest.test-seed#[E21E9796849CC2C2]) [    ] o.a.s.c.CoreContainer Loading cores into CoreContainer [instanceDir=/home/jenkins/workspace/Lucene-Solr-6.x-Linux/solr/build/solr-core/test/J2/temp/solr.cloud.UnloadDistributedZkTest_E21E9796849CC2C2-001/control-001]
   [junit4]   2> 869247 WARN  (TEST-UnloadDistributedZkTest.test-seed#[E21E9796849CC2C2]) [    ] o.a.s.c.CoreContainer Couldn't add files from /home/jenkins/workspace/Lucene-Solr-6.x-Linux/solr/build/solr-core/test/J2/temp/solr.cloud.UnloadDistributedZkTest_E21E9796849CC2C2-001/control-001/lib to classpath: /home/jenkins/workspace/Lucene-Solr-6.x-Linux/solr/build/solr-core/test/J2/temp/solr.cloud.UnloadDistributedZkTest_E21E9796849CC2C2-001/control-001/lib
   [junit4]   2> 869247 INFO  (TEST-UnloadDistributedZkTest.test-seed#[E21E9796849CC2C2]) [    ] o.a.s.h.c.HttpShardHandlerFactory created with socketTimeout : 90000,urlScheme : ,connTimeout : 15000,maxConnectionsPerHost : 20,maxConnections : 10000,corePoolSize : 0,maximumPoolSize : 2147483647,maxThreadIdleTime : 5,sizeOfQueue : -1,fairnessPolicy : false,useRetries : false,
   [junit4]   2> 869248 INFO  (TEST-UnloadDistributedZkTest.test-seed#[E21E9796849CC2C2]) [    ] o.a.s.u.UpdateShardHandler Creating UpdateShardHandler HTTP client with params: socketTimeout=340000&connTimeout=45000&retry=true
   [junit4]   2> 869248 INFO  (TEST-UnloadDistributedZkTest.test-seed#[E21E9796849CC2C2]) [    ] o.a.s.l.LogWatcher SLF4J impl is org.slf4j.impl.Log4jLoggerFactory
   [junit4]   2> 869248 INFO  (TEST-UnloadDistributedZkTest.test-seed#[E21E9796849CC2C2]) [    ] o.a.s.l.LogWatcher Registering Log Listener [Log4j (org.slf4j.impl.Log4jLoggerFactory)]
   [junit4]   2> 869248 INFO  (TEST-UnloadDistributedZkTest.test-seed#[E21E9796849CC2C2]) [    ] o.a.s.c.ZkContainer Zookeeper client=127.0.0.1:42441/solr
   [junit4]   2> 869248 INFO  (TEST-UnloadDistributedZkTest.test-seed#[E21E9796849CC2C2]) [    ] o.a.s.c.ZkController zkHost includes chroot
   [junit4]   2> 869248 INFO  (TEST-UnloadDistributedZkTest.test-seed#[E21E9796849CC2C2]) [    ] o.a.s.c.c.SolrZkClient Using default ZkCredentialsProvider
   [junit4]   2> 869249 INFO  (TEST-UnloadDistributedZkTest.test-seed#[E21E9796849CC2C2]) [    ] o.a.s.c.c.ConnectionManager Waiting for client to connect to ZooKeeper
   [junit4]   2> 869256 INFO  (zkCallback-1309-thread-1) [    ] o.a.s.c.c.ConnectionManager Watcher org.apache.solr.common.cloud.ConnectionManager@84bcdf name:ZooKeeperConnection Watcher:127.0.0.1:42441 got event WatchedEvent state:SyncConnected type:None path:null path:null type:None
   [junit4]   2> 869256 INFO  (TEST-UnloadDistributedZkTest.test-seed#[E21E9796849CC2C2]) [    ] o.a.s.c.c.ConnectionManager Client is connected to ZooKeeper
   [junit4]   2> 869257 INFO  (TEST-UnloadDistributedZkTest.test-seed#[E21E9796849CC2C2]) [    ] o.a.s.c.c.SolrZkClient Using default ZkACLProvider
   [junit4]   2> 869257 INFO  (TEST-UnloadDistributedZkTest.test-seed#[E21E9796849CC2C2]) [n:127.0.0.1:42170_    ] o.a.s.c.c.ConnectionManager Waiting for client to connect to ZooKeeper
   [junit4]   2> 869258 INFO  (zkCallback-1310-thread-1-processing-n:127.0.0.1:42170_) [n:127.0.0.1:42170_    ] o.a.s.c.c.ConnectionManager Watcher org.apache.solr.common.cloud.ConnectionManager@14fb9bd name:ZooKeeperConnection Watcher:127.0.0.1:42441/solr got event WatchedEvent state:SyncConnected type:None path:null path:null type:None
   [junit4]   2> 869258 INFO  (TEST-UnloadDistributedZkTest.test-seed#[E21E9796849CC2C2]) [n:127.0.0.1:42170_    ] o.a.s.c.c.ConnectionManager Client is connected to ZooKeeper
   [junit4]   2> 869259 INFO  (TEST-UnloadDistributedZkTest.test-seed#[E21E9796849CC2C2]) [n:127.0.0.1:42170_    ] o.a.s.c.c.SolrZkClient makePath: /overseer/queue
   [junit4]   2> 869259 INFO  (TEST-UnloadDistributedZkTest.test-seed#[E21E9796849CC2C2]) [n:127.0.0.1:42170_    ] o.a.s.c.c.SolrZkClient makePath: /overseer/collection-queue-work
   [junit4]   2> 869268 INFO  (TEST-UnloadDistributedZkTest.test-seed#[E21E9796849CC2C2]) [n:127.0.0.1:42170_    ] o.a.s.c.c.SolrZkClient makePath: /overseer/collection-map-running
   [junit4]   2> 869268 INFO  (TEST-UnloadDistributedZkTest.test-seed#[E21E9796849CC2C2]) [n:127.0.0.1:42170_    ] o.a.s.c.c.SolrZkClient makePath: /overseer/collection-map-completed
   [junit4]   2> 869269 INFO  (TEST-UnloadDistributedZkTest.test-seed#[E21E9796849CC2C2]) [n:127.0.0.1:42170_    ] o.a.s.c.c.SolrZkClient makePath: /overseer/collection-map-failure
   [junit4]   2> 869269 INFO  (TEST-UnloadDistributedZkTest.test-seed#[E21E9796849CC2C2]) [n:127.0.0.1:42170_    ] o.a.s.c.c.SolrZkClient makePath: /live_nodes
   [junit4]   2> 869270 INFO  (TEST-UnloadDistributedZkTest.test-seed#[E21E9796849CC2C2]) [n:127.0.0.1:42170_    ] o.a.s.c.c.SolrZkClient makePath: /aliases.json
   [junit4]   2> 869270 INFO  (TEST-UnloadDistributedZkTest.test-seed#[E21E9796849CC2C2]) [n:127.0.0.1:42170_    ] o.a.s.c.c.SolrZkClient makePath: /clusterstate.json
   [junit4]   2> 869270 INFO  (TEST-UnloadDistributedZkTest.test-seed#[E21E9796849CC2C2]) [n:127.0.0.1:42170_    ] o.a.s.c.c.SolrZkClient makePath: /security.json
   [junit4]   2> 869271 INFO  (TEST-UnloadDistributedZkTest.test-seed#[E21E9796849CC2C2]) [n:127.0.0.1:42170_    ] o.a.s.c.c.ZkStateReader Updating cluster state from ZooKeeper... 
   [junit4]   2> 869271 INFO  (TEST-UnloadDistributedZkTest.test-seed#[E21E9796849CC2C2]) [n:127.0.0.1:42170_    ] o.a.s.c.c.ZkStateReader Updated live nodes from ZooKeeper... (0) -> (0)
   [junit4]   2> 869272 INFO  (TEST-UnloadDistributedZkTest.test-seed#[E21E9796849CC2C2]) [n:127.0.0.1:42170_    ] o.a.s.c.c.SolrZkClient makePath: /overseer_elect
   [junit4]   2> 869279 INFO  (TEST-UnloadDistributedZkTest.test-seed#[E21E9796849CC2C2]) [n:127.0.0.1:42170_    ] o.a.s.c.c.SolrZkClient makePath: /overseer_elect/election
   [junit4]   2> 869280 INFO  (TEST-UnloadDistributedZkTest.test-seed#[E21E9796849CC2C2]) [n:127.0.0.1:42170_    ] o.a.s.c.Overseer Overseer (id=null) closing
   [junit4]   2> 869280 INFO  (TEST-UnloadDistributedZkTest.test-seed#[E21E9796849CC2C2]) [n:127.0.0.1:42170_    ] o.a.s.c.LeaderElector Joined leadership election with path: /overseer_elect/election/95582821447303172-127.0.0.1:42170_-n_0000000000
   [junit4]   2> 869280 INFO  (TEST-UnloadDistributedZkTest.test-seed#[E21E9796849CC2C2]) [n:127.0.0.1:42170_    ] o.a.s.c.OverseerElectionContext I am going to be the leader 127.0.0.1:42170_
   [junit4]   2> 869280 INFO  (TEST-UnloadDistributedZkTest.test-seed#[E21E9796849CC2C2]) [n:127.0.0.1:42170_    ] o.a.s.c.c.SolrZkClient makePath: /overseer_elect/leader
   [junit4]   2> 869280 INFO  (TEST-UnloadDistributedZkTest.test-seed#[E21E9796849CC2C2]) [n:127.0.0.1:42170_    ] o.a.s.c.Overseer Overseer (id=95582821447303172-127.0.0.1:42170_-n_0000000000) starting
   [junit4]   2> 869281 INFO  (TEST-UnloadDistributedZkTest.test-seed#[E21E9796849CC2C2]) [n:127.0.0.1:42170_    ] o.a.s.c.c.SolrZkClient makePath: /overseer/queue-work
   [junit4]   2> 869282 INFO  (TEST-UnloadDistributedZkTest.test-seed#[E21E9796849CC2C2]) [n:127.0.0.1:42170_    ] o.a.s.c.OverseerAutoReplicaFailoverThread Starting OverseerAutoReplicaFailoverThread autoReplicaFailoverWorkLoopDelay=10000 autoReplicaFailoverWaitAfterExpiration=10000 autoReplicaFailoverBadNodeExpiration=60000
   [junit4]   2> 869282 INFO  (OverseerCollectionConfigSetProcessor-95582821447303172-127.0.0.1:42170_-n_0000000000) [n:127.0.0.1:42170_    ] o.a.s.c.OverseerTaskProcessor Process current queue of overseer operations
   [junit4]   2> 869282 INFO  (OverseerStateUpdate-95582821447303172-127.0.0.1:42170_-n_0000000000) [n:127.0.0.1:42170_    ] o.a.s.c.Overseer Starting to work on the main queue
   [junit4]   2> 869282 INFO  (TEST-UnloadDistributedZkTest.test-seed#[E21E9796849CC2C2]) [n:127.0.0.1:42170_    ] o.a.s.c.ZkController Register node as live in ZooKeeper:/live_nodes/127.0.0.1:42170_
   [junit4]   2> 869283 INFO  (TEST-UnloadDistributedZkTest.test-seed#[E21E9796849CC2C2]) [n:127.0.0.1:42170_    ] o.a.s.c.c.SolrZkClient makePath: /live_nodes/127.0.0.1:42170_
   [junit4]   2> 869283 INFO  (OverseerStateUpdate-95582821447303172-127.0.0.1:42170_-n_0000000000) [n:127.0.0.1:42170_    ] o.a.s.c.c.ZkStateReader Updated live nodes from ZooKeeper... (0) -> (0)
   [junit4]   2> 869283 INFO  (zkCallback-1310-thread-1-processing-n:127.0.0.1:42170_) [n:127.0.0.1:42170_    ] o.a.s.c.c.ZkStateReader A live node change: [WatchedEvent state:SyncConnected type:NodeChildrenChanged path:/live_nodes], has occurred - updating... (live nodes size: [0])
   [junit4]   2> 869283 INFO  (zkCallback-1310-thread-1-processing-n:127.0.0.1:42170_) [n:127.0.0.1:42170_    ] o.a.s.c.c.ZkStateReader Updated live nodes from ZooKeeper... (0) -> (1)
   [junit4]   2> 869330 INFO  (TEST-UnloadDistributedZkTest.test-seed#[E21E9796849CC2C2]) [n:127.0.0.1:42170_    ] o.a.s.c.CoreContainer Security conf doesn't exist. Skipping setup for authorization module.
   [junit4]   2> 869330 INFO  (TEST-UnloadDistributedZkTest.test-seed#[E21E9796849CC2C2]) [n:127.0.0.1:42170_    ] o.a.s.c.CoreContainer No authentication plugin used.
   [junit4]   2> 869330 INFO  (TEST-UnloadDistributedZkTest.test-seed#[E21E9796849CC2C2]) [n:127.0.0.1:42170_    ] o.a.s.c.CorePropertiesLocator Looking for core definitions underneath /home/jenkins/workspace/Lucene-Solr-6.x-Linux/solr/build/solr-core/test/J2/temp/solr.cloud.UnloadDistributedZkTest_E21E9796849CC2C2-001/control-001/cores
   [junit4]   2> 869331 INFO  (TEST-UnloadDistributedZkTest.test-seed#[E21E9796849CC2C2]) [n:127.0.0.1:42170_    ] o.a.s.c.CoreDescriptor Created CoreDescriptor: {name=collection1, config=solrconfig.xml, transient=false, schema=schema.xml, loadOnStartup=true, configSetProperties=configsetprops.json, collection=control_collection, coreNodeName=, dataDir=data/, shard=}
   [junit4]   2> 869331 INFO  (TEST-UnloadDistributedZkTest.test-seed#[E21E9796849CC2C2]) [n:127.0.0.1:42170_    ] o.a.s.c.CorePropertiesLocator Found core collection1 in /home/jenkins/workspace/Lucene-Solr-6.x-Linux/solr/build/solr-core/test/J2/temp/solr.cloud.UnloadDistributedZkTest_E21E9796849CC2C2-001/control-001/cores/collection1
   [junit4]   2> 869331 INFO  (TEST-UnloadDistributedZkTest.test-seed#[E21E9796849CC2C2]) [n:127.0.0.1:42170_    ] o.a.s.c.CorePropertiesLocator Found 1 core definitions
   [junit4]   2> 869332 INFO  (TEST-UnloadDistributedZkTest.test-seed#[E21E9796849CC2C2]) [n:127.0.0.1:42170_    ] o.a.s.s.SolrDispatchFilter user.dir=/home/jenkins/workspace/Lucene-Solr-6.x-Linux/solr/build/solr-core/test/J2
   [junit4]   2> 869332 INFO  (TEST-UnloadDistributedZkTest.test-seed#[E21E9796849CC2C2]) [n:127.0.0.1:42170_    ] o.a.s.s.SolrDispatchFilter SolrDispatchFilter.init() done
   [junit4]   2> 869332 INFO  (coreLoadExecutor-3299-thread-1-processing-n:127.0.0.1:42170_) [n:127.0.0.1:42170_ c:control_collection   x:collection1] o.a.s.c.ZkController publishing state=down
   [junit4]   2> 869332 INFO  (coreLoadExecutor-3299-thread-1-processing-n:127.0.0.1:42170_) [n:127.0.0.1:42170_ c:control_collection   x:collection1] o.a.s.c.ZkController numShards not found on descriptor - reading it from system property
   [junit4]   2> 869332 INFO  (OverseerStateUpdate-95582821447303172-127.0.0.1:42170_-n_0000000000) [n:127.0.0.1:42170_    ] o.a.s.c.Overseer processMessage: queueSize: 1, message = {
   [junit4]   2>   "core":"collection1",
   [junit4]   2>   "roles":null,
   [junit4]   2>   "base_url":"http://127.0.0.1:42170",
   [junit4]   2>   "node_name":"127.0.0.1:42170_",
   [junit4]   2>   "numShards":"1",
   [junit4]   2>   "state":"down",
   [junit4]   2>   "shard":null,
   [junit4]   2>   "collection":"control_collection",
   [junit4]   2>   "operation":"state"} current state version: 0
   [junit4]   2> 869332 INFO  (coreLoadExecutor-3299-thread-1-processing-n:127.0.0.1:42170_) [n:127.0.0.1:42170_ c:control_collection   x:collection1] o.a.s.c.ZkController look for our core node name
   [junit4]   2> 869332 INFO  (OverseerStateUpdate-95582821447303172-127.0.0.1:42170_-n_0000000000) [n:127.0.0.1:42170_    ] o.a.s.c.o.ReplicaMutator Update state numShards=1 message={
   [junit4]   2>   "core":"collection1",
   [junit4]   2>   "roles":null,
   [junit4]   2>   "base_url":"http://127.0.0.1:42170",
   [junit4]   2>   "node_name":"127.0.0.1:42170_",
   [junit4]   2>   "numShards":"1",
   [junit4]   2>   "state":"down",
   [junit4]   2>   "shard":null,
   [junit4]   2>   "collection":"control_collection",
   [junit4]   2>   "operation":"state"}
   [junit4]   2> 869333 INFO  (OverseerStateUpdate-95582821447303172-127.0.0.1:42170_-n_0000000000) [n:127.0.0.1:42170_    ] o.a.s.c.o.ClusterStateMutator building a new cName: control_collection
   [junit4]   2> 869333 INFO  (OverseerStateUpdate-95582821447303172-127.0.0.1:42170_-n_0000000000) [n:127.0.0.1:42170_    ] o.a.s.c.o.ReplicaMutator Assigning new node to shard shard=shard1
   [junit4]   2> 869333 INFO  (zkCallback-1310-thread-1-processing-n:127.0.0.1:42170_) [n:127.0.0.1:42170_    ] o.a.s.c.c.ZkStateReader A cluster state change: [WatchedEvent state:SyncConnected type:NodeDataChanged path:/clusterstate.json], has occurred - updating... (live nodes size: [1])
   [junit4]   2> 870333 INFO  (coreLoadExecutor-3299-thread-1-processing-n:127.0.0.1:42170_) [n:127.0.0.1:42170_ c:control_collection   x:collection1] o.a.s.c.ZkController waiting to find shard id in clusterstate for collection1
   [junit4]   2> 870333 INFO  (coreLoadExecutor-3299-thread-1-processing-n:127.0.0.1:42170_) [n:127.0.0.1:42170_ c:control_collection   x:collection1] o.a.s.c.ZkController Check for collection zkNode:control_collection
   [junit4]   2> 870333 INFO  (coreLoadExecutor-3299-thread-1-processing-n:127.0.0.1:42170_) [n:127.0.0.1:42170_ c:control_collection   x:collection1] o.a.s.c.ZkController Collection zkNode exists
   [junit4]   2> 870333 INFO  (coreLoadExecutor-3299-thread-1-processing-n:127.0.0.1:42170_) [n:127.0.0.1:42170_ c:control_collection   x:collection1] o.a.s.c.c.ZkStateReader Load collection config from: [/collections/control_collection]
   [junit4]   2> 870333 INFO  (coreLoadExecutor-3299-thread-1-processing-n:127.0.0.1:42170_) [n:127.0.0.1:42170_ c:control_collection   x:collection1] o.a.s.c.c.ZkStateReader path=[/collections/control_collection] [configName]=[conf1] specified config exists in ZooKeeper
   [junit4]   2> 870333 INFO  (coreLoadExecutor-3299-thread-1-processing-n:127.0.0.1:42170_) [n:127.0.0.1:42170_ c:control_collection   x:collection1] o.a.s.c.SolrResourceLoader new SolrResourceLoader for directory: '/home/jenkins/workspace/Lucene-Solr-6.x-Linux/solr/build/solr-core/test/J2/temp/solr.cloud.UnloadDistributedZkTest_E21E9796849CC2C2-001/control-001/cores/collection1'
   [junit4]   2> 870334 INFO  (coreLoadExecutor-3299-thread-1-processing-n:127.0.0.1:42170_) [n:127.0.0.1:42170_ c:control_collection   x:collection1] o.a.s.c.SolrResourceLoader JNDI not configured for solr (NoInitialContextEx)
   [junit4]   2> 870334 INFO  (coreLoadExecutor-3299-thread-1-processing-n:127.0.0.1:42170_) [n:127.0.0.1:42170_ c:control_collection   x:collection1] o.a.s.c.SolrResourceLoader solr home defaulted to 'solr/' (could not find system property or JNDI)
   [junit4]   2> 870334 INFO  (coreLoadExecutor-3299-thread-1-processing-n:127.0.0.1:42170_) [n:127.0.0.1:42170_ c:control_collection   x:collection1] o.a.s.c.Config loaded config solrconfig.xml with version 0 
   [junit4]   2> 870338 INFO  (coreLoadExecutor-3299-thread-1-processing-n:127.0.0.1:42170_) [n:127.0.0.1:42170_ c:control_collection   x:collection1] o.a.s.c.SolrConfig current version of requestparams : -1
   [junit4]   2> 870340 INFO  (coreLoadExecutor-3299-thread-1-processing-n:127.0.0.1:42170_) [n:127.0.0.1:42170_ c:control_collection   x:collection1] o.a.s.c.SolrConfig Using Lucene MatchVersion: 6.1.0
   [junit4]   2> 870345 INFO  (coreLoadExecutor-3299-thread-1-processing-n:127.0.0.1:42170_) [n:127.0.0.1:42170_ c:control_collection   x:collection1] o.a.s.c.SolrConfig Loaded SolrConfig: solrconfig.xml
   [junit4]   2> 870349 INFO  (coreLoadExecutor-3299-thread-1-processing-n:127.0.0.1:42170_) [n:127.0.0.1:42170_ c:control_collection   x:collection1] o.a.s.s.IndexSchema [collection1] Schema name=test
   [junit4]   2> 870407 INFO  (coreLoadExecutor-3299-thread-1-processing-n:127.0.0.1:42170_) [n:127.0.0.1:42170_ c:control_collection   x:collection1] o.a.s.s.OpenExchangeRatesOrgProvider Initialized with rates=open-exchange-rates.json, refreshInterval=1440.
   [junit4]   2> 870410 INFO  (coreLoadExecutor-3299-thread-1-processing-n:127.0.0.1:42170_) [n:127.0.0.1:42170_ c:control_collection   x:collection1] o.a.s.s.IndexSchema default search field in schema is text
   [junit4]   2> 870411 INFO  (coreLoadExecutor-3299-thread-1-processing-n:127.0.0.1:42170_) [n:127.0.0.1:42170_ c:control_collection   x:collection1] o.a.s.s.IndexSchema unique key field: id
   [junit4]   2> 870413 INFO  (coreLoadExecutor-3299-thread-1-processing-n:127.0.0.1:42170_) [n:127.0.0.1:42170_ c:control_collection   x:collection1] o.a.s.s.FileExchangeRateProvider Reloading exchange rates from file currency.xml
   [junit4]   2> 870415 INFO  (coreLoadExecutor-3299-thread-1-processing-n:127.0.0.1:42170_) [n:127.0.0.1:42170_ c:control_collection   x:collection1] o.a.s.s.FileExchangeRateProvider Reloading exchange rates from file currency.xml
   [junit4]   2> 870416 INFO  (coreLoadExecutor-3299-thread-1-processing-n:127.0.0.1:42170_) [n:127.0.0.1:42170_ c:control_collection   x:collection1] o.a.s.s.OpenExchangeRatesOrgProvider Reloading exchange rates from open-exchange-rates.json
   [junit4]   2> 870416 INFO  (coreLoadExecutor-3299-thread-1-processing-n:127.0.0.1:42170_) [n:127.0.0.1:42170_ c:control_collection   x:collection1] o.a.s.s.OpenExchangeRatesOrgProvider Reloading exchange rates from open-exchange-rates.json
   [junit4]   2> 870417 INFO  (coreLoadExecutor-3299-thread-1-processing-n:127.0.0.1:42170_) [n:127.0.0.1:42170_ c:control_collection   x:collection1] o.a.s.c.ConfigSetProperties Did not find ConfigSet properties, assuming default properties: Can't find resource 'configsetprops.json' in classpath or '/configs/conf1', cwd=/home/jenkins/workspace/Lucene-Solr-6.x-Linux/solr/build/solr-core/test/J2
   [junit4]   2> 870417 INFO  (coreLoadExecutor-3299-thread-1-processing-n:127.0.0.1:42170_) [n:127.0.0.1:42170_ c:control_collection   x:collection1] o.a.s.c.CoreContainer Creating SolrCore 'collection1' using configuration from collection control_collection
   [junit4]   2> 870417 INFO  (coreLoadExecutor-3299-thread-1-processing-n:127.0.0.1:42170_) [n:127.0.0.1:42170_ c:control_collection s:shard1 r:core_node1 x:collection1] o.a.s.c.SolrCore org.apache.solr.core.MockDirectoryFactory
   [junit4]   2> 870417 INFO  (coreLoadExecutor-3299-thread-1-processing-n:127.0.0.1:42170_) [n:127.0.0.1:42170_ c:control_collection s:shard1 r:core_node1 x:collection1] o.a.s.c.SolrCore [[collection1] ] Opening new SolrCore at [/home/jenkins/workspace/Lucene-Solr-6.x-Linux/solr/build/solr-core/test/J2/temp/solr.cloud.UnloadDistributedZkTest_E21E9796849CC2C2-001/control-001/cores/collection1], dataDir=[/home/jenkins/workspace/Lucene-Solr-6.x-Linux/solr/build/solr-core/test/J2/temp/solr.cloud.UnloadDistributedZkTest_E21E9796849CC2C2-001/control-001/cores/collection1/data/]
   [junit4]   2> 870417 INFO  (coreLoadExecutor-3299-thread-1-processing-n:127.0.0.1:42170_) [n:127.0.0.1:42170_ c:control_collection s:shard1 r:core_node1 x:collection1] o.a.s.c.JmxMonitoredMap JMX monitoring is enabled. Adding Solr mbeans to JMX Server: com.sun.jmx.mbeanserver.JmxMBeanServer@195937c
   [junit4]   2> 870418 INFO  (coreLoadExecutor-3299-thread-1-processing-n:127.0.0.1:42170_) [n:127.0.0.1:42170_ c:control_collection s:shard1 r:core_node1 x:collection1] o.a.s.c.CachingDirectoryFactory return new directory for /home/jenkins/workspace/Lucene-Solr-6.x-Linux/solr/build/solr-core/test/J2/temp/solr.cloud.UnloadDistributedZkTest_E21E9796849CC2C2-001/control-001/cores/collection1/data
   [junit4]   2> 870418 INFO  (coreLoadExecutor-3299-thread-1-processing-n:127.0.0.1:42170_) [n:127.0.0.1:42170_ c:control_collection s:shard1 r:core_node1 x:collection1] o.a.s.c.SolrCore New index directory detected: old=null new=/home/jenkins/workspace/Lucene-Solr-6.x-Linux/solr/build/solr-core/test/J2/temp/solr.cloud.UnloadDistributedZkTest_E21E9796849CC2C2-001/control-001/cores/collection1/data/index/
   [junit4]   2> 870418 WARN  (coreLoadExecutor-3299-thread-1-processing-n:127.0.0.1:42170_) [n:127.0.0.1:42170_ c:control_collection s:shard1 r:core_node1 x:collection1] o.a.s.c.SolrCore [collection1] Solr index directory '/home/jenkins/workspace/Lucene-Solr-6.x-Linux/solr/build/solr-core/test/J2/temp/solr.cloud.UnloadDistributedZkTest_E21E9796849CC2C2-001/control-001/cores/collection1/data/index' doesn't exist. Creating new index...
   [junit4]   2> 870418 INFO  (coreLoadExecutor-3299-thread-1-processing-n:127.0.0.1:42170_) [n:127.0.0.1:42170_ c:control_collection s:shard1 r:core_node1 x:collection1] o.a.s.c.CachingDirectoryFactory return new directory for /home/jenkins/workspace/Lucene-Solr-6.x-Linux/solr/build/solr-core/test/J2/temp/solr.cloud.UnloadDistributedZkTest_E21E9796849CC2C2-001/control-001/cores/collection1/data/index
   [junit4]   2> 870418 INFO  (coreLoadExecutor-3299-thread-1-processing-n:127.0.0.1:42170_) [n:127.0.0.1:42170_ c:control_collection s:shard1 r:core_node1 x:collection1] o.a.s.u.RandomMergePolicy RandomMergePolicy wrapping class org.apache.lucene.index.LogByteSizeMergePolicy: [LogByteSizeMergePolicy: minMergeSize=1677721, mergeFactor=18, maxMergeSize=2147483648, maxMergeSizeForForcedMerge=9223372036854775807, calibrateSizeByDeletes=false, maxMergeDocs=2147483647, maxCFSSegmentSizeMB=8.796093022207999E12, noCFSRatio=0.12304577737518346]
   [junit4]   2> 870418 INFO  (coreLoadExecutor-3299-thread-1-processing-n:127.0.0.1:42170_) [n:127.0.0.1:42170_ c:control_collection s:shard1 r:core_node1 x:collection1] o.a.s.c.SolrDeletionPolicy SolrDeletionPolicy.onCommit: commits: num=1
   [junit4]   2> 	commit{dir=MockDirectoryWrapper(RAMDirectory@ab7cb6 lockFactory=org.apache.lucene.store.SingleInstanceLockFactory@cb4bd5),segFN=segments_1,generation=1}
   [junit4]   2> 870418 INFO  (coreLoadExecutor-3299-thread-1-processing-n:127.0.0.1:42170_) [n:127.0.0.1:42170_ c:control_collection s:shard1 r:core_node1 x:collection1] o.a.s.c.SolrDeletionPolicy newest commit generation = 1
   [junit4]   2> 870419 INFO  (OldIndexDirectoryCleanupThreadForCore-collection1) [n:127.0.0.1:42170_ c:control_collection s:shard1 r:core_node1 x:collection1] o.a.s.c.SolrCore Looking for old index directories to cleanup for core collection1 in /home/jenkins/workspace/Lucene-Solr-6.x-Linux/solr/build/solr-core/test/J2/temp/solr.cloud.UnloadDistributedZkTest_E21E9796849CC2C2-001/control-001/cores/collection1/data/
   [junit4]   2> 870419 WARN  (OldIndexDirectoryCleanupThreadForCore-collection1) [n:127.0.0.1:42170_ c:control_collection s:shard1 r:core_node1 x:collection1] o.a.s.c.DirectoryFactory /home/jenkins/workspace/Lucene-Solr-6.x-Linux/solr/build/solr-core/test/J2/temp/solr.cloud.UnloadDistributedZkTest_E21E9796849CC2C2-001/control-001/cores/collection1/data/ does not point to a valid data directory; skipping clean-up of old index directories.
   [junit4]   2> 870421 INFO  (coreLoadExecutor-3299-thread-1-processing-n:127.0.0.1:42170_) [n:127.0.0.1:42170_ c:control_collection s:shard1 r:core_node1 x:collection1] o.a.s.u.p.UpdateRequestProcessorChain creating updateRequestProcessorChain "nodistrib"
   [junit4]   2> 870421 INFO  (coreLoadExecutor-3299-thread-1-processing-n:127.0.0.1:42170_) [n:127.0.0.1:42170_ c:control_collection s:shard1 r:core_node1 x:collection1] o.a.s.u.p.UpdateRequestProcessorChain creating updateRequestProcessorChain "dedupe"
   [junit4]   2> 870421 INFO  (coreLoadExecutor-3299-thread-1-processing-n:127.0.0.1:42170_) [n:127.0.0.1:42170_ c:control_collection s:shard1 r:core_node1 x:collection1] o.a.s.u.p.UpdateRequestProcessorChain inserting DistributedUpdateProcessorFactory into updateRequestProcessorChain "dedupe"
   [junit4]   2> 870421 INFO  (coreLoadExecutor-3299-thread-1-processing-n:127.0.0.1:42170_) [n:127.0.0.1:42170_ c:control_collection s:shard1 r:core_node1 x:collection1] o.a.s.u.p.UpdateRequestProcessorChain creating updateRequestProcessorChain "stored_sig"
   [junit4]   2> 870422 INFO  (coreLoadExecutor-3299-thread-1-processing-n:127.0.0.1:42170_) [n:127.0.0.1:42170_ c:control_collection s:shard1 r:core_node1 x:collection1] o.a.s.u.p.UpdateRequestProcessorChain inserting DistributedUpdateProcessorFactory into updateRequestProcessorChain "stored_sig"
   [junit4]   2> 870422 INFO  (coreLoadExecutor-3299-thread-1-processing-n:127.0.0.1:42170_) [n:127.0.0.1:42170_ c:control_collection s:shard1 r:core_node1 x:collection1] o.a.s.u.p.UpdateRequestProcessorChain creating updateRequestProcessorChain "distrib-dup-test-chain-explicit"
   [junit4]   2> 870422 INFO  (coreLoadExecutor-3299-thread-1-processing-n:127.0.0.1:42170_) [n:127.0.0.1:42170_ c:control_collection s:shard1 r:core_node1 x:collection1] o.a.s.u.p.UpdateRequestProcessorChain creating updateRequestProcessorChain "distrib-dup-test-chain-implicit"
   [junit4]   2> 870422 INFO  (coreLoadExecutor-3299-thread-1-processing-n:127.0.0.1:42170_) [n:127.0.0.1:42170_ c:control_collection s:shard1 r:core_node1 x:collection1] o.a.s.u.p.UpdateRequestProcessorChain inserting DistributedUpdateProcessorFactory into updateRequestProcessorChain "distrib-dup-test-chain-implicit"
   [junit4]   2> 870422 INFO  (coreLoadExecutor-3299-thread-1-processing-n:127.0.0.1:42170_) [n:127.0.0.1:42170_ c:control_collection s:shard1 r:core_node1 x:collection1] o.a.s.c.SolrCore no updateRequestProcessorChain defined as default, creating implicit default
   [junit4]   2> 870422 WARN  (coreLoadExecutor-3299-thread-1-processing-n:127.0.0.1:42170_) [n:127.0.0.1:42170_ c:control_collection s:shard1 r:core_node1 x:collection1] o.a.s.c.RequestHandlers INVALID paramSet a in requestHandler {type = requestHandler,name = /dump,class = DumpRequestHandler,args = {defaults={a=A,b=B}}}
   [junit4]   2> 870423 INFO  (coreLoadExecutor-3299-thread-1-processing-n:127.0.0.1:42170_) [n:127.0.0.1:42170_ c:control_collection s:shard1 r:core_node1 x:collection1] o.a.s.h.l.XMLLoader xsltCacheLifetimeSeconds=60
   [junit4]   2> 870424 INFO  (coreLoadExecutor-3299-thread-1-processing-n:127.0.0.1:42170_) [n:127.0.0.1:42170_ c:control_collection s:shard1 r:core_node1 x:collection1] o.a.s.h.l.XMLLoader xsltCacheLifetimeSeconds=60
   [junit4]   2> 870424 INFO  (coreLoadExecutor-3299-thread-1-processing-n:127.0.0.1:42170_) [n:127.0.0.1:42170_ c:control_collection s:shard1 r:core_node1 x:collection1] o.a.s.h.l.XMLLoader xsltCacheLifetimeSeconds=60
   [junit4]   2> 870425 INFO  (coreLoadExecutor-3299-thread-1-processing-n:127.0.0.1:42170_) [n:127.0.0.1:42170_ c:control_collection s:shard1 r:core_node1 x:collection1] o.a.s.h.l.XMLLoader xsltCacheLifetimeSeconds=60
   [junit4]   2> 870426 INFO  (coreLoadExecutor-3299-thread-1-processing-n:127.0.0.1:42170_) [n:127.0.0.1:42170_ c:control_collection s:shard1 r:core_node1 x:collection1] o.a.s.c.RequestHandlers Registered paths: /admin/mbeans,standard,/dump,/update/csv,/sql,/update/json/docs,/admin/luke,/export,/admin/segments,/get,/admin/system,/replication,/admin/properties,/config,/stream,/schema,/admin/plugins,/admin/logging,/update/json,/admin/ping,/admin/threads,/update,/admin/file
   [junit4]   2> 870426 INFO  (coreLoadExecutor-3299-thread-1-processing-n:127.0.0.1:42170_) [n:127.0.0.1:42170_ c:control_collection s:shard1 r:core_node1 x:collection1] o.a.s.c.SolrCore Using default statsCache cache: org.apache.solr.search.stats.LocalStatsCache
   [junit4]   2> 870426 INFO  (coreLoadExecutor-3299-thread-1-processing-n:127.0.0.1:42170_) [n:127.0.0.1:42170_ c:control_collection s:shard1 r:core_node1 x:collection1] o.a.s.u.UpdateHandler Using UpdateLog implementation: org.apache.solr.update.UpdateLog
   [junit4]   2> 870426 INFO  (coreLoadExecutor-3299-thread-1-processing-n:127.0.0.1:42170_) [n:127.0.0.1:42170_ c:control_collection s:shard1 r:core_node1 x:collection1] o.a.s.u.UpdateLog Initializing UpdateLog: dataDir= defaultSyncLevel=FLUSH numRecordsToKeep=100 maxNumLogsToKeep=10 numVersionBuckets=65536
   [junit4]   2> 870427 INFO  (coreLoadExecutor-3299-thread-1-processing-n:127.0.0.1:42170_) [n:127.0.0.1:42170_ c:control_collection s:shard1 r:core_node1 x:collection1] o.a.s.u.CommitTracker Hard AutoCommit: disabled
   [junit4]   2> 870427 INFO  (coreLoadExecutor-3299-thread-1-processing-n:127.0.0.1:42170_) [n:127.0.0.1:42170_ c:control_collection s:shard1 r:core_node1 x:collection1] o.a.s.u.CommitTracker Soft AutoCommit: disabled
   [junit4]   2> 870427 INFO  (coreLoadExecutor-3299-thread-1-processing-n:127.0.0.1:42170_) [n:127.0.0.1:42170_ c:control_collection s:shard1 r:core_node1 x:collection1] o.a.s.u.RandomMergePolicy RandomMergePolicy wrapping class org.apache.lucene.index.TieredMergePolicy: [TieredMergePolicy: maxMergeAtOnce=38, maxMergeAtOnceExplicit=44, maxMergedSegmentMB=50.1689453125, floorSegmentMB=0.8681640625, forceMergeDeletesPctAllowed=18.94894080896742, segmentsPerTier=17.0, maxCFSSegmentSizeMB=8.796093022207999E12, noCFSRatio=1.0
   [junit4]   2> 870427 INFO  (coreLoadExecutor-3299-thread-1-processing-n:127.0.0.1:42170_) [n:127.0.0.1:42170_ c:control_collection s:shard1 r:core_node1 x:collection1] o.a.s.c.SolrDeletionPolicy SolrDeletionPolicy.onInit: commits: num=1
   [junit4]   2> 	commit{dir=MockDirectoryWrapper(RAMDirectory@ab7cb6 lockFactory=org.apache.lucene.store.SingleInstanceLockFactory@cb4bd5),segFN=segments_1,generation=1}
   [junit4]   2> 870427 INFO  (coreLoadExecutor-3299-thread-1-processing-n:127.0.0.1:42170_) [n:127.0.0.1:42170_ c:control_collection s:shard1 r:core_node1 x:collection1] o.a.s.c.SolrDeletionPolicy newest commit generation = 1
   [junit4]   2> 870427 INFO  (coreLoadExecutor-3299-thread-1-processing-n:127.0.0.1:42170_) [n:127.0.0.1:42170_ c:control_collection s:shard1 r:core_node1 x:collection1] o.a.s.s.SolrIndexSearcher Opening [Searcher@175df1e[collection1] main]
   [junit4]   2> 870427 INFO  (coreLoadExecutor-3299-thread-1-processing-n:127.0.0.1:42170_) [n:127.0.0.1:42170_ c:control_collection s:shard1 r:core_node1 x:collection1] o.a.s.c.c.ZkStateReader Load collection config from: [/collections/control_collection]
   [junit4]   2> 870428 INFO  (coreLoadExecutor-3299-thread-1-processing-n:127.0.0.1:42170_) [n:127.0.0.1:42170_ c:control_collection s:shard1 r:core_node1 x:collection1] o.a.s.c.c.ZkStateReader path=[/collections/control_collection] [configName]=[conf1] specified config exists in ZooKeeper
   [junit4]   2> 870428 INFO  (coreLoadExecutor-3299-thread-1-processing-n:127.0.0.1:42170_) [n:127.0.0.1:42170_ c:control_collection s:shard1 r:core_node1 x:collection1] o.a.s.r.ManagedResourceStorage Setting up ZooKeeper-based storage for the RestManager with znodeBase: /configs/conf1
   [junit4]   2> 870428 INFO  (coreLoadExecutor-3299-thread-1-processing-n:127.0.0.1:42170_) [n:127.0.0.1:42170_ c:control_collection s:shard1 r:core_node1 x:collection1] o.a.s.r.ManagedResourceStorage Configured ZooKeeperStorageIO with znodeBase: /configs/conf1
   [junit4]   2> 870428 INFO  (coreLoadExecutor-3299-thread-1-processing-n:127.0.0.1:42170_) [n:127.0.0.1:42170_ c:control_collection s:shard1 r:core_node1 x:collection1] o.a.s.r.RestManager Initializing RestManager with initArgs: {}
   [junit4]   2> 870428 INFO  (coreLoadExecutor-3299-thread-1-processing-n:127.0.0.1:42170_) [n:127.0.0.1:42170_ c:control_collection s:shard1 r:core_node1 x:collection1] o.a.s.r.ManagedResourceStorage Reading _rest_managed.json using ZooKeeperStorageIO:path=/configs/conf1
   [junit4]   2> 870428 INFO  (coreLoadExecutor-3299-thread-1-processing-n:127.0.0.1:42170_) [n:127.0.0.1:42170_ c:control_collection s:shard1 r:core_node1 x:collection1] o.a.s.r.ManagedResourceStorage No data found for znode /configs/conf1/_rest_managed.json
   [junit4]   2> 870428 INFO  (coreLoadExecutor-3299-thread-1-processing-n:127.0.0.1:42170_) [n:127.0.0.1:42170_ c:control_collection s:shard1 r:core_node1 x:collection1] o.a.s.r.ManagedResourceStorage Loaded null at path _rest_managed.json using ZooKeeperStorageIO:path=/configs/conf1
   [junit4]   2> 870428 INFO  (coreLoadExecutor-3299-thread-1-processing-n:127.0.0.1:42170_) [n:127.0.0.1:42170_ c:control_collection s:shard1 r:core_node1 x:collection1] o.a.s.r.RestManager Initializing 0 registered ManagedResources
   [junit4]   2> 870428 INFO  (coreLoadExecutor-3299-thread-1-processing-n:127.0.0.1:42170_) [n:127.0.0.1:42170_ c:control_collection s:shard1 r:core_node1 x:collection1] o.a.s.h.ReplicationHandler Commits will be reserved for  10000
   [junit4]   2> 870429 INFO  (searcherExecutor-3300-thread-1-processing-n:127.0.0.1:42170_ x:collection1 s:shard1 c:control_collection r:core_node1) [n:127.0.0.1:42170_ c:control_collection s:shard1 r:core_node1 x:collection1] o.a.s.c.SolrCore [collection1] Registered new searcher Searcher@175df1e[collection1] main{ExitableDirectoryReader(UninvertingDirectoryReader())}
   [junit4]   2> 870429 INFO  (coreLoadExecutor-3299-thread-1-processing-n:127.0.0.1:42170_) [n:127.0.0.1:42170_ c:control_collection s:shard1 r:core_node1 x:collection1] o.a.s.u.UpdateLog Looking up max value of version field to seed version buckets
   [junit4]   2> 870429 INFO  (coreLoadExecutor-3299-thread-1-processing-n:127.0.0.1:42170_) [n:127.0.0.1:42170_ c:control_collection s:shard1 r:core_node1 x:collection1] o.a.s.u.VersionInfo Refreshing highest value of _version_ for 65536 version buckets from index
   [junit4]   2> 870429 INFO  (coreLoadExecutor-3299-thread-1-processing-n:127.0.0.1:42170_) [n:127.0.0.1:42170_ c:control_collection s:shard1 r:core_node1 x:collection1] o.a.s.u.VersionInfo No terms found for _version_, cannot seed version bucket highest value from index
   [junit4]   2> 870429 INFO  (coreLoadExecutor-3299-thread-1-processing-n:127.0.0.1:42170_) [n:127.0.0.1:42170_ c:control_collection s:shard1 r:core_node1 x:collection1] o.a.s.u.UpdateLog Could not find max version in index or recent updates, using new clock 1529325144686723072
   [junit4]   2> 870431 INFO  (coreLoadExecutor-3299-thread-1-processing-n:127.0.0.1:42170_) [n:127.0.0.1:42170_ c:control_collection s:shard1 r:core_node1 x:collection1] o.a.s.u.UpdateLog Took 1.0ms to seed version buckets with highest version 1529325144686723072
   [junit4]   2> 870431 INFO  (coreLoadExecutor-3299-thread-1-processing-n:127.0.0.1:42170_) [n:127.0.0.1:42170_ c:control_collection s:shard1 r:core_node1 x:collection1] o.a.s.c.ZkController watch zkdir /configs/conf1
   [junit4]   2> 870431 INFO  (coreLoadExecutor-3299-thread-1-processing-n:127.0.0.1:42170_) [n:127.0.0.1:42170_ c:control_collection s:shard1 r:core_node1 x:collection1] o.a.s.c.CoreContainer registering core: collection1
   [junit4]   2> 870432 INFO  (coreZkRegister-3293-thread-1-processing-n:127.0.0.1:42170_ x:collection1 s:shard1 c:control_collection r:core_node1) [n:127.0.0.1:42170_ c:control_collection s:shard1 r:core_node1 x:collection1] o.a.s.c.ZkController Register replica - core:collection1 address:http://127.0.0.1:42170 collection:control_collection shard:shard1
   [junit4]   2> 870432 INFO  (coreZkRegister-3293-thread-1-processing-n:127.0.0.1:42170_ x:collection1 s:shard1 c:control_collection r:core_node1) [n:127.0.0.1:42170_ c:control_collection s:shard1 r:core_node1 x:collection1] o.a.s.c.c.SolrZkClient makePath: /collections/control_collection/leader_elect/shard1/election
   [junit4]   2> 870433 INFO  (coreZkRegister-3293-thread-1-processing-n:127.0.0.1:42170_ x:collection1 s:shard1 c:control_collection r:core_node1) [n:127.0.0.1:42170_ c:control_collection s:shard1 r:core_node1 x:collection1] o.a.s.c.LeaderElector Joined leadership election with path: /collections/control_collection/leader_elect/shard1/election/95582821447303172-core_node1-n_0000000000
   [junit4]   2> 870433 INFO  (coreZkRegister-3293-thread-1-processing-n:127.0.0.1:42170_ x:collection1 s:shard1 c:control_collection r:core_node1) [n:127.0.0.1:42170_ c:control_collection s:shard1 r:core_node1 x:collection1] o.a.s.c.ShardLeaderElectionContext Running the leader process for shard=shard1 and weAreReplacement=false and leaderVoteWait=180000
   [junit4]   2> 870434 INFO  (coreZkRegister-3293-thread-1-processing-n:127.0.0.1:42170_ x:collection1 s:shard1 c:control_collection r:core_node1) [n:127.0.0.1:42170_ c:control_collection s:shard1 r:core_node1 x:collection1] o.a.s.c.ShardLeaderElectionContext Enough replicas found to continue.
   [junit4]   2> 870434 INFO  (coreZkRegister-3293-thread-1-processing-n:127.0.0.1:42170_ x:collection1 s:shard1 c:control_collection r:core_node1) [n:127.0.0.1:42170_ c:control_collection s:shard1 r:core_node1 x:collection1] o.a.s.c.ShardLeaderElectionContext I may be the new leader - try and sync
   [junit4]   2> 870434 INFO  (coreZkRegister-3293-thread-1-processing-n:127.0.0.1:42170_ x:collection1 s:shard1 c:control_collection r:core_node1) [n:127.0.0.1:42170_ c:control_collection s:shard1 r:core_node1 x:collection1] o.a.s.c.SyncStrategy Sync replicas to http://127.0.0.1:42170/collection1/
   [junit4]   2> 870434 INFO  (OverseerStateUpdate-95582821447303172-127.0.0.1:42170_-n_0000000000) [n:127.0.0.1:42170_    ] o.a.s.c.Overseer processMessage: queueSize: 1, message = {
   [junit4]   2>   "operation":"leader",
   [junit4]   2>   "shard":"shard1",
   [junit4]   2>   "collection":"control_collection"} current state version: 1
   [junit4]   2> 870434 INFO  (coreZkRegister-3293-thread-1-processing-n:127.0.0.1:42170_ x:collection1 s:shard1 c:control_collection r:core_node1) [n:127.0.0.1:42170_ c:control_collection s:shard1 r:core_node1 x:collection1] o.a.s.c.SyncStrategy Sync Success - now sync replicas to me
   [junit4]   2> 870434 INFO  (coreZkRegister-3293-thread-1-processing-n:127.0.0.1:42170_ x:collection1 s:shard1 c:control_collection r:core_node1) [n:127.0.0.1:42170_ c:control_collection s:shard1 r:core_node1 x:collection1] o.a.s.c.SyncStrategy http://127.0.0.1:42170/collection1/ has no replicas
   [junit4]   2> 870434 INFO  (coreZkRegister-3293-thread-1-processing-n:127.0.0.1:42170_ x:collection1 s:shard1 c:control_collection r:core_node1) [n:127.0.0.1:42170_ c:control_collection s:shard1 r:core_node1 x:collection1] o.a.s.c.c.SolrZkClient makePath: /collections/control_collection/leaders/shard1
   [junit4]   2> 870435 INFO  (coreZkRegister-3293-thread-1-processing-n:127.0.0.1:42170_ x:collection1 s:shard1 c:control_collection r:core_node1) [n:127.0.0.1:42170_ c:control_collection s:shard1 r:core_node1 x:collection1] o.a.s.c.ShardLeaderElectionContextBase Creating leader registration node /collections/control_collection/leaders/shard1/leader after winning as /collections/control_collection/leader_elect/shard1/election/95582821447303172-core_node1-n_0000000000
   [junit4]   2> 870436 INFO  (coreZkRegister-3293-thread-1-processing-n:127.0.0.1:42170_ x:collection1 s:shard1 c:control_collection r:core_node1) [n:127.0.0.1:42170_ c:control_collection s:shard1 r:core_node1 x:collection1] o.a.s.c.ShardLeaderElectionContext I am the new leader: http://127.0.0.1:42170/collection1/ shard1
   [junit4]   2> 870436 INFO  (OverseerStateUpdate-95582821447303172-127.0.0.1:42170_-n_0000000000) [n:127.0.0.1:42170_    ] o.a.s.c.Overseer processMessage: queueSize: 1, message = {
   [junit4]   2>   "operation":"leader",
   [junit4]   2>   "shard":"shard1",
   [junit4]   2>   "collection":"control_collection",
   [junit4]   2>   "base_url":"http://127.0.0.1:42170",
   [junit4]   2>   "core":"collection1",
   [junit4]   2>   "state":"active"} current state version: 1
   [junit4]   2> 870537 INFO  (zkCallback-1310-thread-1-processing-n:127.0.0.1:42170_) [n:127.0.0.1:42170_    ] o.a.s.c.c.ZkStateReader A cluster state change: [WatchedEvent state:SyncConnected type:NodeDataChanged path:/clusterstate.json], has occurred - updating... (live nodes size: [1])
   [junit4]   2> 870586 INFO  (coreZkRegister-3293-thread-1-processing-n:127.0.0.1:42170_ x:collection1 s:shard1 c:control_collection r:core_node1) [n:127.0.0.1:42170_ c:control_collection s:shard1 r:core_node1 x:collection1] o.a.s.c.ZkController We are http://127.0.0.1:42170/collection1/ and leader is http://127.0.0.1:42170/collection1/
   [junit4]   2> 870586 INFO  (coreZkRegister-3293-thread-1-processing-n:127.0.0.1:42170_ x:collection1 s:shard1 c:control_collection r:core_node1) [n:127.0.0.1:42170_ c:control_collection s:shard1 r:core_node1 x:collection1] o.a.s.c.ZkController No LogReplay needed for core=collection1 baseURL=http://127.0.0.1:42170
   [junit4]   2> 870586 INFO  (coreZkRegister-3293-thread-1-processing-n:127.0.0.1:42170_ x:collection1 s:shard1 c:control_collection r:core_node1) [n:127.0.0.1:42170_ c:control_collection s:shard1 r:core_node1 x:collection1] o.a.s.c.ZkController I am the leader, no recovery necessary
   [junit4]   2> 870586 INFO  (coreZkRegister-3293-thread-1-processing-n:127.0.0.1:42170_ x:collection1 s:shard1 c:control_collection r:core_node1) [n:127.0.0.1:42170_ c:control_collection s:shard1 r:core_node1 x:collection1] o.a.s.c.ZkController publishing state=active
   [junit4]   2> 870586 INFO  (coreZkRegister-3293-thread-1-processing-n:127.0.0.1:42170_ x:collection1 s:shard1 c:control_collection r:core_node1) [n:127.0.0.1:42170_ c:control_collection s:shard1 r:core_node1 x:collection1] o.a.s.c.ZkController numShards not found on descriptor - reading it from system property
   [junit4]   2> 870587 INFO  (OverseerStateUpdate-95582821447303172-127.0.0.1:42170_-n_0000000000) [n:127.0.0.1:42170_    ] o.a.s.c.Overseer processMessage: queueSize: 1, message = {
   [junit4]   2>   "core":"collection1",
   [junit4]   2>   "core_node_name":"core_node1",
   [junit4]   2>   "roles":null,
   [junit4]   2>   "base_url":"http://127.0.0.1:42170",
   [junit4]   2>   "node_name":"127.0.0.1:42170_",
   [junit4]   2>   "numShards":"1",
   [junit4]   2>   "state":"active",
   [junit4]   2>   "shard":"shard1",
   [junit4]   2>   "collection":"control_collection",
   [junit4]   2>   "operation":"state"} current state version: 2
   [junit4]   2> 870588 INFO  (OverseerStateUpdate-95582821447303172-127.0.0.1:42170_-n_0000000000) [n:127.0.0.1:42170_    ] o.a.s.c.o.ReplicaMutator Update state numShards=1 message={
   [junit4]   2>   "core":"collection1",
   [junit4]   2>   "core_node_name":"core_node1",
   [junit4]   2>   "roles":null,
   [junit4]   2>   "base_url":"http://127.0.0.1:42170",
   [junit4]   2>   "node_name":"127.0.0.1:42170_",
   [junit4]   2>   "numShards":"1",
   [junit4]   2>   "state":"active",
   [junit4]   2>   "shard":"shard1",
   [junit4]   2>   "collection":"control_collection",
   [junit4]   2>   "operation":"state"}
   [junit4]   2> 870689 INFO  (zkCallback-1310-thread-1-processing-n:127.0.0.1:42170_) [n:127.0.0.1:42170_    ] o.a.s.c.c.ZkStateReader A cluster state change: [WatchedEvent state:SyncConnected type:NodeDataChanged path:/clusterstate.json], has occurred - updating... (live nodes size: [1])
   [junit4]   2> 870833 INFO  (TEST-UnloadDistributedZkTest.test-seed#[E21E9796849CC2C2]) [    ] o.a.s.c.c.SolrZkClient Using default ZkCredentialsProvider
   [junit4]   2> 870833 INFO  (TEST-UnloadDistributedZkTest.test-seed#[E21E9796849CC2C2]) [    ] o.a.s.c.c.ConnectionManager Waiting for client to connect to ZooKeeper
   [junit4]   2> 870834 INFO  (zkCallback-1312-thread-1) [    ] o.a.s.c.c.ConnectionManager Watcher org.apache.solr.common.cloud.ConnectionManager@cfe288 name:ZooKeeperConnection Watcher:127.0.0.1:42441/solr got event WatchedEvent state:SyncConnected type:None path:null path:null type:None
   [junit4]   2> 870834 INFO  (TEST-UnloadDistributedZkTest.test-seed#[E21E9796849CC2C2]) [    ] o.a.s.c.c.ConnectionManager Client is connected to ZooKeeper
   [junit4]   2> 870835 INFO  (TEST-UnloadDistributedZkTest.test-seed#[E21E9796849CC2C2]) [    ] o.a.s.c.c.SolrZkClient Using default ZkACLProvider
   [junit4]   2> 870835 INFO  (TEST-UnloadDistributedZkTest.test-seed#[E21E9796849CC2C2]) [    ] o.a.s.c.c.ZkStateReader Updating cluster state from ZooKeeper... 
   [junit4]   2> 870835 INFO  (TEST-UnloadDistributedZkTest.test-seed#[E21E9796849CC2C2]) [    ] o.a.s.c.c.ZkStateReader Updated live nodes from ZooKeeper... (0) -> (1)
   [junit4]   2> 870835 INFO  (TEST-UnloadDistributedZkTest.test-seed#[E21E9796849CC2C2]) [    ] o.a.s.c.ChaosMonkey monkey: init - expire sessions:false cause connection loss:false
   [junit4]   2> 870835 INFO  (TEST-UnloadDistributedZkTest.test-seed#[E21E9796849CC2C2]) [    ] o.a.s.c.AbstractFullDistribZkTestBase Creating collection1 with stateFormat=2
   [junit4]   2> 870836 INFO  (TEST-UnloadDistributedZkTest.test-seed#[E21E9796849CC2C2]) [    ] o.a.s.c.c.SolrZkClient Using default ZkCredentialsProvider
   [junit4]   2> 870836 INFO  (TEST-UnloadDistributedZkTest.test-seed#[E21E9796849CC2C2]) [    ] o.a.s.c.c.ConnectionManager Waiting for client to connect to ZooKeeper
   [junit4]   2> 870836 INFO  (zkCallback-1313-thread-1) [    ] o.a.s.c.c.ConnectionManager Watcher org.apache.solr.common.cloud.ConnectionManager@1dec8c4 name:ZooKeeperConnection Watcher:127.0.0.1:42441/solr got event WatchedEvent state:SyncConnected type:None path:null path:null type:None
   [junit4]   2> 870836 INFO  (TEST-UnloadDistributedZkTest.test-seed#[E21E9796849CC2C2]) [    ] o.a.s.c.c.ConnectionManager Client is connected to ZooKeeper
   [junit4]   2> 870836 INFO  (TEST-UnloadDistributedZkTest.test-seed#[E21E9796849CC2C2]) [    ] o.a.s.c.c.SolrZkClient Using default ZkACLProvider
   [junit4]   2> 870837 INFO  (OverseerStateUpdate-95582821447303172-127.0.0.1:42170_-n_0000000000) [n:127.0.0.1:42170_    ] o.a.s.c.Overseer processMessage: queueSize: 1, message = {
   [junit4]   2>   "operation":"create",
   [junit4]   2>   "name":"collection1",
   [junit4]   2>   "numShards":"2",
   [junit4]   2>   "stateFormat":"2"} current state version: 3
   [junit4]   2> 870837 INFO  (OverseerStateUpdate-95582821447303172-127.0.0.1:42170_-n_0000000000) [n:127.0.0.1:42170_    ] o.a.s.c.o.ClusterStateMutator building a new cName: collection1
   [junit4]   2> 870892 INFO  (TEST-UnloadDistributedZkTest.test-seed#[E21E9796849CC2C2]) [    ] o.a.s.SolrTestCaseJ4 Writing core.properties file to /home/jenkins/workspace/Lucene-Solr-6.x-Linux/solr/build/solr-core/test/J2/temp/solr.cloud.UnloadDistributedZkTest_E21E9796849CC2C2-001/shard-1-001/cores/collection1
   [junit4]   2> 870892 INFO  (TEST-UnloadDistributedZkTest.test-seed#[E21E9796849CC2C2]) [    ] o.a.s.c.AbstractFullDistribZkTestBase create jetty 1 in directory /home/jenkins/workspace/Lucene-Solr-6.x-Linux/solr/build/solr-core/test/J2/temp/solr.cloud.UnloadDistributedZkTest_E21E9796849CC2C2-001/shard-1-001
   [junit4]   2> 870893 INFO  (TEST-UnloadDistributedZkTest.test-seed#[E21E9796849CC2C2]) [    ] o.e.j.s.Server jetty-9.3.8.v20160314
   [junit4]   2> 870894 INFO  (TEST-UnloadDistributedZkTest.test-seed#[E21E9796849CC2C2]) [    ] o.e.j.s.h.ContextHandler Started o.e.j.s.ServletContextHandler@e60ac0{/,null,AVAILABLE}
   [junit4]   2> 870894 INFO  (TEST-UnloadDistributedZkTest.test-seed#[E21E9796849CC2C2]) [    ] o.e.j.s.ServerConnector Started ServerConnector@3aae3f{HTTP/1.1,[http/1.1]}{127.0.0.1:40633}
   [junit4]   2> 870894 INFO  (TEST-UnloadDistributedZkTest.test-seed#[E21E9796849CC2C2]) [    ] o.e.j.s.Server Started @872568ms
   [junit4]   2> 870894 INFO  (TEST-UnloadDistributedZkTest.test-seed#[E21E9796849CC2C2]) [    ] o.a.s.c.s.e.JettySolrRunner Jetty properties: {solr.data.dir=/home/jenkins/workspace/Lucene-Solr-6.x-Linux/solr/build/solr-core/test/J2/temp/solr.cloud.UnloadDistributedZkTest_E21E9796849CC2C2-001/tempDir-001/jetty1, solrconfig=solrconfig.xml, hostContext=/, hostPort=40633, coreRootDirectory=/home/jenkins/workspace/Lucene-Solr-6.x-Linux/solr/build/solr-core/test/J2/../../../../../../../../../home/jenkins/workspace/Lucene-Solr-6.x-Linux/solr/build/solr-core/test/J2/temp/solr.cloud.UnloadDistributedZkTest_E21E9796849CC2C2-001/shard-1-001/cores}
   [junit4]   2> 870895 INFO  (TEST-UnloadDistributedZkTest.test-seed#[E21E9796849CC2C2]) [    ] o.a.s.s.SolrDispatchFilter SolrDispatchFilter.init(): sun.misc.Launcher$AppClassLoader@1d16e93
   [junit4]   2> 870895 INFO  (TEST-UnloadDistributedZkTest.test-seed#[E21E9796849CC2C2]) [    ] o.a.s.c.SolrResourceLoader new SolrResourceLoader for directory: '/home/jenkins/workspace/Lucene-Solr-6.x-Linux/solr/build/solr-core/test/J2/temp/solr.cloud.UnloadDistributedZkTest_E21E9796849CC2C2-001/shard-1-001'
   [junit4]   2> 870895 INFO  (TEST-UnloadDistributedZkTest.test-seed#[E21E9796849CC2C2]) [    ] o.a.s.c.SolrResourceLoader JNDI not configured for solr (NoInitialContextEx)
   [junit4]   2> 870895 INFO  (TEST-UnloadDistributedZkTest.test-seed#[E21E9796849CC2C2]) [    ] o.a.s.c.SolrResourceLoader solr home defaulted to 'solr/' (could not find system property or JNDI)
   [junit4]   2> 870895 INFO  (TEST-UnloadDistributedZkTest.test-seed#[E21E9796849CC2C2]) [    ] o.a.s.c.c.SolrZkClient Using default ZkCredentialsProvider
   [junit4]   2> 870895 INFO  (TEST-UnloadDistributedZkTest.test-seed#[E21E9796849CC2C2]) [    ] o.a.s.c.c.ConnectionManager Waiting for client to connect to ZooKeeper
   [junit4]   2> 870896 INFO  (zkCallback-1314-thread-1) [    ] o.a.s.c.c.ConnectionManager Watcher org.apache.solr.common.cloud.ConnectionManager@ad6ace name:ZooKeeperConnection Watcher:127.0.0.1:42441/solr got event WatchedEvent state:SyncConnected type:None path:null path:null type:None
   [junit4]   2> 870896 INFO  (TEST-UnloadDistributedZkTest.test-seed#[E21E9796849CC2C2]) [    ] o.a.s.c.c.ConnectionManager Client is connected to ZooKeeper
   [junit4]   2> 870896 INFO  (TEST-UnloadDistributedZkTest.test-seed#[E21E9796849CC2C2]) [    ] o.a.s.c.c.SolrZkClient Using default ZkACLProvider
   [junit4]   2> 870897 INFO  (TEST-UnloadDistributedZkTest.test-seed#[E21E9796849CC2C2]) [    ] o.a.s.s.SolrDispatchFilter Loading solr.xml from SolrHome (not found in ZooKeeper)
   [junit4]   2> 870897 INFO  (TEST-UnloadDistributedZkTest.test-seed#[E21E9796849CC2C2]) [    ] o.a.s.c.SolrXmlConfig Loading container configuration from /home/jenkins/workspace/Lucene-Solr-6.x-Linux/solr/build/solr-core/test/J2/temp/solr.cloud.UnloadDistributedZkTest_E21E9796849CC2C2-001/shard-1-001/solr.xml
   [junit4]   2> 870900 INFO  (TEST-UnloadDistributedZkTest.test-seed#[E21E9796849CC2C2]) [    ] o.a.s.c.CorePropertiesLocator Config-defined core root directory: /home/jenkins/workspace/Lucene-Solr-6.x-Linux/solr/build/solr-core/test/J2/../../../../../../../../../home/jenkins/workspace/Lucene-Solr-6.x-Linux/solr/build/solr-core/test/J2/temp/solr.cloud.UnloadDistributedZkTest_E21E9796849CC2C2-001/shard-1-001/cores
   [junit4]   2> 870900 INFO  (TEST-UnloadDistributedZkTest.test-seed#[E21E9796849CC2C2]) [    ] o.a.s.c.CoreContainer New CoreContainer 1813599
   [junit4]   2> 870900 INFO  (TEST-UnloadDistributedZkTest.test-seed#[E21E9796849CC2C2]) [    ] o.a.s.c.CoreContainer Loading cores into CoreContainer [instanceDir=/home/jenkins/workspace/Lucene-Solr-6.x-Linux/solr/build/solr-core/test/J2/temp/solr.cloud.UnloadDistributedZkTest_E21E9796849CC2C2-001/shard-1-001]
   [junit4]   2> 870901 WARN  (TEST-UnloadDistributedZkTest.test-seed#[E21E9796849CC2C2]) [    ] o.a.s.c.CoreContainer Couldn't add files from /home/jenkins/workspace/Lucene-Solr-6.x-Linux/solr/build/solr-core/test/J2/temp/solr.cloud.UnloadDistributedZkTest_E21E9796849CC2C2-001/shard-1-001/lib to classpath: /home/jenkins/workspace/Lucene-Solr-6.x-Linux/solr/build/solr-core/test/J2/temp/solr.cloud.UnloadDistributedZkTest_E21E9796849CC2C2-001/shard-1-001/lib
   [junit4]   2> 870901 INFO  (TEST-UnloadDistributedZkTest.test-seed#[E21E9796849CC2C2]) [    ] o.a.s.h.c.HttpShardHandlerFactory created with socketTimeout : 90000,urlScheme : ,connTimeout : 15000,maxConnectionsPerHost : 20,maxConnections : 10000,corePoolSize : 0,maximumPoolSize : 2147483647,maxThreadIdleTime : 5,sizeOfQueue : -1,fairnessPolicy : false,useRetries : false,
   [junit4]   2> 870901 INFO  (TEST-UnloadDistributedZkTest.test-seed#[E21E9796849CC2C2]) [    ] o.a.s.u.UpdateShardHandler Creating UpdateShardHandler HTTP client with params: socketTimeout=340000&connTimeout=45000&retry=true
   [junit4]   2> 870902 INFO  (TEST-UnloadDistributedZkTest.test-seed#[E21E9796849CC2C2]) [    ] o.a.s.l.LogWatcher SLF4J impl is org.slf4j.impl.Log4jLoggerFactory
   [junit4]   2> 870902 INFO  (TEST-UnloadDistributedZkTest.test-seed#[E21E9796849CC2C2]) [    ] o.a.s.l.LogWatcher Registering Log Listener [Log4j (org.slf4j.impl.Log4jLoggerFactory)]
   [junit4]   2> 870902 INFO  (TEST-UnloadDistributedZkTest.test-seed#[E21E9796849CC2C2]) [    ] o.a.s.c.ZkContainer Zookeeper client=127.0.0.1:42441/solr
   [junit4]   2> 870902 INFO  (TEST-UnloadDistributedZkTest.test-seed#[E21E9796849CC2C2]) [    ] o.a.s.c.ZkController zkHost includes chroot
   [junit4]   2> 870902 INFO  (TEST-UnloadDistributedZkTest.test-seed#[E21E9796849CC2C2]) [    ] o.a.s.c.c.SolrZkClient Using default ZkCredentialsProvider
   [junit4]   2> 870902 INFO  (TEST-UnloadDistributedZkTest.test-seed#[E21E9796849CC2C2]) [    ] o.a.s.c.c.ConnectionManager Waiting for client to connect to ZooKeeper
   [junit4]   2> 870903 INFO  (zkCallback-1317-thread-1) [    ] o.a.s.c.c.ConnectionManager Watcher org.apache.solr.common.cloud.ConnectionManager@1b475de name:ZooKeeperConnection Watcher:127.0.0.1:42441 got event WatchedEvent state:SyncConnected type:None path:null path:null type:None
   [junit4]   2> 870904 INFO  (TEST-UnloadDistributedZkTest.test-seed#[E21E9796849CC2C2]) [    ] o.a.s.c.c.ConnectionManager Client is connected to ZooKeeper
   [junit4]   2> 870904 INFO  (TEST-UnloadDistributedZkTest.test-seed#[E21E9796849CC2C2]) [    ] o.a.s.c.c.SolrZkClient Using default ZkACLProvider
   [junit4]   2> 870904 INFO  (TEST-UnloadDistributedZkTest.test-seed#[E21E9796849CC2C2]) [n:127.0.0.1:40633_    ] o.a.s.c.c.ConnectionManager Waiting for client to connect to ZooKeeper
   [junit4]   2> 870905 INFO  (zkCallback-1318-thread-1-processing-n:127.0.0.1:40633_) [n:127.0.0.1:40633_    ] o.a.s.c.c.ConnectionManager Watcher org.apache.solr.common.cloud.ConnectionManager@1a8379d name:ZooKeeperConnection Watcher:127.0.0.1:42441/solr got event WatchedEvent state:SyncConnected type:None path:null path:null type:None
   [junit4]   2> 870905 INFO  (TEST-UnloadDistributedZkTest.test-seed#[E21E9796849CC2C2]) [n:127.0.0.1:40633_    ] o.a.s.c.c.ConnectionManager Client is connected to ZooKeeper
   [junit4]   2> 870908 INFO  (TEST-UnloadDistributedZkTest.test-seed#[E21E9796849CC2C2]) [n:127.0.0.1:40633_    ] o.a.s.c.c.ZkStateReader Updating cluster state from ZooKeeper... 
   [junit4]   2> 870908 INFO  (TEST-UnloadDistributedZkTest.test-seed#[E21E9796849CC2C2]) [n:127.0.0.1:40633_    ] o.a.s.c.c.ZkStateReader Updated live nodes from ZooKeeper... (0) -> (1)
   [junit4]   2> 870909 INFO  (TEST-UnloadDistributedZkTest.test-seed#[E21E9796849CC2C2]) [n:127.0.0.1:40633_    ] o.a.s.c.Overseer Overseer (id=null) closing
   [junit4]   2> 870909 INFO  (TEST-UnloadDistributedZkTest.test-seed#[E21E9796849CC2C2]) [n:127.0.0.1:40633_    ] o.a.s.c.LeaderElector Joined leadership election with path: /overseer_elect/election/95582821447303177-127.0.0.1:40633_-n_0000000001
   [junit4]   2> 870909 INFO  (TEST-UnloadDistributedZkTest.test-seed#[E21E9796849CC2C2]) [n:127.0.0.1:40633_    ] o.a.s.c.LeaderElector Watching path /overseer_elect/election/95582821447303172-127.0.0.1:42170_-n_0000000000 to know if I could be the leader
   [junit4]   2> 870909 INFO  (TEST-UnloadDistributedZkTest.test-seed#[E21E9796849CC2C2]) [n:127.0.0.1:40633_    ] o.a.s.c.ZkController Publish node=127.0.0.1:40633_ as DOWN
   [junit4]   2> 870910 INFO  (OverseerStateUpdate-95582821447303172-127.0.0.1:42170_-n_0000000000) [n:127.0.0.1:42170_    ] o.a.s.c.Overseer processMessage: queueSize: 1, message = {
   [junit4]   2>   "operation":"downnode",
   [junit4]   2>   "node_name":"127.0.0.1:40633_"} current state version: 3
   [junit4]   2> 870910 INFO  (OverseerStateUpdate-95582821447303172-127.0.0.1:42170_-n_0000000000) [n:127.0.0.1:42170_    ] o.a.s.c.o.NodeMutator DownNode state invoked for node: 127.0.0.1:40633_
   [junit4]   2> 870910 INFO  (OverseerStateUpdate-95582821447303172-127.0.0.1:42170_-n_0000000000) [n:127.0.0.1:42170_    ] o.a.s.c.o.ZkStateWriter going to create_collection /collections/collection1/state.json
   [junit4]   2> 871013 INFO  (zkCallback-1310-thread-1-processing-n:127.0.0.1:42170_) [n:127.0.0.1:42170_    ] o.a.s.c.c.ZkStateReader A cluster state change: [WatchedEvent state:SyncConnected type:NodeDataChanged path:/clusterstate.json], has occurred - updating... (live nodes size: [1])
   [junit4]   2> 871013 INFO  (zkCallback-1318-thread-1-processing-n:127.0.0.1:40633_) [n:127.0.0.1:40633_    ] o.a.s.c.c.ZkStateReader A cluster state change: [WatchedEvent state:SyncConnected type:NodeDataChanged path:/clusterstate.json], has occurred - updating... (live nodes size: [1])
   [junit4]   2> 871013 INFO  (zkCallback-1312-thread-1) [    ] o.a.s.c.c.ZkStateReader A cluster state change: [WatchedEvent state:SyncConnected type:NodeDataChanged path:/clusterstate.json], has occurred - updating... (live nodes size: [1])
   [junit4]   2> 871910 INFO  (TEST-UnloadDistributedZkTest.test-seed#[E21E9796849CC2C2]) [n:127.0.0.1:40633_    ] o.a.s.c.ZkController Register node as live in ZooKeeper:/live_nodes/127.0.0.1:40633_
   [junit4]   2> 871910 INFO  (TEST-UnloadDistributedZkTest.test-seed#[E21E9796849CC2C2]) [n:127.0.0.1:40633_    ] o.a.s.c.c.SolrZkClient makePath: /live_nodes/127.0.0.1:40633_
   [junit4]   2> 871911 INFO  (zkCallback-1318-thread-1-processing-n:127.0.0.1:40633_) [n:127.0.0.1:40633_    ] o.a.s.c.c.ZkStateReader A live node change: [WatchedEvent state:SyncConnected type:NodeChildrenChanged path:/live_nodes], has occurred - updating... (live nodes size: [1])
   [junit4]   2> 871911 INFO  (zkCallback-1310-thread-1-processing-n:127.0.0.1:42170_) [n:127.0.0.1:42170_    ] o.a.s.c.c.ZkStateReader A live node change: [WatchedEvent state:SyncConnected type:NodeChildrenChanged path:/live_nodes], has occurred - updating... (live nodes size: [1])
   [junit4]   2> 871911 INFO  (zkCallback-1312-thread-1) [    ] o.a.s.c.c.ZkStateReader A live node change: [WatchedEvent state:SyncConnected type:NodeChildrenChanged path:/live_nodes], has occurred - updating... (live nodes size: [1])
   [junit4]   2> 871911 INFO  (zkCallback-1318-thread-1-processing-n:127.0.0.1:40633_) [n:127.0.0.1:40633_    ] o.a.s.c.c.ZkStateReader Updated live nodes from ZooKeeper... (1) -> (2)
   [junit4]   2> 871911 INFO  (zkCallback-1310-thread-1-processing-n:127.0.0.1:42170_) [n:127.0.0.1:42170_    ] o.a.s.c.c.ZkStateReader Updated live nodes from ZooKeeper... (1) -> (2)
   [junit4]   2> 871911 INFO  (zkCallback-1312-thread-1) [    ] o.a.s.c.c.ZkStateReader Updated live nodes from ZooKeeper... (1) -> (2)
   [junit4]   2> 871921 INFO  (TEST-UnloadDistributedZkTest.test-seed#[E21E9796849CC2C2]) [n:127.0.0.1:40633_    ] o.a.s.c.CoreContainer Security conf doesn't exist. Skipping setup for authorization module.
   [junit4]   2> 871921 INFO  (TEST-UnloadDistributedZkTest.test-seed#[E21E9796849CC2C2]) [n:127.0.0.1:40633_    ] o.a.s.c.CoreContainer No authentication plugin used.
   [junit4]   2> 871921 INFO  (TEST-UnloadDistributedZkTest.test-seed#[E21E9796849CC2C2]) [n:127.0.0.1:40633_    ] o.a.s.c.CorePropertiesLocator Looking for core definitions underneath /home/jenkins/workspace/Lucene-Solr-6.x-Linux/solr/build/solr-core/test/J2/../../../../../../../../../home/jenkins/workspace/Lucene-Solr-6.x-Linux/solr/build/solr-core/test/J2/temp/solr.cloud.UnloadDistributedZkTest_E21E9796849CC2C2-001/shard-1-001/cores
   [junit4]   2> 871922 INFO  (TEST-UnloadDistributedZkTest.test-seed#[E21E9796849CC2C2]) [n:127.0.0.1:40633_    ] o.a.s.c.CoreDescriptor Created CoreDescriptor: {name=collection1, config=solrconfig.xml, transient=false, schema=schema.xml, loadOnStartup=true, configSetProperties=configsetprops.json, collection=collection1, coreNodeName=, dataDir=data/, shard=}
   [junit4]   2> 871922 INFO  (TEST-UnloadDistributedZkTest.test-seed#[E21E9796849CC2C2]) [n:127.0.0.1:40633_    ] o.a.s.c.CorePropertiesLocator Found core collection1 in /home/jenkins/workspace/Lucene-Solr-6.x-Linux/solr/build/solr-core/test/J2/../../../../../../../../../home/jenkins/workspace/Lucene-Solr-6.x-Linux/solr/build/solr-core/test/J2/temp/solr.cloud.UnloadDistributedZkTest_E21E9796849CC2C2-001/shard-1-001/cores/collection1
   [junit4]   2> 871922 INFO  (TEST-UnloadDistributedZkTest.test-seed#[E21E9796849CC2C2]) [n:127.0.0.1:40633_    ] o.a.s.c.CorePropertiesLocator Found 1 core definitions
   [junit4]   2> 871923 INFO  (TEST-UnloadDistributedZkTest.test-seed#[E21E9796849CC2C2]) [n:127.0.0.1:40633_    ] o.a.s.s.SolrDispatchFilter user.dir=/home/jenkins/workspace/Lucene-Solr-6.x-Linux/solr/build/solr-core/test/J2
   [junit4]   2> 871923 INFO  (TEST-UnloadDistributedZkTest.test-seed#[E21E9796849CC2C2]) [n:127.0.0.1:40633_    ] o.a.s.s.SolrDispatchFilter SolrDispatchFilter.init() done
   [junit4]   2> 871923 INFO  (coreLoadExecutor-3310-thread-1-processing-n:127.0.0.1:40633_) [n:127.0.0.1:40633_ c:collection1   x:collection1] o.a.s.c.ZkController publishing state=down
   [junit4]   2> 871923 INFO  (coreLoadExecutor-3310-thread-1-processing-n:127.0.0.1:40633_) [n:127.0.0.1:40633_ c:collection1   x:collection1] o.a.s.c.ZkController numShards not found on descriptor - reading it from system property
   [junit4]   2> 871924 INFO  (coreLoadExecutor-3310-thread-1-processing-n:127.0.0.1:40633_) [n:127.0.0.1:40633_ c:collection1   x:collection1] o.a.s.c.ZkController Registering watch for collection collection1
   [junit4]   2> 871924 INFO  (coreLoadExecutor-3310-thread-1-processing-n:127.0.0.1:40633_) [n:127.0.0.1:40633_ c:collection1   x:collection1] o.a.s.c.c.ZkStateReader addZkWatch [collection1]
   [junit4]   2> 871924 INFO  (OverseerStateUpdate-95582821447303172-127.0.0.1:42170_-n_0000000000) [n:127.0.0.1:42170_    ] o.a.s.c.Overseer processMessage: queueSize: 1, message = {
   [junit4]   2>   "core":"collection1",
   [junit4]   2>   "roles":null,
   [junit4]   2>   "base_url":"http://127.0.0.1:40633",
   [junit4]   2>   "node_name":"127.0.0.1:40633_",
   [junit4]   2>   "numShards":"2",
   [junit4]   2>   "state":"down",
   [junit4]   2>   "shard":null,
   [junit4]   2>   "collection":"collection1",
   [junit4]   2>   "operation":"state"} current state version: 4
   [junit4]   2> 871924 INFO  (coreLoadExecutor-3310-thread-1-processing-n:127.0.0.1:40633_) [n:127.0.0.1:40633_ c:collection1   x:collection1] o.a.s.c.c.ZkStateReader Add data for [collection1] ver [0]
   [junit4]   2> 871924 INFO  (coreLoadExecutor-3310-thread-1-processing-n:127.0.0.1:40633_) [n:127.0.0.1:40633_ c:collection1   x:collection1] o.a.s.c.ZkController look for our core node name
   [junit4]   2> 871924 INFO  (OverseerStateUpdate-95582821447303172-127.0.0.1:42170_-n_0000000000) [n:127.0.0.1:42170_    ] o.a.s.c.o.ReplicaMutator Update state numShards=2 message={
   [junit4]   2>   "core":"collection1",
   [junit4]   2>   "roles":null,
   [junit4]   2>   "base_url":"http://127.0.0.1:40633",
   [junit4]   2>   "node_name":"127.0.0.1:40633_",
   [junit4]   2>   "numShards":"2",
   [junit4]   2>   "state":"down",
   [junit4]   2>   "shard":null,
   [junit4]   2>   "collection":"collection1",
   [junit4]   2>   "operation":"state"}
   [junit4]   2> 871924 INFO  (OverseerStateUpdate-95582821447303172-127.0.0.1:42170_-n_0000000000) [n:127.0.0.1:42170_    ] o.a.s.c.o.ReplicaMutator Collection already exists with numShards=2
   [junit4]   2> 871924 INFO  (OverseerStateUpdate-95582821447303172-127.0.0.1:42170_-n_0000000000) [n:127.0.0.1:42170_    ] o.a.s.c.o.ReplicaMutator Assigning new node to shard shard=shard2
   [junit4]   2> 872025 INFO  (OverseerStateUpdate-95582821447303172-127.0.0.1:42170_-n_0000000000) [n:127.0.0.1:42170_    ] o.a.s.c.o.ZkStateWriter going to update_collection /collections/collection1/state.json version: 0
   [junit4]   2> 872025 INFO  (zkCallback-1318-thread-1-processing-n:127.0.0.1:40633_) [n:127.0.0.1:40633_    ] o.a.s.c.c.ZkStateReader A cluster state change: [WatchedEvent state:SyncConnected type:NodeDataChanged path:/collections/collection1/state.json] for collection [collection1] has occurred - updating... (live nodes size: [2])
   [junit4]   2> 872026 INFO  (zkCallback-1318-thread-1-processing-n:127.0.0.1:40633_) [n:127.0.0.1:40633_    ] o.a.s.c.c.ZkStateReader Updating data for [collection1] from [0] to [1]
   [junit4]   2> 872924 INFO  (coreLoadExecutor-3310-thread-1-processing-n:127.0.0.1:40633_) [n:127.0.0.1:40633_ c:collection1   x:collection1] o.a.s.c.ZkController waiting to find shard id in clusterstate for collection1
   [junit4]   2> 872924 INFO  (coreLoadExecutor-3310-thread-1-processing-n:127.0.0.1:40633_) [n:127.0.0.1:40633_ c:collection1   x:collection1] o.a.s.c.ZkController Check for collection zkNode:collection1
   [junit4]   2> 872924 INFO  (coreLoadExecutor-3310-thread-1-processing-n:127.0.0.1:40633_) [n:127.0.0.1:40633_ c:collection1   x:collection1] o.a.s.c.ZkController Collection zkNode exists
   [junit4]   2> 872924 INFO  (coreLoadExecutor-3310-thread-1-processing-n:127.0.0.1:40633_) [n:127.0.0.1:40633_ c:collection1   x:collection1] o.a.s.c.c.ZkStateReader Load collection config from: [/collections/collection1]
   [junit4]   2> 872925 INFO  (coreLoadExecutor-3310-thread-1-processing-n:127.0.0.1:40633_) [n:127.0.0.1:40633_ c:collection1   x:collection1] o.a.s.c.c.ZkStateReader path=[/collections/collection1] [configName]=[conf1] specified config exists in ZooKeeper
   [junit4]   2> 872925 INFO  (coreLoadExecutor-3310-thread-1-processing-n:127.0.0.1:40633_) [n:127.0.0.1:40633_ c:collection1   x:collection1] o.a.s.c.SolrResourceLoader new SolrResourceLoader for directory: '/home/jenkins/workspace/Lucene-Solr-6.x-Linux/solr/build/solr-core/test/J2/temp/solr.cloud.UnloadDistributedZkTest_E21E9796849CC2C2-001/shard-1-001/cores/collection1'
   [junit4]   2> 872925 INFO  (coreLoadExecutor-3310-thread-1-processing-n:127.0.0.1:40633_) [n:127.0.0.1:40633_ c:collection1   x:collection1] o.a.s.c.SolrResourceLoader JNDI not configured for solr (NoInitialContextEx)
   [junit4]   2> 872925 INFO  (coreLoadExecutor-3310-thread-1-processing-n:127.0.0.1:40633_) [n:127.0.0.1:40633_ c:collection1   x:collection1] o.a.s.c.SolrResourceLoader solr home defaulted to 'solr/' (could not find system property or JNDI)
   [junit4]   2> 872925 INFO  (coreLoadExecutor-3310-thread-1-processing-n:127.0.0.1:40633_) [n:127.0.0.1:40633_ c:collection1   x:collection1] o.a.s.c.Config loaded config solrconfig.xml with version 0 
   [junit4]   2> 872929 INFO  (coreLoadExecutor-3310-thread-1-processing-n:127.0.0.1:40633_) [n:127.0.0.1:40633_ c:collection1   x:collection1] o.a.s.c.SolrConfig current version of requestparams : -1
   [junit4]   2> 872931 INFO  (coreLoadExecutor-3310-thread-1-processing-n:127.0.0.1:40633_) [n:127.0.0.1:40633_ c:collection1   x:collection1] o.a.s.c.SolrConfig Using Lucene MatchVersion: 6.1.0
   [junit4]   2> 872937 INFO  (coreLoadExecutor-3310-thread-1-processing-n:127.0.0.1:40633_) [n:127.0.0.1:40633_ c:collection1   x:collection1] o.a.s.c.SolrConfig Loaded SolrConfig: solrconfig.xml
   [junit4]   2> 872940 INFO  (coreLoadExecutor-3310-thread-1-processing-n:127.0.0.1:40633_) [n:127.0.0.1:40633_ c:collection1   x:collection1] o.a.s.s.IndexSchema [collection1] Schema name=test
   [junit4]   2> 872998 INFO  (coreLoadExecutor-3310-thread-1-processing-n:127.0.0.1:40633_) [n:127.0.0.1:40633_ c:collection1   x:collection1] o.a.s.s.OpenExchangeRatesOrgProvider Initialized with rates=open-exchange-rates.json, refreshInterval=1440.
   [junit4]   2> 873002 INFO  (coreLoadExecutor-3310-thread-1-processing-n:127.0.0.1:40633_) [n:127.0.0.1:40633_ c:collection1   x:collection1] o.a.s.s.IndexSchema default search field in schema is text
   [junit4]   2> 873003 INFO  (coreLoadExecutor-3310-thread-1-processing-n:127.0.0.1:40633_) [n:127.0.0.1:40633_ c:collection1   x:collection1] o.a.s.s.IndexSchema unique key field: id
   [junit4]   2> 873006 INFO  (coreLoadExecutor-3310-thread-1-processing-n:127.0.0.1:40633_) [n:127.0.0.1:40633_ c:collection1   x:collection1] o.a.s.s.FileExchangeRateProvider Reloading exchange rates from file currency.xml
   [junit4]   2> 873007 INFO  (coreLoadExecutor-3310-thread-1-processing-n:127.0.0.1:40633_) [n:127.0.0.1:40633_ c:collection1   x:collection1] o.a.s.s.FileExchangeRateProvider Reloading exchange rates from file currency.xml
   [junit4]   2> 873008 INFO  (coreLoadExecutor-3310-thread-1-processing-n:127.0.0.1:40633_) [n:127.0.0.1:40633_ c:collection1   x:collection1] o.a.s.s.OpenExchangeRatesOrgProvider Reloading exchange rates from open-exchange-rates.json
   [junit4]   2> 873008 INFO  (coreLoadExecutor-3310-thread-1-processing-n:127.0.0.1:40633_) [n:127.0.0.1:40633_ c:collection1   x:collection1] o.a.s.s.OpenExchangeRatesOrgProvider Reloading exchange rates from open-exchange-rates.json
   [junit4]   2> 873009 INFO  (coreLoadExecutor-3310-thread-1-processing-n:127.0.0.1:40633_) [n:127.0.0.1:40633_ c:collection1   x:collection1] o.a.s.c.ConfigSetProperties Did not find ConfigSet properties, assuming default properties: Can't find resource 'configsetprops.json' in classpath or '/configs/conf1', cwd=/home/jenkins/workspace/Lucene-Solr-6.x-Linux/solr/build/solr-core/test/J2
   [junit4]   2> 873009 INFO  (coreLoadExecutor-3310-thread-1-processing-n:127.0.0.1:40633_) [n:127.0.0.1:40633_ c:collection1   x:collection1] o.a.s.c.CoreContainer Creating SolrCore 'collection1' using configuration from collection collection1
   [junit4]   2> 873009 INFO  (coreLoadExecutor-3310-thread-1-processing-n:127.0.0.1:40633_) [n:127.0.0.1:40633_ c:collection1 s:shard2 r:core_node1 x:collection1] o.a.s.c.SolrCore org.apache.solr.core.MockDirectoryFactory
   [junit4]   2> 873009 INFO  (coreLoadExecutor-3310-thread-1-processing-n:127.0.0.1:40633_) [n:127.0.0.1:40633_ c:collection1 s:shard2 r:core_node1 x:collection1] o.a.s.c.SolrCore [[collection1] ] Opening new SolrCore at [/home/jenkins/workspace/Lucene-Solr-6.x-Linux/solr/build/solr-core/test/J2/temp/solr.cloud.UnloadDistributedZkTest_E21E9796849CC2C2-001/shard-1-001/cores/collection1], dataDir=[/home/jenkins/workspace/Lucene-Solr-6.x-Linux/solr/build/solr-core/test/J2/../../../../../../../../../home/jenkins/workspace/Lucene-Solr-6.x-Linux/solr/build/solr-core/test/J2/temp/solr.cloud.UnloadDistributedZkTest_E21E9796849CC2C2-001/shard-1-001/cores/collection1/data/]
   [junit4]   2> 873009 INFO  (coreLoadExecutor-3310-thread-1-processing-n:127.0.0.1:40633_) [n:127.0.0.1:40633_ c:collection1 s:shard2 r:core_node1 x:collection1] o.a.s.c.JmxMonitoredMap JMX monitoring is enabled. Adding Solr mbeans to JMX Server: com.sun.jmx.mbeanserver.JmxMBeanServer@195937c
   [junit4]   2> 873010 INFO  (coreLoadExecutor-3310-thread-1-processing-n:127.0.0.1:40633_) [n:127.0.0.1:40633_ c:collection1 s:shard2 r:core_node1 x:collection1] o.a.s.c.CachingDirectoryFactory return new directory for /home/jenkins/workspace/Lucene-Solr-6.x-Linux/solr/build/solr-core/test/J2/../../../../../../../../../home/jenkins/workspace/Lucene-Solr-6.x-Linux/solr/build/solr-core/test/J2/temp/solr.cloud.UnloadDistributedZkTest_E21E9796849CC2C2-001/shard-1-001/cores/collection1/data
   [junit4]   2> 873010 INFO  (coreLoadExecutor-3310-thread-1-processing-n:127.0.0.1:40633_) [n:127.0.0.1:40633_ c:collection1 s:shard2 r:core_node1 x:collection1] o.a.s.c.SolrCore New index directory detected: old=null new=/home/jenkins/workspace/Lucene-Solr-6.x-Linux/solr/build/solr-core/test/J2/../../../../../../../../../home/jenkins/workspace/Lucene-Solr-6.x-Linux/solr/build/solr-core/test/J2/temp/solr.cloud.UnloadDistributedZkTest_E21E9796849CC2C2-001/shard-1-001/cores/collection1/data/index/
   [junit4]   2> 873010 WARN  (coreLoadExecutor-3310-thread-1-processing-n:127.0.0.1:40633_) [n:127.0.0.1:40633_ c:collection1 s:shard2 r:core_node1 x:collection1] o.a.s.c.SolrCore [collection1] Solr index directory '/home/jenkins/workspace/Lucene-Solr-6.x-Linux/solr/build/solr-core/test/J2/../../../../../../../../../home/jenkins/workspace/Lucene-Solr-6.x-Linux/solr/build/solr-core/test/J2/temp/solr.cloud.UnloadDistributedZkTest_E21E9796849CC2C2-001/shard-1-001/cores/collection1/data/index' doesn't exist. Creating new index...
   [junit4]   2> 873010 INFO  (coreLoadExecutor-3310-thread-1-processing-n:127.0.0.1:40633_) [n:127.0.0.1:40633_ c:collection1 s:shard2 r:core_node1 x:collection1] o.a.s.c.CachingDirectoryFactory return new directory for /home/jenkins/workspace/Lucene-Solr-6.x-Linux/solr/build/solr-core/test/J2/../../../../../../../../../home/jenkins/workspace/Lucene-Solr-6.x-Linux/solr/build/solr-core/test/J2/temp/solr.cloud.UnloadDistributedZkTest_E21E9796849CC2C2-001/shard-1-001/cores/collection1/data/index
   [junit4]   2> 873010 INFO  (coreLoadExecutor-3310-thread-1-processing-n:127.0.0.1:40633_) [n:127.0.0.1:40633_ c:collection1 s:shard2 r:core_node1 x:collection1] o.a.s.u.RandomMergePolicy RandomMergePolicy wrapping class org.apache.lucene.index.LogByteSizeMergePolicy: [LogByteSizeMergePolic

[...truncated too long message...]

cutor.java:124)
   [junit4]    > 	at org.apache.http.impl.client.DefaultRequestDirector.tryExecute(DefaultRequestDirector.java:685)
   [junit4]    > 	at org.apache.http.impl.client.DefaultRequestDirector.execute(DefaultRequestDirector.java:487)
   [junit4]    > 	at org.apache.http.impl.client.AbstractHttpClient.doExecute(AbstractHttpClient.java:882)
   [junit4]    > 	at org.apache.http.impl.client.CloseableHttpClient.execute(CloseableHttpClient.java:82)
   [junit4]    > 	at org.apache.http.impl.client.CloseableHttpClient.execute(CloseableHttpClient.java:107)
   [junit4]    > 	at org.apache.http.impl.client.CloseableHttpClient.execute(CloseableHttpClient.java:55)
   [junit4]    > 	at org.apache.solr.client.solrj.impl.HttpSolrClient.executeMethod(HttpSolrClient.java:482)
   [junit4]    > 	... 8 moreThrowable #7: com.carrotsearch.randomizedtesting.UncaughtExceptionError: Captured an uncaught exception in thread: Thread[id=7379, name=testExecutor-3377-thread-13, state=RUNNABLE, group=TGRP-UnloadDistributedZkTest]
   [junit4]    > Caused by: java.lang.RuntimeException: org.apache.solr.client.solrj.SolrServerException: Timeout occured while waiting response from server at: http://127.0.0.1:39077
   [junit4]    > 	at __randomizedtesting.SeedInfo.seed([E21E9796849CC2C2]:0)
   [junit4]    > 	at org.apache.solr.cloud.BasicDistributedZkTest.lambda$createCores$0(BasicDistributedZkTest.java:583)
   [junit4]    > 	at org.apache.solr.common.util.ExecutorUtil$MDCAwareThreadPoolExecutor.lambda$execute$0(ExecutorUtil.java:229)
   [junit4]    > 	at java.util.concurrent.ThreadPoolExecutor.runWorker(ThreadPoolExecutor.java:1142)
   [junit4]    > 	at java.util.concurrent.ThreadPoolExecutor$Worker.run(ThreadPoolExecutor.java:617)
   [junit4]    > 	at java.lang.Thread.run(Thread.java:745)
   [junit4]    > Caused by: org.apache.solr.client.solrj.SolrServerException: Timeout occured while waiting response from server at: http://127.0.0.1:39077
   [junit4]    > 	at org.apache.solr.client.solrj.impl.HttpSolrClient.executeMethod(HttpSolrClient.java:588)
   [junit4]    > 	at org.apache.solr.client.solrj.impl.HttpSolrClient.request(HttpSolrClient.java:241)
   [junit4]    > 	at org.apache.solr.client.solrj.impl.HttpSolrClient.request(HttpSolrClient.java:230)
   [junit4]    > 	at org.apache.solr.client.solrj.SolrClient.request(SolrClient.java:1219)
   [junit4]    > 	at org.apache.solr.cloud.BasicDistributedZkTest.lambda$createCores$0(BasicDistributedZkTest.java:581)
   [junit4]    > 	... 4 more
   [junit4]    > Caused by: java.net.SocketTimeoutException: Read timed out
   [junit4]    > 	at java.net.SocketInputStream.socketRead0(Native Method)
   [junit4]    > 	at java.net.SocketInputStream.socketRead(SocketInputStream.java:116)
   [junit4]    > 	at java.net.SocketInputStream.read(SocketInputStream.java:170)
   [junit4]    > 	at java.net.SocketInputStream.read(SocketInputStream.java:141)
   [junit4]    > 	at org.apache.http.impl.io.AbstractSessionInputBuffer.fillBuffer(AbstractSessionInputBuffer.java:160)
   [junit4]    > 	at org.apache.http.impl.io.SocketInputBuffer.fillBuffer(SocketInputBuffer.java:84)
   [junit4]    > 	at org.apache.http.impl.io.AbstractSessionInputBuffer.readLine(AbstractSessionInputBuffer.java:273)
   [junit4]    > 	at org.apache.http.impl.conn.DefaultHttpResponseParser.parseHead(DefaultHttpResponseParser.java:140)
   [junit4]    > 	at org.apache.http.impl.conn.DefaultHttpResponseParser.parseHead(DefaultHttpResponseParser.java:57)
   [junit4]    > 	at org.apache.http.impl.io.AbstractMessageParser.parse(AbstractMessageParser.java:261)
   [junit4]    > 	at org.apache.http.impl.AbstractHttpClientConnection.receiveResponseHeader(AbstractHttpClientConnection.java:283)
   [junit4]    > 	at org.apache.http.impl.conn.DefaultClientConnection.receiveResponseHeader(DefaultClientConnection.java:251)
   [junit4]    > 	at org.apache.http.impl.conn.ManagedClientConnectionImpl.receiveResponseHeader(ManagedClientConnectionImpl.java:197)
   [junit4]    > 	at org.apache.http.protocol.HttpRequestExecutor.doReceiveResponse(HttpRequestExecutor.java:272)
   [junit4]    > 	at org.apache.http.protocol.HttpRequestExecutor.execute(HttpRequestExecutor.java:124)
   [junit4]    > 	at org.apache.http.impl.client.DefaultRequestDirector.tryExecute(DefaultRequestDirector.java:685)
   [junit4]    > 	at org.apache.http.impl.client.DefaultRequestDirector.execute(DefaultRequestDirector.java:487)
   [junit4]    > 	at org.apache.http.impl.client.AbstractHttpClient.doExecute(AbstractHttpClient.java:882)
   [junit4]    > 	at org.apache.http.impl.client.CloseableHttpClient.execute(CloseableHttpClient.java:82)
   [junit4]    > 	at org.apache.http.impl.client.CloseableHttpClient.execute(CloseableHttpClient.java:107)
   [junit4]    > 	at org.apache.http.impl.client.CloseableHttpClient.execute(CloseableHttpClient.java:55)
   [junit4]    > 	at org.apache.solr.client.solrj.impl.HttpSolrClient.executeMethod(HttpSolrClient.java:482)
   [junit4]    > 	... 8 more
   [junit4]   2> 1004018 INFO  (SUITE-UnloadDistributedZkTest-seed#[E21E9796849CC2C2]-worker) [    ] o.a.s.SolrTestCaseJ4 ###deleteCore
   [junit4]   2> Mar 20, 2016 12:50:45 PM com.carrotsearch.randomizedtesting.ThreadLeakControl checkThreadLeaks
   [junit4]   2> WARNING: Will linger awaiting termination of 1 leaked thread(s).
   [junit4]   2> NOTE: test params are: codec=Asserting(Lucene60): {other_tl1=Lucene50(blocksize=128), range_facet_l_dv=PostingsFormat(name=Asserting), _version_=Lucene50(blocksize=128), multiDefault=PostingsFormat(name=MockRandom), a_t=Lucene50(blocksize=128), intDefault=Lucene50(blocksize=128), a_i1=Lucene50(blocksize=128), id=PostingsFormat(name=Asserting), range_facet_i_dv=Lucene50(blocksize=128), text=PostingsFormat(name=Direct), range_facet_l=Lucene50(blocksize=128), timestamp=Lucene50(blocksize=128)}, docValues:{range_facet_l_dv=DocValuesFormat(name=Asserting), range_facet_i_dv=DocValuesFormat(name=Lucene54), timestamp=DocValuesFormat(name=Lucene54)}, maxPointsInLeafNode=1133, maxMBSortInHeap=4.021129009823096, sim=ClassicSimilarity, locale=nn-NO, timezone=SystemV/PST8PDT
   [junit4]   2> NOTE: Linux 4.2.0-34-generic i386/Oracle Corporation 1.8.0_72 (32-bit)/cpus=12,threads=1,free=109222104,total=368574464
   [junit4]   2> NOTE: All tests run in this JVM: [NoCacheHeaderTest, XmlUpdateRequestHandlerTest, DistributedFacetPivotSmallAdvancedTest, TestConfigSetsAPIZkFailure, VersionInfoTest, TestSearchPerf, SolrCloudExampleTest, TermVectorComponentDistributedTest, TestReload, TestStressRecovery, PKIAuthenticationIntegrationTest, TestPHPSerializedResponseWriter, SortSpecParsingTest, TestSimpleQParserPlugin, TestSolrQueryParser, TestUseDocValuesAsStored2, TestSuggestSpellingConverter, TestLeaderInitiatedRecoveryThread, BadIndexSchemaTest, RequestHandlersTest, BitVectorTest, CollectionsAPISolrJTest, TestIndexSearcher, FieldAnalysisRequestHandlerTest, CdcrRequestHandlerTest, TestCollapseQParserPlugin, TestInitQParser, OverseerCollectionConfigSetProcessorTest, DeleteLastCustomShardedReplicaTest, SliceStateTest, TestConfigOverlay, DistributedQueryComponentCustomSortTest, DistributedExpandComponentTest, HdfsRestartWhileUpdatingTest, TestFieldResource, OverseerTest, DistribJoinFromCollectionTest, RecoveryZkTest, VMParamsZkACLAndCredentialsProvidersTest, TestCollectionAPI, TestInfoStreamLogging, TestNamedUpdateProcessors, TestJmxMonitoredMap, TestCloudDeleteByQuery, ReplicationFactorTest, TestSweetSpotSimilarityFactory, SimpleFacetsTest, FacetPivotSmallTest, CollectionStateFormat2Test, TestReloadAndDeleteDocs, GraphQueryTest, TestXIncludeConfig, TestGeoJSONResponseWriter, DirectUpdateHandlerOptimizeTest, BinaryUpdateRequestHandlerTest, TestFieldSortValues, TestExtendedDismaxParser, StressHdfsTest, ConnectionManagerTest, HardAutoCommitTest, IgnoreCommitOptimizeUpdateProcessorFactoryTest, TestCSVResponseWriter, AssignTest, CoreAdminHandlerTest, TestStandardQParsers, BaseCdcrDistributedZkTest, LeaderElectionTest, TestPivotHelperCode, HdfsDirectoryTest, TestXmlQParser, TestStressReorder, HdfsNNFailoverTest, SuggestComponentTest, UpdateParamsTest, FullSolrCloudDistribCmdsTest, SuggesterTSTTest, TestClassicSimilarityFactory, RegexBoostProcessorTest, FieldMutatingUpdateProcessorTest, ClusterStateTest, BlockJoinFacetDistribTest, SuggesterWFSTTest, TestSolrQueryResponse, TestElisionMultitermQuery, HdfsTlogReplayBufferedWhileIndexingTest, DateMathParserTest, TestOrdValues, SampleTest, TestSort, ConjunctionSolrSpellCheckerTest, TestGroupingSearch, TestSolrDynamicMBean, TestSolrConfigHandlerCloud, TestDocBasedVersionConstraints, ChaosMonkeySafeLeaderTest, BasicDistributedZk2Test, UnloadDistributedZkTest]
   [junit4] Completed [252/581 (1!)] on J2 in 135.67s, 1 test, 1 error <<< FAILURES!

[...truncated 1089 lines...]
BUILD FAILED
/home/jenkins/workspace/Lucene-Solr-6.x-Linux/build.xml:740: The following error occurred while executing this line:
/home/jenkins/workspace/Lucene-Solr-6.x-Linux/build.xml:684: The following error occurred while executing this line:
/home/jenkins/workspace/Lucene-Solr-6.x-Linux/build.xml:59: The following error occurred while executing this line:
/home/jenkins/workspace/Lucene-Solr-6.x-Linux/solr/build.xml:233: The following error occurred while executing this line:
/home/jenkins/workspace/Lucene-Solr-6.x-Linux/solr/common-build.xml:529: The following error occurred while executing this line:
/home/jenkins/workspace/Lucene-Solr-6.x-Linux/lucene/common-build.xml:1457: The following error occurred while executing this line:
/home/jenkins/workspace/Lucene-Solr-6.x-Linux/lucene/common-build.xml:1014: There were test failures: 581 suites (10 ignored), 2327 tests, 1 error, 115 ignored (70 assumptions) [seed: E21E9796849CC2C2]

Total time: 57 minutes 16 seconds
Build step 'Invoke Ant' marked build as failure
Archiving artifacts
[WARNINGS] Skipping publisher since build result is FAILURE
Recording test results
Email was triggered for: Failure - Any
Sending email for trigger: Failure - Any



Mime
View raw message