lucene-dev mailing list archives

Site index · List index
Message view « Date » · « Thread »
Top « Date » · « Thread »
From Policeman Jenkins Server <jenk...@thetaphi.de>
Subject [JENKINS-EA] Lucene-Solr-trunk-Linux (64bit/jdk-9-ea+107) - Build # 16055 - Still Failing!
Date Tue, 01 Mar 2016 05:07:19 GMT
Build: http://jenkins.thetaphi.de/job/Lucene-Solr-trunk-Linux/16055/
Java: 64bit/jdk-9-ea+107 -XX:-UseCompressedOops -XX:+UseConcMarkSweepGC

6 tests failed.
FAILED:  org.apache.lucene.search.TestDocValuesRewriteMethod.testRegexps

Error Message:
source=3 is out of bounds (maxState is 2)

Stack Trace:
java.lang.IllegalArgumentException: source=3 is out of bounds (maxState is 2)
	at __randomizedtesting.SeedInfo.seed([A9B7DAB3FA2F5C4C:48EB9BA224850BC4]:0)
	at org.apache.lucene.util.automaton.Automaton.addTransition(Automaton.java:165)
	at org.apache.lucene.util.automaton.MinimizationOperations.minimize(MinimizationOperations.java:245)
	at org.apache.lucene.util.automaton.RegExp.toAutomatonInternal(RegExp.java:537)
	at org.apache.lucene.util.automaton.RegExp.findLeaves(RegExp.java:617)
	at org.apache.lucene.util.automaton.RegExp.findLeaves(RegExp.java:612)
	at org.apache.lucene.util.automaton.RegExp.toAutomatonInternal(RegExp.java:521)
	at org.apache.lucene.util.automaton.RegExp.findLeaves(RegExp.java:617)
	at org.apache.lucene.util.automaton.RegExp.toAutomatonInternal(RegExp.java:510)
	at org.apache.lucene.util.automaton.RegExp.toAutomaton(RegExp.java:495)
	at org.apache.lucene.util.automaton.RegExp.toAutomaton(RegExp.java:466)
	at org.apache.lucene.search.RegexpQuery.<init>(RegexpQuery.java:109)
	at org.apache.lucene.search.RegexpQuery.<init>(RegexpQuery.java:79)
	at org.apache.lucene.search.TestDocValuesRewriteMethod.assertSame(TestDocValuesRewriteMethod.java:117)
	at org.apache.lucene.search.TestDocValuesRewriteMethod.testRegexps(TestDocValuesRewriteMethod.java:109)
	at sun.reflect.NativeMethodAccessorImpl.invoke0(Native Method)
	at sun.reflect.NativeMethodAccessorImpl.invoke(NativeMethodAccessorImpl.java:62)
	at sun.reflect.DelegatingMethodAccessorImpl.invoke(DelegatingMethodAccessorImpl.java:43)
	at java.lang.reflect.Method.invoke(Method.java:520)
	at com.carrotsearch.randomizedtesting.RandomizedRunner.invoke(RandomizedRunner.java:1764)
	at com.carrotsearch.randomizedtesting.RandomizedRunner$8.evaluate(RandomizedRunner.java:871)
	at com.carrotsearch.randomizedtesting.RandomizedRunner$9.evaluate(RandomizedRunner.java:907)
	at com.carrotsearch.randomizedtesting.RandomizedRunner$10.evaluate(RandomizedRunner.java:921)
	at org.apache.lucene.util.TestRuleSetupTeardownChained$1.evaluate(TestRuleSetupTeardownChained.java:49)
	at org.apache.lucene.util.AbstractBeforeAfterRule$1.evaluate(AbstractBeforeAfterRule.java:45)
	at org.apache.lucene.util.TestRuleThreadAndTestName$1.evaluate(TestRuleThreadAndTestName.java:48)
	at org.apache.lucene.util.TestRuleIgnoreAfterMaxFailures$1.evaluate(TestRuleIgnoreAfterMaxFailures.java:64)
	at org.apache.lucene.util.TestRuleMarkFailure$1.evaluate(TestRuleMarkFailure.java:47)
	at com.carrotsearch.randomizedtesting.rules.StatementAdapter.evaluate(StatementAdapter.java:36)
	at com.carrotsearch.randomizedtesting.ThreadLeakControl$StatementRunner.run(ThreadLeakControl.java:367)
	at com.carrotsearch.randomizedtesting.ThreadLeakControl.forkTimeoutingTask(ThreadLeakControl.java:809)
	at com.carrotsearch.randomizedtesting.ThreadLeakControl$3.evaluate(ThreadLeakControl.java:460)
	at com.carrotsearch.randomizedtesting.RandomizedRunner.runSingleTest(RandomizedRunner.java:880)
	at com.carrotsearch.randomizedtesting.RandomizedRunner$5.evaluate(RandomizedRunner.java:781)
	at com.carrotsearch.randomizedtesting.RandomizedRunner$6.evaluate(RandomizedRunner.java:816)
	at com.carrotsearch.randomizedtesting.RandomizedRunner$7.evaluate(RandomizedRunner.java:827)
	at org.apache.lucene.util.AbstractBeforeAfterRule$1.evaluate(AbstractBeforeAfterRule.java:45)
	at com.carrotsearch.randomizedtesting.rules.StatementAdapter.evaluate(StatementAdapter.java:36)
	at org.apache.lucene.util.TestRuleStoreClassName$1.evaluate(TestRuleStoreClassName.java:41)
	at com.carrotsearch.randomizedtesting.rules.NoShadowingOrOverridesOnMethodsRule$1.evaluate(NoShadowingOrOverridesOnMethodsRule.java:40)
	at com.carrotsearch.randomizedtesting.rules.NoShadowingOrOverridesOnMethodsRule$1.evaluate(NoShadowingOrOverridesOnMethodsRule.java:40)
	at com.carrotsearch.randomizedtesting.rules.StatementAdapter.evaluate(StatementAdapter.java:36)
	at com.carrotsearch.randomizedtesting.rules.StatementAdapter.evaluate(StatementAdapter.java:36)
	at com.carrotsearch.randomizedtesting.rules.StatementAdapter.evaluate(StatementAdapter.java:36)
	at org.apache.lucene.util.TestRuleAssertionsRequired$1.evaluate(TestRuleAssertionsRequired.java:53)
	at org.apache.lucene.util.TestRuleMarkFailure$1.evaluate(TestRuleMarkFailure.java:47)
	at org.apache.lucene.util.TestRuleIgnoreAfterMaxFailures$1.evaluate(TestRuleIgnoreAfterMaxFailures.java:64)
	at org.apache.lucene.util.TestRuleIgnoreTestSuites$1.evaluate(TestRuleIgnoreTestSuites.java:54)
	at com.carrotsearch.randomizedtesting.rules.StatementAdapter.evaluate(StatementAdapter.java:36)
	at com.carrotsearch.randomizedtesting.ThreadLeakControl$StatementRunner.run(ThreadLeakControl.java:367)
	at java.lang.Thread.run(Thread.java:804)


FAILED:  org.apache.lucene.util.TestQueryBuilder.testPhraseQueryPositionIncrements

Error Message:
6

Stack Trace:
java.lang.ArrayIndexOutOfBoundsException: 6
	at __randomizedtesting.SeedInfo.seed([A9B7DAB3FA2F5C4C:8BFC6EE769AADC79]:0)
	at org.apache.lucene.util.automaton.MinimizationOperations.minimize(MinimizationOperations.java:235)
	at org.apache.lucene.util.automaton.RegExp.toAutomatonInternal(RegExp.java:524)
	at org.apache.lucene.util.automaton.RegExp.toAutomaton(RegExp.java:495)
	at org.apache.lucene.util.automaton.RegExp.toAutomaton(RegExp.java:426)
	at org.apache.lucene.util.TestQueryBuilder.testPhraseQueryPositionIncrements(TestQueryBuilder.java:111)
	at sun.reflect.NativeMethodAccessorImpl.invoke0(Native Method)
	at sun.reflect.NativeMethodAccessorImpl.invoke(NativeMethodAccessorImpl.java:62)
	at sun.reflect.DelegatingMethodAccessorImpl.invoke(DelegatingMethodAccessorImpl.java:43)
	at java.lang.reflect.Method.invoke(Method.java:520)
	at com.carrotsearch.randomizedtesting.RandomizedRunner.invoke(RandomizedRunner.java:1764)
	at com.carrotsearch.randomizedtesting.RandomizedRunner$8.evaluate(RandomizedRunner.java:871)
	at com.carrotsearch.randomizedtesting.RandomizedRunner$9.evaluate(RandomizedRunner.java:907)
	at com.carrotsearch.randomizedtesting.RandomizedRunner$10.evaluate(RandomizedRunner.java:921)
	at org.apache.lucene.util.TestRuleSetupTeardownChained$1.evaluate(TestRuleSetupTeardownChained.java:49)
	at org.apache.lucene.util.AbstractBeforeAfterRule$1.evaluate(AbstractBeforeAfterRule.java:45)
	at org.apache.lucene.util.TestRuleThreadAndTestName$1.evaluate(TestRuleThreadAndTestName.java:48)
	at org.apache.lucene.util.TestRuleIgnoreAfterMaxFailures$1.evaluate(TestRuleIgnoreAfterMaxFailures.java:64)
	at org.apache.lucene.util.TestRuleMarkFailure$1.evaluate(TestRuleMarkFailure.java:47)
	at com.carrotsearch.randomizedtesting.rules.StatementAdapter.evaluate(StatementAdapter.java:36)
	at com.carrotsearch.randomizedtesting.ThreadLeakControl$StatementRunner.run(ThreadLeakControl.java:367)
	at com.carrotsearch.randomizedtesting.ThreadLeakControl.forkTimeoutingTask(ThreadLeakControl.java:809)
	at com.carrotsearch.randomizedtesting.ThreadLeakControl$3.evaluate(ThreadLeakControl.java:460)
	at com.carrotsearch.randomizedtesting.RandomizedRunner.runSingleTest(RandomizedRunner.java:880)
	at com.carrotsearch.randomizedtesting.RandomizedRunner$5.evaluate(RandomizedRunner.java:781)
	at com.carrotsearch.randomizedtesting.RandomizedRunner$6.evaluate(RandomizedRunner.java:816)
	at com.carrotsearch.randomizedtesting.RandomizedRunner$7.evaluate(RandomizedRunner.java:827)
	at org.apache.lucene.util.AbstractBeforeAfterRule$1.evaluate(AbstractBeforeAfterRule.java:45)
	at com.carrotsearch.randomizedtesting.rules.StatementAdapter.evaluate(StatementAdapter.java:36)
	at org.apache.lucene.util.TestRuleStoreClassName$1.evaluate(TestRuleStoreClassName.java:41)
	at com.carrotsearch.randomizedtesting.rules.NoShadowingOrOverridesOnMethodsRule$1.evaluate(NoShadowingOrOverridesOnMethodsRule.java:40)
	at com.carrotsearch.randomizedtesting.rules.NoShadowingOrOverridesOnMethodsRule$1.evaluate(NoShadowingOrOverridesOnMethodsRule.java:40)
	at com.carrotsearch.randomizedtesting.rules.StatementAdapter.evaluate(StatementAdapter.java:36)
	at com.carrotsearch.randomizedtesting.rules.StatementAdapter.evaluate(StatementAdapter.java:36)
	at com.carrotsearch.randomizedtesting.rules.StatementAdapter.evaluate(StatementAdapter.java:36)
	at org.apache.lucene.util.TestRuleAssertionsRequired$1.evaluate(TestRuleAssertionsRequired.java:53)
	at org.apache.lucene.util.TestRuleMarkFailure$1.evaluate(TestRuleMarkFailure.java:47)
	at org.apache.lucene.util.TestRuleIgnoreAfterMaxFailures$1.evaluate(TestRuleIgnoreAfterMaxFailures.java:64)
	at org.apache.lucene.util.TestRuleIgnoreTestSuites$1.evaluate(TestRuleIgnoreTestSuites.java:54)
	at com.carrotsearch.randomizedtesting.rules.StatementAdapter.evaluate(StatementAdapter.java:36)
	at com.carrotsearch.randomizedtesting.ThreadLeakControl$StatementRunner.run(ThreadLeakControl.java:367)
	at java.lang.Thread.run(Thread.java:804)


FAILED:  org.apache.lucene.util.automaton.TestAutomaton.testMakeBinaryIntervalRandom

Error Message:
automaton was not minimal

Stack Trace:
java.lang.AssertionError: automaton was not minimal
	at __randomizedtesting.SeedInfo.seed([A9B7DAB3FA2F5C4C:9DE87CCC49A28DAF]:0)
	at org.junit.Assert.fail(Assert.java:93)
	at org.apache.lucene.util.automaton.TestAutomaton.makeBinaryInterval(TestAutomaton.java:1167)
	at org.apache.lucene.util.automaton.TestAutomaton.testMakeBinaryIntervalRandom(TestAutomaton.java:1290)
	at sun.reflect.NativeMethodAccessorImpl.invoke0(Native Method)
	at sun.reflect.NativeMethodAccessorImpl.invoke(NativeMethodAccessorImpl.java:62)
	at sun.reflect.DelegatingMethodAccessorImpl.invoke(DelegatingMethodAccessorImpl.java:43)
	at java.lang.reflect.Method.invoke(Method.java:520)
	at com.carrotsearch.randomizedtesting.RandomizedRunner.invoke(RandomizedRunner.java:1764)
	at com.carrotsearch.randomizedtesting.RandomizedRunner$8.evaluate(RandomizedRunner.java:871)
	at com.carrotsearch.randomizedtesting.RandomizedRunner$9.evaluate(RandomizedRunner.java:907)
	at com.carrotsearch.randomizedtesting.RandomizedRunner$10.evaluate(RandomizedRunner.java:921)
	at org.apache.lucene.util.TestRuleSetupTeardownChained$1.evaluate(TestRuleSetupTeardownChained.java:49)
	at org.apache.lucene.util.AbstractBeforeAfterRule$1.evaluate(AbstractBeforeAfterRule.java:45)
	at org.apache.lucene.util.TestRuleThreadAndTestName$1.evaluate(TestRuleThreadAndTestName.java:48)
	at org.apache.lucene.util.TestRuleIgnoreAfterMaxFailures$1.evaluate(TestRuleIgnoreAfterMaxFailures.java:64)
	at org.apache.lucene.util.TestRuleMarkFailure$1.evaluate(TestRuleMarkFailure.java:47)
	at com.carrotsearch.randomizedtesting.rules.StatementAdapter.evaluate(StatementAdapter.java:36)
	at com.carrotsearch.randomizedtesting.ThreadLeakControl$StatementRunner.run(ThreadLeakControl.java:367)
	at com.carrotsearch.randomizedtesting.ThreadLeakControl.forkTimeoutingTask(ThreadLeakControl.java:809)
	at com.carrotsearch.randomizedtesting.ThreadLeakControl$3.evaluate(ThreadLeakControl.java:460)
	at com.carrotsearch.randomizedtesting.RandomizedRunner.runSingleTest(RandomizedRunner.java:880)
	at com.carrotsearch.randomizedtesting.RandomizedRunner$5.evaluate(RandomizedRunner.java:781)
	at com.carrotsearch.randomizedtesting.RandomizedRunner$6.evaluate(RandomizedRunner.java:816)
	at com.carrotsearch.randomizedtesting.RandomizedRunner$7.evaluate(RandomizedRunner.java:827)
	at org.apache.lucene.util.AbstractBeforeAfterRule$1.evaluate(AbstractBeforeAfterRule.java:45)
	at com.carrotsearch.randomizedtesting.rules.StatementAdapter.evaluate(StatementAdapter.java:36)
	at org.apache.lucene.util.TestRuleStoreClassName$1.evaluate(TestRuleStoreClassName.java:41)
	at com.carrotsearch.randomizedtesting.rules.NoShadowingOrOverridesOnMethodsRule$1.evaluate(NoShadowingOrOverridesOnMethodsRule.java:40)
	at com.carrotsearch.randomizedtesting.rules.NoShadowingOrOverridesOnMethodsRule$1.evaluate(NoShadowingOrOverridesOnMethodsRule.java:40)
	at com.carrotsearch.randomizedtesting.rules.StatementAdapter.evaluate(StatementAdapter.java:36)
	at com.carrotsearch.randomizedtesting.rules.StatementAdapter.evaluate(StatementAdapter.java:36)
	at com.carrotsearch.randomizedtesting.rules.StatementAdapter.evaluate(StatementAdapter.java:36)
	at org.apache.lucene.util.TestRuleAssertionsRequired$1.evaluate(TestRuleAssertionsRequired.java:53)
	at org.apache.lucene.util.TestRuleMarkFailure$1.evaluate(TestRuleMarkFailure.java:47)
	at org.apache.lucene.util.TestRuleIgnoreAfterMaxFailures$1.evaluate(TestRuleIgnoreAfterMaxFailures.java:64)
	at org.apache.lucene.util.TestRuleIgnoreTestSuites$1.evaluate(TestRuleIgnoreTestSuites.java:54)
	at com.carrotsearch.randomizedtesting.rules.StatementAdapter.evaluate(StatementAdapter.java:36)
	at com.carrotsearch.randomizedtesting.ThreadLeakControl$StatementRunner.run(ThreadLeakControl.java:367)
	at java.lang.Thread.run(Thread.java:804)


FAILED:  org.apache.lucene.util.automaton.TestAutomaton.testRandomFinite

Error Message:
automaton has cycles

Stack Trace:
java.lang.IllegalArgumentException: automaton has cycles
	at __randomizedtesting.SeedInfo.seed([A9B7DAB3FA2F5C4C:EE01BC8E45BF396D]:0)
	at org.apache.lucene.util.automaton.FiniteStringsIterator.next(FiniteStringsIterator.java:121)
	at org.apache.lucene.util.automaton.TestOperations.getFiniteStrings(TestOperations.java:156)
	at org.apache.lucene.util.automaton.TestOperations.getFiniteStrings(TestOperations.java:136)
	at org.apache.lucene.util.automaton.TestAutomaton.assertSame(TestAutomaton.java:1129)
	at org.apache.lucene.util.automaton.TestAutomaton.testRandomFinite(TestAutomaton.java:1031)
	at sun.reflect.NativeMethodAccessorImpl.invoke0(Native Method)
	at sun.reflect.NativeMethodAccessorImpl.invoke(NativeMethodAccessorImpl.java:62)
	at sun.reflect.DelegatingMethodAccessorImpl.invoke(DelegatingMethodAccessorImpl.java:43)
	at java.lang.reflect.Method.invoke(Method.java:520)
	at com.carrotsearch.randomizedtesting.RandomizedRunner.invoke(RandomizedRunner.java:1764)
	at com.carrotsearch.randomizedtesting.RandomizedRunner$8.evaluate(RandomizedRunner.java:871)
	at com.carrotsearch.randomizedtesting.RandomizedRunner$9.evaluate(RandomizedRunner.java:907)
	at com.carrotsearch.randomizedtesting.RandomizedRunner$10.evaluate(RandomizedRunner.java:921)
	at org.apache.lucene.util.TestRuleSetupTeardownChained$1.evaluate(TestRuleSetupTeardownChained.java:49)
	at org.apache.lucene.util.AbstractBeforeAfterRule$1.evaluate(AbstractBeforeAfterRule.java:45)
	at org.apache.lucene.util.TestRuleThreadAndTestName$1.evaluate(TestRuleThreadAndTestName.java:48)
	at org.apache.lucene.util.TestRuleIgnoreAfterMaxFailures$1.evaluate(TestRuleIgnoreAfterMaxFailures.java:64)
	at org.apache.lucene.util.TestRuleMarkFailure$1.evaluate(TestRuleMarkFailure.java:47)
	at com.carrotsearch.randomizedtesting.rules.StatementAdapter.evaluate(StatementAdapter.java:36)
	at com.carrotsearch.randomizedtesting.ThreadLeakControl$StatementRunner.run(ThreadLeakControl.java:367)
	at com.carrotsearch.randomizedtesting.ThreadLeakControl.forkTimeoutingTask(ThreadLeakControl.java:809)
	at com.carrotsearch.randomizedtesting.ThreadLeakControl$3.evaluate(ThreadLeakControl.java:460)
	at com.carrotsearch.randomizedtesting.RandomizedRunner.runSingleTest(RandomizedRunner.java:880)
	at com.carrotsearch.randomizedtesting.RandomizedRunner$5.evaluate(RandomizedRunner.java:781)
	at com.carrotsearch.randomizedtesting.RandomizedRunner$6.evaluate(RandomizedRunner.java:816)
	at com.carrotsearch.randomizedtesting.RandomizedRunner$7.evaluate(RandomizedRunner.java:827)
	at org.apache.lucene.util.AbstractBeforeAfterRule$1.evaluate(AbstractBeforeAfterRule.java:45)
	at com.carrotsearch.randomizedtesting.rules.StatementAdapter.evaluate(StatementAdapter.java:36)
	at org.apache.lucene.util.TestRuleStoreClassName$1.evaluate(TestRuleStoreClassName.java:41)
	at com.carrotsearch.randomizedtesting.rules.NoShadowingOrOverridesOnMethodsRule$1.evaluate(NoShadowingOrOverridesOnMethodsRule.java:40)
	at com.carrotsearch.randomizedtesting.rules.NoShadowingOrOverridesOnMethodsRule$1.evaluate(NoShadowingOrOverridesOnMethodsRule.java:40)
	at com.carrotsearch.randomizedtesting.rules.StatementAdapter.evaluate(StatementAdapter.java:36)
	at com.carrotsearch.randomizedtesting.rules.StatementAdapter.evaluate(StatementAdapter.java:36)
	at com.carrotsearch.randomizedtesting.rules.StatementAdapter.evaluate(StatementAdapter.java:36)
	at org.apache.lucene.util.TestRuleAssertionsRequired$1.evaluate(TestRuleAssertionsRequired.java:53)
	at org.apache.lucene.util.TestRuleMarkFailure$1.evaluate(TestRuleMarkFailure.java:47)
	at org.apache.lucene.util.TestRuleIgnoreAfterMaxFailures$1.evaluate(TestRuleIgnoreAfterMaxFailures.java:64)
	at org.apache.lucene.util.TestRuleIgnoreTestSuites$1.evaluate(TestRuleIgnoreTestSuites.java:54)
	at com.carrotsearch.randomizedtesting.rules.StatementAdapter.evaluate(StatementAdapter.java:36)
	at com.carrotsearch.randomizedtesting.ThreadLeakControl$StatementRunner.run(ThreadLeakControl.java:367)
	at java.lang.Thread.run(Thread.java:804)


FAILED:  org.apache.lucene.util.automaton.TestAutomaton.testMakeBinaryIntervalFiniteCasesRandom

Error Message:
automaton was not minimal

Stack Trace:
java.lang.AssertionError: automaton was not minimal
	at __randomizedtesting.SeedInfo.seed([A9B7DAB3FA2F5C4C:D1B6CA4B59C7621D]:0)
	at org.junit.Assert.fail(Assert.java:93)
	at org.apache.lucene.util.automaton.TestAutomaton.makeBinaryInterval(TestAutomaton.java:1167)
	at org.apache.lucene.util.automaton.TestAutomaton.testMakeBinaryIntervalFiniteCasesRandom(TestAutomaton.java:1243)
	at sun.reflect.NativeMethodAccessorImpl.invoke0(Native Method)
	at sun.reflect.NativeMethodAccessorImpl.invoke(NativeMethodAccessorImpl.java:62)
	at sun.reflect.DelegatingMethodAccessorImpl.invoke(DelegatingMethodAccessorImpl.java:43)
	at java.lang.reflect.Method.invoke(Method.java:520)
	at com.carrotsearch.randomizedtesting.RandomizedRunner.invoke(RandomizedRunner.java:1764)
	at com.carrotsearch.randomizedtesting.RandomizedRunner$8.evaluate(RandomizedRunner.java:871)
	at com.carrotsearch.randomizedtesting.RandomizedRunner$9.evaluate(RandomizedRunner.java:907)
	at com.carrotsearch.randomizedtesting.RandomizedRunner$10.evaluate(RandomizedRunner.java:921)
	at org.apache.lucene.util.TestRuleSetupTeardownChained$1.evaluate(TestRuleSetupTeardownChained.java:49)
	at org.apache.lucene.util.AbstractBeforeAfterRule$1.evaluate(AbstractBeforeAfterRule.java:45)
	at org.apache.lucene.util.TestRuleThreadAndTestName$1.evaluate(TestRuleThreadAndTestName.java:48)
	at org.apache.lucene.util.TestRuleIgnoreAfterMaxFailures$1.evaluate(TestRuleIgnoreAfterMaxFailures.java:64)
	at org.apache.lucene.util.TestRuleMarkFailure$1.evaluate(TestRuleMarkFailure.java:47)
	at com.carrotsearch.randomizedtesting.rules.StatementAdapter.evaluate(StatementAdapter.java:36)
	at com.carrotsearch.randomizedtesting.ThreadLeakControl$StatementRunner.run(ThreadLeakControl.java:367)
	at com.carrotsearch.randomizedtesting.ThreadLeakControl.forkTimeoutingTask(ThreadLeakControl.java:809)
	at com.carrotsearch.randomizedtesting.ThreadLeakControl$3.evaluate(ThreadLeakControl.java:460)
	at com.carrotsearch.randomizedtesting.RandomizedRunner.runSingleTest(RandomizedRunner.java:880)
	at com.carrotsearch.randomizedtesting.RandomizedRunner$5.evaluate(RandomizedRunner.java:781)
	at com.carrotsearch.randomizedtesting.RandomizedRunner$6.evaluate(RandomizedRunner.java:816)
	at com.carrotsearch.randomizedtesting.RandomizedRunner$7.evaluate(RandomizedRunner.java:827)
	at org.apache.lucene.util.AbstractBeforeAfterRule$1.evaluate(AbstractBeforeAfterRule.java:45)
	at com.carrotsearch.randomizedtesting.rules.StatementAdapter.evaluate(StatementAdapter.java:36)
	at org.apache.lucene.util.TestRuleStoreClassName$1.evaluate(TestRuleStoreClassName.java:41)
	at com.carrotsearch.randomizedtesting.rules.NoShadowingOrOverridesOnMethodsRule$1.evaluate(NoShadowingOrOverridesOnMethodsRule.java:40)
	at com.carrotsearch.randomizedtesting.rules.NoShadowingOrOverridesOnMethodsRule$1.evaluate(NoShadowingOrOverridesOnMethodsRule.java:40)
	at com.carrotsearch.randomizedtesting.rules.StatementAdapter.evaluate(StatementAdapter.java:36)
	at com.carrotsearch.randomizedtesting.rules.StatementAdapter.evaluate(StatementAdapter.java:36)
	at com.carrotsearch.randomizedtesting.rules.StatementAdapter.evaluate(StatementAdapter.java:36)
	at org.apache.lucene.util.TestRuleAssertionsRequired$1.evaluate(TestRuleAssertionsRequired.java:53)
	at org.apache.lucene.util.TestRuleMarkFailure$1.evaluate(TestRuleMarkFailure.java:47)
	at org.apache.lucene.util.TestRuleIgnoreAfterMaxFailures$1.evaluate(TestRuleIgnoreAfterMaxFailures.java:64)
	at org.apache.lucene.util.TestRuleIgnoreTestSuites$1.evaluate(TestRuleIgnoreTestSuites.java:54)
	at com.carrotsearch.randomizedtesting.rules.StatementAdapter.evaluate(StatementAdapter.java:36)
	at com.carrotsearch.randomizedtesting.ThreadLeakControl$StatementRunner.run(ThreadLeakControl.java:367)
	at java.lang.Thread.run(Thread.java:804)


FAILED:  org.apache.lucene.util.automaton.TestAutomaton.testIntervalRandom

Error Message:


Stack Trace:
java.lang.AssertionError
	at __randomizedtesting.SeedInfo.seed([A9B7DAB3FA2F5C4C:F8FBC5D3AB2C534B]:0)
	at org.junit.Assert.fail(Assert.java:92)
	at org.junit.Assert.assertTrue(Assert.java:43)
	at org.junit.Assert.assertTrue(Assert.java:54)
	at org.apache.lucene.util.automaton.TestAutomaton.testIntervalRandom(TestAutomaton.java:474)
	at sun.reflect.NativeMethodAccessorImpl.invoke0(Native Method)
	at sun.reflect.NativeMethodAccessorImpl.invoke(NativeMethodAccessorImpl.java:62)
	at sun.reflect.DelegatingMethodAccessorImpl.invoke(DelegatingMethodAccessorImpl.java:43)
	at java.lang.reflect.Method.invoke(Method.java:520)
	at com.carrotsearch.randomizedtesting.RandomizedRunner.invoke(RandomizedRunner.java:1764)
	at com.carrotsearch.randomizedtesting.RandomizedRunner$8.evaluate(RandomizedRunner.java:871)
	at com.carrotsearch.randomizedtesting.RandomizedRunner$9.evaluate(RandomizedRunner.java:907)
	at com.carrotsearch.randomizedtesting.RandomizedRunner$10.evaluate(RandomizedRunner.java:921)
	at org.apache.lucene.util.TestRuleSetupTeardownChained$1.evaluate(TestRuleSetupTeardownChained.java:49)
	at org.apache.lucene.util.AbstractBeforeAfterRule$1.evaluate(AbstractBeforeAfterRule.java:45)
	at org.apache.lucene.util.TestRuleThreadAndTestName$1.evaluate(TestRuleThreadAndTestName.java:48)
	at org.apache.lucene.util.TestRuleIgnoreAfterMaxFailures$1.evaluate(TestRuleIgnoreAfterMaxFailures.java:64)
	at org.apache.lucene.util.TestRuleMarkFailure$1.evaluate(TestRuleMarkFailure.java:47)
	at com.carrotsearch.randomizedtesting.rules.StatementAdapter.evaluate(StatementAdapter.java:36)
	at com.carrotsearch.randomizedtesting.ThreadLeakControl$StatementRunner.run(ThreadLeakControl.java:367)
	at com.carrotsearch.randomizedtesting.ThreadLeakControl.forkTimeoutingTask(ThreadLeakControl.java:809)
	at com.carrotsearch.randomizedtesting.ThreadLeakControl$3.evaluate(ThreadLeakControl.java:460)
	at com.carrotsearch.randomizedtesting.RandomizedRunner.runSingleTest(RandomizedRunner.java:880)
	at com.carrotsearch.randomizedtesting.RandomizedRunner$5.evaluate(RandomizedRunner.java:781)
	at com.carrotsearch.randomizedtesting.RandomizedRunner$6.evaluate(RandomizedRunner.java:816)
	at com.carrotsearch.randomizedtesting.RandomizedRunner$7.evaluate(RandomizedRunner.java:827)
	at org.apache.lucene.util.AbstractBeforeAfterRule$1.evaluate(AbstractBeforeAfterRule.java:45)
	at com.carrotsearch.randomizedtesting.rules.StatementAdapter.evaluate(StatementAdapter.java:36)
	at org.apache.lucene.util.TestRuleStoreClassName$1.evaluate(TestRuleStoreClassName.java:41)
	at com.carrotsearch.randomizedtesting.rules.NoShadowingOrOverridesOnMethodsRule$1.evaluate(NoShadowingOrOverridesOnMethodsRule.java:40)
	at com.carrotsearch.randomizedtesting.rules.NoShadowingOrOverridesOnMethodsRule$1.evaluate(NoShadowingOrOverridesOnMethodsRule.java:40)
	at com.carrotsearch.randomizedtesting.rules.StatementAdapter.evaluate(StatementAdapter.java:36)
	at com.carrotsearch.randomizedtesting.rules.StatementAdapter.evaluate(StatementAdapter.java:36)
	at com.carrotsearch.randomizedtesting.rules.StatementAdapter.evaluate(StatementAdapter.java:36)
	at org.apache.lucene.util.TestRuleAssertionsRequired$1.evaluate(TestRuleAssertionsRequired.java:53)
	at org.apache.lucene.util.TestRuleMarkFailure$1.evaluate(TestRuleMarkFailure.java:47)
	at org.apache.lucene.util.TestRuleIgnoreAfterMaxFailures$1.evaluate(TestRuleIgnoreAfterMaxFailures.java:64)
	at org.apache.lucene.util.TestRuleIgnoreTestSuites$1.evaluate(TestRuleIgnoreTestSuites.java:54)
	at com.carrotsearch.randomizedtesting.rules.StatementAdapter.evaluate(StatementAdapter.java:36)
	at com.carrotsearch.randomizedtesting.ThreadLeakControl$StatementRunner.run(ThreadLeakControl.java:367)
	at java.lang.Thread.run(Thread.java:804)




Build Log:
[...truncated 1416 lines...]
   [junit4] Suite: org.apache.lucene.search.TestDocValuesRewriteMethod
   [junit4]   2> NOTE: reproduce with: ant test  -Dtestcase=TestDocValuesRewriteMethod -Dtests.method=testRegexps -Dtests.seed=A9B7DAB3FA2F5C4C -Dtests.multiplier=3 -Dtests.slow=true -Dtests.locale=id -Dtests.timezone=Asia/Pontianak -Dtests.asserts=true -Dtests.file.encoding=US-ASCII
   [junit4] ERROR   0.07s J2 | TestDocValuesRewriteMethod.testRegexps <<<
   [junit4]    > Throwable #1: java.lang.IllegalArgumentException: source=3 is out of bounds (maxState is 2)
   [junit4]    > 	at __randomizedtesting.SeedInfo.seed([A9B7DAB3FA2F5C4C:48EB9BA224850BC4]:0)
   [junit4]    > 	at org.apache.lucene.util.automaton.Automaton.addTransition(Automaton.java:165)
   [junit4]    > 	at org.apache.lucene.util.automaton.MinimizationOperations.minimize(MinimizationOperations.java:245)
   [junit4]    > 	at org.apache.lucene.util.automaton.RegExp.toAutomatonInternal(RegExp.java:537)
   [junit4]    > 	at org.apache.lucene.util.automaton.RegExp.findLeaves(RegExp.java:617)
   [junit4]    > 	at org.apache.lucene.util.automaton.RegExp.findLeaves(RegExp.java:612)
   [junit4]    > 	at org.apache.lucene.util.automaton.RegExp.toAutomatonInternal(RegExp.java:521)
   [junit4]    > 	at org.apache.lucene.util.automaton.RegExp.findLeaves(RegExp.java:617)
   [junit4]    > 	at org.apache.lucene.util.automaton.RegExp.toAutomatonInternal(RegExp.java:510)
   [junit4]    > 	at org.apache.lucene.util.automaton.RegExp.toAutomaton(RegExp.java:495)
   [junit4]    > 	at org.apache.lucene.util.automaton.RegExp.toAutomaton(RegExp.java:466)
   [junit4]    > 	at org.apache.lucene.search.RegexpQuery.<init>(RegexpQuery.java:109)
   [junit4]    > 	at org.apache.lucene.search.RegexpQuery.<init>(RegexpQuery.java:79)
   [junit4]    > 	at org.apache.lucene.search.TestDocValuesRewriteMethod.assertSame(TestDocValuesRewriteMethod.java:117)
   [junit4]    > 	at org.apache.lucene.search.TestDocValuesRewriteMethod.testRegexps(TestDocValuesRewriteMethod.java:109)
   [junit4]    > 	at java.lang.Thread.run(Thread.java:804)
   [junit4]   2> NOTE: test params are: codec=CheapBastard, sim=RandomSimilarity(queryNorm=true,coord=yes): {}, locale=id, timezone=Asia/Pontianak
   [junit4]   2> NOTE: Linux 3.19.0-51-generic amd64/Oracle Corporation 9-ea (64-bit)/cpus=12,threads=1,free=439815320,total=518979584
   [junit4]   2> NOTE: All tests run in this JVM: [TestNoMergeScheduler, TestConcurrentMergeScheduler, TestFastCompressionMode, TestFieldValueQuery, TestIndexWriterMerging, TestTransactions, TestSearchWithThreads, TestUsageTrackingFilterCachingPolicy, TestPackedTokenAttributeImpl, TestArrayUtil, TestIndexableField, TestBytesStore, TestSpanFirstQuery, TestPointQueries, Test2BSortedDocValuesOrds, TestIndexCommit, TestPointValues, TestIntBlockPool, TestBKD, TestSleepingLockWrapper, TestSegmentInfos, TestIndexWriterThreadsToSegments, TestManyFields, TestNorms, TestTwoPhaseCommitTool, TestBlockPostingsFormat, TestSimpleFSDirectory, TestDemo, TestTryDelete, TestIndexWriterMaxDocs, TestCharsRefBuilder, Test2BBinaryDocValues, TestDirectPacked, TestTieredMergePolicy, TestAtomicUpdate, TestBooleanRewrites, TestPrefixCodedTerms, TestIndexWriterReader, TestNIOFSDirectory, TestControlledRealTimeReopenThread, TestExternalCodecs, TestDirectoryReader, TestBooleanOr, TestTotalHitCountCollector, TestIndexWriterConfig, TestTermVectors, TestStressIndexing2, TestSearch, TestFrequencyTrackingRingBuffer, TestSpans, TestIndexWriterOnDiskFull, TestIntsRef, TestMixedCodecs, TestMultiThreadTermVectors, TestElevationComparator, TestDuelingCodecsAtNight, TestNumericTokenStream, TestConsistentFieldNumbers, TestComplexExplanationsOfNonMatches, TestTermsEnum2, TestMergeRateLimiter, TestFieldReuse, TestSearchForDuplicates, TestDocBoost, TestReqExclBulkScorer, TestIndexWriterDeleteByQuery, TestForceMergeForever, TestBufferedIndexInput, TestDateTools, Test2BPagedBytes, TestIndexWriterWithThreads, TestNumericRangeQuery32, TestBasics, TestSloppyPhraseQuery, TestIndexWriterMergePolicy, TestPersistentSnapshotDeletionPolicy, TestStressAdvance, TestDirectoryReaderReopen, TestHighCompressionMode, TestTopDocsMerge, TestLongPostings, TestStressIndexing, TestMinimize, TestRollingUpdates, TestSnapshotDeletionPolicy, TestIndexWriterUnicode, TestNRTReaderWithThreads, TestByteSlices, TestTermsEnum, TestLucene60PointFormat, TestFieldType, TestAllFilesHaveChecksumFooter, TestCodecUtil, TestDemoParallelLeafReader, TestDocValues, TestExitableDirectoryReader, TestIndexReaderClose, TestIndexWriterOnVMError, TestLogMergePolicy, TestMaxPosition, TestMergePolicyWrapper, TestMixedDocValuesUpdates, TestMultiTermsEnum, TestNRTReaderCleanup, TestNumericDocValuesUpdates, TestOrdinalMap, TestReadOnlyIndex, TestUpgradeIndexMergePolicy, TestApproximationSearchEquivalence, TestBooleanCoord, TestBoostQuery, TestDocValuesRewriteMethod]
   [junit4] Completed [371/411 (1!)] on J2 in 0.11s, 2 tests, 1 error <<< FAILURES!

[...truncated 87 lines...]
   [junit4] Suite: org.apache.lucene.util.TestQueryBuilder
   [junit4]   2> NOTE: reproduce with: ant test  -Dtestcase=TestQueryBuilder -Dtests.method=testPhraseQueryPositionIncrements -Dtests.seed=A9B7DAB3FA2F5C4C -Dtests.multiplier=3 -Dtests.slow=true -Dtests.locale=en-BW -Dtests.timezone=Asia/Thimbu -Dtests.asserts=true -Dtests.file.encoding=US-ASCII
   [junit4] ERROR   0.00s J2 | TestQueryBuilder.testPhraseQueryPositionIncrements <<<
   [junit4]    > Throwable #1: java.lang.ArrayIndexOutOfBoundsException: 6
   [junit4]    > 	at __randomizedtesting.SeedInfo.seed([A9B7DAB3FA2F5C4C:8BFC6EE769AADC79]:0)
   [junit4]    > 	at org.apache.lucene.util.automaton.MinimizationOperations.minimize(MinimizationOperations.java:235)
   [junit4]    > 	at org.apache.lucene.util.automaton.RegExp.toAutomatonInternal(RegExp.java:524)
   [junit4]    > 	at org.apache.lucene.util.automaton.RegExp.toAutomaton(RegExp.java:495)
   [junit4]    > 	at org.apache.lucene.util.automaton.RegExp.toAutomaton(RegExp.java:426)
   [junit4]    > 	at org.apache.lucene.util.TestQueryBuilder.testPhraseQueryPositionIncrements(TestQueryBuilder.java:111)
   [junit4]    > 	at java.lang.Thread.run(Thread.java:804)
   [junit4]   2> NOTE: test params are: codec=CheapBastard, sim=RandomSimilarity(queryNorm=true,coord=yes): {}, locale=en-BW, timezone=Asia/Thimbu
   [junit4]   2> NOTE: Linux 3.19.0-51-generic amd64/Oracle Corporation 9-ea (64-bit)/cpus=12,threads=1,free=311251608,total=518979584
   [junit4]   2> NOTE: All tests run in this JVM: [TestNoMergeScheduler, TestConcurrentMergeScheduler, TestFastCompressionMode, TestFieldValueQuery, TestIndexWriterMerging, TestTransactions, TestSearchWithThreads, TestUsageTrackingFilterCachingPolicy, TestPackedTokenAttributeImpl, TestArrayUtil, TestIndexableField, TestBytesStore, TestSpanFirstQuery, TestPointQueries, Test2BSortedDocValuesOrds, TestIndexCommit, TestPointValues, TestIntBlockPool, TestBKD, TestSleepingLockWrapper, TestSegmentInfos, TestIndexWriterThreadsToSegments, TestManyFields, TestNorms, TestTwoPhaseCommitTool, TestBlockPostingsFormat, TestSimpleFSDirectory, TestDemo, TestTryDelete, TestIndexWriterMaxDocs, TestCharsRefBuilder, Test2BBinaryDocValues, TestDirectPacked, TestTieredMergePolicy, TestAtomicUpdate, TestBooleanRewrites, TestPrefixCodedTerms, TestIndexWriterReader, TestNIOFSDirectory, TestControlledRealTimeReopenThread, TestExternalCodecs, TestDirectoryReader, TestBooleanOr, TestTotalHitCountCollector, TestIndexWriterConfig, TestTermVectors, TestStressIndexing2, TestSearch, TestFrequencyTrackingRingBuffer, TestSpans, TestIndexWriterOnDiskFull, TestIntsRef, TestMixedCodecs, TestMultiThreadTermVectors, TestElevationComparator, TestDuelingCodecsAtNight, TestNumericTokenStream, TestConsistentFieldNumbers, TestComplexExplanationsOfNonMatches, TestTermsEnum2, TestMergeRateLimiter, TestFieldReuse, TestSearchForDuplicates, TestDocBoost, TestReqExclBulkScorer, TestIndexWriterDeleteByQuery, TestForceMergeForever, TestBufferedIndexInput, TestDateTools, Test2BPagedBytes, TestIndexWriterWithThreads, TestNumericRangeQuery32, TestBasics, TestSloppyPhraseQuery, TestIndexWriterMergePolicy, TestPersistentSnapshotDeletionPolicy, TestStressAdvance, TestDirectoryReaderReopen, TestHighCompressionMode, TestTopDocsMerge, TestLongPostings, TestStressIndexing, TestMinimize, TestRollingUpdates, TestSnapshotDeletionPolicy, TestIndexWriterUnicode, TestNRTReaderWithThreads, TestByteSlices, TestTermsEnum, TestLucene60PointFormat, TestFieldType, TestAllFilesHaveChecksumFooter, TestCodecUtil, TestDemoParallelLeafReader, TestDocValues, TestExitableDirectoryReader, TestIndexReaderClose, TestIndexWriterOnVMError, TestLogMergePolicy, TestMaxPosition, TestMergePolicyWrapper, TestMixedDocValuesUpdates, TestMultiTermsEnum, TestNRTReaderCleanup, TestNumericDocValuesUpdates, TestOrdinalMap, TestReadOnlyIndex, TestUpgradeIndexMergePolicy, TestApproximationSearchEquivalence, TestBooleanCoord, TestBoostQuery, TestDocValuesRewriteMethod, TestIndexSearcher, TestLRUQueryCache, TestSortRescorer, TestFilterSpans, TestSpanContainQuery, TestSpanOrQuery, TestBufferedChecksum, TestSimpleFSLockFactory, TestQueryBuilder]
   [junit4] Completed [400/411 (2!)] on J2 in 0.03s, 20 tests, 1 error <<< FAILURES!

[...truncated 21 lines...]
   [junit4] Suite: org.apache.lucene.util.automaton.TestAutomaton
   [junit4]   1> Original was not minimal:
   [junit4]   1> Original:
   [junit4]   1> digraph Automaton {
   [junit4]   1>   rankdir = LR
   [junit4]   1>   initial [shape=plaintext,label="0"]
   [junit4]   1>   initial -> 0
   [junit4]   1>   0 [shape=circle,label="0"]
   [junit4]   1>   0 -> 2 [label="."]
   [junit4]   1>   0 -> 1 [label="/-q"]
   [junit4]   1>   0 -> 3 [label="r"]
   [junit4]   1>   1 [shape=doublecircle,label="1"]
   [junit4]   1>   1 -> 1 [label="\\U00000000-\\U000000ff"]
   [junit4]   1>   2 [shape=circle,label="2"]
   [junit4]   1>   2 -> 4 [label="\\U000000b2"]
   [junit4]   1>   2 -> 1 [label="\\U000000b3-\\U000000ff"]
   [junit4]   1>   3 [shape=doublecircle,label="3"]
   [junit4]   1>   3 -> 1 [label="\\U00000000-C"]
   [junit4]   1>   3 -> 11 [label="D"]
   [junit4]   1>   4 [shape=circle,label="4"]
   [junit4]   1>   4 -> 5 [label="\\U00000097"]
   [junit4]   1>   4 -> 1 [label="\\U00000098-\\U000000ff"]
   [junit4]   1>   5 [shape=circle,label="5"]
   [junit4]   1>   5 -> 6 [label="\\U000000bf"]
   [junit4]   1>   5 -> 1 [label="\\U000000c0-\\U000000ff"]
   [junit4]   1>   6 [shape=circle,label="6"]
   [junit4]   1>   6 -> 7 [label="Q"]
   [junit4]   1>   6 -> 1 [label="R-\\U000000ff"]
   [junit4]   1>   7 [shape=circle,label="7"]
   [junit4]   1>   7 -> 8 [label="\\U000000e3"]
   [junit4]   1>   7 -> 1 [label="\\U000000e4-\\U000000ff"]
   [junit4]   1>   8 [shape=circle,label="8"]
   [junit4]   1>   8 -> 9 [label=";"]
   [junit4]   1>   8 -> 1 [label="<-\\U000000ff"]
   [junit4]   1>   9 [shape=circle,label="9"]
   [junit4]   1>   9 -> 10 [label="R"]
   [junit4]   1>   9 -> 1 [label="S-\\U000000ff"]
   [junit4]   1>   10 [shape=circle,label="10"]
   [junit4]   1>   10 -> 1 [label="\\U00000096-\\U000000ff"]
   [junit4]   1>   11 [shape=doublecircle,label="11"]
   [junit4]   1>   11 -> 1 [label="\\U00000000-\\U00000003"]
   [junit4]   1>   11 -> 12 [label="\\U00000004"]
   [junit4]   1>   12 [shape=doublecircle,label="12"]
   [junit4]   1>   12 -> 1 [label="\\U00000000-\\U000000cd"]
   [junit4]   1>   12 -> 13 [label="\\U000000ce"]
   [junit4]   1>   13 [shape=doublecircle,label="13"]
   [junit4]   1>   13 -> 1 [label="\\U00000000-\\U000000b1"]
   [junit4]   1>   13 -> 14 [label="\\U000000b2"]
   [junit4]   1>   14 [shape=doublecircle,label="14"]
   [junit4]   1> }
   [junit4]   1> Minimized:
   [junit4]   1> digraph Automaton {
   [junit4]   1>   rankdir = LR
   [junit4]   1>   initial [shape=plaintext,label="0"]
   [junit4]   1>   initial -> 0
   [junit4]   1>   0 [shape=circle,label="0"]
   [junit4]   1>   0 -> 4 [label="\\U00000000--"]
   [junit4]   1>   0 -> 6 [label="."]
   [junit4]   1>   0 -> 3 [label="/-q"]
   [junit4]   1>   0 -> 1 [label="r"]
   [junit4]   1>   0 -> 4 [label="s-\\U0010ffff"]
   [junit4]   1>   1 [shape=doublecircle,label="1"]
   [junit4]   1>   1 -> 3 [label="\\U00000000-C"]
   [junit4]   1>   1 -> 2 [label="D"]
   [junit4]   1>   1 -> 4 [label="E-\\U0010ffff"]
   [junit4]   1>   2 [shape=doublecircle,label="2"]
   [junit4]   1>   2 -> 3 [label="\\U00000000-\\U00000003"]
   [junit4]   1>   2 -> 5 [label="\\U00000004"]
   [junit4]   1>   2 -> 4 [label="\\U00000005-\\U0010ffff"]
   [junit4]   1>   3 [shape=doublecircle,label="3"]
   [junit4]   1>   3 -> 3 [label="\\U00000000-\\U000000ff"]
   [junit4]   1>   3 -> 4 [label="\\U00000100-\\U0010ffff"]
   [junit4]   1>   4 [shape=circle,label="4"]
   [junit4]   1>   4 -> 3 [label="\\U00000000-\\U000000ff"]
   [junit4]   1>   4 -> 4 [label="\\U00000100-\\U0010ffff"]
   [junit4]   1>   5 [shape=doublecircle,label="5"]
   [junit4]   1>   5 -> 3 [label="\\U00000000-\\U000000ff"]
   [junit4]   1>   5 -> 4 [label="\\U00000100-\\U0010ffff"]
   [junit4]   1>   6 [shape=circle,label="6"]
   [junit4]   1>   6 -> 3 [label="\\U00000000-\\U000000ff"]
   [junit4]   1>   6 -> 4 [label="\\U00000100-\\U0010ffff"]
   [junit4]   1> }
   [junit4]   1> minTerm=[2e b2 97 bf 51 e3 3b 52 96] minInclusive=true
   [junit4]   1> maxTerm=[72 44 4 ce b2] maxInclusive=true
   [junit4]   2> NOTE: reproduce with: ant test  -Dtestcase=TestAutomaton -Dtests.method=testMakeBinaryIntervalRandom -Dtests.seed=A9B7DAB3FA2F5C4C -Dtests.multiplier=3 -Dtests.slow=true -Dtests.locale=el-GR -Dtests.timezone=Chile/Continental -Dtests.asserts=true -Dtests.file.encoding=US-ASCII
   [junit4] FAILURE 0.01s J2 | TestAutomaton.testMakeBinaryIntervalRandom <<<
   [junit4]    > Throwable #1: java.lang.AssertionError: automaton was not minimal
   [junit4]    > 	at __randomizedtesting.SeedInfo.seed([A9B7DAB3FA2F5C4C:9DE87CCC49A28DAF]:0)
   [junit4]    > 	at org.apache.lucene.util.automaton.TestAutomaton.makeBinaryInterval(TestAutomaton.java:1167)
   [junit4]    > 	at org.apache.lucene.util.automaton.TestAutomaton.testMakeBinaryIntervalRandom(TestAutomaton.java:1290)
   [junit4]    > 	at java.lang.Thread.run(Thread.java:804)
   [junit4]   2> NOTE: reproduce with: ant test  -Dtestcase=TestAutomaton -Dtests.method=testRandomFinite -Dtests.seed=A9B7DAB3FA2F5C4C -Dtests.multiplier=3 -Dtests.slow=true -Dtests.locale=el-GR -Dtests.timezone=Chile/Continental -Dtests.asserts=true -Dtests.file.encoding=US-ASCII
   [junit4] ERROR   1.06s J2 | TestAutomaton.testRandomFinite <<<
   [junit4]    > Throwable #1: java.lang.IllegalArgumentException: automaton has cycles
   [junit4]    > 	at __randomizedtesting.SeedInfo.seed([A9B7DAB3FA2F5C4C:EE01BC8E45BF396D]:0)
   [junit4]    > 	at org.apache.lucene.util.automaton.FiniteStringsIterator.next(FiniteStringsIterator.java:121)
   [junit4]    > 	at org.apache.lucene.util.automaton.TestOperations.getFiniteStrings(TestOperations.java:156)
   [junit4]    > 	at org.apache.lucene.util.automaton.TestOperations.getFiniteStrings(TestOperations.java:136)
   [junit4]    > 	at org.apache.lucene.util.automaton.TestAutomaton.assertSame(TestAutomaton.java:1129)
   [junit4]    > 	at org.apache.lucene.util.automaton.TestAutomaton.testRandomFinite(TestAutomaton.java:1031)
   [junit4]    > 	at java.lang.Thread.run(Thread.java:804)
   [junit4]   1> Original was not minimal:
   [junit4]   1> Original:
   [junit4]   1> digraph Automaton {
   [junit4]   1>   rankdir = LR
   [junit4]   1>   initial [shape=plaintext,label="0"]
   [junit4]   1>   initial -> 0
   [junit4]   1>   0 [shape=circle,label="0"]
   [junit4]   1>   0 -> 1 [label="\\U000000f0"]
   [junit4]   1>   1 [shape=circle,label="1"]
   [junit4]   1>   1 -> 2 [label="\\U00000090"]
   [junit4]   1>   2 [shape=circle,label="2"]
   [junit4]   1>   2 -> 3 [label="\\U000000ad"]
   [junit4]   1>   3 [shape=circle,label="3"]
   [junit4]   1>   3 -> 4 [label="\\U000000b4"]
   [junit4]   1>   4 [shape=circle,label="4"]
   [junit4]   1>   4 -> 5 [label="\\U000000f0"]
   [junit4]   1>   5 [shape=circle,label="5"]
   [junit4]   1>   5 -> 6 [label="\\U00000090"]
   [junit4]   1>   6 [shape=circle,label="6"]
   [junit4]   1>   6 -> 7 [label="\\U000000ad"]
   [junit4]   1>   7 [shape=circle,label="7"]
   [junit4]   1>   7 -> 8 [label="\\U000000b3"]
   [junit4]   1>   8 [shape=circle,label="8"]
   [junit4]   1>   8 -> 9 [label="\\U000000f0"]
   [junit4]   1>   9 [shape=circle,label="9"]
   [junit4]   1>   9 -> 10 [label="\\U00000090"]
   [junit4]   1>   10 [shape=circle,label="10"]
   [junit4]   1>   10 -> 11 [label="\\U000000ad"]
   [junit4]   1>   11 [shape=circle,label="11"]
   [junit4]   1>   11 -> 12 [label="\\U000000a3"]
   [junit4]   1>   12 [shape=circle,label="12"]
   [junit4]   1>   12 -> 13 [label="\\U000000f0"]
   [junit4]   1>   13 [shape=circle,label="13"]
   [junit4]   1>   13 -> 14 [label="\\U00000090"]
   [junit4]   1>   14 [shape=circle,label="14"]
   [junit4]   1>   14 -> 15 [label="\\U000000ad"]
   [junit4]   1>   15 [shape=circle,label="15"]
   [junit4]   1>   15 -> 16 [label="\\U000000af"]
   [junit4]   1>   16 [shape=circle,label="16"]
   [junit4]   1>   16 -> 17 [label="\\U000000f0"]
   [junit4]   1>   17 [shape=circle,label="17"]
   [junit4]   1>   17 -> 18 [label="\\U00000090"]
   [junit4]   1>   18 [shape=circle,label="18"]
   [junit4]   1>   18 -> 19 [label="\\U000000ad"]
   [junit4]   1>   19 [shape=circle,label="19"]
   [junit4]   1>   19 -> 20 [label="\\U000000b3"]
   [junit4]   1>   20 [shape=circle,label="20"]
   [junit4]   1>   20 -> 21 [label="\\U00000000"]
   [junit4]   1>   21 [shape=circle,label="21"]
   [junit4]   1>   21 -> 22 [label="\\U00000000"]
   [junit4]   1>   22 [shape=circle,label="22"]
   [junit4]   1>   22 -> 23 [label="\\U00000000"]
   [junit4]   1>   23 [shape=circle,label="23"]
   [junit4]   1>   23 -> 24 [label="\\U00000000"]
   [junit4]   1>   24 [shape=doublecircle,label="24"]
   [junit4]   1> }
   [junit4]   1> Minimized:
   [junit4]   1> digraph Automaton {
   [junit4]   1>   rankdir = LR
   [junit4]   1>   initial [shape=plaintext,label="0"]
   [junit4]   1>   initial -> 0
   [junit4]   1>   0 [shape=circle,label="0"]
   [junit4]   1>   0 -> 7 [label="\\U00000000-\\U000000ef"]
   [junit4]   1>   0 -> 6 [label="\\U000000f0"]
   [junit4]   1>   0 -> 7 [label="\\U000000f1-\\U0010ffff"]
   [junit4]   1>   1 [shape=doublecircle,label="1"]
   [junit4]   1>   1 -> 7 [label="\\U00000000-\\U0010ffff"]
   [junit4]   1>   2 [shape=circle,label="2"]
   [junit4]   1>   2 -> 5 [label="\\U00000000"]
   [junit4]   1>   2 -> 7 [label="\\U00000001-\\U0010ffff"]
   [junit4]   1>   3 [shape=circle,label="3"]
   [junit4]   1>   3 -> 1 [label="\\U00000000"]
   [junit4]   1>   3 -> 7 [label="\\U00000001-\\U0010ffff"]
   [junit4]   1>   4 [shape=circle,label="4"]
   [junit4]   1>   4 -> 3 [label="\\U00000000"]
   [junit4]   1>   4 -> 7 [label="\\U00000001-\\U0010ffff"]
   [junit4]   1>   5 [shape=circle,label="5"]
   [junit4]   1>   5 -> 4 [label="\\U00000000"]
   [junit4]   1>   5 -> 7 [label="\\U00000001-\\U0010ffff"]
   [junit4]   1>   6 [shape=circle,label="6"]
   [junit4]   1>   6 -> 7 [label="\\U00000000-\\U000000b2"]
   [junit4]   1>   6 -> 2 [label="\\U000000b3"]
   [junit4]   1>   6 -> 7 [label="\\U000000b4-\\U0010ffff"]
   [junit4]   1>   7 [shape=circle,label="7"]
   [junit4]   1>   7 -> 7 [label="\\U00000000-\\U000000b2"]
   [junit4]   1>   7 -> 2 [label="\\U000000b3"]
   [junit4]   1>   7 -> 7 [label="\\U000000b4-\\U0010ffff"]
   [junit4]   1> }
   [junit4]   1> minTerm=[f0 90 ad b4 f0 90 ad b3 f0 90 ad a3 f0 90 ad af f0 90 ad b3 0 0 0] minInclusive=false
   [junit4]   1> maxTerm=[f0 90 ad b4 f0 90 ad b3 f0 90 ad a3 f0 90 ad af f0 90 ad b3 0 0 0 0] maxInclusive=true
   [junit4]   2> NOTE: reproduce with: ant test  -Dtestcase=TestAutomaton -Dtests.method=testMakeBinaryIntervalFiniteCasesRandom -Dtests.seed=A9B7DAB3FA2F5C4C -Dtests.multiplier=3 -Dtests.slow=true -Dtests.locale=el-GR -Dtests.timezone=Chile/Continental -Dtests.asserts=true -Dtests.file.encoding=US-ASCII
   [junit4] FAILURE 0.03s J2 | TestAutomaton.testMakeBinaryIntervalFiniteCasesRandom <<<
   [junit4]    > Throwable #1: java.lang.AssertionError: automaton was not minimal
   [junit4]    > 	at __randomizedtesting.SeedInfo.seed([A9B7DAB3FA2F5C4C:D1B6CA4B59C7621D]:0)
   [junit4]    > 	at org.apache.lucene.util.automaton.TestAutomaton.makeBinaryInterval(TestAutomaton.java:1167)
   [junit4]    > 	at org.apache.lucene.util.automaton.TestAutomaton.testMakeBinaryIntervalFiniteCasesRandom(TestAutomaton.java:1243)
   [junit4]    > 	at java.lang.Thread.run(Thread.java:804)
   [junit4]   2> NOTE: reproduce with: ant test  -Dtestcase=TestAutomaton -Dtests.method=testIntervalRandom -Dtests.seed=A9B7DAB3FA2F5C4C -Dtests.multiplier=3 -Dtests.slow=true -Dtests.locale=el-GR -Dtests.timezone=Chile/Continental -Dtests.asserts=true -Dtests.file.encoding=US-ASCII
   [junit4] FAILURE 0.00s J2 | TestAutomaton.testIntervalRandom <<<
   [junit4]    > Throwable #1: java.lang.AssertionError
   [junit4]    > 	at __randomizedtesting.SeedInfo.seed([A9B7DAB3FA2F5C4C:F8FBC5D3AB2C534B]:0)
   [junit4]    > 	at org.apache.lucene.util.automaton.TestAutomaton.testIntervalRandom(TestAutomaton.java:474)
   [junit4]    > 	at java.lang.Thread.run(Thread.java:804)
   [junit4]   2> NOTE: test params are: codec=Asserting(Lucene60): {}, docValues:{}, maxPointsInLeafNode=1691, maxMBSortInHeap=6.227995511866378, sim=ClassicSimilarity, locale=el-GR, timezone=Chile/Continental
   [junit4]   2> NOTE: Linux 3.19.0-51-generic amd64/Oracle Corporation 9-ea (64-bit)/cpus=12,threads=1,free=414509016,total=518979584
   [junit4]   2> NOTE: All tests run in this JVM: [TestNoMergeScheduler, TestConcurrentMergeScheduler, TestFastCompressionMode, TestFieldValueQuery, TestIndexWriterMerging, TestTransactions, TestSearchWithThreads, TestUsageTrackingFilterCachingPolicy, TestPackedTokenAttributeImpl, TestArrayUtil, TestIndexableField, TestBytesStore, TestSpanFirstQuery, TestPointQueries, Test2BSortedDocValuesOrds, TestIndexCommit, TestPointValues, TestIntBlockPool, TestBKD, TestSleepingLockWrapper, TestSegmentInfos, TestIndexWriterThreadsToSegments, TestManyFields, TestNorms, TestTwoPhaseCommitTool, TestBlockPostingsFormat, TestSimpleFSDirectory, TestDemo, TestTryDelete, TestIndexWriterMaxDocs, TestCharsRefBuilder, Test2BBinaryDocValues, TestDirectPacked, TestTieredMergePolicy, TestAtomicUpdate, TestBooleanRewrites, TestPrefixCodedTerms, TestIndexWriterReader, TestNIOFSDirectory, TestControlledRealTimeReopenThread, TestExternalCodecs, TestDirectoryReader, TestBooleanOr, TestTotalHitCountCollector, TestIndexWriterConfig, TestTermVectors, TestStressIndexing2, TestSearch, TestFrequencyTrackingRingBuffer, TestSpans, TestIndexWriterOnDiskFull, TestIntsRef, TestMixedCodecs, TestMultiThreadTermVectors, TestElevationComparator, TestDuelingCodecsAtNight, TestNumericTokenStream, TestConsistentFieldNumbers, TestComplexExplanationsOfNonMatches, TestTermsEnum2, TestMergeRateLimiter, TestFieldReuse, TestSearchForDuplicates, TestDocBoost, TestReqExclBulkScorer, TestIndexWriterDeleteByQuery, TestForceMergeForever, TestBufferedIndexInput, TestDateTools, Test2BPagedBytes, TestIndexWriterWithThreads, TestNumericRangeQuery32, TestBasics, TestSloppyPhraseQuery, TestIndexWriterMergePolicy, TestPersistentSnapshotDeletionPolicy, TestStressAdvance, TestDirectoryReaderReopen, TestHighCompressionMode, TestTopDocsMerge, TestLongPostings, TestStressIndexing, TestMinimize, TestRollingUpdates, TestSnapshotDeletionPolicy, TestIndexWriterUnicode, TestNRTReaderWithThreads, TestByteSlices, TestTermsEnum, TestLucene60PointFormat, TestFieldType, TestAllFilesHaveChecksumFooter, TestCodecUtil, TestDemoParallelLeafReader, TestDocValues, TestExitableDirectoryReader, TestIndexReaderClose, TestIndexWriterOnVMError, TestLogMergePolicy, TestMaxPosition, TestMergePolicyWrapper, TestMixedDocValuesUpdates, TestMultiTermsEnum, TestNRTReaderCleanup, TestNumericDocValuesUpdates, TestOrdinalMap, TestReadOnlyIndex, TestUpgradeIndexMergePolicy, TestApproximationSearchEquivalence, TestBooleanCoord, TestBoostQuery, TestDocValuesRewriteMethod, TestIndexSearcher, TestLRUQueryCache, TestSortRescorer, TestFilterSpans, TestSpanContainQuery, TestSpanOrQuery, TestBufferedChecksum, TestSimpleFSLockFactory, TestQueryBuilder, TestRoaringDocIdSet, TestSPIClassIterator, TestSparseFixedBitSet, TestAutomaton]
   [junit4] Completed [407/411 (3!)] on J2 in 2.24s, 56 tests, 3 failures, 1 error <<< FAILURES!

[...truncated 34 lines...]
BUILD FAILED
/home/jenkins/workspace/Lucene-Solr-trunk-Linux/build.xml:740: The following error occurred while executing this line:
/home/jenkins/workspace/Lucene-Solr-trunk-Linux/build.xml:684: The following error occurred while executing this line:
/home/jenkins/workspace/Lucene-Solr-trunk-Linux/build.xml:59: The following error occurred while executing this line:
/home/jenkins/workspace/Lucene-Solr-trunk-Linux/lucene/build.xml:50: The following error occurred while executing this line:
/home/jenkins/workspace/Lucene-Solr-trunk-Linux/lucene/common-build.xml:1457: The following error occurred while executing this line:
/home/jenkins/workspace/Lucene-Solr-trunk-Linux/lucene/common-build.xml:1014: There were test failures: 411 suites (1 ignored), 3423 tests, 3 errors, 3 failures, 59 ignored (55 assumptions) [seed: A9B7DAB3FA2F5C4C]

Total time: 6 minutes 53 seconds
Build step 'Invoke Ant' marked build as failure
Archiving artifacts
[WARNINGS] Skipping publisher since build result is FAILURE
Recording test results
Email was triggered for: Failure - Any
Sending email for trigger: Failure - Any



Mime
View raw message