lucene-dev mailing list archives

Site index · List index
Message view « Date » · « Thread »
Top « Date » · « Thread »
From Policeman Jenkins Server <jenk...@thetaphi.de>
Subject [JENKINS-EA] Lucene-Solr-6.x-Linux (32bit/jdk-9-ea+109) - Build # 149 - Still Failing!
Date Thu, 17 Mar 2016 03:33:33 GMT
Build: http://jenkins.thetaphi.de/job/Lucene-Solr-6.x-Linux/149/
Java: 32bit/jdk-9-ea+109 -client -XX:+UseSerialGC

1 tests failed.
FAILED:  org.apache.solr.cloud.UnloadDistributedZkTest.test

Error Message:
Captured an uncaught exception in thread: Thread[id=2012, name=testExecutor-789-thread-5, state=RUNNABLE, group=TGRP-UnloadDistributedZkTest]

Stack Trace:
com.carrotsearch.randomizedtesting.UncaughtExceptionError: Captured an uncaught exception in thread: Thread[id=2012, name=testExecutor-789-thread-5, state=RUNNABLE, group=TGRP-UnloadDistributedZkTest]
Caused by: java.lang.RuntimeException: org.apache.solr.client.solrj.SolrServerException: Timeout occured while waiting response from server at: http://127.0.0.1:43544/m_dbp/e
	at __randomizedtesting.SeedInfo.seed([1D87E600A5593DDF]:0)
	at org.apache.solr.cloud.BasicDistributedZkTest.lambda$createCores$0(BasicDistributedZkTest.java:583)
	at org.apache.solr.common.util.ExecutorUtil$MDCAwareThreadPoolExecutor.lambda$execute$0(ExecutorUtil.java:229)
	at java.util.concurrent.ThreadPoolExecutor.runWorker(ThreadPoolExecutor.java:1158)
	at java.util.concurrent.ThreadPoolExecutor$Worker.run(ThreadPoolExecutor.java:632)
	at java.lang.Thread.run(Thread.java:804)
Caused by: org.apache.solr.client.solrj.SolrServerException: Timeout occured while waiting response from server at: http://127.0.0.1:43544/m_dbp/e
	at org.apache.solr.client.solrj.impl.HttpSolrClient.executeMethod(HttpSolrClient.java:588)
	at org.apache.solr.client.solrj.impl.HttpSolrClient.request(HttpSolrClient.java:241)
	at org.apache.solr.client.solrj.impl.HttpSolrClient.request(HttpSolrClient.java:230)
	at org.apache.solr.client.solrj.SolrClient.request(SolrClient.java:1219)
	at org.apache.solr.cloud.BasicDistributedZkTest.lambda$createCores$0(BasicDistributedZkTest.java:581)
	... 4 more
Caused by: java.net.SocketTimeoutException: Read timed out
	at java.net.SocketInputStream.socketRead0(Native Method)
	at java.net.SocketInputStream.socketRead(SocketInputStream.java:116)
	at java.net.SocketInputStream.read(SocketInputStream.java:170)
	at java.net.SocketInputStream.read(SocketInputStream.java:141)
	at org.apache.http.impl.io.AbstractSessionInputBuffer.fillBuffer(AbstractSessionInputBuffer.java:160)
	at org.apache.http.impl.io.SocketInputBuffer.fillBuffer(SocketInputBuffer.java:84)
	at org.apache.http.impl.io.AbstractSessionInputBuffer.readLine(AbstractSessionInputBuffer.java:273)
	at org.apache.http.impl.conn.DefaultHttpResponseParser.parseHead(DefaultHttpResponseParser.java:140)
	at org.apache.http.impl.conn.DefaultHttpResponseParser.parseHead(DefaultHttpResponseParser.java:57)
	at org.apache.http.impl.io.AbstractMessageParser.parse(AbstractMessageParser.java:261)
	at org.apache.http.impl.AbstractHttpClientConnection.receiveResponseHeader(AbstractHttpClientConnection.java:283)
	at org.apache.http.impl.conn.DefaultClientConnection.receiveResponseHeader(DefaultClientConnection.java:251)
	at org.apache.http.impl.conn.ManagedClientConnectionImpl.receiveResponseHeader(ManagedClientConnectionImpl.java:197)
	at org.apache.http.protocol.HttpRequestExecutor.doReceiveResponse(HttpRequestExecutor.java:272)
	at org.apache.http.protocol.HttpRequestExecutor.execute(HttpRequestExecutor.java:124)
	at org.apache.http.impl.client.DefaultRequestDirector.tryExecute(DefaultRequestDirector.java:685)
	at org.apache.http.impl.client.DefaultRequestDirector.execute(DefaultRequestDirector.java:487)
	at org.apache.http.impl.client.AbstractHttpClient.doExecute(AbstractHttpClient.java:882)
	at org.apache.http.impl.client.CloseableHttpClient.execute(CloseableHttpClient.java:82)
	at org.apache.http.impl.client.CloseableHttpClient.execute(CloseableHttpClient.java:107)
	at org.apache.http.impl.client.CloseableHttpClient.execute(CloseableHttpClient.java:55)
	at org.apache.solr.client.solrj.impl.HttpSolrClient.executeMethod(HttpSolrClient.java:482)
	... 8 more




Build Log:
[...truncated 10996 lines...]
   [junit4] Suite: org.apache.solr.cloud.UnloadDistributedZkTest
   [junit4]   2> Creating dataDir: /home/jenkins/workspace/Lucene-Solr-6.x-Linux/solr/build/solr-core/test/J2/temp/solr.cloud.UnloadDistributedZkTest_1D87E600A5593DDF-001/init-core-data-001
   [junit4]   2> 246603 INFO  (SUITE-UnloadDistributedZkTest-seed#[1D87E600A5593DDF]-worker) [    ] o.a.s.BaseDistributedSearchTestCase Setting hostContext system property: /m_dbp/e
   [junit4]   2> 246604 INFO  (TEST-UnloadDistributedZkTest.test-seed#[1D87E600A5593DDF]) [    ] o.a.s.c.ZkTestServer STARTING ZK TEST SERVER
   [junit4]   2> 246604 INFO  (Thread-616) [    ] o.a.s.c.ZkTestServer client port:0.0.0.0/0.0.0.0:0
   [junit4]   2> 246604 INFO  (Thread-616) [    ] o.a.s.c.ZkTestServer Starting server
   [junit4]   2> 246705 INFO  (TEST-UnloadDistributedZkTest.test-seed#[1D87E600A5593DDF]) [    ] o.a.s.c.ZkTestServer start zk server on port:37394
   [junit4]   2> 246705 INFO  (TEST-UnloadDistributedZkTest.test-seed#[1D87E600A5593DDF]) [    ] o.a.s.c.c.SolrZkClient Using default ZkCredentialsProvider
   [junit4]   2> 246705 INFO  (TEST-UnloadDistributedZkTest.test-seed#[1D87E600A5593DDF]) [    ] o.a.s.c.c.ConnectionManager Waiting for client to connect to ZooKeeper
   [junit4]   2> 246707 INFO  (zkCallback-258-thread-1) [    ] o.a.s.c.c.ConnectionManager Watcher org.apache.solr.common.cloud.ConnectionManager@1bdad80 name:ZooKeeperConnection Watcher:127.0.0.1:37394 got event WatchedEvent state:SyncConnected type:None path:null path:null type:None
   [junit4]   2> 246707 INFO  (TEST-UnloadDistributedZkTest.test-seed#[1D87E600A5593DDF]) [    ] o.a.s.c.c.ConnectionManager Client is connected to ZooKeeper
   [junit4]   2> 246708 INFO  (TEST-UnloadDistributedZkTest.test-seed#[1D87E600A5593DDF]) [    ] o.a.s.c.c.SolrZkClient Using default ZkACLProvider
   [junit4]   2> 246708 INFO  (TEST-UnloadDistributedZkTest.test-seed#[1D87E600A5593DDF]) [    ] o.a.s.c.c.SolrZkClient makePath: /solr
   [junit4]   2> 246710 INFO  (TEST-UnloadDistributedZkTest.test-seed#[1D87E600A5593DDF]) [    ] o.a.s.c.c.SolrZkClient Using default ZkCredentialsProvider
   [junit4]   2> 246711 INFO  (TEST-UnloadDistributedZkTest.test-seed#[1D87E600A5593DDF]) [    ] o.a.s.c.c.ConnectionManager Waiting for client to connect to ZooKeeper
   [junit4]   2> 246712 INFO  (zkCallback-259-thread-1) [    ] o.a.s.c.c.ConnectionManager Watcher org.apache.solr.common.cloud.ConnectionManager@10d9684 name:ZooKeeperConnection Watcher:127.0.0.1:37394/solr got event WatchedEvent state:SyncConnected type:None path:null path:null type:None
   [junit4]   2> 246712 INFO  (TEST-UnloadDistributedZkTest.test-seed#[1D87E600A5593DDF]) [    ] o.a.s.c.c.ConnectionManager Client is connected to ZooKeeper
   [junit4]   2> 246712 INFO  (TEST-UnloadDistributedZkTest.test-seed#[1D87E600A5593DDF]) [    ] o.a.s.c.c.SolrZkClient Using default ZkACLProvider
   [junit4]   2> 246712 INFO  (TEST-UnloadDistributedZkTest.test-seed#[1D87E600A5593DDF]) [    ] o.a.s.c.c.SolrZkClient makePath: /collections/collection1
   [junit4]   2> 246714 INFO  (TEST-UnloadDistributedZkTest.test-seed#[1D87E600A5593DDF]) [    ] o.a.s.c.c.SolrZkClient makePath: /collections/collection1/shards
   [junit4]   2> 246716 INFO  (TEST-UnloadDistributedZkTest.test-seed#[1D87E600A5593DDF]) [    ] o.a.s.c.c.SolrZkClient makePath: /collections/control_collection
   [junit4]   2> 246717 INFO  (TEST-UnloadDistributedZkTest.test-seed#[1D87E600A5593DDF]) [    ] o.a.s.c.c.SolrZkClient makePath: /collections/control_collection/shards
   [junit4]   2> 246720 INFO  (TEST-UnloadDistributedZkTest.test-seed#[1D87E600A5593DDF]) [    ] o.a.s.c.AbstractZkTestCase put /home/jenkins/workspace/Lucene-Solr-6.x-Linux/solr/core/src/test-files/solr/collection1/conf/solrconfig-tlog.xml to /configs/conf1/solrconfig.xml
   [junit4]   2> 246720 INFO  (TEST-UnloadDistributedZkTest.test-seed#[1D87E600A5593DDF]) [    ] o.a.s.c.c.SolrZkClient makePath: /configs/conf1/solrconfig.xml
   [junit4]   2> 246722 INFO  (TEST-UnloadDistributedZkTest.test-seed#[1D87E600A5593DDF]) [    ] o.a.s.c.AbstractZkTestCase put /home/jenkins/workspace/Lucene-Solr-6.x-Linux/solr/core/src/test-files/solr/collection1/conf/schema.xml to /configs/conf1/schema.xml
   [junit4]   2> 246723 INFO  (TEST-UnloadDistributedZkTest.test-seed#[1D87E600A5593DDF]) [    ] o.a.s.c.c.SolrZkClient makePath: /configs/conf1/schema.xml
   [junit4]   2> 246724 INFO  (TEST-UnloadDistributedZkTest.test-seed#[1D87E600A5593DDF]) [    ] o.a.s.c.AbstractZkTestCase put /home/jenkins/workspace/Lucene-Solr-6.x-Linux/solr/core/src/test-files/solr/collection1/conf/solrconfig.snippet.randomindexconfig.xml to /configs/conf1/solrconfig.snippet.randomindexconfig.xml
   [junit4]   2> 246725 INFO  (TEST-UnloadDistributedZkTest.test-seed#[1D87E600A5593DDF]) [    ] o.a.s.c.c.SolrZkClient makePath: /configs/conf1/solrconfig.snippet.randomindexconfig.xml
   [junit4]   2> 246726 INFO  (TEST-UnloadDistributedZkTest.test-seed#[1D87E600A5593DDF]) [    ] o.a.s.c.AbstractZkTestCase put /home/jenkins/workspace/Lucene-Solr-6.x-Linux/solr/core/src/test-files/solr/collection1/conf/stopwords.txt to /configs/conf1/stopwords.txt
   [junit4]   2> 246726 INFO  (TEST-UnloadDistributedZkTest.test-seed#[1D87E600A5593DDF]) [    ] o.a.s.c.c.SolrZkClient makePath: /configs/conf1/stopwords.txt
   [junit4]   2> 246727 INFO  (TEST-UnloadDistributedZkTest.test-seed#[1D87E600A5593DDF]) [    ] o.a.s.c.AbstractZkTestCase put /home/jenkins/workspace/Lucene-Solr-6.x-Linux/solr/core/src/test-files/solr/collection1/conf/protwords.txt to /configs/conf1/protwords.txt
   [junit4]   2> 246728 INFO  (TEST-UnloadDistributedZkTest.test-seed#[1D87E600A5593DDF]) [    ] o.a.s.c.c.SolrZkClient makePath: /configs/conf1/protwords.txt
   [junit4]   2> 246729 INFO  (TEST-UnloadDistributedZkTest.test-seed#[1D87E600A5593DDF]) [    ] o.a.s.c.AbstractZkTestCase put /home/jenkins/workspace/Lucene-Solr-6.x-Linux/solr/core/src/test-files/solr/collection1/conf/currency.xml to /configs/conf1/currency.xml
   [junit4]   2> 246729 INFO  (TEST-UnloadDistributedZkTest.test-seed#[1D87E600A5593DDF]) [    ] o.a.s.c.c.SolrZkClient makePath: /configs/conf1/currency.xml
   [junit4]   2> 246731 INFO  (TEST-UnloadDistributedZkTest.test-seed#[1D87E600A5593DDF]) [    ] o.a.s.c.AbstractZkTestCase put /home/jenkins/workspace/Lucene-Solr-6.x-Linux/solr/core/src/test-files/solr/collection1/conf/enumsConfig.xml to /configs/conf1/enumsConfig.xml
   [junit4]   2> 246731 INFO  (TEST-UnloadDistributedZkTest.test-seed#[1D87E600A5593DDF]) [    ] o.a.s.c.c.SolrZkClient makePath: /configs/conf1/enumsConfig.xml
   [junit4]   2> 246733 INFO  (TEST-UnloadDistributedZkTest.test-seed#[1D87E600A5593DDF]) [    ] o.a.s.c.AbstractZkTestCase put /home/jenkins/workspace/Lucene-Solr-6.x-Linux/solr/core/src/test-files/solr/collection1/conf/open-exchange-rates.json to /configs/conf1/open-exchange-rates.json
   [junit4]   2> 246733 INFO  (TEST-UnloadDistributedZkTest.test-seed#[1D87E600A5593DDF]) [    ] o.a.s.c.c.SolrZkClient makePath: /configs/conf1/open-exchange-rates.json
   [junit4]   2> 246734 INFO  (TEST-UnloadDistributedZkTest.test-seed#[1D87E600A5593DDF]) [    ] o.a.s.c.AbstractZkTestCase put /home/jenkins/workspace/Lucene-Solr-6.x-Linux/solr/core/src/test-files/solr/collection1/conf/mapping-ISOLatin1Accent.txt to /configs/conf1/mapping-ISOLatin1Accent.txt
   [junit4]   2> 246734 INFO  (TEST-UnloadDistributedZkTest.test-seed#[1D87E600A5593DDF]) [    ] o.a.s.c.c.SolrZkClient makePath: /configs/conf1/mapping-ISOLatin1Accent.txt
   [junit4]   2> 246735 INFO  (TEST-UnloadDistributedZkTest.test-seed#[1D87E600A5593DDF]) [    ] o.a.s.c.AbstractZkTestCase put /home/jenkins/workspace/Lucene-Solr-6.x-Linux/solr/core/src/test-files/solr/collection1/conf/old_synonyms.txt to /configs/conf1/old_synonyms.txt
   [junit4]   2> 246736 INFO  (TEST-UnloadDistributedZkTest.test-seed#[1D87E600A5593DDF]) [    ] o.a.s.c.c.SolrZkClient makePath: /configs/conf1/old_synonyms.txt
   [junit4]   2> 246737 INFO  (TEST-UnloadDistributedZkTest.test-seed#[1D87E600A5593DDF]) [    ] o.a.s.c.AbstractZkTestCase put /home/jenkins/workspace/Lucene-Solr-6.x-Linux/solr/core/src/test-files/solr/collection1/conf/synonyms.txt to /configs/conf1/synonyms.txt
   [junit4]   2> 246737 INFO  (TEST-UnloadDistributedZkTest.test-seed#[1D87E600A5593DDF]) [    ] o.a.s.c.c.SolrZkClient makePath: /configs/conf1/synonyms.txt
   [junit4]   2> 246808 INFO  (TEST-UnloadDistributedZkTest.test-seed#[1D87E600A5593DDF]) [    ] o.a.s.SolrTestCaseJ4 Writing core.properties file to /home/jenkins/workspace/Lucene-Solr-6.x-Linux/solr/build/solr-core/test/J2/temp/solr.cloud.UnloadDistributedZkTest_1D87E600A5593DDF-001/control-001/cores/collection1
   [junit4]   2> 246810 INFO  (TEST-UnloadDistributedZkTest.test-seed#[1D87E600A5593DDF]) [    ] o.e.j.s.Server jetty-9.3.6.v20151106
   [junit4]   2> 246811 INFO  (TEST-UnloadDistributedZkTest.test-seed#[1D87E600A5593DDF]) [    ] o.e.j.s.h.ContextHandler Started o.e.j.s.ServletContextHandler@7a75f{/m_dbp/e,null,AVAILABLE}
   [junit4]   2> 246815 INFO  (TEST-UnloadDistributedZkTest.test-seed#[1D87E600A5593DDF]) [    ] o.e.j.s.ServerConnector Started ServerConnector@1c80070{HTTP/1.1,[http/1.1]}{127.0.0.1:40805}
   [junit4]   2> 246815 INFO  (TEST-UnloadDistributedZkTest.test-seed#[1D87E600A5593DDF]) [    ] o.e.j.s.Server Started @248533ms
   [junit4]   2> 246815 INFO  (TEST-UnloadDistributedZkTest.test-seed#[1D87E600A5593DDF]) [    ] o.a.s.c.s.e.JettySolrRunner Jetty properties: {solr.data.dir=/home/jenkins/workspace/Lucene-Solr-6.x-Linux/solr/build/solr-core/test/J2/temp/solr.cloud.UnloadDistributedZkTest_1D87E600A5593DDF-001/tempDir-001/control/data, hostContext=/m_dbp/e, hostPort=40805, coreRootDirectory=/home/jenkins/workspace/Lucene-Solr-6.x-Linux/solr/build/solr-core/test/J2/../../../../../../../../../home/jenkins/workspace/Lucene-Solr-6.x-Linux/solr/build/solr-core/test/J2/temp/solr.cloud.UnloadDistributedZkTest_1D87E600A5593DDF-001/control-001/cores}
   [junit4]   2> 246815 INFO  (TEST-UnloadDistributedZkTest.test-seed#[1D87E600A5593DDF]) [    ] o.a.s.s.SolrDispatchFilter SolrDispatchFilter.init(): sun.misc.Launcher$AppClassLoader@122cdd0
   [junit4]   2> 246815 INFO  (TEST-UnloadDistributedZkTest.test-seed#[1D87E600A5593DDF]) [    ] o.a.s.c.SolrResourceLoader new SolrResourceLoader for directory: '/home/jenkins/workspace/Lucene-Solr-6.x-Linux/solr/build/solr-core/test/J2/temp/solr.cloud.UnloadDistributedZkTest_1D87E600A5593DDF-001/control-001'
   [junit4]   2> 246815 INFO  (TEST-UnloadDistributedZkTest.test-seed#[1D87E600A5593DDF]) [    ] o.a.s.c.SolrResourceLoader JNDI not configured for solr (NoInitialContextEx)
   [junit4]   2> 246815 INFO  (TEST-UnloadDistributedZkTest.test-seed#[1D87E600A5593DDF]) [    ] o.a.s.c.SolrResourceLoader solr home defaulted to 'solr/' (could not find system property or JNDI)
   [junit4]   2> 246815 INFO  (TEST-UnloadDistributedZkTest.test-seed#[1D87E600A5593DDF]) [    ] o.a.s.c.c.SolrZkClient Using default ZkCredentialsProvider
   [junit4]   2> 246816 INFO  (TEST-UnloadDistributedZkTest.test-seed#[1D87E600A5593DDF]) [    ] o.a.s.c.c.ConnectionManager Waiting for client to connect to ZooKeeper
   [junit4]   2> 246817 INFO  (zkCallback-260-thread-1) [    ] o.a.s.c.c.ConnectionManager Watcher org.apache.solr.common.cloud.ConnectionManager@eb1ff0 name:ZooKeeperConnection Watcher:127.0.0.1:37394/solr got event WatchedEvent state:SyncConnected type:None path:null path:null type:None
   [junit4]   2> 246817 INFO  (TEST-UnloadDistributedZkTest.test-seed#[1D87E600A5593DDF]) [    ] o.a.s.c.c.ConnectionManager Client is connected to ZooKeeper
   [junit4]   2> 246817 INFO  (TEST-UnloadDistributedZkTest.test-seed#[1D87E600A5593DDF]) [    ] o.a.s.c.c.SolrZkClient Using default ZkACLProvider
   [junit4]   2> 246819 INFO  (TEST-UnloadDistributedZkTest.test-seed#[1D87E600A5593DDF]) [    ] o.a.s.s.SolrDispatchFilter Loading solr.xml from SolrHome (not found in ZooKeeper)
   [junit4]   2> 246819 INFO  (TEST-UnloadDistributedZkTest.test-seed#[1D87E600A5593DDF]) [    ] o.a.s.c.SolrXmlConfig Loading container configuration from /home/jenkins/workspace/Lucene-Solr-6.x-Linux/solr/build/solr-core/test/J2/temp/solr.cloud.UnloadDistributedZkTest_1D87E600A5593DDF-001/control-001/solr.xml
   [junit4]   2> 246823 INFO  (TEST-UnloadDistributedZkTest.test-seed#[1D87E600A5593DDF]) [    ] o.a.s.c.CorePropertiesLocator Config-defined core root directory: /home/jenkins/workspace/Lucene-Solr-6.x-Linux/solr/build/solr-core/test/J2/../../../../../../../../../home/jenkins/workspace/Lucene-Solr-6.x-Linux/solr/build/solr-core/test/J2/temp/solr.cloud.UnloadDistributedZkTest_1D87E600A5593DDF-001/control-001/cores
   [junit4]   2> 246823 INFO  (TEST-UnloadDistributedZkTest.test-seed#[1D87E600A5593DDF]) [    ] o.a.s.c.CoreContainer New CoreContainer 15512333
   [junit4]   2> 246823 INFO  (TEST-UnloadDistributedZkTest.test-seed#[1D87E600A5593DDF]) [    ] o.a.s.c.CoreContainer Loading cores into CoreContainer [instanceDir=/home/jenkins/workspace/Lucene-Solr-6.x-Linux/solr/build/solr-core/test/J2/temp/solr.cloud.UnloadDistributedZkTest_1D87E600A5593DDF-001/control-001]
   [junit4]   2> 246824 WARN  (TEST-UnloadDistributedZkTest.test-seed#[1D87E600A5593DDF]) [    ] o.a.s.c.CoreContainer Couldn't add files from /home/jenkins/workspace/Lucene-Solr-6.x-Linux/solr/build/solr-core/test/J2/temp/solr.cloud.UnloadDistributedZkTest_1D87E600A5593DDF-001/control-001/lib to classpath: /home/jenkins/workspace/Lucene-Solr-6.x-Linux/solr/build/solr-core/test/J2/temp/solr.cloud.UnloadDistributedZkTest_1D87E600A5593DDF-001/control-001/lib
   [junit4]   2> 246824 INFO  (TEST-UnloadDistributedZkTest.test-seed#[1D87E600A5593DDF]) [    ] o.a.s.h.c.HttpShardHandlerFactory created with socketTimeout : 90000,urlScheme : ,connTimeout : 15000,maxConnectionsPerHost : 20,maxConnections : 10000,corePoolSize : 0,maximumPoolSize : 2147483647,maxThreadIdleTime : 5,sizeOfQueue : -1,fairnessPolicy : false,useRetries : false,
   [junit4]   2> 246825 INFO  (TEST-UnloadDistributedZkTest.test-seed#[1D87E600A5593DDF]) [    ] o.a.s.u.UpdateShardHandler Creating UpdateShardHandler HTTP client with params: socketTimeout=340000&connTimeout=45000&retry=true
   [junit4]   2> 246825 INFO  (TEST-UnloadDistributedZkTest.test-seed#[1D87E600A5593DDF]) [    ] o.a.s.l.LogWatcher SLF4J impl is org.slf4j.impl.Log4jLoggerFactory
   [junit4]   2> 246825 INFO  (TEST-UnloadDistributedZkTest.test-seed#[1D87E600A5593DDF]) [    ] o.a.s.l.LogWatcher Registering Log Listener [Log4j (org.slf4j.impl.Log4jLoggerFactory)]
   [junit4]   2> 246825 INFO  (TEST-UnloadDistributedZkTest.test-seed#[1D87E600A5593DDF]) [    ] o.a.s.c.ZkContainer Zookeeper client=127.0.0.1:37394/solr
   [junit4]   2> 246825 INFO  (TEST-UnloadDistributedZkTest.test-seed#[1D87E600A5593DDF]) [    ] o.a.s.c.ZkController zkHost includes chroot
   [junit4]   2> 246825 INFO  (TEST-UnloadDistributedZkTest.test-seed#[1D87E600A5593DDF]) [    ] o.a.s.c.c.SolrZkClient Using default ZkCredentialsProvider
   [junit4]   2> 246826 INFO  (TEST-UnloadDistributedZkTest.test-seed#[1D87E600A5593DDF]) [    ] o.a.s.c.c.ConnectionManager Waiting for client to connect to ZooKeeper
   [junit4]   2> 246827 INFO  (zkCallback-263-thread-1) [    ] o.a.s.c.c.ConnectionManager Watcher org.apache.solr.common.cloud.ConnectionManager@40a94a name:ZooKeeperConnection Watcher:127.0.0.1:37394 got event WatchedEvent state:SyncConnected type:None path:null path:null type:None
   [junit4]   2> 246827 INFO  (TEST-UnloadDistributedZkTest.test-seed#[1D87E600A5593DDF]) [    ] o.a.s.c.c.ConnectionManager Client is connected to ZooKeeper
   [junit4]   2> 246828 INFO  (TEST-UnloadDistributedZkTest.test-seed#[1D87E600A5593DDF]) [    ] o.a.s.c.c.SolrZkClient Using default ZkACLProvider
   [junit4]   2> 246829 INFO  (TEST-UnloadDistributedZkTest.test-seed#[1D87E600A5593DDF]) [    ] o.a.s.c.c.ConnectionManager Waiting for client to connect to ZooKeeper
   [junit4]   2> 246830 INFO  (zkCallback-264-thread-1) [    ] o.a.s.c.c.ConnectionManager Watcher org.apache.solr.common.cloud.ConnectionManager@1b3f75f name:ZooKeeperConnection Watcher:127.0.0.1:37394/solr got event WatchedEvent state:SyncConnected type:None path:null path:null type:None
   [junit4]   2> 246830 INFO  (TEST-UnloadDistributedZkTest.test-seed#[1D87E600A5593DDF]) [    ] o.a.s.c.c.ConnectionManager Client is connected to ZooKeeper
   [junit4]   2> 246831 INFO  (TEST-UnloadDistributedZkTest.test-seed#[1D87E600A5593DDF]) [    ] o.a.s.c.c.SolrZkClient makePath: /overseer/queue
   [junit4]   2> 246833 INFO  (TEST-UnloadDistributedZkTest.test-seed#[1D87E600A5593DDF]) [    ] o.a.s.c.c.SolrZkClient makePath: /overseer/collection-queue-work
   [junit4]   2> 246835 INFO  (TEST-UnloadDistributedZkTest.test-seed#[1D87E600A5593DDF]) [    ] o.a.s.c.c.SolrZkClient makePath: /overseer/collection-map-running
   [junit4]   2> 246837 INFO  (TEST-UnloadDistributedZkTest.test-seed#[1D87E600A5593DDF]) [    ] o.a.s.c.c.SolrZkClient makePath: /overseer/collection-map-completed
   [junit4]   2> 246839 INFO  (TEST-UnloadDistributedZkTest.test-seed#[1D87E600A5593DDF]) [    ] o.a.s.c.c.SolrZkClient makePath: /overseer/collection-map-failure
   [junit4]   2> 246840 INFO  (TEST-UnloadDistributedZkTest.test-seed#[1D87E600A5593DDF]) [    ] o.a.s.c.c.SolrZkClient makePath: /live_nodes
   [junit4]   2> 246841 INFO  (TEST-UnloadDistributedZkTest.test-seed#[1D87E600A5593DDF]) [    ] o.a.s.c.c.SolrZkClient makePath: /aliases.json
   [junit4]   2> 246842 INFO  (TEST-UnloadDistributedZkTest.test-seed#[1D87E600A5593DDF]) [    ] o.a.s.c.c.SolrZkClient makePath: /clusterstate.json
   [junit4]   2> 246843 INFO  (TEST-UnloadDistributedZkTest.test-seed#[1D87E600A5593DDF]) [    ] o.a.s.c.c.SolrZkClient makePath: /security.json
   [junit4]   2> 246844 INFO  (TEST-UnloadDistributedZkTest.test-seed#[1D87E600A5593DDF]) [    ] o.a.s.c.c.ZkStateReader Updating cluster state from ZooKeeper... 
   [junit4]   2> 246845 INFO  (TEST-UnloadDistributedZkTest.test-seed#[1D87E600A5593DDF]) [    ] o.a.s.c.c.ZkStateReader Updated live nodes from ZooKeeper... (0) -> (0)
   [junit4]   2> 246846 INFO  (TEST-UnloadDistributedZkTest.test-seed#[1D87E600A5593DDF]) [    ] o.a.s.c.c.SolrZkClient makePath: /overseer_elect
   [junit4]   2> 246847 INFO  (TEST-UnloadDistributedZkTest.test-seed#[1D87E600A5593DDF]) [    ] o.a.s.c.c.SolrZkClient makePath: /overseer_elect/election
   [junit4]   2> 246848 INFO  (TEST-UnloadDistributedZkTest.test-seed#[1D87E600A5593DDF]) [    ] o.a.s.c.Overseer Overseer (id=null) closing
   [junit4]   2> 246848 INFO  (TEST-UnloadDistributedZkTest.test-seed#[1D87E600A5593DDF]) [    ] o.a.s.c.LeaderElector Joined leadership election with path: /overseer_elect/election/95563537236033540-127.0.0.1:40805_m_dbp%2Fe-n_0000000000
   [junit4]   2> 246848 INFO  (TEST-UnloadDistributedZkTest.test-seed#[1D87E600A5593DDF]) [    ] o.a.s.c.OverseerElectionContext I am going to be the leader 127.0.0.1:40805_m_dbp%2Fe
   [junit4]   2> 246848 INFO  (TEST-UnloadDistributedZkTest.test-seed#[1D87E600A5593DDF]) [    ] o.a.s.c.c.SolrZkClient makePath: /overseer_elect/leader
   [junit4]   2> 246849 INFO  (TEST-UnloadDistributedZkTest.test-seed#[1D87E600A5593DDF]) [    ] o.a.s.c.Overseer Overseer (id=95563537236033540-127.0.0.1:40805_m_dbp%2Fe-n_0000000000) starting
   [junit4]   2> 246851 INFO  (TEST-UnloadDistributedZkTest.test-seed#[1D87E600A5593DDF]) [    ] o.a.s.c.c.SolrZkClient makePath: /overseer/queue-work
   [junit4]   2> 246855 INFO  (TEST-UnloadDistributedZkTest.test-seed#[1D87E600A5593DDF]) [    ] o.a.s.c.OverseerAutoReplicaFailoverThread Starting OverseerAutoReplicaFailoverThread autoReplicaFailoverWorkLoopDelay=10000 autoReplicaFailoverWaitAfterExpiration=10000 autoReplicaFailoverBadNodeExpiration=60000
   [junit4]   2> 246855 INFO  (OverseerCollectionConfigSetProcessor-95563537236033540-127.0.0.1:40805_m_dbp%2Fe-n_0000000000) [    ] o.a.s.c.OverseerTaskProcessor Process current queue of overseer operations
   [junit4]   2> 246855 INFO  (OverseerStateUpdate-95563537236033540-127.0.0.1:40805_m_dbp%2Fe-n_0000000000) [    ] o.a.s.c.Overseer Starting to work on the main queue
   [junit4]   2> 246855 INFO  (TEST-UnloadDistributedZkTest.test-seed#[1D87E600A5593DDF]) [    ] o.a.s.c.ZkController Register node as live in ZooKeeper:/live_nodes/127.0.0.1:40805_m_dbp%2Fe
   [junit4]   2> 246856 INFO  (TEST-UnloadDistributedZkTest.test-seed#[1D87E600A5593DDF]) [    ] o.a.s.c.c.SolrZkClient makePath: /live_nodes/127.0.0.1:40805_m_dbp%2Fe
   [junit4]   2> 246858 INFO  (OverseerStateUpdate-95563537236033540-127.0.0.1:40805_m_dbp%2Fe-n_0000000000) [    ] o.a.s.c.c.ZkStateReader Updated live nodes from ZooKeeper... (0) -> (0)
   [junit4]   2> 246859 INFO  (zkCallback-264-thread-1) [    ] o.a.s.c.c.ZkStateReader A live node change: [WatchedEvent state:SyncConnected type:NodeChildrenChanged path:/live_nodes], has occurred - updating... (live nodes size: [0])
   [junit4]   2> 246859 INFO  (zkCallback-264-thread-1) [    ] o.a.s.c.c.ZkStateReader Updated live nodes from ZooKeeper... (0) -> (1)
   [junit4]   2> 246888 INFO  (TEST-UnloadDistributedZkTest.test-seed#[1D87E600A5593DDF]) [    ] o.a.s.c.CoreContainer Security conf doesn't exist. Skipping setup for authorization module.
   [junit4]   2> 246888 INFO  (TEST-UnloadDistributedZkTest.test-seed#[1D87E600A5593DDF]) [    ] o.a.s.c.CoreContainer No authentication plugin used.
   [junit4]   2> 246888 INFO  (TEST-UnloadDistributedZkTest.test-seed#[1D87E600A5593DDF]) [    ] o.a.s.c.CorePropertiesLocator Looking for core definitions underneath /home/jenkins/workspace/Lucene-Solr-6.x-Linux/solr/build/solr-core/test/J2/../../../../../../../../../home/jenkins/workspace/Lucene-Solr-6.x-Linux/solr/build/solr-core/test/J2/temp/solr.cloud.UnloadDistributedZkTest_1D87E600A5593DDF-001/control-001/cores
   [junit4]   2> 246889 INFO  (TEST-UnloadDistributedZkTest.test-seed#[1D87E600A5593DDF]) [    ] o.a.s.c.CoreDescriptor Created CoreDescriptor: {name=collection1, config=solrconfig.xml, transient=false, schema=schema.xml, loadOnStartup=true, configSetProperties=configsetprops.json, collection=control_collection, coreNodeName=, dataDir=data/, shard=}
   [junit4]   2> 246889 INFO  (TEST-UnloadDistributedZkTest.test-seed#[1D87E600A5593DDF]) [    ] o.a.s.c.CorePropertiesLocator Found core collection1 in /home/jenkins/workspace/Lucene-Solr-6.x-Linux/solr/build/solr-core/test/J2/../../../../../../../../../home/jenkins/workspace/Lucene-Solr-6.x-Linux/solr/build/solr-core/test/J2/temp/solr.cloud.UnloadDistributedZkTest_1D87E600A5593DDF-001/control-001/cores/collection1
   [junit4]   2> 246889 INFO  (TEST-UnloadDistributedZkTest.test-seed#[1D87E600A5593DDF]) [    ] o.a.s.c.CorePropertiesLocator Found 1 core definitions
   [junit4]   2> 246890 INFO  (TEST-UnloadDistributedZkTest.test-seed#[1D87E600A5593DDF]) [    ] o.a.s.s.SolrDispatchFilter user.dir=/home/jenkins/workspace/Lucene-Solr-6.x-Linux/solr/build/solr-core/test/J2
   [junit4]   2> 246890 INFO  (TEST-UnloadDistributedZkTest.test-seed#[1D87E600A5593DDF]) [    ] o.a.s.s.SolrDispatchFilter SolrDispatchFilter.init() done
   [junit4]   2> 246890 INFO  (coreLoadExecutor-711-thread-1) [    ] o.a.s.c.ZkController publishing state=down
   [junit4]   2> 246890 INFO  (coreLoadExecutor-711-thread-1) [    ] o.a.s.c.ZkController numShards not found on descriptor - reading it from system property
   [junit4]   2> 246892 INFO  (OverseerStateUpdate-95563537236033540-127.0.0.1:40805_m_dbp%2Fe-n_0000000000) [    ] o.a.s.c.Overseer processMessage: queueSize: 1, message = {
   [junit4]   2>   "core":"collection1",
   [junit4]   2>   "roles":null,
   [junit4]   2>   "base_url":"http://127.0.0.1:40805/m_dbp/e",
   [junit4]   2>   "node_name":"127.0.0.1:40805_m_dbp%2Fe",
   [junit4]   2>   "numShards":"1",
   [junit4]   2>   "state":"down",
   [junit4]   2>   "shard":null,
   [junit4]   2>   "collection":"control_collection",
   [junit4]   2>   "operation":"state"} current state version: 0
   [junit4]   2> 246892 INFO  (coreLoadExecutor-711-thread-1) [    ] o.a.s.c.ZkController look for our core node name
   [junit4]   2> 246892 INFO  (OverseerStateUpdate-95563537236033540-127.0.0.1:40805_m_dbp%2Fe-n_0000000000) [    ] o.a.s.c.o.ReplicaMutator Update state numShards=1 message={
   [junit4]   2>   "core":"collection1",
   [junit4]   2>   "roles":null,
   [junit4]   2>   "base_url":"http://127.0.0.1:40805/m_dbp/e",
   [junit4]   2>   "node_name":"127.0.0.1:40805_m_dbp%2Fe",
   [junit4]   2>   "numShards":"1",
   [junit4]   2>   "state":"down",
   [junit4]   2>   "shard":null,
   [junit4]   2>   "collection":"control_collection",
   [junit4]   2>   "operation":"state"}
   [junit4]   2> 246893 INFO  (OverseerStateUpdate-95563537236033540-127.0.0.1:40805_m_dbp%2Fe-n_0000000000) [    ] o.a.s.c.o.ClusterStateMutator building a new cName: control_collection
   [junit4]   2> 246893 INFO  (OverseerStateUpdate-95563537236033540-127.0.0.1:40805_m_dbp%2Fe-n_0000000000) [    ] o.a.s.c.o.ReplicaMutator Assigning new node to shard shard=shard1
   [junit4]   2> 246894 INFO  (zkCallback-264-thread-1) [    ] o.a.s.c.c.ZkStateReader A cluster state change: [WatchedEvent state:SyncConnected type:NodeDataChanged path:/clusterstate.json], has occurred - updating... (live nodes size: [1])
   [junit4]   2> 247892 INFO  (coreLoadExecutor-711-thread-1) [    ] o.a.s.c.ZkController waiting to find shard id in clusterstate for collection1
   [junit4]   2> 247892 INFO  (coreLoadExecutor-711-thread-1) [    ] o.a.s.c.ZkController Check for collection zkNode:control_collection
   [junit4]   2> 247893 INFO  (coreLoadExecutor-711-thread-1) [    ] o.a.s.c.ZkController Collection zkNode exists
   [junit4]   2> 247893 INFO  (coreLoadExecutor-711-thread-1) [    ] o.a.s.c.c.ZkStateReader Load collection config from: [/collections/control_collection]
   [junit4]   2> 247893 INFO  (coreLoadExecutor-711-thread-1) [    ] o.a.s.c.c.ZkStateReader path=[/collections/control_collection] [configName]=[conf1] specified config exists in ZooKeeper
   [junit4]   2> 247893 INFO  (coreLoadExecutor-711-thread-1) [    ] o.a.s.c.SolrResourceLoader new SolrResourceLoader for directory: '/home/jenkins/workspace/Lucene-Solr-6.x-Linux/solr/build/solr-core/test/J2/temp/solr.cloud.UnloadDistributedZkTest_1D87E600A5593DDF-001/control-001/cores/collection1'
   [junit4]   2> 247893 INFO  (coreLoadExecutor-711-thread-1) [    ] o.a.s.c.SolrResourceLoader JNDI not configured for solr (NoInitialContextEx)
   [junit4]   2> 247893 INFO  (coreLoadExecutor-711-thread-1) [    ] o.a.s.c.SolrResourceLoader solr home defaulted to 'solr/' (could not find system property or JNDI)
   [junit4]   2> 247895 INFO  (coreLoadExecutor-711-thread-1) [    ] o.a.s.c.Config loaded config solrconfig.xml with version 0 
   [junit4]   2> 247900 INFO  (coreLoadExecutor-711-thread-1) [    ] o.a.s.c.SolrConfig current version of requestparams : -1
   [junit4]   2> 247903 WARN  (coreLoadExecutor-711-thread-1) [    ] o.a.s.c.Config Beginning with Solr 5.5, <mergePolicy> is deprecated, use <mergePolicyFactory> instead.
   [junit4]   2> 247904 INFO  (coreLoadExecutor-711-thread-1) [    ] o.a.s.c.SolrConfig Using Lucene MatchVersion: 6.1.0
   [junit4]   2> 247920 INFO  (coreLoadExecutor-711-thread-1) [    ] o.a.s.c.SolrConfig Loaded SolrConfig: solrconfig.xml
   [junit4]   2> 247928 INFO  (coreLoadExecutor-711-thread-1) [    ] o.a.s.s.IndexSchema [collection1] Schema name=test
   [junit4]   2> 248017 INFO  (coreLoadExecutor-711-thread-1) [    ] o.a.s.s.OpenExchangeRatesOrgProvider Initialized with rates=open-exchange-rates.json, refreshInterval=1440.
   [junit4]   2> 248024 INFO  (coreLoadExecutor-711-thread-1) [    ] o.a.s.s.IndexSchema default search field in schema is text
   [junit4]   2> 248025 INFO  (coreLoadExecutor-711-thread-1) [    ] o.a.s.s.IndexSchema unique key field: id
   [junit4]   2> 248034 INFO  (coreLoadExecutor-711-thread-1) [    ] o.a.s.s.FileExchangeRateProvider Reloading exchange rates from file currency.xml
   [junit4]   2> 248036 INFO  (coreLoadExecutor-711-thread-1) [    ] o.a.s.s.FileExchangeRateProvider Reloading exchange rates from file currency.xml
   [junit4]   2> 248038 INFO  (coreLoadExecutor-711-thread-1) [    ] o.a.s.s.OpenExchangeRatesOrgProvider Reloading exchange rates from open-exchange-rates.json
   [junit4]   2> 248039 INFO  (coreLoadExecutor-711-thread-1) [    ] o.a.s.s.OpenExchangeRatesOrgProvider Reloading exchange rates from open-exchange-rates.json
   [junit4]   2> 248040 INFO  (coreLoadExecutor-711-thread-1) [    ] o.a.s.c.ConfigSetProperties Did not find ConfigSet properties, assuming default properties: Can't find resource 'configsetprops.json' in classpath or '/configs/conf1', cwd=/home/jenkins/workspace/Lucene-Solr-6.x-Linux/solr/build/solr-core/test/J2
   [junit4]   2> 248040 INFO  (coreLoadExecutor-711-thread-1) [    ] o.a.s.c.CoreContainer Creating SolrCore 'collection1' using configuration from collection control_collection
   [junit4]   2> 248040 INFO  (coreLoadExecutor-711-thread-1) [    ] o.a.s.c.SolrCore org.apache.solr.core.MockDirectoryFactory
   [junit4]   2> 248041 INFO  (coreLoadExecutor-711-thread-1) [    ] o.a.s.c.SolrCore [[collection1] ] Opening new SolrCore at [/home/jenkins/workspace/Lucene-Solr-6.x-Linux/solr/build/solr-core/test/J2/temp/solr.cloud.UnloadDistributedZkTest_1D87E600A5593DDF-001/control-001/cores/collection1], dataDir=[/home/jenkins/workspace/Lucene-Solr-6.x-Linux/solr/build/solr-core/test/J2/../../../../../../../../../home/jenkins/workspace/Lucene-Solr-6.x-Linux/solr/build/solr-core/test/J2/temp/solr.cloud.UnloadDistributedZkTest_1D87E600A5593DDF-001/control-001/cores/collection1/data/]
   [junit4]   2> 248041 INFO  (coreLoadExecutor-711-thread-1) [    ] o.a.s.c.JmxMonitoredMap JMX monitoring is enabled. Adding Solr mbeans to JMX Server: com.sun.jmx.mbeanserver.JmxMBeanServer@11d6cb9
   [junit4]   2> 248041 INFO  (coreLoadExecutor-711-thread-1) [    ] o.a.s.c.CachingDirectoryFactory return new directory for /home/jenkins/workspace/Lucene-Solr-6.x-Linux/solr/build/solr-core/test/J2/../../../../../../../../../home/jenkins/workspace/Lucene-Solr-6.x-Linux/solr/build/solr-core/test/J2/temp/solr.cloud.UnloadDistributedZkTest_1D87E600A5593DDF-001/control-001/cores/collection1/data
   [junit4]   2> 248041 INFO  (coreLoadExecutor-711-thread-1) [    ] o.a.s.c.SolrCore New index directory detected: old=null new=/home/jenkins/workspace/Lucene-Solr-6.x-Linux/solr/build/solr-core/test/J2/../../../../../../../../../home/jenkins/workspace/Lucene-Solr-6.x-Linux/solr/build/solr-core/test/J2/temp/solr.cloud.UnloadDistributedZkTest_1D87E600A5593DDF-001/control-001/cores/collection1/data/index/
   [junit4]   2> 248041 WARN  (coreLoadExecutor-711-thread-1) [    ] o.a.s.c.SolrCore [collection1] Solr index directory '/home/jenkins/workspace/Lucene-Solr-6.x-Linux/solr/build/solr-core/test/J2/../../../../../../../../../home/jenkins/workspace/Lucene-Solr-6.x-Linux/solr/build/solr-core/test/J2/temp/solr.cloud.UnloadDistributedZkTest_1D87E600A5593DDF-001/control-001/cores/collection1/data/index' doesn't exist. Creating new index...
   [junit4]   2> 248042 INFO  (coreLoadExecutor-711-thread-1) [    ] o.a.s.c.CachingDirectoryFactory return new directory for /home/jenkins/workspace/Lucene-Solr-6.x-Linux/solr/build/solr-core/test/J2/../../../../../../../../../home/jenkins/workspace/Lucene-Solr-6.x-Linux/solr/build/solr-core/test/J2/temp/solr.cloud.UnloadDistributedZkTest_1D87E600A5593DDF-001/control-001/cores/collection1/data/index
   [junit4]   2> 248042 INFO  (coreLoadExecutor-711-thread-1) [    ] o.a.s.u.RandomMergePolicy RandomMergePolicy wrapping class org.apache.lucene.index.TieredMergePolicy: [TieredMergePolicy: maxMergeAtOnce=48, maxMergeAtOnceExplicit=17, maxMergedSegmentMB=16.9892578125, floorSegmentMB=0.51953125, forceMergeDeletesPctAllowed=22.30549426414006, segmentsPerTier=10.0, maxCFSSegmentSizeMB=8.796093022207999E12, noCFSRatio=0.7613767531758969
   [junit4]   2> 248042 INFO  (coreLoadExecutor-711-thread-1) [    ] o.a.s.c.SolrDeletionPolicy SolrDeletionPolicy.onCommit: commits: num=1
   [junit4]   2> 	commit{dir=MockDirectoryWrapper(RAMDirectory@12799d1 lockFactory=org.apache.lucene.store.SingleInstanceLockFactory@19e90e1),segFN=segments_1,generation=1}
   [junit4]   2> 248042 INFO  (coreLoadExecutor-711-thread-1) [    ] o.a.s.c.SolrDeletionPolicy newest commit generation = 1
   [junit4]   2> 248042 INFO  (OldIndexDirectoryCleanupThreadForCore-collection1) [    ] o.a.s.c.SolrCore Looking for old index directories to cleanup for core collection1 in /home/jenkins/workspace/Lucene-Solr-6.x-Linux/solr/build/solr-core/test/J2/../../../../../../../../../home/jenkins/workspace/Lucene-Solr-6.x-Linux/solr/build/solr-core/test/J2/temp/solr.cloud.UnloadDistributedZkTest_1D87E600A5593DDF-001/control-001/cores/collection1/data/
   [junit4]   2> 248043 WARN  (OldIndexDirectoryCleanupThreadForCore-collection1) [    ] o.a.s.c.DirectoryFactory /home/jenkins/workspace/Lucene-Solr-6.x-Linux/solr/build/solr-core/test/J2/../../../../../../../../../home/jenkins/workspace/Lucene-Solr-6.x-Linux/solr/build/solr-core/test/J2/temp/solr.cloud.UnloadDistributedZkTest_1D87E600A5593DDF-001/control-001/cores/collection1/data/ does not point to a valid data directory; skipping clean-up of old index directories.
   [junit4]   2> 248045 INFO  (coreLoadExecutor-711-thread-1) [    ] o.a.s.u.p.UpdateRequestProcessorChain creating updateRequestProcessorChain "nodistrib"
   [junit4]   2> 248045 INFO  (coreLoadExecutor-711-thread-1) [    ] o.a.s.u.p.UpdateRequestProcessorChain creating updateRequestProcessorChain "dedupe"
   [junit4]   2> 248045 INFO  (coreLoadExecutor-711-thread-1) [    ] o.a.s.u.p.UpdateRequestProcessorChain inserting DistributedUpdateProcessorFactory into updateRequestProcessorChain "dedupe"
   [junit4]   2> 248045 INFO  (coreLoadExecutor-711-thread-1) [    ] o.a.s.u.p.UpdateRequestProcessorChain creating updateRequestProcessorChain "stored_sig"
   [junit4]   2> 248045 INFO  (coreLoadExecutor-711-thread-1) [    ] o.a.s.u.p.UpdateRequestProcessorChain inserting DistributedUpdateProcessorFactory into updateRequestProcessorChain "stored_sig"
   [junit4]   2> 248045 INFO  (coreLoadExecutor-711-thread-1) [    ] o.a.s.u.p.UpdateRequestProcessorChain creating updateRequestProcessorChain "distrib-dup-test-chain-explicit"
   [junit4]   2> 248045 INFO  (coreLoadExecutor-711-thread-1) [    ] o.a.s.u.p.UpdateRequestProcessorChain creating updateRequestProcessorChain "distrib-dup-test-chain-implicit"
   [junit4]   2> 248046 INFO  (coreLoadExecutor-711-thread-1) [    ] o.a.s.u.p.UpdateRequestProcessorChain inserting DistributedUpdateProcessorFactory into updateRequestProcessorChain "distrib-dup-test-chain-implicit"
   [junit4]   2> 248046 INFO  (coreLoadExecutor-711-thread-1) [    ] o.a.s.c.SolrCore no updateRequestProcessorChain defined as default, creating implicit default
   [junit4]   2> 248046 WARN  (coreLoadExecutor-711-thread-1) [    ] o.a.s.c.RequestHandlers INVALID paramSet a in requestHandler {type = requestHandler,name = /dump,class = DumpRequestHandler,args = {defaults={a=A,b=B}}}
   [junit4]   2> 248047 INFO  (coreLoadExecutor-711-thread-1) [    ] o.a.s.h.l.XMLLoader xsltCacheLifetimeSeconds=60
   [junit4]   2> 248048 INFO  (coreLoadExecutor-711-thread-1) [    ] o.a.s.h.l.XMLLoader xsltCacheLifetimeSeconds=60
   [junit4]   2> 248049 INFO  (coreLoadExecutor-711-thread-1) [    ] o.a.s.h.l.XMLLoader xsltCacheLifetimeSeconds=60
   [junit4]   2> 248050 INFO  (coreLoadExecutor-711-thread-1) [    ] o.a.s.h.l.XMLLoader xsltCacheLifetimeSeconds=60
   [junit4]   2> 248053 INFO  (coreLoadExecutor-711-thread-1) [    ] o.a.s.c.RequestHandlers Registered paths: /admin/mbeans,standard,/dump,/update/csv,/sql,/update/json/docs,/admin/luke,/export,/admin/segments,/get,/admin/system,/replication,/admin/properties,/config,/stream,/schema,/admin/plugins,/admin/logging,/update/json,/admin/ping,/admin/threads,/update,/admin/file
   [junit4]   2> 248053 INFO  (coreLoadExecutor-711-thread-1) [    ] o.a.s.c.SolrCore Using default statsCache cache: org.apache.solr.search.stats.LocalStatsCache
   [junit4]   2> 248053 INFO  (coreLoadExecutor-711-thread-1) [    ] o.a.s.u.UpdateHandler Using UpdateLog implementation: org.apache.solr.update.UpdateLog
   [junit4]   2> 248053 INFO  (coreLoadExecutor-711-thread-1) [    ] o.a.s.u.UpdateLog Initializing UpdateLog: dataDir= defaultSyncLevel=FLUSH numRecordsToKeep=100 maxNumLogsToKeep=10 numVersionBuckets=65536
   [junit4]   2> 248055 INFO  (coreLoadExecutor-711-thread-1) [    ] o.a.s.u.CommitTracker Hard AutoCommit: disabled
   [junit4]   2> 248055 INFO  (coreLoadExecutor-711-thread-1) [    ] o.a.s.u.CommitTracker Soft AutoCommit: disabled
   [junit4]   2> 248055 INFO  (coreLoadExecutor-711-thread-1) [    ] o.a.s.u.RandomMergePolicy RandomMergePolicy wrapping class org.apache.lucene.index.LogDocMergePolicy: [LogDocMergePolicy: minMergeSize=1000, mergeFactor=24, maxMergeSize=9223372036854775807, maxMergeSizeForForcedMerge=9223372036854775807, calibrateSizeByDeletes=false, maxMergeDocs=2147483647, maxCFSSegmentSizeMB=8.796093022207999E12, noCFSRatio=0.6973842390159682]
   [junit4]   2> 248055 INFO  (coreLoadExecutor-711-thread-1) [    ] o.a.s.c.SolrDeletionPolicy SolrDeletionPolicy.onInit: commits: num=1
   [junit4]   2> 	commit{dir=MockDirectoryWrapper(RAMDirectory@12799d1 lockFactory=org.apache.lucene.store.SingleInstanceLockFactory@19e90e1),segFN=segments_1,generation=1}
   [junit4]   2> 248055 INFO  (coreLoadExecutor-711-thread-1) [    ] o.a.s.c.SolrDeletionPolicy newest commit generation = 1
   [junit4]   2> 248055 INFO  (coreLoadExecutor-711-thread-1) [    ] o.a.s.s.SolrIndexSearcher Opening [Searcher@8cb2[collection1] main]
   [junit4]   2> 248055 INFO  (coreLoadExecutor-711-thread-1) [    ] o.a.s.c.c.ZkStateReader Load collection config from: [/collections/control_collection]
   [junit4]   2> 248056 INFO  (coreLoadExecutor-711-thread-1) [    ] o.a.s.c.c.ZkStateReader path=[/collections/control_collection] [configName]=[conf1] specified config exists in ZooKeeper
   [junit4]   2> 248056 INFO  (coreLoadExecutor-711-thread-1) [    ] o.a.s.r.ManagedResourceStorage Setting up ZooKeeper-based storage for the RestManager with znodeBase: /configs/conf1
   [junit4]   2> 248056 INFO  (coreLoadExecutor-711-thread-1) [    ] o.a.s.r.ManagedResourceStorage Configured ZooKeeperStorageIO with znodeBase: /configs/conf1
   [junit4]   2> 248056 INFO  (coreLoadExecutor-711-thread-1) [    ] o.a.s.r.RestManager Initializing RestManager with initArgs: {}
   [junit4]   2> 248056 INFO  (coreLoadExecutor-711-thread-1) [    ] o.a.s.r.ManagedResourceStorage Reading _rest_managed.json using ZooKeeperStorageIO:path=/configs/conf1
   [junit4]   2> 248057 INFO  (coreLoadExecutor-711-thread-1) [    ] o.a.s.r.ManagedResourceStorage No data found for znode /configs/conf1/_rest_managed.json
   [junit4]   2> 248057 INFO  (coreLoadExecutor-711-thread-1) [    ] o.a.s.r.ManagedResourceStorage Loaded null at path _rest_managed.json using ZooKeeperStorageIO:path=/configs/conf1
   [junit4]   2> 248057 INFO  (coreLoadExecutor-711-thread-1) [    ] o.a.s.r.RestManager Initializing 0 registered ManagedResources
   [junit4]   2> 248057 INFO  (coreLoadExecutor-711-thread-1) [    ] o.a.s.h.ReplicationHandler Commits will be reserved for  10000
   [junit4]   2> 248058 INFO  (searcherExecutor-712-thread-1) [    ] o.a.s.c.SolrCore [collection1] Registered new searcher Searcher@8cb2[collection1] main{ExitableDirectoryReader(UninvertingDirectoryReader())}
   [junit4]   2> 248058 INFO  (coreLoadExecutor-711-thread-1) [    ] o.a.s.u.UpdateLog Looking up max value of version field to seed version buckets
   [junit4]   2> 248058 INFO  (coreLoadExecutor-711-thread-1) [    ] o.a.s.u.VersionInfo Refreshing highest value of _version_ for 65536 version buckets from index
   [junit4]   2> 248058 INFO  (coreLoadExecutor-711-thread-1) [    ] o.a.s.u.VersionInfo No terms found for _version_, cannot seed version bucket highest value from index
   [junit4]   2> 248058 INFO  (coreLoadExecutor-711-thread-1) [    ] o.a.s.u.UpdateLog Could not find max version in index or recent updates, using new clock 1529016597300117504
   [junit4]   2> 248060 INFO  (coreLoadExecutor-711-thread-1) [    ] o.a.s.u.UpdateLog Took 1.0ms to seed version buckets with highest version 1529016597300117504
   [junit4]   2> 248060 INFO  (coreLoadExecutor-711-thread-1) [    ] o.a.s.c.ZkController watch zkdir /configs/conf1
   [junit4]   2> 248060 INFO  (coreLoadExecutor-711-thread-1) [    ] o.a.s.c.CoreContainer registering core: collection1
   [junit4]   2> 248060 INFO  (coreZkRegister-705-thread-1) [    ] o.a.s.c.ZkController Register replica - core:collection1 address:http://127.0.0.1:40805/m_dbp/e collection:control_collection shard:shard1
   [junit4]   2> 248061 INFO  (coreZkRegister-705-thread-1) [    ] o.a.s.c.c.SolrZkClient makePath: /collections/control_collection/leader_elect/shard1/election
   [junit4]   2> 248063 INFO  (coreZkRegister-705-thread-1) [    ] o.a.s.c.LeaderElector Joined leadership election with path: /collections/control_collection/leader_elect/shard1/election/95563537236033540-core_node1-n_0000000000
   [junit4]   2> 248064 INFO  (coreZkRegister-705-thread-1) [    ] o.a.s.c.ShardLeaderElectionContext Running the leader process for shard=shard1 and weAreReplacement=false and leaderVoteWait=180000
   [junit4]   2> 248065 INFO  (coreZkRegister-705-thread-1) [    ] o.a.s.c.ShardLeaderElectionContext Enough replicas found to continue.
   [junit4]   2> 248065 INFO  (coreZkRegister-705-thread-1) [    ] o.a.s.c.ShardLeaderElectionContext I may be the new leader - try and sync
   [junit4]   2> 248065 INFO  (coreZkRegister-705-thread-1) [    ] o.a.s.c.SyncStrategy Sync replicas to http://127.0.0.1:40805/m_dbp/e/collection1/
   [junit4]   2> 248065 INFO  (coreZkRegister-705-thread-1) [    ] o.a.s.c.SyncStrategy Sync Success - now sync replicas to me
   [junit4]   2> 248065 INFO  (coreZkRegister-705-thread-1) [    ] o.a.s.c.SyncStrategy http://127.0.0.1:40805/m_dbp/e/collection1/ has no replicas
   [junit4]   2> 248065 INFO  (OverseerStateUpdate-95563537236033540-127.0.0.1:40805_m_dbp%2Fe-n_0000000000) [    ] o.a.s.c.Overseer processMessage: queueSize: 1, message = {
   [junit4]   2>   "operation":"leader",
   [junit4]   2>   "shard":"shard1",
   [junit4]   2>   "collection":"control_collection"} current state version: 1
   [junit4]   2> 248065 INFO  (coreZkRegister-705-thread-1) [    ] o.a.s.c.c.SolrZkClient makePath: /collections/control_collection/leaders/shard1
   [junit4]   2> 248067 INFO  (coreZkRegister-705-thread-1) [    ] o.a.s.c.ShardLeaderElectionContextBase Creating leader registration node /collections/control_collection/leaders/shard1/leader after winning as /collections/control_collection/leader_elect/shard1/election/95563537236033540-core_node1-n_0000000000
   [junit4]   2> 248068 INFO  (coreZkRegister-705-thread-1) [    ] o.a.s.c.ShardLeaderElectionContext I am the new leader: http://127.0.0.1:40805/m_dbp/e/collection1/ shard1
   [junit4]   2> 248069 INFO  (OverseerStateUpdate-95563537236033540-127.0.0.1:40805_m_dbp%2Fe-n_0000000000) [    ] o.a.s.c.Overseer processMessage: queueSize: 1, message = {
   [junit4]   2>   "operation":"leader",
   [junit4]   2>   "shard":"shard1",
   [junit4]   2>   "collection":"control_collection",
   [junit4]   2>   "base_url":"http://127.0.0.1:40805/m_dbp/e",
   [junit4]   2>   "core":"collection1",
   [junit4]   2>   "state":"active"} current state version: 1
   [junit4]   2> 248171 INFO  (zkCallback-264-thread-1) [    ] o.a.s.c.c.ZkStateReader A cluster state change: [WatchedEvent state:SyncConnected type:NodeDataChanged path:/clusterstate.json], has occurred - updating... (live nodes size: [1])
   [junit4]   2> 248219 INFO  (coreZkRegister-705-thread-1) [    ] o.a.s.c.ZkController We are http://127.0.0.1:40805/m_dbp/e/collection1/ and leader is http://127.0.0.1:40805/m_dbp/e/collection1/
   [junit4]   2> 248219 INFO  (coreZkRegister-705-thread-1) [    ] o.a.s.c.ZkController No LogReplay needed for core=collection1 baseURL=http://127.0.0.1:40805/m_dbp/e
   [junit4]   2> 248219 INFO  (coreZkRegister-705-thread-1) [    ] o.a.s.c.ZkController I am the leader, no recovery necessary
   [junit4]   2> 248219 INFO  (coreZkRegister-705-thread-1) [    ] o.a.s.c.ZkController publishing state=active
   [junit4]   2> 248219 INFO  (coreZkRegister-705-thread-1) [    ] o.a.s.c.ZkController numShards not found on descriptor - reading it from system property
   [junit4]   2> 248220 INFO  (OverseerStateUpdate-95563537236033540-127.0.0.1:40805_m_dbp%2Fe-n_0000000000) [    ] o.a.s.c.Overseer processMessage: queueSize: 1, message = {
   [junit4]   2>   "core":"collection1",
   [junit4]   2>   "core_node_name":"core_node1",
   [junit4]   2>   "roles":null,
   [junit4]   2>   "base_url":"http://127.0.0.1:40805/m_dbp/e",
   [junit4]   2>   "node_name":"127.0.0.1:40805_m_dbp%2Fe",
   [junit4]   2>   "numShards":"1",
   [junit4]   2>   "state":"active",
   [junit4]   2>   "shard":"shard1",
   [junit4]   2>   "collection":"control_collection",
   [junit4]   2>   "operation":"state"} current state version: 2
   [junit4]   2> 248221 INFO  (OverseerStateUpdate-95563537236033540-127.0.0.1:40805_m_dbp%2Fe-n_0000000000) [    ] o.a.s.c.o.ReplicaMutator Update state numShards=1 message={
   [junit4]   2>   "core":"collection1",
   [junit4]   2>   "core_node_name":"core_node1",
   [junit4]   2>   "roles":null,
   [junit4]   2>   "base_url":"http://127.0.0.1:40805/m_dbp/e",
   [junit4]   2>   "node_name":"127.0.0.1:40805_m_dbp%2Fe",
   [junit4]   2>   "numShards":"1",
   [junit4]   2>   "state":"active",
   [junit4]   2>   "shard":"shard1",
   [junit4]   2>   "collection":"control_collection",
   [junit4]   2>   "operation":"state"}
   [junit4]   2> 248323 INFO  (zkCallback-264-thread-1) [    ] o.a.s.c.c.ZkStateReader A cluster state change: [WatchedEvent state:SyncConnected type:NodeDataChanged path:/clusterstate.json], has occurred - updating... (live nodes size: [1])
   [junit4]   2> 248392 INFO  (TEST-UnloadDistributedZkTest.test-seed#[1D87E600A5593DDF]) [    ] o.a.s.c.c.SolrZkClient Using default ZkCredentialsProvider
   [junit4]   2> 248392 INFO  (TEST-UnloadDistributedZkTest.test-seed#[1D87E600A5593DDF]) [    ] o.a.s.c.c.ConnectionManager Waiting for client to connect to ZooKeeper
   [junit4]   2> 248393 INFO  (zkCallback-266-thread-1) [    ] o.a.s.c.c.ConnectionManager Watcher org.apache.solr.common.cloud.ConnectionManager@b53e7d name:ZooKeeperConnection Watcher:127.0.0.1:37394/solr got event WatchedEvent state:SyncConnected type:None path:null path:null type:None
   [junit4]   2> 248393 INFO  (TEST-UnloadDistributedZkTest.test-seed#[1D87E600A5593DDF]) [    ] o.a.s.c.c.ConnectionManager Client is connected to ZooKeeper
   [junit4]   2> 248394 INFO  (TEST-UnloadDistributedZkTest.test-seed#[1D87E600A5593DDF]) [    ] o.a.s.c.c.SolrZkClient Using default ZkACLProvider
   [junit4]   2> 248394 INFO  (TEST-UnloadDistributedZkTest.test-seed#[1D87E600A5593DDF]) [    ] o.a.s.c.c.ZkStateReader Updating cluster state from ZooKeeper... 
   [junit4]   2> 248395 INFO  (TEST-UnloadDistributedZkTest.test-seed#[1D87E600A5593DDF]) [    ] o.a.s.c.c.ZkStateReader Updated live nodes from ZooKeeper... (0) -> (1)
   [junit4]   2> 248395 INFO  (TEST-UnloadDistributedZkTest.test-seed#[1D87E600A5593DDF]) [    ] o.a.s.c.ChaosMonkey monkey: init - expire sessions:false cause connection loss:false
   [junit4]   2> 248395 INFO  (TEST-UnloadDistributedZkTest.test-seed#[1D87E600A5593DDF]) [    ] o.a.s.c.AbstractFullDistribZkTestBase Creating collection1 with stateFormat=2
   [junit4]   2> 248395 INFO  (TEST-UnloadDistributedZkTest.test-seed#[1D87E600A5593DDF]) [    ] o.a.s.c.c.SolrZkClient Using default ZkCredentialsProvider
   [junit4]   2> 248396 INFO  (TEST-UnloadDistributedZkTest.test-seed#[1D87E600A5593DDF]) [    ] o.a.s.c.c.ConnectionManager Waiting for client to connect to ZooKeeper
   [junit4]   2> 248397 INFO  (zkCallback-267-thread-1) [    ] o.a.s.c.c.ConnectionManager Watcher org.apache.solr.common.cloud.ConnectionManager@14d1a5a name:ZooKeeperConnection Watcher:127.0.0.1:37394/solr got event WatchedEvent state:SyncConnected type:None path:null path:null type:None
   [junit4]   2> 248397 INFO  (TEST-UnloadDistributedZkTest.test-seed#[1D87E600A5593DDF]) [    ] o.a.s.c.c.ConnectionManager Client is connected to ZooKeeper
   [junit4]   2> 248397 INFO  (TEST-UnloadDistributedZkTest.test-seed#[1D87E600A5593DDF]) [    ] o.a.s.c.c.SolrZkClient Using default ZkACLProvider
   [junit4]   2> 248400 INFO  (OverseerStateUpdate-95563537236033540-127.0.0.1:40805_m_dbp%2Fe-n_0000000000) [    ] o.a.s.c.Overseer processMessage: queueSize: 1, message = {
   [junit4]   2>   "operation":"create",
   [junit4]   2>   "name":"collection1",
   [junit4]   2>   "numShards":"2",
   [junit4]   2>   "stateFormat":"2"} current state version: 3
   [junit4]   2> 248400 INFO  (OverseerStateUpdate-95563537236033540-127.0.0.1:40805_m_dbp%2Fe-n_0000000000) [    ] o.a.s.c.o.ClusterStateMutator building a new cName: collection1
   [junit4]   2> 248468 INFO  (TEST-UnloadDistributedZkTest.test-seed#[1D87E600A5593DDF]) [    ] o.a.s.SolrTestCaseJ4 Writing core.properties file to /home/jenkins/workspace/Lucene-Solr-6.x-Linux/solr/build/solr-core/test/J2/temp/solr.cloud.UnloadDistributedZkTest_1D87E600A5593DDF-001/shard-1-001/cores/collection1
   [junit4]   2> 248469 INFO  (TEST-UnloadDistributedZkTest.test-seed#[1D87E600A5593DDF]) [    ] o.a.s.c.AbstractFullDistribZkTestBase create jetty 1 in directory /home/jenkins/workspace/Lucene-Solr-6.x-Linux/solr/build/solr-core/test/J2/temp/solr.cloud.UnloadDistributedZkTest_1D87E600A5593DDF-001/shard-1-001
   [junit4]   2> 248469 INFO  (TEST-UnloadDistributedZkTest.test-seed#[1D87E600A5593DDF]) [    ] o.e.j.s.Server jetty-9.3.6.v20151106
   [junit4]   2> 248471 INFO  (TEST-UnloadDistributedZkTest.test-seed#[1D87E600A5593DDF]) [    ] o.e.j.s.h.ContextHandler Started o.e.j.s.ServletContextHandler@1861034{/m_dbp/e,null,AVAILABLE}
   [junit4]   2> 248471 INFO  (TEST-UnloadDistributedZkTest.test-seed#[1D87E600A5593DDF]) [    ] o.e.j.s.ServerConnector Started ServerConnector@18ba059{HTTP/1.1,[http/1.1]}{127.0.0.1:43513}
   [junit4]   2> 248471 INFO  (TEST-UnloadDistributedZkTest.test-seed#[1D87E600A5593DDF]) [    ] o.e.j.s.Server Started @250189ms
   [junit4]   2> 248471 INFO  (TEST-UnloadDistributedZkTest.test-seed#[1D87E600A5593DDF]) [    ] o.a.s.c.s.e.JettySolrRunner Jetty properties: {solr.data.dir=/home/jenkins/workspace/Lucene-Solr-6.x-Linux/solr/build/solr-core/test/J2/temp/solr.cloud.UnloadDistributedZkTest_1D87E600A5593DDF-001/tempDir-001/jetty1, solrconfig=solrconfig.xml, hostContext=/m_dbp/e, hostPort=43513, coreRootDirectory=/home/jenkins/workspace/Lucene-Solr-6.x-Linux/solr/build/solr-core/test/J2/temp/solr.cloud.UnloadDistributedZkTest_1D87E600A5593DDF-001/shard-1-001/cores}
   [junit4]   2> 248472 INFO  (TEST-UnloadDistributedZkTest.test-seed#[1D87E600A5593DDF]) [    ] o.a.s.s.SolrDispatchFilter SolrDispatchFilter.init(): sun.misc.Launcher$AppClassLoader@122cdd0
   [junit4]   2> 248472 INFO  (TEST-UnloadDistributedZkTest.test-seed#[1D87E600A5593DDF]) [    ] o.a.s.c.SolrResourceLoader new SolrResourceLoader for directory: '/home/jenkins/workspace/Lucene-Solr-6.x-Linux/solr/build/solr-core/test/J2/temp/solr.cloud.UnloadDistributedZkTest_1D87E600A5593DDF-001/shard-1-001'
   [junit4]   2> 248472 INFO  (TEST-UnloadDistributedZkTest.test-seed#[1D87E600A5593DDF]) [    ] o.a.s.c.SolrResourceLoader JNDI not configured for solr (NoInitialContextEx)
   [junit4]   2> 248472 INFO  (TEST-UnloadDistributedZkTest.test-seed#[1D87E600A5593DDF]) [    ] o.a.s.c.SolrResourceLoader solr home defaulted to 'solr/' (could not find system property or JNDI)
   [junit4]   2> 248472 INFO  (TEST-UnloadDistributedZkTest.test-seed#[1D87E600A5593DDF]) [    ] o.a.s.c.c.SolrZkClient Using default ZkCredentialsProvider
   [junit4]   2> 248472 INFO  (TEST-UnloadDistributedZkTest.test-seed#[1D87E600A5593DDF]) [    ] o.a.s.c.c.ConnectionManager Waiting for client to connect to ZooKeeper
   [junit4]   2> 248473 INFO  (zkCallback-268-thread-1) [    ] o.a.s.c.c.ConnectionManager Watcher org.apache.solr.common.cloud.ConnectionManager@1c4e579 name:ZooKeeperConnection Watcher:127.0.0.1:37394/solr got event WatchedEvent state:SyncConnected type:None path:null path:null type:None
   [junit4]   2> 248474 INFO  (TEST-UnloadDistributedZkTest.test-seed#[1D87E600A5593DDF]) [    ] o.a.s.c.c.ConnectionManager Client is connected to ZooKeeper
   [junit4]   2> 248474 INFO  (TEST-UnloadDistributedZkTest.test-seed#[1D87E600A5593DDF]) [    ] o.a.s.c.c.SolrZkClient Using default ZkACLProvider
   [junit4]   2> 248475 INFO  (TEST-UnloadDistributedZkTest.test-seed#[1D87E600A5593DDF]) [    ] o.a.s.s.SolrDispatchFilter Loading solr.xml from SolrHome (not found in ZooKeeper)
   [junit4]   2> 248475 INFO  (TEST-UnloadDistributedZkTest.test-seed#[1D87E600A5593DDF]) [    ] o.a.s.c.SolrXmlConfig Loading container configuration from /home/jenkins/workspace/Lucene-Solr-6.x-Linux/solr/build/solr-core/test/J2/temp/solr.cloud.UnloadDistributedZkTest_1D87E600A5593DDF-001/shard-1-001/solr.xml
   [junit4]   2> 248479 INFO  (TEST-UnloadDistributedZkTest.test-seed#[1D87E600A5593DDF]) [    ] o.a.s.c.CorePropertiesLocator Config-defined core root directory: /home/jenkins/workspace/Lucene-Solr-6.x-Linux/solr/build/solr-core/test/J2/temp/solr.cloud.UnloadDistributedZkTest_1D87E600A5593DDF-001/shard-1-001/cores
   [junit4]   2> 248479 INFO  (TEST-UnloadDistributedZkTest.test-seed#[1D87E600A5593DDF]) [    ] o.a.s.c.CoreContainer New CoreContainer 1193844
   [junit4]   2> 248479 INFO  (TEST-UnloadDistributedZkTest.test-seed#[1D87E600A5593DDF]) [    ] o.a.s.c.CoreContainer Loading cores into CoreContainer [instanceDir=/home/jenkins/workspace/Lucene-Solr-6.x-Linux/solr/build/solr-core/test/J2/temp/solr.cloud.UnloadDistributedZkTest_1D87E600A5593DDF-001/shard-1-001]
   [junit4]   2> 248480 WARN  (TEST-UnloadDistributedZkTest.test-seed#[1D87E600A5593DDF]) [    ] o.a.s.c.CoreContainer Couldn't add files from /home/jenkins/workspace/Lucene-Solr-6.x-Linux/solr/build/solr-core/test/J2/temp/solr.cloud.UnloadDistributedZkTest_1D87E600A5593DDF-001/shard-1-001/lib to classpath: /home/jenkins/workspace/Lucene-Solr-6.x-Linux/solr/build/solr-core/test/J2/temp/solr.cloud.UnloadDistributedZkTest_1D87E600A5593DDF-001/shard-1-001/lib
   [junit4]   2> 248480 INFO  (TEST-UnloadDistributedZkTest.test-seed#[1D87E600A5593DDF]) [    ] o.a.s.h.c.HttpShardHandlerFactory created with socketTimeout : 90000,urlScheme : ,connTimeout : 15000,maxConnectionsPerHost : 20,maxConnections : 10000,corePoolSize : 0,maximumPoolSize : 2147483647,maxThreadIdleTime : 5,sizeOfQueue : -1,fairnessPolicy : false,useRetries : false,
   [junit4]   2> 248481 INFO  (TEST-UnloadDistributedZkTest.test-seed#[1D87E600A5593DDF]) [    ] o.a.s.u.UpdateShardHandler Creating UpdateShardHandler HTTP client with params: socketTimeout=340000&connTimeout=45000&retry=true
   [junit4]   2> 248481 INFO  (TEST-UnloadDistributedZkTest.test-seed#[1D87E600A5593DDF]) [    ] o.a.s.l.LogWatcher SLF4J impl is org.slf4j.impl.Log4jLoggerFactory
   [junit4]   2> 248481 INFO  (TEST-UnloadDistributedZkTest.test-seed#[1D87E600A5593DDF]) [    ] o.a.s.l.LogWatcher Registering Log Listener [Log4j (org.slf4j.impl.Log4jLoggerFactory)]
   [junit4]   2> 248481 INFO  (TEST-UnloadDistributedZkTest.test-seed#[1D87E600A5593DDF]) [    ] o.a.s.c.ZkContainer Zookeeper client=127.0.0.1:37394/solr
   [junit4]   2> 248481 INFO  (TEST-UnloadDistributedZkTest.test-seed#[1D87E600A5593DDF]) [    ] o.a.s.c.ZkController zkHost includes chroot
   [junit4]   2> 248481 INFO  (TEST-UnloadDistributedZkTest.test-seed#[1D87E600A5593DDF]) [    ] o.a.s.c.c.SolrZkClient Using default ZkCredentialsProvider
   [junit4]   2> 248481 INFO  (TEST-UnloadDistributedZkTest.test-seed#[1D87E600A5593DDF]) [    ] o.a.s.c.c.ConnectionManager Waiting for client to connect to ZooKeeper
   [junit4]   2> 248483 INFO  (zkCallback-271-thread-1) [    ] o.a.s.c.c.ConnectionManager Watcher org.apache.solr.common.cloud.ConnectionManager@17e75b4 name:ZooKeeperConnection Watcher:127.0.0.1:37394 got event WatchedEvent state:SyncConnected type:None path:null path:null type:None
   [junit4]   2> 248483 INFO  (TEST-UnloadDistributedZkTest.test-seed#[1D87E600A5593DDF]) [    ] o.a.s.c.c.ConnectionManager Client is connected to ZooKeeper
   [junit4]   2> 248484 INFO  (TEST-UnloadDistributedZkTest.test-seed#[1D87E600A5593DDF]) [    ] o.a.s.c.c.SolrZkClient Using default ZkACLProvider
   [junit4]   2> 248485 INFO  (TEST-UnloadDistributedZkTest.test-seed#[1D87E600A5593DDF]) [    ] o.a.s.c.c.ConnectionManager Waiting for client to connect to ZooKeeper
   [junit4]   2> 248486 INFO  (zkCallback-272-thread-1) [    ] o.a.s.c.c.ConnectionManager Watcher org.apache.solr.common.cloud.ConnectionManager@9667d7 name:ZooKeeperConnection Watcher:127.0.0.1:37394/solr got event WatchedEvent state:SyncConnected type:None path:null path:null type:None
   [junit4]   2> 248486 INFO  (TEST-UnloadDistributedZkTest.test-seed#[1D87E600A5593DDF]) [    ] o.a.s.c.c.ConnectionManager Client is connected to ZooKeeper
   [junit4]   2> 248490 INFO  (TEST-UnloadDistributedZkTest.test-seed#[1D87E600A5593DDF]) [    ] o.a.s.c.c.ZkStateReader Updating cluster state from ZooKeeper... 
   [junit4]   2> 248491 INFO  (TEST-UnloadDistributedZkTest.test-seed#[1D87E600A5593DDF]) [    ] o.a.s.c.c.ZkStateReader Updated live nodes from ZooKeeper... (0) -> (1)
   [junit4]   2> 248492 INFO  (TEST-UnloadDistributedZkTest.test-seed#[1D87E600A5593DDF]) [    ] o.a.s.c.Overseer Overseer (id=null) closing
   [junit4]   2> 248493 INFO  (TEST-UnloadDistributedZkTest.test-seed#[1D87E600A5593DDF]) [    ] o.a.s.c.LeaderElector Joined leadership election with path: /overseer_elect/election/95563537236033545-127.0.0.1:43513_m_dbp%2Fe-n_0000000001
   [junit4]   2> 248493 INFO  (TEST-UnloadDistributedZkTest.test-seed#[1D87E600A5593DDF]) [    ] o.a.s.c.LeaderElector Watching path /overseer_elect/election/95563537236033540-127.0.0.1:40805_m_dbp%2Fe-n_0000000000 to know if I could be the leader
   [junit4]   2> 248493 INFO  (TEST-UnloadDistributedZkTest.test-seed#[1D87E600A5593DDF]) [    ] o.a.s.c.ZkController Publish node=127.0.0.1:43513_m_dbp%2Fe as DOWN
   [junit4]   2> 248495 INFO  (OverseerStateUpdate-95563537236033540-127.0.0.1:40805_m_dbp%2Fe-n_0000000000) [    ] o.a.s.c.Overseer processMessage: queueSize: 1, message = {
   [junit4]   2>   "operation":"downnode",
   [junit4]   2>   "node_name":"127.0.0.1:43513_m_dbp%2Fe"} current state version: 3
   [junit4]   2> 248495 INFO  (OverseerStateUpdate-95563537236033540-127.0.0.1:40805_m_dbp%2Fe-n_0000000000) [    ] o.a.s.c.o.NodeMutator DownNode state invoked for node: 127.0.0.1:43513_m_dbp%2Fe
   [junit4]   2> 248496 INFO  (OverseerStateUpdate-95563537236033540-127.0.0.1:40805_m_dbp%2Fe-n_0000000000) [    ] o.a.s.c.o.ZkStateWriter going to create_collection /collections/collection1/state.json
   [junit4]   2> 248599 INFO  (zkCallback-264-thread-1) [    ] o.a.s.c.c.ZkStateReader A cluster state change: [WatchedEvent state:SyncConnected type:NodeDataChanged path:/clusterstate.json], has occurred - updating... (live nodes size: [1])
   [junit4]   2> 248599 INFO  (zkCallback-272-thread-1) [    ] o.a.s.c.c.ZkStateReader A cluster state change: [WatchedEvent state:SyncConnected type:NodeDataChanged path:/clusterstate.json], has occurred - updating... (live nodes size: [1])
   [junit4]   2> 248599 INFO  (zkCallback-266-thread-1) [    ] o.a.s.c.c.ZkStateReader A cluster state change: [WatchedEvent state:SyncConnected type:NodeDataChanged path:/clusterstate.json], has occurred - updating... (live nodes size: [1])
   [junit4]   2> 249495 INFO  (TEST-UnloadDistributedZkTest.test-seed#[1D87E600A5593DDF]) [    ] o.a.s.c.ZkController Register node as live in ZooKeeper:/live_nodes/127.0.0.1:43513_m_dbp%2Fe
   [junit4]   2> 249496 INFO  (TEST-UnloadDistributedZkTest.test-seed#[1D87E600A5593DDF]) [    ] o.a.s.c.c.SolrZkClient makePath: /live_nodes/127.0.0.1:43513_m_dbp%2Fe
   [junit4]   2> 249497 INFO  (zkCallback-264-thread-1) [    ] o.a.s.c.c.ZkStateReader A live node change: [WatchedEvent state:SyncConnected type:NodeChildrenChanged path:/live_nodes], has occurred - updating... (live nodes size: [1])
   [junit4]   2> 249497 INFO  (zkCallback-266-thread-1) [    ] o.a.s.c.c.ZkStateReader A live node change: [WatchedEvent state:SyncConnected type:NodeChildrenChanged path:/live_nodes], has occurred - updating... (live nodes size: [1])
   [junit4]   2> 249497 INFO  (zkCallback-272-thread-1) [    ] o.a.s.c.c.ZkStateReader A live node change: [WatchedEvent state:SyncConnected type:NodeChildrenChanged path:/live_nodes], has occurred - updating... (live nodes size: [1])
   [junit4]   2> 249497 INFO  (zkCallback-264-thread-1) [    ] o.a.s.c.c.ZkStateReader Updated live nodes from ZooKeeper... (1) -> (2)
   [junit4]   2> 249497 INFO  (zkCallback-266-thread-1) [    ] o.a.s.c.c.ZkStateReader Updated live nodes from ZooKeeper... (1) -> (2)
   [junit4]   2> 249497 INFO  (zkCallback-272-thread-1) [    ] o.a.s.c.c.ZkStateReader Updated live nodes from ZooKeeper... (1) -> (2)
   [junit4]   2> 249536 INFO  (TEST-UnloadDistributedZkTest.test-seed#[1D87E600A5593DDF]) [    ] o.a.s.c.CoreContainer Security conf doesn't exist. Skipping setup for authorization module.
   [junit4]   2> 249536 INFO  (TEST-UnloadDistributedZkTest.test-seed#[1D87E600A5593DDF]) [    ] o.a.s.c.CoreContainer No authentication plugin used.
   [junit4]   2> 249536 INFO  (TEST-UnloadDistributedZkTest.test-seed#[1D87E600A5593DDF]) [    ] o.a.s.c.CorePropertiesLocator Looking for core definitions underneath /home/jenkins/workspace/Lucene-Solr-6.x-Linux/solr/build/solr-core/test/J2/temp/solr.cloud.UnloadDistributedZkTest_1D87E600A5593DDF-001/shard-1-001/cores
   [junit4]   2> 249537 INFO  (TEST-UnloadDistributedZkTest.test-seed#[1D87E600A5593DDF]) [    ] o.a.s.c.CoreDescriptor Created CoreDescriptor: {name=collection1, config=solrconfig.xml, transient=false, schema=schema.xml, loadOnStartup=true, configSetProperties=configsetprops.json, collection=collection1, coreNodeName=, dataDir=data/, shard=}
   [junit4]   2> 249537 INFO  (TEST-UnloadDistributedZkTest.test-seed#[1D87E600A5593DDF]) [    ] o.a.s.c.CorePropertiesLocator Found core collection1 in /home/jenkins/workspace/Lucene-Solr-6.x-Linux/solr/build/solr-core/test/J2/temp/solr.cloud.UnloadDistributedZkTest_1D87E600A5593DDF-001/shard-1-001/cores/collection1
   [junit4]   2> 249537 INFO  (TEST-UnloadDistributedZkTest.test-seed#[1D87E600A5593DDF]) [    ] o.a.s.c.CorePropertiesLocator Found 1 core definitions
   [junit4]   2> 249548 INFO  (TEST-UnloadDistributedZkTest.test-seed#[1D87E600A5593DDF]) [    ] o.a.s.s.SolrDispatchFilter user.dir=/home/jenkins/workspace/Lucene-Solr-6.x-Linux/solr/build/solr-core/test/J2
   [junit4]   2> 249548 INFO  (TEST-UnloadDistributedZkTest.test-seed#[1D87E600A5593DDF]) [    ] o.a.s.s.SolrDispatchFilter SolrDispatchFilter.init() done
   [junit4]   2> 249548 INFO  (coreLoadExecutor-722-thread-1) [    ] o.a.s.c.ZkController publishing state=down
   [junit4]   2> 249548 INFO  (coreLoadExecutor-722-thread-1) [    ] o.a.s.c.ZkController numShards not found on descriptor - reading it from system property
   [junit4]   2> 249549 INFO  (coreLoadExecutor-722-thread-1) [    ] o.a.s.c.ZkController Registering watch for collection collection1
   [junit4]   2> 249549 INFO  (coreLoadExecutor-722-thread-1) [    ] o.a.s.c.c.ZkStateReader addZkWatch [collection1]
   [junit4]   2> 249549 INFO  (OverseerStateUpdate-95563537236033540-127.0.0.1:40805_m_dbp%2Fe-n_0000000000) [    ] o.a.s.c.Overseer processMessage: queueSize: 1, message = {
   [junit4]   2>   "core":"collection1",
   [junit4]   2>   "roles":null,
   [junit4]   2>   "base_url":"http://127.0.0.1:43513/m_dbp/e",
   [junit4]   2>   "node_name":"127.0.0.1:43513_m_dbp%2Fe",
   [junit4]   2>   "numShards":"2",
   [junit4]   2>   "state":"down",
   [junit4]   2>   "shard":null,
   [junit4]   2>   "collection":"collection1",
   [junit4]   2>   "operation":"state"} current state version: 4
   [junit4]   2> 249549 INFO  (coreLoadExecutor-722-thread-1) [    ] o.a.s.c.c.ZkStateReader Add data for [collection1] ver [0]
   [junit4]   2> 249550 INFO  (coreLoadExecutor-722-thread-1) [    ] o.a.s.c.ZkController look for our core node name
   [junit4]   2> 249550 INFO  (OverseerStateUpdate-95563537236033540-127.0.0.1:40805_m_dbp%2Fe-n_0000000000) [    ] o.a.s.c.o.ReplicaMutator Update state numShards=2 message={
   [junit4]   2>   "core":"collection1",
   [junit4]   2>   "roles":null,
   [junit4]   2>   "base_url":"http://127.0.0.1:43513/m_dbp/e",
   [junit4]   2>   "node_name":"127.0.0.1:43513_m_dbp%2Fe",
   [junit4]   2>   "numShards":"2",
   [junit4]   2>   "state":"down",
   [junit4]   2>   "shard":null,
   [junit4]   2>   "collection":"collection1",
   [junit4]   2>   "operation":"state"}
   [junit4]   2> 249550 INFO  (OverseerStateUpdate-95563537236033540-127.0.0.1:40805_m_dbp%2Fe-n_0000000000) [    ] o.a.s.c.o.ReplicaMutator Collection already exists with numShards=2
   [junit4]   2> 249550 INFO  (OverseerStateUpdate-95563537236033540-127.0.0.1:40805_m_dbp%2Fe-n_0000000000) [    ] o.a.s.c.o.ReplicaMutator Assigning new node to shard shard=shard2
   [junit4]   2> 249652 INFO  (OverseerStateUpdate-95563537236033540-127.0.0.1:40805_m_dbp%2Fe-n_0000000000) [    ] o.a.s.c.o.ZkStateWriter going to update_collection /collections/collection1/state.json version: 0
   [junit4]   2> 249652 INFO  (zkCallback-272-thread-1) [    ] o.a.s.c.c.ZkStateReader A cluster state change: [WatchedEvent state:SyncConnected type:NodeDataChanged path:/collections/collection1/state.json] for collection [collection1] has occurred - updating... (live nodes size: [2])
   [junit4]   2> 249653 INFO  (zkCallback-272-thread-1) [    ] o.a.s.c.c.ZkStateReader Updating data for [collection1] from [0] to [1]
   [junit4]   2> 250550 INFO  (coreLoadExecutor-722-thread-1) [    ] o.a.s.c.ZkController waiting to find shard id in clusterstate for collection1
   [junit4]   2> 250550 INFO  (coreLoadExecutor-722-thread-1) [    ] o.a.s.c.ZkController Check for collection zkNode:collection1
   [junit4]   2> 250550 INFO  (coreLoadExecutor-722-thread-1) [    ] o.a.s.c.ZkController Collection zkNode exists
   [junit4]   2> 250550 INFO  (coreLoadExecutor-722-thread-1) [    ] o.a.s.c.c.ZkStateReader Load collection config from: [/collections/collection1]
   [junit4]   2> 250551 INFO  (coreLoadExecutor-722-thread-1) [    ] o.a.s.c.c.ZkStateReader path=[/collections/collection1] [configName]=[conf1] specified config exists in ZooKeeper
   [junit4]   2> 250551 INFO  (coreLoadExecutor-722-thread-1) [    ] o.a.s.c.SolrResourceLoader new SolrResourceLoader for directory: '/home/jenkins/workspace/Lucene-Solr-6.x-Linux/solr/build/solr-core/test/J2/temp/solr.cloud.UnloadDistributedZkTest_1D87E600A5593DDF-001/shard-1-001/cores/collection1'
   [junit4]   2> 250551 INFO  (coreLoadExecutor-722-thread-1) [    ] o.a.s.c.SolrResourceLoader JNDI not configured for solr (NoInitialContextEx)
   [junit4]   2> 250551 INFO  (coreLoadExecutor-722-thread-1) [    ] o.a.s.c.SolrResourceLoader solr home defaulted to 'solr/' (could not find system property or JNDI)
   [junit4]   2> 250552 INFO  (coreLoadExecutor-722-thread-1) [    ] o.a.s.c.Config loaded config solrconfig.xml with version 0 
   [junit4]   2> 250557 INFO  (coreLoadExecutor-722-thread-1) [    ] o.a.s.c.SolrConfig current version of requestparams : -1
   [junit4]   2> 250560 WARN  (coreLoadExecutor-722-thread-1) [    ] o.a.s.c.Config Beginning with Solr 5.5, <mergePolicy> is deprecated, use <mergePolicyFactory> instead.
   [junit4]   2> 250561 INFO  (coreLoadExecutor-722-thread-1) [    ] o.a.s.c.SolrConfig Using Lucene MatchVersion: 6.1.0
   [junit4]   2> 250568 INFO  (coreLoadExecutor-722-thread-1) [    ] o.a.s.c.SolrConfig Loaded SolrConfig: solrconfig.xml
   [junit4]   2> 250575 INFO  (coreLoadExecutor-722-thread-1) [    ] o.a.s.s.IndexSchema [collection1] Schema name=test
   [junit4]   2> 250663 INFO  (coreLoadExecutor-722-thread-1) [    ] o.a.s.s.OpenExchangeRatesOrgProvider Initialized with rates=open-exchange-rates.json, refreshInterval=1440.
   [junit4]   2> 250668 INFO  (coreLoadExecutor-722-thread-1) [    ] o.a.s.s.IndexSchema default search field in schema is text
   [junit4]   2> 250669 INFO  (coreLoadExecutor-722-thread-1) [    ] o.a.s.s.IndexSchema unique key field: id
   [junit4]   2> 250676 INFO  (coreLoadExecutor-722-thread-1) [    ] o.a.s.s.FileExchangeRateProvider Reloading exchange rates from file currency.xml
   [junit4]   2> 250678 INFO  (coreLoadExecutor-722-thread-1) [    ] o.a.s.s.FileExchangeRateProvider Reloading exchange rates from file currency.xml
   [junit4]   2> 250680 INFO  (coreLoadExecutor-722-thread-1) [    ] o.a.s.s.OpenExchangeRatesOrgProvider Reloading exchange rates from open-exchange-rates.json
   [junit4]   2> 250687 INFO  (coreLoadExecutor-722-thread-1) [    ] o.a.s.s.OpenExchangeRatesOrgProvider Reloading exchange rates from open-exchange-rates.json
   [junit4]   2> 250688 INFO  (coreLoadExecutor-722-thread-1) [    ] o.a.s.c.ConfigSetProperties Did not find ConfigSet properties, assuming default properties: Can't find resource 'configsetprops.json' in classpath or '/configs/conf1', cwd=/home/jenkins/workspace/Lucene-Solr-6.x-Linux/solr/build/solr-core/test/J2
   [junit4]   2> 250688 INFO  (coreLoadExecutor-722-thread-1) [    ] o.a.s.c.CoreContainer Creating SolrCore 'collection1' using configuration from collection collection1
   [junit4]   2> 250689 INFO  (coreLoadExecutor-722-thread-1) [    ] o.a.s.c.SolrCore org.apache.solr.core.MockDirectoryFactory
   [junit4]   2> 250689 INFO  (coreLoadExecutor-722-thread-1) [    ] o.a.s.c.SolrCore [[collection1] ] Opening new SolrCore at [/home/jenkins/workspace/Lucene-Solr-6.x-Linux/solr/build/solr-core/test/J2/temp/solr.cloud.UnloadDistributedZkTest_1D87E600A5593DDF-001/shard-1-001/cores/collection1], dataDir=[/home/jenkins/workspace/Lucene-Solr-6.x-Linux/solr/build/solr-core/test/J2/temp/solr.cloud.UnloadDistributedZkTest_1D87E600A5593DDF-001/shard-1-001/cores/collection1/data/]
   [junit4]   2> 250689 INFO  (coreLoadExecutor-722-thread-1) [    ] o.a.s.c.JmxMonitoredMap JMX monitoring is enabled. Adding Solr mbeans to JMX Server: com.sun.jmx.mbeanserver.JmxMBeanServer@11d6cb9
   [junit4]   2> 250689 INFO  (coreLoadExecutor-722-thread-1) [    ] o.a.s.c.CachingDirectoryFactory return new directory for /home/jenkins/workspace/Lucene-Solr-6.x-Linux/solr/build/solr-core/test/J2/temp/solr.cloud.UnloadDistributedZkTest_1D87E600A5593DDF-001/shard-1-001/cores/collection1/data
   [junit4]   2> 250689 INFO  (coreLoadExecutor-722-thread-1) [    ] o.a.s.c.SolrCore New index directory detected: old=null new=/home/jenkins/workspace/Lucene-Solr-6.x-Linux/solr/build/solr-core/test/J2/temp/solr.cloud.UnloadDistributedZkTest_1D87E600A5593DDF-001/shard-1-001/cores/collection1/data/index/
   [junit4]   2> 250689 WARN  (coreLoadExecutor-722-thread-1) [    ] o.a.s.c.SolrCore [collection1] Solr index directory '/home/jenkins/workspace/Lucene-Solr-6.x-Linux/solr/build/solr-core/test/J2/temp/solr.cloud.UnloadDistributedZkTest_1D87E600A5593DDF-001/shard-1-001/cores/collection1/data/index' doesn't exist. Creating new index...
   [junit4]   2> 250690 INFO  (coreLoadExecutor-722-thread-1) [    ] o.a.s.c.CachingDirectoryFactory return new directory for /home/jenkins/workspace/Lucene-Solr-6.x-Linux/solr/build/solr-core/test/J2/temp/solr.cloud.UnloadDistributedZkTest_1D87E600A5593DDF-001/shard-1-001/cores/collection1/data/index
   [junit4]   2> 250690 INFO  (coreLoadExecutor-722-thread-1) [    ] o.a.s.u.RandomMergePolicy RandomMergePolicy wrapping class org.apache.lucene.index.TieredMergePolicy: [TieredMergePolicy: maxMergeAtOnce=48, maxMergeAtOnceExplicit=17, maxMergedSegmentMB=16.9892578125, floorSegmentMB=0.51953125, forceMergeDeletesPctAllowed=22.30549426414006, segmentsPerTier=10.0, maxCFSSegmentSizeMB=8.796093022207999E12, noCFSRatio=0.7613767531758969
   [junit4]   2> 250690 INFO  (coreLoadExecutor-722-thread-1) [    ] o.a.s.c.SolrDeletionPolicy SolrDeletionPolicy.onCommit: commits: num=1
   [junit4]   2> 	commit{dir=MockDirectoryWrapper(RAMDirectory@977ea6 lockFactory=org.apache.lucene.store.SingleInstanceLockFactory@1a102dd),segFN=segments_1,generation=1}
   [junit4]   2> 250690 INFO  (coreLoadExecutor-722-thread-1) [    ] o.a.s.c.SolrDeletionPolicy newest commit generation = 1
   [junit4]   2> 250691 INFO  (OldIndexDirectoryCleanupThreadForCore-collection1) [    ] o.a.s.c.SolrCore Looking for old index directories to cleanup for core collection1 in /home/jenkins/workspace/Lucene-Solr-6.x-Linux/solr/build/solr-core/test/J2/temp/solr.cloud.UnloadDistributedZkTest_1D87E600A5593DDF-001/shard-1-001/cores/collection1/data/
   [junit4]   2> 250691 WARN  (OldIndexDirectoryCleanupThreadForCore-collection1) [    ] o.a.s.c.DirectoryFactory /home/jenkins/workspace/Lucene-Solr-6.x-Linux/solr/build/solr-core/test/J2/temp/solr.cloud.UnloadDistributedZkTest_1D87E600A5593DDF-001/shard-1-001/cores/collection1/data/ does not point to a valid data directory; skipping clean-up of old index directories.
   [junit4]   2> 250693 INFO  (coreLoadExecutor-722-thread-1) [    ] o.a.s.u.p.UpdateRequestProcessorChain creating updateRequestProcessorChain "nodistrib"
   [junit4]   2> 250693 INFO  (coreLoadExecutor-722-thread-1) [    ] o.a.s.u.p.UpdateRequestProcessorChain creating updateRequestProcessorChain "dedupe"
   [junit4]   2> 250693 INFO  (coreLoadExecutor-722-thread-1) [    ] o.a.s.u.p.UpdateRequestProcessorChain inserting DistributedUpdateProcessorFactory into updateRequestProcessorChain "dedupe"
   [junit4]   2> 250693 INFO  (coreLoadExecutor-722-thread-1) [    ] o.a.s.u.p.UpdateRequestProcessorChain creating updateRequestProcessorChain "stored_sig"
   [junit4]   2> 250693 INFO  (coreLoadExecutor-722-thread-1) [    ] o.a.s.u.p.UpdateRequestProcessorChain inserting DistributedUpdateProcessorFactory into updateRequestProcessorChain "stored_sig"
   [junit4]   2> 250694 INFO  (coreLoadExecutor-722-thread-1) [    ] o.a.s.u.p.UpdateRequestProcessorChain creating updateRequestProcessorChain "distrib-dup-test-chain-explicit"
   [junit4]   2> 250694 INFO  (coreLoadExecutor-722-thread-1) [    ] o.a.s.u.p.UpdateRequestProcessorChain creating updateRequestProcessorChain "distrib-dup-test-chain-implicit"
   [junit4]   2> 250694 INFO  (coreLoadExecutor-722-thread-1) [    ] o.a.s.u.p.UpdateRequestProcessorChain inserting DistributedUpdateProcessorFactory into updateRequestProcessorChain "distrib-dup-test-chain-implicit"
   [junit4]   2> 250694 INFO  (coreLoadExecutor-722-thread-1) [    ] o.a.s.c.SolrCore no updateRequestProcessorChain defined as default, creating implicit default
   [junit4]   2> 250694 WARN  (coreLoadExecutor-722-thread-1) [    ] o.a.s.c.RequestHandlers INVALID paramSet a in requestHandler {type = requestHandler,name = /dump,class = DumpRequestHandler,args = {defaults={a=A,b=B}}}
   [junit4]   2> 250695 INFO  (coreLoadExecutor-722-thread-1) [    ] o.a.s.h.l.XMLLoader xsltCacheLifetimeSeconds=60
   [junit4]   2> 250696 INFO  (coreLoadExecutor-722-thread-1) [    ] o.a.s.h.l.XMLLoader xsltCacheLifetimeSeconds=60
   [junit4]   2> 250697 INFO  (coreLoadExecutor-722-thread-1) [    ] o.a.s.h.l.XMLLoader xsltCacheLifetimeSeconds=60
   [junit4]   2> 250698 INFO  (coreLoadExecutor-722-thread-1) [    ] o.a.s.h.l.XMLLoader xsltCacheLifetimeSeconds=60
   [junit4]   2> 250702 INFO  (coreLoadExecutor-722-thread-1) [    ] o.a.s.c.RequestHandlers Registered paths: /admin/mbeans,standard,/dump,/update/csv,/sql,/update/json/docs,/admin/luke,/export,/admin/segments,/get,/admin/system,/replication,/admin/properties,/config,/stream,/schema,/admin/plugins,/admin/logging,/update/json,/admin/ping,/admin/threads,/update,/admin/file
   [junit4]   2> 250702 INFO  (coreLoadExecutor-722-thread-1) [    ] o.a.s.c.SolrCore Using default statsCache cache: org.apache.solr.search.stats.LocalStatsCache
   [junit4]   2> 250703 INFO  (coreLoadExecutor-722-thread-1) [    ] o.a.s.u.UpdateHandler Using UpdateLog implementation: org.apache.solr.update.UpdateLog
   [junit4]   2> 250703 INFO  (coreLoadExecutor-722-thread-1) [    ] o.a.s.u.UpdateLog Initializing UpdateLog: dataDir= defaultSyncLevel=FLUSH numRecordsToKeep=100 maxNumLogsToKeep=10 numVersionBuckets=65536
   [junit4]   2> 250703 INFO  (coreLoadExecutor-722-thread-1) [    ] o.a.s.u.CommitTracker Hard AutoCommit: disabled
   [junit4]   2> 250704 INFO  (coreLoadExecutor-722-thread-1) [    ] o.a.s.u.CommitTracker Soft AutoCommit: disabled
   [junit4]   2> 250704 INFO  (coreLoadExecutor-722-thread-1) [    ] o.a.s.u.RandomMergePolicy RandomMergePolicy wrapping class org.apache.lucene.index.LogDocMergePolicy: [LogDocMergePolicy: minMergeSize=1000, mergeFactor=24, maxMergeSize=9223372036854775807, maxMergeSizeForForcedMerge=9223372036854775807, calibrateSizeByDeletes=false, maxMergeDocs=2147483647, maxCFSSegmentSizeMB=8.796093022207999E12, noCFSRatio=0.6973842390159682]
   [junit4]   2> 250704 INFO  (coreLoadExecutor-722-thread-1) [    ] o.a.s.c.SolrDeletionPolicy SolrDeletionPolicy.onInit: commits: num=1
   [junit4]   2> 	commit{dir=MockDirectoryWrapper(RAMDirectory@977ea6 lockFactory=org.apache.lucene.store.SingleInstanceLockFactory@1a102dd),segFN=segments_1,generation=1}
   [junit4]   2> 250704 INFO  (coreLoadExecutor-722-thread-1) [    ] o.a.s.c.SolrDeletionPolicy newest commit generation = 1
   [junit4]   2> 250704 INFO  (coreLoadExecutor-722-thread-1) [    ] o.a.s.s.SolrIndexSearcher Opening [Searcher@c41cb9[collection1] main]
   [junit4]   2> 250704 INFO  (coreLoadExecutor-722-thread-1) [    ] o.a.s.c.c.ZkStateReader Load collection config from: [/collections/collection1]
   [junit4]   2> 250705 INFO  (coreLoadExecutor-722-thread-1) [    ] o.a.s.c.c.ZkStateReader path=[/collections/collection1] [configName]=[conf1] specified config exists in ZooKeeper
   [junit4]   2> 250705 INFO  (coreLoadExecutor-722-thread-1) [    ] o.a.s.r.ManagedResourceStorage Setting up ZooKeeper-based storage for the RestManager with znodeBase: /configs/conf1
   [junit4]   2> 250705 INFO  (coreLoadExecutor-722-thread-1) [    ] o.a.s.r.ManagedResourceStorage Configured ZooKeeperStorageIO with znodeBase: /configs/conf1
   [junit4]   2> 250705 INFO  (coreLoadExecutor-722-thread-1) [    ] o.a.s.r.RestManager Initializing RestManager with initArgs: {}
   [junit4]   2> 250705 INFO  (coreLoadExecutor-722-thread-1) [    ] o.a.s.r.ManagedResourceStorage Reading _rest_managed.json using ZooKeeperStorageIO:path=/configs/conf1
   [junit4]   2> 250706 INFO  (coreLoadExecutor-722-thread-1) [    ] o.a.s.r.ManagedResourceStorage No data found for znode /configs/conf1/_rest_managed.json
   [junit4]   2> 250706 INFO  (coreLoadExecutor-722-thread-1) [    ] o.a.s.r.ManagedResourceStorage Loaded null at path _rest_managed.json using ZooKeeperStorageIO:path=/configs/conf1
   [junit4]   2> 250706 INFO  (coreLoadExecutor-722-thread-1) [    ] o.a.s.r.RestManager Initializing 0 registered ManagedResources
   [junit4]   2> 250706 INFO  (coreLoadExecutor-722-thread-1) [    ] o.a.s.h.ReplicationHandler Commits will be reserved for  10000
   [junit4]   2> 250707 INFO  (searcherExecutor-723-thread-1) [    ] o.a.s.c.SolrCore [collection1] Registered new searcher Searcher@c41cb9[collection1] main{ExitableDirectoryReader(UninvertingDirectoryReader())}
   [junit4]   2> 250707 INFO  (coreLoadExecutor-722-thread-1) [    ] o.a.s.u.UpdateLog Looking up max value of version field to seed version buckets
   [junit4]   2> 250707 INFO  (coreLoadExecutor-722-thread-1) [    ] o.a.s.u.VersionInfo Refreshing highest value of _version_ for 65536 version buckets from index
   [junit4]   2> 250707 INFO  (coreLoadExecutor-722-thread-1) [    ] o.a.s.u.VersionInfo No terms found for _version_, cannot seed version bucket highest value from index
   [junit4]   2> 250707 INFO  (coreLoadExecutor-722-thread-1) [    ] o.a.s.u.UpdateLog Could not find max version in index or recent updates, using new clock 1529016600077795328
   [junit4]   2> 250709 INFO  (coreLoadExecutor-722-thread-1) [    ] o.a.s.u.UpdateLog Took 1.0ms to seed version buckets with highest version 1529016600077795328
   [junit4]   2> 250709 INFO  (coreLoadExecutor-722-thread-1) [    ] o.a.s.c.ZkController watch zkdir /configs/conf1
   [junit4]   2> 250709 INFO  (coreLoadExecutor-722-thread-1) [    ] o.a.s.c.CoreContainer registering core: collection1
   [junit4]   2> 250710 INFO  (coreZkRegister-717-thread-1) [    ] o.a.s.c.ZkController Register replica - core:collection1 address:http://127.0.0.1:43513/m_dbp/e collection:collection1 shard:shard2
   [junit4]   2> 250710 INFO  (coreZkRegister-717-thread-1) [    ] o.a.s.c.c.SolrZkClient makePath: /collections/collection1/leader_elect/shard2/election
   [junit4]   2> 250712 INFO  (coreZkRegister-717-thread-1) [    ] o.a.s.c.LeaderElector Joined leadership election with path: /collections/collection1/leader_elect/shard2/election/95563537236033545-core_node1-n_0000000000
   [junit4]   2> 250712 INFO  (coreZkRegister-717-thread-1) [    ] o.a.s.c.ShardLeaderElectionContext Running the leader process for shard=shard2 and weAreReplacement=false and leaderVoteWait=180000
   [junit4]   2> 250713 INFO  (coreZkRegister-717-thread-1) [    ] o.a.s.c.ShardLeaderElectionContext Enough replicas found to continue.
   [junit4]   2> 250713 INFO  (coreZkRegister-717-thread-1) [    ] o.a.s.c.ShardLeaderElectionContext I may be the new leader - try and sync
   [junit4]   2> 250713 INFO  (coreZkRegister-717-thread-1) [    ] o.a.s.c.SyncStrategy Sync replicas to http://127.0.0.1:43513/m_dbp/e/collection1/
   [junit4]   2> 250713 INFO  (coreZkRegister-717-thread-1) [    ] o.a.s.c.SyncStrategy Sync Success - now sync replicas to me
   [junit4]   2> 250713 INFO  (coreZkRegister-717-thread-1) [    ] o.a.s.c.SyncStrategy http://127.0.0.1:43513/m_dbp/e/collection1/ has no replicas
   [junit4]   2> 250713 INFO  (OverseerStateUpdate-95563537236033540-127.0.0.1:40805_m_dbp%2Fe-n_0000000000) [    ] o.a.s.c.Overseer processMessage: queueSize: 1, message = {
   [junit4]   2>   "operation":"leader",
   [junit4]   2>   "shard":"shard2",
   [junit4]   2>   "collection":"collection1"} current state version: 4
   [junit4]   2> 250714 INFO  (coreZkRegister-717-thread-1) [    ] o.a.s.c.c.SolrZkClient makePath: /collections/collection1/leaders/shard2
   [junit4]   2> 250716 INFO  (coreZkRegister-717-thread-1) [    ] o.a.s.c.ShardLeaderElectionContextBase Creating leader registration node /collections/collection1/leaders/shard2/leader after winning as /collections/collection1/leader_elect/shard2/election/95563537236033545-core_node1-n_0000000000
   [junit4]   2> 250718 INFO  (coreZkRegister-717-thread-1) [    ] o.a.s.c.ShardLeaderElectionContext I am the new leader: http://127.0.0.1:43513/m_dbp/e/collection1/ shard2
   [junit4]   2> 250718 INFO  (OverseerStateUpdate-95563537236033540-127.0.0.1:40805_m_dbp%2Fe-n_0000000000) [    ] o.a.s.c.Overseer processMessage: queueSize: 1, message = {
   [junit4]   2>   "operation":"leader",
   [junit4]   2>   "shard":"shard2",
   [junit4]   2>   "collection":"collection1",
   [junit4]   2>   "base_url":"http://127.0.0.1:43513/m_dbp/e",
   [junit4]   2>   "core":"collection1",
   [junit4]   2>   "state":"active"} current state version: 4
   [junit4]   2> 250820 INFO  (OverseerStateUpdate-95563537236033540-127.0.0.1:40805_m_dbp%2Fe-n_0000000000) [    ] o.a.s.c.o.ZkStateWriter going to update_collection /collections/collection1/state.json version: 1
   [junit4]   2> 250821 INFO  (zkCallback-272-thread-1) [    ] o.a.s.c.c.ZkStateReader A cluster state change: [WatchedEvent state:SyncConnected type:NodeDataChanged path:/collections/collection1/state.json] for collection [collection1] has occurred - updating... (live nodes size: [2])
   [junit4]   2> 250821 INFO  (zkCallback-272-thread-1) [    ] o.a.s.c.c.ZkStateReader Updating data for [collection1] from [1] to [2]
   [junit4]   2> 250868 INFO  (coreZkRegister-717-thread-1) [    ] o.a.s.c.ZkController We are http://127.0.0.1:43513/m_dbp/e/collection1/ and leader is http://127.0.0.1:43513/m_dbp/e/collection1/
   [junit4]   2> 250868 INFO  (coreZkRegister-717-thread-1) [    ] o.a.s.c.ZkController No LogReplay needed for core=collection1 baseURL=http://127.0.0.1:43513/m_dbp/e
   [junit4]   2> 250868 INFO  (coreZkRegister-717-thread-1) [    ] o.a.s.c.ZkController I am the leader, no recovery necessary
   [junit4]   2> 250868 INFO  (coreZkRegister-717-thread-1) [    ] o.a.s.c.ZkController publishing state=active
   [junit4]   2> 250869 INFO  (coreZkRegister-717-thread-1) [    ] o.a.s.c.ZkController numShards not found on descriptor - reading it from system property
   [junit4]   2> 250870 INFO  (OverseerStateUpdate-95563537236033540-127.0.0.1:40805_m_dbp%2Fe-n_0000000000) [    ] o.a.s.c.Overseer processMessage: queueSize: 1, message = {
   [junit4]   2>   "core":"collection1",
   [junit4]   2>   "core_node_name":"core_node1",
   [junit4]   2>   "roles":null,
   [junit4]   2>   "base_url":"http://127.0.0.1:43513/m_dbp/e",
   [junit4]   2>   "node_name":"127.0.0.1:43513_m_dbp%2Fe",
   [junit4]   2>   "numShards":"2",
   [junit4]   2>   "state":"active",
   [junit4]   2>   "shard":"shard2",
   [junit4]   2>   "collection":"collection1",
   [junit4]   2>   "operation":"state"} current state version: 4
   [junit4]   2> 250870 INFO  (OverseerStateUpdate-95563537236033540-127.0.0.1:40805_m_dbp%2Fe-n_0000000000) [    ] o.a.s.c.o.ReplicaMutator Update state numShards=2 message={
   [junit4]   2>   "core":"collection1",
   [junit4]   2>   "core_node_name":"core_node1",
   [junit4]   2>   "roles":null,
   [junit4]   2>   "base_url":"http://127.0.0.1:43513/m_dbp/e",
   [junit4]   2>   "node_name":"127.0.0.1:43513_m_dbp%2Fe",
   [junit4]   2>   "numShards":"2",
 

[...truncated too long message...]

til.concurrent.ThreadPoolExecutor.runWorker(ThreadPoolExecutor.java:1158)
   [junit4]    > 	at java.util.concurrent.ThreadPoolExecutor$Worker.run(ThreadPoolExecutor.java:632)
   [junit4]    > 	at java.lang.Thread.run(Thread.java:804)
   [junit4]    > Caused by: org.apache.solr.client.solrj.SolrServerException: Timeout occured while waiting response from server at: http://127.0.0.1:43544/m_dbp/e
   [junit4]    > 	at org.apache.solr.client.solrj.impl.HttpSolrClient.executeMethod(HttpSolrClient.java:588)
   [junit4]    > 	at org.apache.solr.client.solrj.impl.HttpSolrClient.request(HttpSolrClient.java:241)
   [junit4]    > 	at org.apache.solr.client.solrj.impl.HttpSolrClient.request(HttpSolrClient.java:230)
   [junit4]    > 	at org.apache.solr.client.solrj.SolrClient.request(SolrClient.java:1219)
   [junit4]    > 	at org.apache.solr.cloud.BasicDistributedZkTest.lambda$createCores$0(BasicDistributedZkTest.java:581)
   [junit4]    > 	... 4 more
   [junit4]    > Caused by: java.net.SocketTimeoutException: Read timed out
   [junit4]    > 	at java.net.SocketInputStream.socketRead0(Native Method)
   [junit4]    > 	at java.net.SocketInputStream.socketRead(SocketInputStream.java:116)
   [junit4]    > 	at java.net.SocketInputStream.read(SocketInputStream.java:170)
   [junit4]    > 	at java.net.SocketInputStream.read(SocketInputStream.java:141)
   [junit4]    > 	at org.apache.http.impl.io.AbstractSessionInputBuffer.fillBuffer(AbstractSessionInputBuffer.java:160)
   [junit4]    > 	at org.apache.http.impl.io.SocketInputBuffer.fillBuffer(SocketInputBuffer.java:84)
   [junit4]    > 	at org.apache.http.impl.io.AbstractSessionInputBuffer.readLine(AbstractSessionInputBuffer.java:273)
   [junit4]    > 	at org.apache.http.impl.conn.DefaultHttpResponseParser.parseHead(DefaultHttpResponseParser.java:140)
   [junit4]    > 	at org.apache.http.impl.conn.DefaultHttpResponseParser.parseHead(DefaultHttpResponseParser.java:57)
   [junit4]    > 	at org.apache.http.impl.io.AbstractMessageParser.parse(AbstractMessageParser.java:261)
   [junit4]    > 	at org.apache.http.impl.AbstractHttpClientConnection.receiveResponseHeader(AbstractHttpClientConnection.java:283)
   [junit4]    > 	at org.apache.http.impl.conn.DefaultClientConnection.receiveResponseHeader(DefaultClientConnection.java:251)
   [junit4]    > 	at org.apache.http.impl.conn.ManagedClientConnectionImpl.receiveResponseHeader(ManagedClientConnectionImpl.java:197)
   [junit4]    > 	at org.apache.http.protocol.HttpRequestExecutor.doReceiveResponse(HttpRequestExecutor.java:272)
   [junit4]    > 	at org.apache.http.protocol.HttpRequestExecutor.execute(HttpRequestExecutor.java:124)
   [junit4]    > 	at org.apache.http.impl.client.DefaultRequestDirector.tryExecute(DefaultRequestDirector.java:685)
   [junit4]    > 	at org.apache.http.impl.client.DefaultRequestDirector.execute(DefaultRequestDirector.java:487)
   [junit4]    > 	at org.apache.http.impl.client.AbstractHttpClient.doExecute(AbstractHttpClient.java:882)
   [junit4]    > 	at org.apache.http.impl.client.CloseableHttpClient.execute(CloseableHttpClient.java:82)
   [junit4]    > 	at org.apache.http.impl.client.CloseableHttpClient.execute(CloseableHttpClient.java:107)
   [junit4]    > 	at org.apache.http.impl.client.CloseableHttpClient.execute(CloseableHttpClient.java:55)
   [junit4]    > 	at org.apache.solr.client.solrj.impl.HttpSolrClient.executeMethod(HttpSolrClient.java:482)
   [junit4]    > 	... 8 moreThrowable #6: com.carrotsearch.randomizedtesting.UncaughtExceptionError: Captured an uncaught exception in thread: Thread[id=2014, name=testExecutor-789-thread-7, state=RUNNABLE, group=TGRP-UnloadDistributedZkTest]
   [junit4]    > Caused by: java.lang.RuntimeException: org.apache.solr.client.solrj.SolrServerException: Timeout occured while waiting response from server at: http://127.0.0.1:43544/m_dbp/e
   [junit4]    > 	at __randomizedtesting.SeedInfo.seed([1D87E600A5593DDF]:0)
   [junit4]    > 	at org.apache.solr.cloud.BasicDistributedZkTest.lambda$createCores$0(BasicDistributedZkTest.java:583)
   [junit4]    > 	at org.apache.solr.common.util.ExecutorUtil$MDCAwareThreadPoolExecutor.lambda$execute$0(ExecutorUtil.java:229)
   [junit4]    > 	at java.util.concurrent.ThreadPoolExecutor.runWorker(ThreadPoolExecutor.java:1158)
   [junit4]    > 	at java.util.concurrent.ThreadPoolExecutor$Worker.run(ThreadPoolExecutor.java:632)
   [junit4]    > 	at java.lang.Thread.run(Thread.java:804)
   [junit4]    > Caused by: org.apache.solr.client.solrj.SolrServerException: Timeout occured while waiting response from server at: http://127.0.0.1:43544/m_dbp/e
   [junit4]    > 	at org.apache.solr.client.solrj.impl.HttpSolrClient.executeMethod(HttpSolrClient.java:588)
   [junit4]    > 	at org.apache.solr.client.solrj.impl.HttpSolrClient.request(HttpSolrClient.java:241)
   [junit4]    > 	at org.apache.solr.client.solrj.impl.HttpSolrClient.request(HttpSolrClient.java:230)
   [junit4]    > 	at org.apache.solr.client.solrj.SolrClient.request(SolrClient.java:1219)
   [junit4]    > 	at org.apache.solr.cloud.BasicDistributedZkTest.lambda$createCores$0(BasicDistributedZkTest.java:581)
   [junit4]    > 	... 4 more
   [junit4]    > Caused by: java.net.SocketTimeoutException: Read timed out
   [junit4]    > 	at java.net.SocketInputStream.socketRead0(Native Method)
   [junit4]    > 	at java.net.SocketInputStream.socketRead(SocketInputStream.java:116)
   [junit4]    > 	at java.net.SocketInputStream.read(SocketInputStream.java:170)
   [junit4]    > 	at java.net.SocketInputStream.read(SocketInputStream.java:141)
   [junit4]    > 	at org.apache.http.impl.io.AbstractSessionInputBuffer.fillBuffer(AbstractSessionInputBuffer.java:160)
   [junit4]    > 	at org.apache.http.impl.io.SocketInputBuffer.fillBuffer(SocketInputBuffer.java:84)
   [junit4]    > 	at org.apache.http.impl.io.AbstractSessionInputBuffer.readLine(AbstractSessionInputBuffer.java:273)
   [junit4]    > 	at org.apache.http.impl.conn.DefaultHttpResponseParser.parseHead(DefaultHttpResponseParser.java:140)
   [junit4]    > 	at org.apache.http.impl.conn.DefaultHttpResponseParser.parseHead(DefaultHttpResponseParser.java:57)
   [junit4]    > 	at org.apache.http.impl.io.AbstractMessageParser.parse(AbstractMessageParser.java:261)
   [junit4]    > 	at org.apache.http.impl.AbstractHttpClientConnection.receiveResponseHeader(AbstractHttpClientConnection.java:283)
   [junit4]    > 	at org.apache.http.impl.conn.DefaultClientConnection.receiveResponseHeader(DefaultClientConnection.java:251)
   [junit4]    > 	at org.apache.http.impl.conn.ManagedClientConnectionImpl.receiveResponseHeader(ManagedClientConnectionImpl.java:197)
   [junit4]    > 	at org.apache.http.protocol.HttpRequestExecutor.doReceiveResponse(HttpRequestExecutor.java:272)
   [junit4]    > 	at org.apache.http.protocol.HttpRequestExecutor.execute(HttpRequestExecutor.java:124)
   [junit4]    > 	at org.apache.http.impl.client.DefaultRequestDirector.tryExecute(DefaultRequestDirector.java:685)
   [junit4]    > 	at org.apache.http.impl.client.DefaultRequestDirector.execute(DefaultRequestDirector.java:487)
   [junit4]    > 	at org.apache.http.impl.client.AbstractHttpClient.doExecute(AbstractHttpClient.java:882)
   [junit4]    > 	at org.apache.http.impl.client.CloseableHttpClient.execute(CloseableHttpClient.java:82)
   [junit4]    > 	at org.apache.http.impl.client.CloseableHttpClient.execute(CloseableHttpClient.java:107)
   [junit4]    > 	at org.apache.http.impl.client.CloseableHttpClient.execute(CloseableHttpClient.java:55)
   [junit4]    > 	at org.apache.solr.client.solrj.impl.HttpSolrClient.executeMethod(HttpSolrClient.java:482)
   [junit4]    > 	... 8 more
   [junit4]   2> 381845 INFO  (SUITE-UnloadDistributedZkTest-seed#[1D87E600A5593DDF]-worker) [    ] o.a.s.SolrTestCaseJ4 ###deleteCore
   [junit4]   2> NOTE: test params are: codec=CheapBastard, sim=RandomSimilarity(queryNorm=true,coord=no): {}, locale=km-KH, timezone=America/Fort_Wayne
   [junit4]   2> NOTE: Linux 4.2.0-34-generic i386/Oracle Corporation 9-ea (32-bit)/cpus=12,threads=1,free=45310576,total=211296256
   [junit4]   2> NOTE: All tests run in this JVM: [ScriptEngineTest, TestRuleBasedAuthorizationPlugin, BasicDistributedZk2Test, AutoCommitTest, TestRecoveryHdfs, TestUseDocValuesAsStored2, HdfsTlogReplayBufferedWhileIndexingTest, OverseerTaskQueueTest, IgnoreCommitOptimizeUpdateProcessorFactoryTest, UpdateParamsTest, RulesTest, GraphQueryTest, ExitableDirectoryReaderTest, TestInitQParser, AnalysisErrorHandlingTest, SolrTestCaseJ4Test, ReplicationFactorTest, SolrCoreCheckLockOnStartupTest, ConnectionManagerTest, TestStressReorder, TestPostingsSolrHighlighter, TestUtils, TestMacros, UnloadDistributedZkTest]
   [junit4] Completed [117/581 (1!)] on J2 in 135.39s, 1 test, 1 error <<< FAILURES!

[...truncated 1470 lines...]
BUILD FAILED
/home/jenkins/workspace/Lucene-Solr-6.x-Linux/build.xml:740: The following error occurred while executing this line:
/home/jenkins/workspace/Lucene-Solr-6.x-Linux/build.xml:684: The following error occurred while executing this line:
/home/jenkins/workspace/Lucene-Solr-6.x-Linux/build.xml:59: The following error occurred while executing this line:
/home/jenkins/workspace/Lucene-Solr-6.x-Linux/solr/build.xml:233: The following error occurred while executing this line:
/home/jenkins/workspace/Lucene-Solr-6.x-Linux/solr/common-build.xml:526: The following error occurred while executing this line:
/home/jenkins/workspace/Lucene-Solr-6.x-Linux/lucene/common-build.xml:1457: The following error occurred while executing this line:
/home/jenkins/workspace/Lucene-Solr-6.x-Linux/lucene/common-build.xml:1014: There were test failures: 581 suites (10 ignored), 2325 tests, 1 error, 116 ignored (70 assumptions) [seed: 1D87E600A5593DDF]

Total time: 57 minutes 20 seconds
Build step 'Invoke Ant' marked build as failure
Archiving artifacts
[WARNINGS] Skipping publisher since build result is FAILURE
Recording test results
Email was triggered for: Failure - Any
Sending email for trigger: Failure - Any



Mime
View raw message