lucene-dev mailing list archives

Site index · List index
Message view « Date » · « Thread »
Top « Date » · « Thread »
From Policeman Jenkins Server <jenk...@thetaphi.de>
Subject [JENKINS-EA] Lucene-Solr-master-Linux (32bit/jdk-9-jigsaw-ea+110) - Build # 16325 - Failure!
Date Fri, 25 Mar 2016 06:52:36 GMT
Build: http://jenkins.thetaphi.de/job/Lucene-Solr-master-Linux/16325/
Java: 32bit/jdk-9-jigsaw-ea+110 -client -XX:+UseG1GC -XX:-CompactStrings

1 tests failed.
FAILED:  org.apache.lucene.facet.range.TestRangeFacetCounts.testRandomDoubles

Error Message:
range "r3" matches nothing

Stack Trace:
java.lang.IllegalArgumentException: range "r3" matches nothing
	at __randomizedtesting.SeedInfo.seed([79A859A9E601B2F8:610594AA6271E43E]:0)
	at org.apache.lucene.facet.range.Range.failNoMatch(Range.java:68)
	at org.apache.lucene.facet.range.DoubleRange.<init>(DoubleRange.java:72)
	at org.apache.lucene.facet.range.TestRangeFacetCounts.testRandomDoubles(TestRangeFacetCounts.java:542)
	at sun.reflect.NativeMethodAccessorImpl.invoke0(java.base@9-ea/Native Method)
	at sun.reflect.NativeMethodAccessorImpl.invoke(java.base@9-ea/NativeMethodAccessorImpl.java:62)
	at sun.reflect.DelegatingMethodAccessorImpl.invoke(java.base@9-ea/DelegatingMethodAccessorImpl.java:43)
	at java.lang.reflect.Method.invoke(java.base@9-ea/Method.java:531)
	at com.carrotsearch.randomizedtesting.RandomizedRunner.invoke(RandomizedRunner.java:1764)
	at com.carrotsearch.randomizedtesting.RandomizedRunner$8.evaluate(RandomizedRunner.java:871)
	at com.carrotsearch.randomizedtesting.RandomizedRunner$9.evaluate(RandomizedRunner.java:907)
	at com.carrotsearch.randomizedtesting.RandomizedRunner$10.evaluate(RandomizedRunner.java:921)
	at org.apache.lucene.util.TestRuleSetupTeardownChained$1.evaluate(TestRuleSetupTeardownChained.java:49)
	at org.apache.lucene.util.AbstractBeforeAfterRule$1.evaluate(AbstractBeforeAfterRule.java:45)
	at org.apache.lucene.util.TestRuleThreadAndTestName$1.evaluate(TestRuleThreadAndTestName.java:48)
	at org.apache.lucene.util.TestRuleIgnoreAfterMaxFailures$1.evaluate(TestRuleIgnoreAfterMaxFailures.java:64)
	at org.apache.lucene.util.TestRuleMarkFailure$1.evaluate(TestRuleMarkFailure.java:47)
	at com.carrotsearch.randomizedtesting.rules.StatementAdapter.evaluate(StatementAdapter.java:36)
	at com.carrotsearch.randomizedtesting.ThreadLeakControl$StatementRunner.run(ThreadLeakControl.java:367)
	at com.carrotsearch.randomizedtesting.ThreadLeakControl.forkTimeoutingTask(ThreadLeakControl.java:809)
	at com.carrotsearch.randomizedtesting.ThreadLeakControl$3.evaluate(ThreadLeakControl.java:460)
	at com.carrotsearch.randomizedtesting.RandomizedRunner.runSingleTest(RandomizedRunner.java:880)
	at com.carrotsearch.randomizedtesting.RandomizedRunner$5.evaluate(RandomizedRunner.java:781)
	at com.carrotsearch.randomizedtesting.RandomizedRunner$6.evaluate(RandomizedRunner.java:816)
	at com.carrotsearch.randomizedtesting.RandomizedRunner$7.evaluate(RandomizedRunner.java:827)
	at org.apache.lucene.util.AbstractBeforeAfterRule$1.evaluate(AbstractBeforeAfterRule.java:45)
	at com.carrotsearch.randomizedtesting.rules.StatementAdapter.evaluate(StatementAdapter.java:36)
	at org.apache.lucene.util.TestRuleStoreClassName$1.evaluate(TestRuleStoreClassName.java:41)
	at com.carrotsearch.randomizedtesting.rules.NoShadowingOrOverridesOnMethodsRule$1.evaluate(NoShadowingOrOverridesOnMethodsRule.java:40)
	at com.carrotsearch.randomizedtesting.rules.NoShadowingOrOverridesOnMethodsRule$1.evaluate(NoShadowingOrOverridesOnMethodsRule.java:40)
	at com.carrotsearch.randomizedtesting.rules.StatementAdapter.evaluate(StatementAdapter.java:36)
	at com.carrotsearch.randomizedtesting.rules.StatementAdapter.evaluate(StatementAdapter.java:36)
	at com.carrotsearch.randomizedtesting.rules.StatementAdapter.evaluate(StatementAdapter.java:36)
	at org.apache.lucene.util.TestRuleAssertionsRequired$1.evaluate(TestRuleAssertionsRequired.java:53)
	at org.apache.lucene.util.TestRuleMarkFailure$1.evaluate(TestRuleMarkFailure.java:47)
	at org.apache.lucene.util.TestRuleIgnoreAfterMaxFailures$1.evaluate(TestRuleIgnoreAfterMaxFailures.java:64)
	at org.apache.lucene.util.TestRuleIgnoreTestSuites$1.evaluate(TestRuleIgnoreTestSuites.java:54)
	at com.carrotsearch.randomizedtesting.rules.StatementAdapter.evaluate(StatementAdapter.java:36)
	at com.carrotsearch.randomizedtesting.ThreadLeakControl$StatementRunner.run(ThreadLeakControl.java:367)
	at java.lang.Thread.run(java.base@9-ea/Thread.java:804)




Build Log:
[...truncated 6612 lines...]
   [junit4] Suite: org.apache.lucene.facet.range.TestRangeFacetCounts
   [junit4]   2> NOTE: reproduce with: ant test  -Dtestcase=TestRangeFacetCounts -Dtests.method=testRandomDoubles
-Dtests.seed=79A859A9E601B2F8 -Dtests.multiplier=3 -Dtests.slow=true -Dtests.locale=dyo -Dtests.timezone=Asia/Tashkent
-Dtests.asserts=true -Dtests.file.encoding=ISO-8859-1
   [junit4] ERROR   0.31s J0 | TestRangeFacetCounts.testRandomDoubles <<<
   [junit4]    > Throwable #1: java.lang.IllegalArgumentException: range "r3" matches nothing
   [junit4]    > 	at __randomizedtesting.SeedInfo.seed([79A859A9E601B2F8:610594AA6271E43E]:0)
   [junit4]    > 	at org.apache.lucene.facet.range.Range.failNoMatch(Range.java:68)
   [junit4]    > 	at org.apache.lucene.facet.range.DoubleRange.<init>(DoubleRange.java:72)
   [junit4]    > 	at org.apache.lucene.facet.range.TestRangeFacetCounts.testRandomDoubles(TestRangeFacetCounts.java:542)
   [junit4]    > 	at java.lang.Thread.run(java.base@9-ea/Thread.java:804)
   [junit4]   2> NOTE: test params are: codec=DummyCompressingStoredFields(storedFieldsFormat=CompressingStoredFieldsFormat(compressionMode=DUMMY,
chunkSize=6, maxDocsPerChunk=943, blockSize=4), termVectorsFormat=CompressingTermVectorsFormat(compressionMode=DUMMY,
chunkSize=6, blockSize=4)), sim=RandomSimilarity(queryNorm=false,coord=crazy): {}, locale=dyo,
timezone=Asia/Tashkent
   [junit4]   2> NOTE: Linux 4.2.0-34-generic i386/Oracle Corporation 9-ea (32-bit)/cpus=12,threads=1,free=18837272,total=100663296
   [junit4]   2> NOTE: All tests run in this JVM: [TestMultipleIndexFields, TestTaxonomyFacetAssociations,
TestDrillDownQuery, TestTaxonomyFacetSumValueSource, TestAddTaxonomy, TestConcurrentFacetedIndexing,
TestRangeFacetCounts]
   [junit4] Completed [18/23 (1!)] on J0 in 2.36s, 10 tests, 1 error <<< FAILURES!

[...truncated 26 lines...]
BUILD FAILED
/home/jenkins/workspace/Lucene-Solr-master-Linux/build.xml:740: The following error occurred
while executing this line:
/home/jenkins/workspace/Lucene-Solr-master-Linux/build.xml:684: The following error occurred
while executing this line:
/home/jenkins/workspace/Lucene-Solr-master-Linux/build.xml:59: The following error occurred
while executing this line:
/home/jenkins/workspace/Lucene-Solr-master-Linux/lucene/build.xml:476: The following error
occurred while executing this line:
/home/jenkins/workspace/Lucene-Solr-master-Linux/lucene/common-build.xml:2187: The following
error occurred while executing this line:
/home/jenkins/workspace/Lucene-Solr-master-Linux/lucene/module-build.xml:58: The following
error occurred while executing this line:
/home/jenkins/workspace/Lucene-Solr-master-Linux/lucene/common-build.xml:1457: The following
error occurred while executing this line:
/home/jenkins/workspace/Lucene-Solr-master-Linux/lucene/common-build.xml:1014: There were
test failures: 23 suites, 152 tests, 1 error [seed: 79A859A9E601B2F8]

Total time: 21 minutes 33 seconds
Build step 'Invoke Ant' marked build as failure
Archiving artifacts
[WARNINGS] Skipping publisher since build result is FAILURE
Recording test results
Email was triggered for: Failure - Any
Sending email for trigger: Failure - Any



Mime
View raw message