lucene-dev mailing list archives

Site index · List index
Message view « Date » · « Thread »
Top « Date » · « Thread »
From Policeman Jenkins Server <jenk...@thetaphi.de>
Subject [JENKINS] Lucene-Solr-6.x-MacOSX (64bit/jdk1.8.0) - Build # 39 - Failure!
Date Mon, 28 Mar 2016 21:37:31 GMT
Build: http://jenkins.thetaphi.de/job/Lucene-Solr-6.x-MacOSX/39/
Java: 64bit/jdk1.8.0 -XX:+UseCompressedOops -XX:+UseG1GC

1 tests failed.
FAILED:  org.apache.solr.cloud.DistribDocExpirationUpdateProcessorTest.test

Error Message:
There are still nodes recoverying - waited for 45 seconds

Stack Trace:
java.lang.AssertionError: There are still nodes recoverying - waited for 45 seconds
	at __randomizedtesting.SeedInfo.seed([161A4A7F16B3230A:9E4E75A5B84F4EF2]:0)
	at org.junit.Assert.fail(Assert.java:93)
	at org.apache.solr.cloud.AbstractDistribZkTestBase.waitForRecoveriesToFinish(AbstractDistribZkTestBase.java:173)
	at org.apache.solr.cloud.AbstractFullDistribZkTestBase.waitForRecoveriesToFinish(AbstractFullDistribZkTestBase.java:856)
	at org.apache.solr.cloud.DistribDocExpirationUpdateProcessorTest.test(DistribDocExpirationUpdateProcessorTest.java:73)
	at sun.reflect.NativeMethodAccessorImpl.invoke0(Native Method)
	at sun.reflect.NativeMethodAccessorImpl.invoke(NativeMethodAccessorImpl.java:62)
	at sun.reflect.DelegatingMethodAccessorImpl.invoke(DelegatingMethodAccessorImpl.java:43)
	at java.lang.reflect.Method.invoke(Method.java:498)
	at com.carrotsearch.randomizedtesting.RandomizedRunner.invoke(RandomizedRunner.java:1764)
	at com.carrotsearch.randomizedtesting.RandomizedRunner$8.evaluate(RandomizedRunner.java:871)
	at com.carrotsearch.randomizedtesting.RandomizedRunner$9.evaluate(RandomizedRunner.java:907)
	at com.carrotsearch.randomizedtesting.RandomizedRunner$10.evaluate(RandomizedRunner.java:921)
	at org.apache.solr.BaseDistributedSearchTestCase$ShardsRepeatRule$ShardsFixedStatement.callStatement(BaseDistributedSearchTestCase.java:996)
	at org.apache.solr.BaseDistributedSearchTestCase$ShardsRepeatRule$ShardsStatement.evaluate(BaseDistributedSearchTestCase.java:971)
	at com.carrotsearch.randomizedtesting.rules.SystemPropertiesRestoreRule$1.evaluate(SystemPropertiesRestoreRule.java:57)
	at org.apache.lucene.util.TestRuleSetupTeardownChained$1.evaluate(TestRuleSetupTeardownChained.java:49)
	at org.apache.lucene.util.AbstractBeforeAfterRule$1.evaluate(AbstractBeforeAfterRule.java:45)
	at org.apache.lucene.util.TestRuleThreadAndTestName$1.evaluate(TestRuleThreadAndTestName.java:48)
	at org.apache.lucene.util.TestRuleIgnoreAfterMaxFailures$1.evaluate(TestRuleIgnoreAfterMaxFailures.java:64)
	at org.apache.lucene.util.TestRuleMarkFailure$1.evaluate(TestRuleMarkFailure.java:47)
	at com.carrotsearch.randomizedtesting.rules.StatementAdapter.evaluate(StatementAdapter.java:36)
	at com.carrotsearch.randomizedtesting.ThreadLeakControl$StatementRunner.run(ThreadLeakControl.java:367)
	at com.carrotsearch.randomizedtesting.ThreadLeakControl.forkTimeoutingTask(ThreadLeakControl.java:809)
	at com.carrotsearch.randomizedtesting.ThreadLeakControl$3.evaluate(ThreadLeakControl.java:460)
	at com.carrotsearch.randomizedtesting.RandomizedRunner.runSingleTest(RandomizedRunner.java:880)
	at com.carrotsearch.randomizedtesting.RandomizedRunner$5.evaluate(RandomizedRunner.java:781)
	at com.carrotsearch.randomizedtesting.RandomizedRunner$6.evaluate(RandomizedRunner.java:816)
	at com.carrotsearch.randomizedtesting.RandomizedRunner$7.evaluate(RandomizedRunner.java:827)
	at com.carrotsearch.randomizedtesting.rules.StatementAdapter.evaluate(StatementAdapter.java:36)
	at com.carrotsearch.randomizedtesting.rules.SystemPropertiesRestoreRule$1.evaluate(SystemPropertiesRestoreRule.java:57)
	at org.apache.lucene.util.AbstractBeforeAfterRule$1.evaluate(AbstractBeforeAfterRule.java:45)
	at com.carrotsearch.randomizedtesting.rules.StatementAdapter.evaluate(StatementAdapter.java:36)
	at org.apache.lucene.util.TestRuleStoreClassName$1.evaluate(TestRuleStoreClassName.java:41)
	at com.carrotsearch.randomizedtesting.rules.NoShadowingOrOverridesOnMethodsRule$1.evaluate(NoShadowingOrOverridesOnMethodsRule.java:40)
	at com.carrotsearch.randomizedtesting.rules.NoShadowingOrOverridesOnMethodsRule$1.evaluate(NoShadowingOrOverridesOnMethodsRule.java:40)
	at com.carrotsearch.randomizedtesting.rules.StatementAdapter.evaluate(StatementAdapter.java:36)
	at com.carrotsearch.randomizedtesting.rules.StatementAdapter.evaluate(StatementAdapter.java:36)
	at com.carrotsearch.randomizedtesting.rules.StatementAdapter.evaluate(StatementAdapter.java:36)
	at org.apache.lucene.util.TestRuleAssertionsRequired$1.evaluate(TestRuleAssertionsRequired.java:53)
	at org.apache.lucene.util.TestRuleMarkFailure$1.evaluate(TestRuleMarkFailure.java:47)
	at org.apache.lucene.util.TestRuleIgnoreAfterMaxFailures$1.evaluate(TestRuleIgnoreAfterMaxFailures.java:64)
	at org.apache.lucene.util.TestRuleIgnoreTestSuites$1.evaluate(TestRuleIgnoreTestSuites.java:54)
	at com.carrotsearch.randomizedtesting.rules.StatementAdapter.evaluate(StatementAdapter.java:36)
	at com.carrotsearch.randomizedtesting.ThreadLeakControl$StatementRunner.run(ThreadLeakControl.java:367)
	at java.lang.Thread.run(Thread.java:745)




Build Log:
[...truncated 10861 lines...]
   [junit4] Suite: org.apache.solr.cloud.DistribDocExpirationUpdateProcessorTest
   [junit4]   2> Creating dataDir: /Users/jenkins/workspace/Lucene-Solr-6.x-MacOSX/solr/build/solr-core/test/J0/temp/solr.cloud.DistribDocExpirationUpdateProcessorTest_161A4A7F16B3230A-001/init-core-data-001
   [junit4]   2> 470131 INFO  (SUITE-DistribDocExpirationUpdateProcessorTest-seed#[161A4A7F16B3230A]-worker) [    ] o.a.s.SolrTestCaseJ4 Randomized ssl (false) and clientAuth (false)
   [junit4]   2> 470131 INFO  (SUITE-DistribDocExpirationUpdateProcessorTest-seed#[161A4A7F16B3230A]-worker) [    ] o.a.s.BaseDistributedSearchTestCase Setting hostContext system property: /
   [junit4]   2> 470135 INFO  (TEST-DistribDocExpirationUpdateProcessorTest.test-seed#[161A4A7F16B3230A]) [    ] o.a.s.c.ZkTestServer STARTING ZK TEST SERVER
   [junit4]   2> 470135 INFO  (Thread-764) [    ] o.a.s.c.ZkTestServer client port:0.0.0.0/0.0.0.0:0
   [junit4]   2> 470135 INFO  (Thread-764) [    ] o.a.s.c.ZkTestServer Starting server
   [junit4]   2> 470235 INFO  (TEST-DistribDocExpirationUpdateProcessorTest.test-seed#[161A4A7F16B3230A]) [    ] o.a.s.c.ZkTestServer start zk server on port:65050
   [junit4]   2> 470236 INFO  (TEST-DistribDocExpirationUpdateProcessorTest.test-seed#[161A4A7F16B3230A]) [    ] o.a.s.c.c.SolrZkClient Using default ZkCredentialsProvider
   [junit4]   2> 470237 INFO  (TEST-DistribDocExpirationUpdateProcessorTest.test-seed#[161A4A7F16B3230A]) [    ] o.a.s.c.c.ConnectionManager Waiting for client to connect to ZooKeeper
   [junit4]   2> 470252 INFO  (zkCallback-483-thread-1) [    ] o.a.s.c.c.ConnectionManager Watcher org.apache.solr.common.cloud.ConnectionManager@3ec52542 name:ZooKeeperConnection Watcher:127.0.0.1:65050 got event WatchedEvent state:SyncConnected type:None path:null path:null type:None
   [junit4]   2> 470253 INFO  (TEST-DistribDocExpirationUpdateProcessorTest.test-seed#[161A4A7F16B3230A]) [    ] o.a.s.c.c.ConnectionManager Client is connected to ZooKeeper
   [junit4]   2> 470253 INFO  (TEST-DistribDocExpirationUpdateProcessorTest.test-seed#[161A4A7F16B3230A]) [    ] o.a.s.c.c.SolrZkClient Using default ZkACLProvider
   [junit4]   2> 470253 INFO  (TEST-DistribDocExpirationUpdateProcessorTest.test-seed#[161A4A7F16B3230A]) [    ] o.a.s.c.c.SolrZkClient makePath: /solr
   [junit4]   2> 470261 INFO  (TEST-DistribDocExpirationUpdateProcessorTest.test-seed#[161A4A7F16B3230A]) [    ] o.a.s.c.c.SolrZkClient Using default ZkCredentialsProvider
   [junit4]   2> 470263 INFO  (TEST-DistribDocExpirationUpdateProcessorTest.test-seed#[161A4A7F16B3230A]) [    ] o.a.s.c.c.ConnectionManager Waiting for client to connect to ZooKeeper
   [junit4]   2> 470265 INFO  (zkCallback-484-thread-1) [    ] o.a.s.c.c.ConnectionManager Watcher org.apache.solr.common.cloud.ConnectionManager@1b74b2f7 name:ZooKeeperConnection Watcher:127.0.0.1:65050/solr got event WatchedEvent state:SyncConnected type:None path:null path:null type:None
   [junit4]   2> 470265 INFO  (TEST-DistribDocExpirationUpdateProcessorTest.test-seed#[161A4A7F16B3230A]) [    ] o.a.s.c.c.ConnectionManager Client is connected to ZooKeeper
   [junit4]   2> 470266 INFO  (TEST-DistribDocExpirationUpdateProcessorTest.test-seed#[161A4A7F16B3230A]) [    ] o.a.s.c.c.SolrZkClient Using default ZkACLProvider
   [junit4]   2> 470266 INFO  (TEST-DistribDocExpirationUpdateProcessorTest.test-seed#[161A4A7F16B3230A]) [    ] o.a.s.c.c.SolrZkClient makePath: /collections/collection1
   [junit4]   2> 470271 INFO  (TEST-DistribDocExpirationUpdateProcessorTest.test-seed#[161A4A7F16B3230A]) [    ] o.a.s.c.c.SolrZkClient makePath: /collections/collection1/shards
   [junit4]   2> 470275 INFO  (TEST-DistribDocExpirationUpdateProcessorTest.test-seed#[161A4A7F16B3230A]) [    ] o.a.s.c.c.SolrZkClient makePath: /collections/control_collection
   [junit4]   2> 470277 INFO  (TEST-DistribDocExpirationUpdateProcessorTest.test-seed#[161A4A7F16B3230A]) [    ] o.a.s.c.c.SolrZkClient makePath: /collections/control_collection/shards
   [junit4]   2> 470281 INFO  (TEST-DistribDocExpirationUpdateProcessorTest.test-seed#[161A4A7F16B3230A]) [    ] o.a.s.c.AbstractZkTestCase put /Users/jenkins/workspace/Lucene-Solr-6.x-MacOSX/solr/core/src/test-files/solr/collection1/conf/solrconfig-doc-expire-update-processor.xml to /configs/conf1/solrconfig.xml
   [junit4]   2> 470282 INFO  (TEST-DistribDocExpirationUpdateProcessorTest.test-seed#[161A4A7F16B3230A]) [    ] o.a.s.c.c.SolrZkClient makePath: /configs/conf1/solrconfig.xml
   [junit4]   2> 470287 INFO  (TEST-DistribDocExpirationUpdateProcessorTest.test-seed#[161A4A7F16B3230A]) [    ] o.a.s.c.AbstractZkTestCase put /Users/jenkins/workspace/Lucene-Solr-6.x-MacOSX/solr/core/src/test-files/solr/collection1/conf/schema15.xml to /configs/conf1/schema.xml
   [junit4]   2> 470287 INFO  (TEST-DistribDocExpirationUpdateProcessorTest.test-seed#[161A4A7F16B3230A]) [    ] o.a.s.c.c.SolrZkClient makePath: /configs/conf1/schema.xml
   [junit4]   2> 470292 INFO  (TEST-DistribDocExpirationUpdateProcessorTest.test-seed#[161A4A7F16B3230A]) [    ] o.a.s.c.AbstractZkTestCase put /Users/jenkins/workspace/Lucene-Solr-6.x-MacOSX/solr/core/src/test-files/solr/collection1/conf/solrconfig.snippet.randomindexconfig.xml to /configs/conf1/solrconfig.snippet.randomindexconfig.xml
   [junit4]   2> 470292 INFO  (TEST-DistribDocExpirationUpdateProcessorTest.test-seed#[161A4A7F16B3230A]) [    ] o.a.s.c.c.SolrZkClient makePath: /configs/conf1/solrconfig.snippet.randomindexconfig.xml
   [junit4]   2> 470296 INFO  (TEST-DistribDocExpirationUpdateProcessorTest.test-seed#[161A4A7F16B3230A]) [    ] o.a.s.c.AbstractZkTestCase put /Users/jenkins/workspace/Lucene-Solr-6.x-MacOSX/solr/core/src/test-files/solr/collection1/conf/stopwords.txt to /configs/conf1/stopwords.txt
   [junit4]   2> 470296 INFO  (TEST-DistribDocExpirationUpdateProcessorTest.test-seed#[161A4A7F16B3230A]) [    ] o.a.s.c.c.SolrZkClient makePath: /configs/conf1/stopwords.txt
   [junit4]   2> 470301 INFO  (TEST-DistribDocExpirationUpdateProcessorTest.test-seed#[161A4A7F16B3230A]) [    ] o.a.s.c.AbstractZkTestCase put /Users/jenkins/workspace/Lucene-Solr-6.x-MacOSX/solr/core/src/test-files/solr/collection1/conf/protwords.txt to /configs/conf1/protwords.txt
   [junit4]   2> 470301 INFO  (TEST-DistribDocExpirationUpdateProcessorTest.test-seed#[161A4A7F16B3230A]) [    ] o.a.s.c.c.SolrZkClient makePath: /configs/conf1/protwords.txt
   [junit4]   2> 470305 INFO  (TEST-DistribDocExpirationUpdateProcessorTest.test-seed#[161A4A7F16B3230A]) [    ] o.a.s.c.AbstractZkTestCase put /Users/jenkins/workspace/Lucene-Solr-6.x-MacOSX/solr/core/src/test-files/solr/collection1/conf/currency.xml to /configs/conf1/currency.xml
   [junit4]   2> 470305 INFO  (TEST-DistribDocExpirationUpdateProcessorTest.test-seed#[161A4A7F16B3230A]) [    ] o.a.s.c.c.SolrZkClient makePath: /configs/conf1/currency.xml
   [junit4]   2> 470314 INFO  (TEST-DistribDocExpirationUpdateProcessorTest.test-seed#[161A4A7F16B3230A]) [    ] o.a.s.c.AbstractZkTestCase put /Users/jenkins/workspace/Lucene-Solr-6.x-MacOSX/solr/core/src/test-files/solr/collection1/conf/enumsConfig.xml to /configs/conf1/enumsConfig.xml
   [junit4]   2> 470314 INFO  (TEST-DistribDocExpirationUpdateProcessorTest.test-seed#[161A4A7F16B3230A]) [    ] o.a.s.c.c.SolrZkClient makePath: /configs/conf1/enumsConfig.xml
   [junit4]   2> 470318 INFO  (TEST-DistribDocExpirationUpdateProcessorTest.test-seed#[161A4A7F16B3230A]) [    ] o.a.s.c.AbstractZkTestCase put /Users/jenkins/workspace/Lucene-Solr-6.x-MacOSX/solr/core/src/test-files/solr/collection1/conf/open-exchange-rates.json to /configs/conf1/open-exchange-rates.json
   [junit4]   2> 470319 INFO  (TEST-DistribDocExpirationUpdateProcessorTest.test-seed#[161A4A7F16B3230A]) [    ] o.a.s.c.c.SolrZkClient makePath: /configs/conf1/open-exchange-rates.json
   [junit4]   2> 470323 INFO  (TEST-DistribDocExpirationUpdateProcessorTest.test-seed#[161A4A7F16B3230A]) [    ] o.a.s.c.AbstractZkTestCase put /Users/jenkins/workspace/Lucene-Solr-6.x-MacOSX/solr/core/src/test-files/solr/collection1/conf/mapping-ISOLatin1Accent.txt to /configs/conf1/mapping-ISOLatin1Accent.txt
   [junit4]   2> 470323 INFO  (TEST-DistribDocExpirationUpdateProcessorTest.test-seed#[161A4A7F16B3230A]) [    ] o.a.s.c.c.SolrZkClient makePath: /configs/conf1/mapping-ISOLatin1Accent.txt
   [junit4]   2> 470328 INFO  (TEST-DistribDocExpirationUpdateProcessorTest.test-seed#[161A4A7F16B3230A]) [    ] o.a.s.c.AbstractZkTestCase put /Users/jenkins/workspace/Lucene-Solr-6.x-MacOSX/solr/core/src/test-files/solr/collection1/conf/old_synonyms.txt to /configs/conf1/old_synonyms.txt
   [junit4]   2> 470328 INFO  (TEST-DistribDocExpirationUpdateProcessorTest.test-seed#[161A4A7F16B3230A]) [    ] o.a.s.c.c.SolrZkClient makePath: /configs/conf1/old_synonyms.txt
   [junit4]   2> 470332 INFO  (TEST-DistribDocExpirationUpdateProcessorTest.test-seed#[161A4A7F16B3230A]) [    ] o.a.s.c.AbstractZkTestCase put /Users/jenkins/workspace/Lucene-Solr-6.x-MacOSX/solr/core/src/test-files/solr/collection1/conf/synonyms.txt to /configs/conf1/synonyms.txt
   [junit4]   2> 470333 INFO  (TEST-DistribDocExpirationUpdateProcessorTest.test-seed#[161A4A7F16B3230A]) [    ] o.a.s.c.c.SolrZkClient makePath: /configs/conf1/synonyms.txt
   [junit4]   2> 470702 INFO  (TEST-DistribDocExpirationUpdateProcessorTest.test-seed#[161A4A7F16B3230A]) [    ] o.a.s.SolrTestCaseJ4 Writing core.properties file to /Users/jenkins/workspace/Lucene-Solr-6.x-MacOSX/solr/build/solr-core/test/J0/temp/solr.cloud.DistribDocExpirationUpdateProcessorTest_161A4A7F16B3230A-001/control-001/cores/collection1
   [junit4]   2> 470709 INFO  (TEST-DistribDocExpirationUpdateProcessorTest.test-seed#[161A4A7F16B3230A]) [    ] o.e.j.s.Server jetty-9.3.8.v20160314
   [junit4]   2> 470712 INFO  (TEST-DistribDocExpirationUpdateProcessorTest.test-seed#[161A4A7F16B3230A]) [    ] o.e.j.s.h.ContextHandler Started o.e.j.s.ServletContextHandler@6eb3be72{/,null,AVAILABLE}
   [junit4]   2> 470713 INFO  (TEST-DistribDocExpirationUpdateProcessorTest.test-seed#[161A4A7F16B3230A]) [    ] o.e.j.s.ServerConnector Started ServerConnector@57a53453{HTTP/1.1,[http/1.1]}{127.0.0.1:65053}
   [junit4]   2> 470714 INFO  (TEST-DistribDocExpirationUpdateProcessorTest.test-seed#[161A4A7F16B3230A]) [    ] o.e.j.s.Server Started @476400ms
   [junit4]   2> 470714 INFO  (TEST-DistribDocExpirationUpdateProcessorTest.test-seed#[161A4A7F16B3230A]) [    ] o.a.s.c.s.e.JettySolrRunner Jetty properties: {solr.data.dir=/Users/jenkins/workspace/Lucene-Solr-6.x-MacOSX/solr/build/solr-core/test/J0/temp/solr.cloud.DistribDocExpirationUpdateProcessorTest_161A4A7F16B3230A-001/tempDir-001/control/data, hostContext=/, hostPort=65053, coreRootDirectory=/Users/jenkins/workspace/Lucene-Solr-6.x-MacOSX/solr/build/solr-core/test/J0/../../../../../../../../../Users/jenkins/workspace/Lucene-Solr-6.x-MacOSX/solr/build/solr-core/test/J0/temp/solr.cloud.DistribDocExpirationUpdateProcessorTest_161A4A7F16B3230A-001/control-001/cores}
   [junit4]   2> 470714 INFO  (TEST-DistribDocExpirationUpdateProcessorTest.test-seed#[161A4A7F16B3230A]) [    ] o.a.s.s.SolrDispatchFilter SolrDispatchFilter.init(): sun.misc.Launcher$AppClassLoader@4554617c
   [junit4]   2> 470714 INFO  (TEST-DistribDocExpirationUpdateProcessorTest.test-seed#[161A4A7F16B3230A]) [    ] o.a.s.c.SolrResourceLoader new SolrResourceLoader for directory: '/Users/jenkins/workspace/Lucene-Solr-6.x-MacOSX/solr/build/solr-core/test/J0/temp/solr.cloud.DistribDocExpirationUpdateProcessorTest_161A4A7F16B3230A-001/control-001'
   [junit4]   2> 470715 INFO  (TEST-DistribDocExpirationUpdateProcessorTest.test-seed#[161A4A7F16B3230A]) [    ] o.a.s.c.SolrResourceLoader JNDI not configured for solr (NoInitialContextEx)
   [junit4]   2> 470715 INFO  (TEST-DistribDocExpirationUpdateProcessorTest.test-seed#[161A4A7F16B3230A]) [    ] o.a.s.c.SolrResourceLoader solr home defaulted to 'solr/' (could not find system property or JNDI)
   [junit4]   2> 470715 INFO  (TEST-DistribDocExpirationUpdateProcessorTest.test-seed#[161A4A7F16B3230A]) [    ] o.a.s.c.c.SolrZkClient Using default ZkCredentialsProvider
   [junit4]   2> 470716 INFO  (TEST-DistribDocExpirationUpdateProcessorTest.test-seed#[161A4A7F16B3230A]) [    ] o.a.s.c.c.ConnectionManager Waiting for client to connect to ZooKeeper
   [junit4]   2> 470718 INFO  (zkCallback-485-thread-1) [    ] o.a.s.c.c.ConnectionManager Watcher org.apache.solr.common.cloud.ConnectionManager@1a0dc774 name:ZooKeeperConnection Watcher:127.0.0.1:65050/solr got event WatchedEvent state:SyncConnected type:None path:null path:null type:None
   [junit4]   2> 470718 INFO  (TEST-DistribDocExpirationUpdateProcessorTest.test-seed#[161A4A7F16B3230A]) [    ] o.a.s.c.c.ConnectionManager Client is connected to ZooKeeper
   [junit4]   2> 470719 INFO  (TEST-DistribDocExpirationUpdateProcessorTest.test-seed#[161A4A7F16B3230A]) [    ] o.a.s.c.c.SolrZkClient Using default ZkACLProvider
   [junit4]   2> 470722 INFO  (TEST-DistribDocExpirationUpdateProcessorTest.test-seed#[161A4A7F16B3230A]) [    ] o.a.s.s.SolrDispatchFilter Loading solr.xml from SolrHome (not found in ZooKeeper)
   [junit4]   2> 470722 INFO  (TEST-DistribDocExpirationUpdateProcessorTest.test-seed#[161A4A7F16B3230A]) [    ] o.a.s.c.SolrXmlConfig Loading container configuration from /Users/jenkins/workspace/Lucene-Solr-6.x-MacOSX/solr/build/solr-core/test/J0/temp/solr.cloud.DistribDocExpirationUpdateProcessorTest_161A4A7F16B3230A-001/control-001/solr.xml
   [junit4]   2> 470770 INFO  (TEST-DistribDocExpirationUpdateProcessorTest.test-seed#[161A4A7F16B3230A]) [    ] o.a.s.c.CorePropertiesLocator Config-defined core root directory: /Users/jenkins/workspace/Lucene-Solr-6.x-MacOSX/solr/build/solr-core/test/J0/../../../../../../../../../Users/jenkins/workspace/Lucene-Solr-6.x-MacOSX/solr/build/solr-core/test/J0/temp/solr.cloud.DistribDocExpirationUpdateProcessorTest_161A4A7F16B3230A-001/control-001/cores
   [junit4]   2> 470770 INFO  (TEST-DistribDocExpirationUpdateProcessorTest.test-seed#[161A4A7F16B3230A]) [    ] o.a.s.c.CoreContainer New CoreContainer 1499372002
   [junit4]   2> 470771 INFO  (TEST-DistribDocExpirationUpdateProcessorTest.test-seed#[161A4A7F16B3230A]) [    ] o.a.s.c.CoreContainer Loading cores into CoreContainer [instanceDir=/Users/jenkins/workspace/Lucene-Solr-6.x-MacOSX/solr/build/solr-core/test/J0/temp/solr.cloud.DistribDocExpirationUpdateProcessorTest_161A4A7F16B3230A-001/control-001]
   [junit4]   2> 470771 WARN  (TEST-DistribDocExpirationUpdateProcessorTest.test-seed#[161A4A7F16B3230A]) [    ] o.a.s.c.CoreContainer Couldn't add files from /Users/jenkins/workspace/Lucene-Solr-6.x-MacOSX/solr/build/solr-core/test/J0/temp/solr.cloud.DistribDocExpirationUpdateProcessorTest_161A4A7F16B3230A-001/control-001/lib to classpath: /Users/jenkins/workspace/Lucene-Solr-6.x-MacOSX/solr/build/solr-core/test/J0/temp/solr.cloud.DistribDocExpirationUpdateProcessorTest_161A4A7F16B3230A-001/control-001/lib
   [junit4]   2> 470771 INFO  (TEST-DistribDocExpirationUpdateProcessorTest.test-seed#[161A4A7F16B3230A]) [    ] o.a.s.h.c.HttpShardHandlerFactory created with socketTimeout : 90000,urlScheme : ,connTimeout : 15000,maxConnectionsPerHost : 20,maxConnections : 10000,corePoolSize : 0,maximumPoolSize : 2147483647,maxThreadIdleTime : 5,sizeOfQueue : -1,fairnessPolicy : false,useRetries : false,
   [junit4]   2> 470776 INFO  (TEST-DistribDocExpirationUpdateProcessorTest.test-seed#[161A4A7F16B3230A]) [    ] o.a.s.u.UpdateShardHandler Creating UpdateShardHandler HTTP client with params: socketTimeout=340000&connTimeout=45000&retry=true
   [junit4]   2> 470777 INFO  (TEST-DistribDocExpirationUpdateProcessorTest.test-seed#[161A4A7F16B3230A]) [    ] o.a.s.l.LogWatcher SLF4J impl is org.slf4j.impl.Log4jLoggerFactory
   [junit4]   2> 470777 INFO  (TEST-DistribDocExpirationUpdateProcessorTest.test-seed#[161A4A7F16B3230A]) [    ] o.a.s.l.LogWatcher Registering Log Listener [Log4j (org.slf4j.impl.Log4jLoggerFactory)]
   [junit4]   2> 470777 INFO  (TEST-DistribDocExpirationUpdateProcessorTest.test-seed#[161A4A7F16B3230A]) [    ] o.a.s.c.ZkContainer Zookeeper client=127.0.0.1:65050/solr
   [junit4]   2> 470777 INFO  (TEST-DistribDocExpirationUpdateProcessorTest.test-seed#[161A4A7F16B3230A]) [    ] o.a.s.c.ZkController zkHost includes chroot
   [junit4]   2> 470777 INFO  (TEST-DistribDocExpirationUpdateProcessorTest.test-seed#[161A4A7F16B3230A]) [    ] o.a.s.c.c.SolrZkClient Using default ZkCredentialsProvider
   [junit4]   2> 470779 INFO  (TEST-DistribDocExpirationUpdateProcessorTest.test-seed#[161A4A7F16B3230A]) [    ] o.a.s.c.c.ConnectionManager Waiting for client to connect to ZooKeeper
   [junit4]   2> 470781 INFO  (zkCallback-488-thread-1) [    ] o.a.s.c.c.ConnectionManager Watcher org.apache.solr.common.cloud.ConnectionManager@723ff16d name:ZooKeeperConnection Watcher:127.0.0.1:65050 got event WatchedEvent state:SyncConnected type:None path:null path:null type:None
   [junit4]   2> 470781 INFO  (TEST-DistribDocExpirationUpdateProcessorTest.test-seed#[161A4A7F16B3230A]) [    ] o.a.s.c.c.ConnectionManager Client is connected to ZooKeeper
   [junit4]   2> 470781 INFO  (TEST-DistribDocExpirationUpdateProcessorTest.test-seed#[161A4A7F16B3230A]) [    ] o.a.s.c.c.SolrZkClient Using default ZkACLProvider
   [junit4]   2> 470794 INFO  (TEST-DistribDocExpirationUpdateProcessorTest.test-seed#[161A4A7F16B3230A]) [n:127.0.0.1:65053_    ] o.a.s.c.c.ConnectionManager Waiting for client to connect to ZooKeeper
   [junit4]   2> 470794 INFO  (zkCallback-489-thread-1-processing-n:127.0.0.1:65053_) [n:127.0.0.1:65053_    ] o.a.s.c.c.ConnectionManager Watcher org.apache.solr.common.cloud.ConnectionManager@7ae6d5b3 name:ZooKeeperConnection Watcher:127.0.0.1:65050/solr got event WatchedEvent state:SyncConnected type:None path:null path:null type:None
   [junit4]   2> 470795 INFO  (TEST-DistribDocExpirationUpdateProcessorTest.test-seed#[161A4A7F16B3230A]) [n:127.0.0.1:65053_    ] o.a.s.c.c.ConnectionManager Client is connected to ZooKeeper
   [junit4]   2> 470797 INFO  (TEST-DistribDocExpirationUpdateProcessorTest.test-seed#[161A4A7F16B3230A]) [n:127.0.0.1:65053_    ] o.a.s.c.c.SolrZkClient makePath: /overseer/queue
   [junit4]   2> 470803 INFO  (TEST-DistribDocExpirationUpdateProcessorTest.test-seed#[161A4A7F16B3230A]) [n:127.0.0.1:65053_    ] o.a.s.c.c.SolrZkClient makePath: /overseer/collection-queue-work
   [junit4]   2> 470810 INFO  (TEST-DistribDocExpirationUpdateProcessorTest.test-seed#[161A4A7F16B3230A]) [n:127.0.0.1:65053_    ] o.a.s.c.c.SolrZkClient makePath: /overseer/collection-map-running
   [junit4]   2> 470815 INFO  (TEST-DistribDocExpirationUpdateProcessorTest.test-seed#[161A4A7F16B3230A]) [n:127.0.0.1:65053_    ] o.a.s.c.c.SolrZkClient makePath: /overseer/collection-map-completed
   [junit4]   2> 470819 INFO  (TEST-DistribDocExpirationUpdateProcessorTest.test-seed#[161A4A7F16B3230A]) [n:127.0.0.1:65053_    ] o.a.s.c.c.SolrZkClient makePath: /overseer/collection-map-failure
   [junit4]   2> 470824 INFO  (TEST-DistribDocExpirationUpdateProcessorTest.test-seed#[161A4A7F16B3230A]) [n:127.0.0.1:65053_    ] o.a.s.c.c.SolrZkClient makePath: /live_nodes
   [junit4]   2> 470832 INFO  (TEST-DistribDocExpirationUpdateProcessorTest.test-seed#[161A4A7F16B3230A]) [n:127.0.0.1:65053_    ] o.a.s.c.c.SolrZkClient makePath: /aliases.json
   [junit4]   2> 470835 INFO  (TEST-DistribDocExpirationUpdateProcessorTest.test-seed#[161A4A7F16B3230A]) [n:127.0.0.1:65053_    ] o.a.s.c.c.SolrZkClient makePath: /clusterstate.json
   [junit4]   2> 470838 INFO  (TEST-DistribDocExpirationUpdateProcessorTest.test-seed#[161A4A7F16B3230A]) [n:127.0.0.1:65053_    ] o.a.s.c.c.SolrZkClient makePath: /security.json
   [junit4]   2> 470840 INFO  (TEST-DistribDocExpirationUpdateProcessorTest.test-seed#[161A4A7F16B3230A]) [n:127.0.0.1:65053_    ] o.a.s.c.c.ZkStateReader Updating cluster state from ZooKeeper... 
   [junit4]   2> 470843 INFO  (TEST-DistribDocExpirationUpdateProcessorTest.test-seed#[161A4A7F16B3230A]) [n:127.0.0.1:65053_    ] o.a.s.c.c.ZkStateReader Updated live nodes from ZooKeeper... (0) -> (0)
   [junit4]   2> 470847 INFO  (TEST-DistribDocExpirationUpdateProcessorTest.test-seed#[161A4A7F16B3230A]) [n:127.0.0.1:65053_    ] o.a.s.c.c.SolrZkClient makePath: /overseer_elect
   [junit4]   2> 470850 INFO  (TEST-DistribDocExpirationUpdateProcessorTest.test-seed#[161A4A7F16B3230A]) [n:127.0.0.1:65053_    ] o.a.s.c.c.SolrZkClient makePath: /overseer_elect/election
   [junit4]   2> 470852 INFO  (TEST-DistribDocExpirationUpdateProcessorTest.test-seed#[161A4A7F16B3230A]) [n:127.0.0.1:65053_    ] o.a.s.c.Overseer Overseer (id=null) closing
   [junit4]   2> 470853 INFO  (TEST-DistribDocExpirationUpdateProcessorTest.test-seed#[161A4A7F16B3230A]) [n:127.0.0.1:65053_    ] o.a.s.c.LeaderElector Joined leadership election with path: /overseer_elect/election/95630002423988228-127.0.0.1:65053_-n_0000000000
   [junit4]   2> 470853 INFO  (TEST-DistribDocExpirationUpdateProcessorTest.test-seed#[161A4A7F16B3230A]) [n:127.0.0.1:65053_    ] o.a.s.c.OverseerElectionContext I am going to be the leader 127.0.0.1:65053_
   [junit4]   2> 470853 INFO  (TEST-DistribDocExpirationUpdateProcessorTest.test-seed#[161A4A7F16B3230A]) [n:127.0.0.1:65053_    ] o.a.s.c.c.SolrZkClient makePath: /overseer_elect/leader
   [junit4]   2> 470858 INFO  (TEST-DistribDocExpirationUpdateProcessorTest.test-seed#[161A4A7F16B3230A]) [n:127.0.0.1:65053_    ] o.a.s.c.Overseer Overseer (id=95630002423988228-127.0.0.1:65053_-n_0000000000) starting
   [junit4]   2> 470863 INFO  (TEST-DistribDocExpirationUpdateProcessorTest.test-seed#[161A4A7F16B3230A]) [n:127.0.0.1:65053_    ] o.a.s.c.c.SolrZkClient makePath: /overseer/queue-work
   [junit4]   2> 470875 INFO  (TEST-DistribDocExpirationUpdateProcessorTest.test-seed#[161A4A7F16B3230A]) [n:127.0.0.1:65053_    ] o.a.s.c.OverseerAutoReplicaFailoverThread Starting OverseerAutoReplicaFailoverThread autoReplicaFailoverWorkLoopDelay=10000 autoReplicaFailoverWaitAfterExpiration=30000 autoReplicaFailoverBadNodeExpiration=60000
   [junit4]   2> 470876 INFO  (OverseerStateUpdate-95630002423988228-127.0.0.1:65053_-n_0000000000) [n:127.0.0.1:65053_    ] o.a.s.c.Overseer Starting to work on the main queue
   [junit4]   2> 470877 INFO  (OverseerCollectionConfigSetProcessor-95630002423988228-127.0.0.1:65053_-n_0000000000) [n:127.0.0.1:65053_    ] o.a.s.c.OverseerTaskProcessor Process current queue of overseer operations
   [junit4]   2> 470880 INFO  (OverseerStateUpdate-95630002423988228-127.0.0.1:65053_-n_0000000000) [n:127.0.0.1:65053_    ] o.a.s.c.c.ZkStateReader Updated live nodes from ZooKeeper... (0) -> (0)
   [junit4]   2> 470882 INFO  (TEST-DistribDocExpirationUpdateProcessorTest.test-seed#[161A4A7F16B3230A]) [n:127.0.0.1:65053_    ] o.a.s.c.ZkController Register node as live in ZooKeeper:/live_nodes/127.0.0.1:65053_
   [junit4]   2> 470883 INFO  (TEST-DistribDocExpirationUpdateProcessorTest.test-seed#[161A4A7F16B3230A]) [n:127.0.0.1:65053_    ] o.a.s.c.c.SolrZkClient makePath: /live_nodes/127.0.0.1:65053_
   [junit4]   2> 470886 INFO  (zkCallback-489-thread-1-processing-n:127.0.0.1:65053_) [n:127.0.0.1:65053_    ] o.a.s.c.c.ZkStateReader A live node change: [WatchedEvent state:SyncConnected type:NodeChildrenChanged path:/live_nodes], has occurred - updating... (live nodes size: [0])
   [junit4]   2> 470887 INFO  (zkCallback-489-thread-1-processing-n:127.0.0.1:65053_) [n:127.0.0.1:65053_    ] o.a.s.c.c.ZkStateReader Updated live nodes from ZooKeeper... (0) -> (1)
   [junit4]   2> 470896 INFO  (TEST-DistribDocExpirationUpdateProcessorTest.test-seed#[161A4A7F16B3230A]) [n:127.0.0.1:65053_    ] o.a.s.c.CoreContainer Security conf doesn't exist. Skipping setup for authorization module.
   [junit4]   2> 470896 INFO  (TEST-DistribDocExpirationUpdateProcessorTest.test-seed#[161A4A7F16B3230A]) [n:127.0.0.1:65053_    ] o.a.s.c.CoreContainer No authentication plugin used.
   [junit4]   2> 470898 INFO  (TEST-DistribDocExpirationUpdateProcessorTest.test-seed#[161A4A7F16B3230A]) [n:127.0.0.1:65053_    ] o.a.s.c.CorePropertiesLocator Looking for core definitions underneath /Users/jenkins/workspace/Lucene-Solr-6.x-MacOSX/solr/build/solr-core/test/J0/../../../../../../../../../Users/jenkins/workspace/Lucene-Solr-6.x-MacOSX/solr/build/solr-core/test/J0/temp/solr.cloud.DistribDocExpirationUpdateProcessorTest_161A4A7F16B3230A-001/control-001/cores
   [junit4]   2> 470900 INFO  (TEST-DistribDocExpirationUpdateProcessorTest.test-seed#[161A4A7F16B3230A]) [n:127.0.0.1:65053_    ] o.a.s.c.CoreDescriptor Created CoreDescriptor: {name=collection1, config=solrconfig.xml, transient=false, schema=schema.xml, loadOnStartup=true, configSetProperties=configsetprops.json, collection=control_collection, coreNodeName=, dataDir=data/, shard=}
   [junit4]   2> 470900 INFO  (TEST-DistribDocExpirationUpdateProcessorTest.test-seed#[161A4A7F16B3230A]) [n:127.0.0.1:65053_    ] o.a.s.c.CorePropertiesLocator Found core collection1 in /Users/jenkins/workspace/Lucene-Solr-6.x-MacOSX/solr/build/solr-core/test/J0/../../../../../../../../../Users/jenkins/workspace/Lucene-Solr-6.x-MacOSX/solr/build/solr-core/test/J0/temp/solr.cloud.DistribDocExpirationUpdateProcessorTest_161A4A7F16B3230A-001/control-001/cores/collection1
   [junit4]   2> 470901 INFO  (TEST-DistribDocExpirationUpdateProcessorTest.test-seed#[161A4A7F16B3230A]) [n:127.0.0.1:65053_    ] o.a.s.c.CorePropertiesLocator Found 1 core definitions
   [junit4]   2> 470903 INFO  (coreLoadExecutor-1221-thread-1-processing-n:127.0.0.1:65053_) [n:127.0.0.1:65053_ c:control_collection   x:collection1] o.a.s.c.ZkController publishing state=down
   [junit4]   2> 470903 INFO  (coreLoadExecutor-1221-thread-1-processing-n:127.0.0.1:65053_) [n:127.0.0.1:65053_ c:control_collection   x:collection1] o.a.s.c.ZkController numShards not found on descriptor - reading it from system property
   [junit4]   2> 470903 INFO  (TEST-DistribDocExpirationUpdateProcessorTest.test-seed#[161A4A7F16B3230A]) [n:127.0.0.1:65053_    ] o.a.s.s.SolrDispatchFilter user.dir=/Users/jenkins/workspace/Lucene-Solr-6.x-MacOSX/solr/build/solr-core/test/J0
   [junit4]   2> 470903 INFO  (TEST-DistribDocExpirationUpdateProcessorTest.test-seed#[161A4A7F16B3230A]) [n:127.0.0.1:65053_    ] o.a.s.s.SolrDispatchFilter SolrDispatchFilter.init() done
   [junit4]   2> 470907 INFO  (OverseerStateUpdate-95630002423988228-127.0.0.1:65053_-n_0000000000) [n:127.0.0.1:65053_    ] o.a.s.c.Overseer processMessage: queueSize: 1, message = {
   [junit4]   2>   "core":"collection1",
   [junit4]   2>   "roles":null,
   [junit4]   2>   "base_url":"http://127.0.0.1:65053",
   [junit4]   2>   "node_name":"127.0.0.1:65053_",
   [junit4]   2>   "numShards":"1",
   [junit4]   2>   "state":"down",
   [junit4]   2>   "shard":null,
   [junit4]   2>   "collection":"control_collection",
   [junit4]   2>   "operation":"state"} current state version: 0
   [junit4]   2> 470908 INFO  (coreLoadExecutor-1221-thread-1-processing-n:127.0.0.1:65053_) [n:127.0.0.1:65053_ c:control_collection   x:collection1] o.a.s.c.ZkController look for our core node name
   [junit4]   2> 470909 INFO  (OverseerStateUpdate-95630002423988228-127.0.0.1:65053_-n_0000000000) [n:127.0.0.1:65053_    ] o.a.s.c.o.ReplicaMutator Update state numShards=1 message={
   [junit4]   2>   "core":"collection1",
   [junit4]   2>   "roles":null,
   [junit4]   2>   "base_url":"http://127.0.0.1:65053",
   [junit4]   2>   "node_name":"127.0.0.1:65053_",
   [junit4]   2>   "numShards":"1",
   [junit4]   2>   "state":"down",
   [junit4]   2>   "shard":null,
   [junit4]   2>   "collection":"control_collection",
   [junit4]   2>   "operation":"state"}
   [junit4]   2> 470910 INFO  (OverseerStateUpdate-95630002423988228-127.0.0.1:65053_-n_0000000000) [n:127.0.0.1:65053_    ] o.a.s.c.o.ClusterStateMutator building a new cName: control_collection
   [junit4]   2> 470911 INFO  (OverseerStateUpdate-95630002423988228-127.0.0.1:65053_-n_0000000000) [n:127.0.0.1:65053_    ] o.a.s.c.o.ReplicaMutator Assigning new node to shard shard=shard1
   [junit4]   2> 470915 INFO  (zkCallback-489-thread-1-processing-n:127.0.0.1:65053_) [n:127.0.0.1:65053_    ] o.a.s.c.c.ZkStateReader A cluster state change: [WatchedEvent state:SyncConnected type:NodeDataChanged path:/clusterstate.json], has occurred - updating... (live nodes size: [1])
   [junit4]   2> 471912 INFO  (coreLoadExecutor-1221-thread-1-processing-n:127.0.0.1:65053_) [n:127.0.0.1:65053_ c:control_collection   x:collection1] o.a.s.c.ZkController waiting to find shard id in clusterstate for collection1
   [junit4]   2> 471912 INFO  (coreLoadExecutor-1221-thread-1-processing-n:127.0.0.1:65053_) [n:127.0.0.1:65053_ c:control_collection   x:collection1] o.a.s.c.ZkController Check for collection zkNode:control_collection
   [junit4]   2> 471913 INFO  (coreLoadExecutor-1221-thread-1-processing-n:127.0.0.1:65053_) [n:127.0.0.1:65053_ c:control_collection   x:collection1] o.a.s.c.ZkController Collection zkNode exists
   [junit4]   2> 471913 INFO  (coreLoadExecutor-1221-thread-1-processing-n:127.0.0.1:65053_) [n:127.0.0.1:65053_ c:control_collection   x:collection1] o.a.s.c.c.ZkStateReader Load collection config from: [/collections/control_collection]
   [junit4]   2> 471914 INFO  (coreLoadExecutor-1221-thread-1-processing-n:127.0.0.1:65053_) [n:127.0.0.1:65053_ c:control_collection   x:collection1] o.a.s.c.c.ZkStateReader path=[/collections/control_collection] [configName]=[conf1] specified config exists in ZooKeeper
   [junit4]   2> 471914 INFO  (coreLoadExecutor-1221-thread-1-processing-n:127.0.0.1:65053_) [n:127.0.0.1:65053_ c:control_collection   x:collection1] o.a.s.c.SolrResourceLoader new SolrResourceLoader for directory: '/Users/jenkins/workspace/Lucene-Solr-6.x-MacOSX/solr/build/solr-core/test/J0/temp/solr.cloud.DistribDocExpirationUpdateProcessorTest_161A4A7F16B3230A-001/control-001/cores/collection1'
   [junit4]   2> 471914 INFO  (coreLoadExecutor-1221-thread-1-processing-n:127.0.0.1:65053_) [n:127.0.0.1:65053_ c:control_collection   x:collection1] o.a.s.c.SolrResourceLoader JNDI not configured for solr (NoInitialContextEx)
   [junit4]   2> 471915 INFO  (coreLoadExecutor-1221-thread-1-processing-n:127.0.0.1:65053_) [n:127.0.0.1:65053_ c:control_collection   x:collection1] o.a.s.c.SolrResourceLoader solr home defaulted to 'solr/' (could not find system property or JNDI)
   [junit4]   2> 471924 INFO  (coreLoadExecutor-1221-thread-1-processing-n:127.0.0.1:65053_) [n:127.0.0.1:65053_ c:control_collection   x:collection1] o.a.s.c.Config loaded config solrconfig.xml with version 0 
   [junit4]   2> 471936 INFO  (coreLoadExecutor-1221-thread-1-processing-n:127.0.0.1:65053_) [n:127.0.0.1:65053_ c:control_collection   x:collection1] o.a.s.c.SolrConfig current version of requestparams : -1
   [junit4]   2> 471939 WARN  (coreLoadExecutor-1221-thread-1-processing-n:127.0.0.1:65053_) [n:127.0.0.1:65053_ c:control_collection   x:collection1] o.a.s.c.Config Beginning with Solr 5.5, <mergePolicy> is deprecated, use <mergePolicyFactory> instead.
   [junit4]   2> 471940 INFO  (coreLoadExecutor-1221-thread-1-processing-n:127.0.0.1:65053_) [n:127.0.0.1:65053_ c:control_collection   x:collection1] o.a.s.c.SolrConfig Using Lucene MatchVersion: 6.1.0
   [junit4]   2> 471951 INFO  (coreLoadExecutor-1221-thread-1-processing-n:127.0.0.1:65053_) [n:127.0.0.1:65053_ c:control_collection   x:collection1] o.a.s.c.SolrConfig Loaded SolrConfig: solrconfig.xml
   [junit4]   2> 471963 INFO  (coreLoadExecutor-1221-thread-1-processing-n:127.0.0.1:65053_) [n:127.0.0.1:65053_ c:control_collection   x:collection1] o.a.s.s.IndexSchema [collection1] Schema name=test
   [junit4]   2> 472071 INFO  (coreLoadExecutor-1221-thread-1-processing-n:127.0.0.1:65053_) [n:127.0.0.1:65053_ c:control_collection   x:collection1] o.a.s.s.IndexSchema default search field in schema is text
   [junit4]   2> 472072 INFO  (coreLoadExecutor-1221-thread-1-processing-n:127.0.0.1:65053_) [n:127.0.0.1:65053_ c:control_collection   x:collection1] o.a.s.s.IndexSchema unique key field: id
   [junit4]   2> 472073 INFO  (coreLoadExecutor-1221-thread-1-processing-n:127.0.0.1:65053_) [n:127.0.0.1:65053_ c:control_collection   x:collection1] o.a.s.s.FileExchangeRateProvider Reloading exchange rates from file currency.xml
   [junit4]   2> 472078 INFO  (coreLoadExecutor-1221-thread-1-processing-n:127.0.0.1:65053_) [n:127.0.0.1:65053_ c:control_collection   x:collection1] o.a.s.s.FileExchangeRateProvider Reloading exchange rates from file currency.xml
   [junit4]   2> 472149 INFO  (coreLoadExecutor-1221-thread-1-processing-n:127.0.0.1:65053_) [n:127.0.0.1:65053_ c:control_collection   x:collection1] o.a.s.c.ConfigSetProperties Did not find ConfigSet properties, assuming default properties: Can't find resource 'configsetprops.json' in classpath or '/configs/conf1', cwd=/Users/jenkins/workspace/Lucene-Solr-6.x-MacOSX/solr/build/solr-core/test/J0
   [junit4]   2> 472149 INFO  (coreLoadExecutor-1221-thread-1-processing-n:127.0.0.1:65053_) [n:127.0.0.1:65053_ c:control_collection   x:collection1] o.a.s.c.CoreContainer Creating SolrCore 'collection1' using configuration from collection control_collection
   [junit4]   2> 472150 INFO  (coreLoadExecutor-1221-thread-1-processing-n:127.0.0.1:65053_) [n:127.0.0.1:65053_ c:control_collection s:shard1 r:core_node1 x:collection1] o.a.s.c.SolrCore org.apache.solr.core.MockDirectoryFactory
   [junit4]   2> 472150 INFO  (coreLoadExecutor-1221-thread-1-processing-n:127.0.0.1:65053_) [n:127.0.0.1:65053_ c:control_collection s:shard1 r:core_node1 x:collection1] o.a.s.c.SolrCore [[collection1] ] Opening new SolrCore at [/Users/jenkins/workspace/Lucene-Solr-6.x-MacOSX/solr/build/solr-core/test/J0/temp/solr.cloud.DistribDocExpirationUpdateProcessorTest_161A4A7F16B3230A-001/control-001/cores/collection1], dataDir=[/Users/jenkins/workspace/Lucene-Solr-6.x-MacOSX/solr/build/solr-core/test/J0/../../../../../../../../../Users/jenkins/workspace/Lucene-Solr-6.x-MacOSX/solr/build/solr-core/test/J0/temp/solr.cloud.DistribDocExpirationUpdateProcessorTest_161A4A7F16B3230A-001/control-001/cores/collection1/data/]
   [junit4]   2> 472150 INFO  (coreLoadExecutor-1221-thread-1-processing-n:127.0.0.1:65053_) [n:127.0.0.1:65053_ c:control_collection s:shard1 r:core_node1 x:collection1] o.a.s.c.SolrCore JMX monitoring not detected for core: collection1
   [junit4]   2> 472151 INFO  (coreLoadExecutor-1221-thread-1-processing-n:127.0.0.1:65053_) [n:127.0.0.1:65053_ c:control_collection s:shard1 r:core_node1 x:collection1] o.a.s.c.CachingDirectoryFactory return new directory for /Users/jenkins/workspace/Lucene-Solr-6.x-MacOSX/solr/build/solr-core/test/J0/../../../../../../../../../Users/jenkins/workspace/Lucene-Solr-6.x-MacOSX/solr/build/solr-core/test/J0/temp/solr.cloud.DistribDocExpirationUpdateProcessorTest_161A4A7F16B3230A-001/control-001/cores/collection1/data
   [junit4]   2> 472151 INFO  (coreLoadExecutor-1221-thread-1-processing-n:127.0.0.1:65053_) [n:127.0.0.1:65053_ c:control_collection s:shard1 r:core_node1 x:collection1] o.a.s.c.SolrCore New index directory detected: old=null new=/Users/jenkins/workspace/Lucene-Solr-6.x-MacOSX/solr/build/solr-core/test/J0/../../../../../../../../../Users/jenkins/workspace/Lucene-Solr-6.x-MacOSX/solr/build/solr-core/test/J0/temp/solr.cloud.DistribDocExpirationUpdateProcessorTest_161A4A7F16B3230A-001/control-001/cores/collection1/data/index/
   [junit4]   2> 472151 WARN  (coreLoadExecutor-1221-thread-1-processing-n:127.0.0.1:65053_) [n:127.0.0.1:65053_ c:control_collection s:shard1 r:core_node1 x:collection1] o.a.s.c.SolrCore [collection1] Solr index directory '/Users/jenkins/workspace/Lucene-Solr-6.x-MacOSX/solr/build/solr-core/test/J0/../../../../../../../../../Users/jenkins/workspace/Lucene-Solr-6.x-MacOSX/solr/build/solr-core/test/J0/temp/solr.cloud.DistribDocExpirationUpdateProcessorTest_161A4A7F16B3230A-001/control-001/cores/collection1/data/index' doesn't exist. Creating new index...
   [junit4]   2> 472151 INFO  (coreLoadExecutor-1221-thread-1-processing-n:127.0.0.1:65053_) [n:127.0.0.1:65053_ c:control_collection s:shard1 r:core_node1 x:collection1] o.a.s.c.CachingDirectoryFactory return new directory for /Users/jenkins/workspace/Lucene-Solr-6.x-MacOSX/solr/build/solr-core/test/J0/../../../../../../../../../Users/jenkins/workspace/Lucene-Solr-6.x-MacOSX/solr/build/solr-core/test/J0/temp/solr.cloud.DistribDocExpirationUpdateProcessorTest_161A4A7F16B3230A-001/control-001/cores/collection1/data/index
   [junit4]   2> 472151 INFO  (coreLoadExecutor-1221-thread-1-processing-n:127.0.0.1:65053_) [n:127.0.0.1:65053_ c:control_collection s:shard1 r:core_node1 x:collection1] o.a.s.u.RandomMergePolicy RandomMergePolicy wrapping class org.apache.lucene.index.LogByteSizeMergePolicy: [LogByteSizeMergePolicy: minMergeSize=1677721, mergeFactor=16, maxMergeSize=2147483648, maxMergeSizeForForcedMerge=9223372036854775807, calibrateSizeByDeletes=false, maxMergeDocs=2147483647, maxCFSSegmentSizeMB=8.796093022207999E12, noCFSRatio=0.7546625467356884]
   [junit4]   2> 472166 INFO  (coreLoadExecutor-1221-thread-1-processing-n:127.0.0.1:65053_) [n:127.0.0.1:65053_ c:control_collection s:shard1 r:core_node1 x:collection1] o.a.s.c.SolrDeletionPolicy SolrDeletionPolicy.onCommit: commits: num=1
   [junit4]   2> 	commit{dir=MockDirectoryWrapper(RAMDirectory@18887905 lockFactory=org.apache.lucene.store.SingleInstanceLockFactory@70679abe),segFN=segments_1,generation=1}
   [junit4]   2> 472166 INFO  (coreLoadExecutor-1221-thread-1-processing-n:127.0.0.1:65053_) [n:127.0.0.1:65053_ c:control_collection s:shard1 r:core_node1 x:collection1] o.a.s.c.SolrDeletionPolicy newest commit generation = 1
   [junit4]   2> 472168 INFO  (OldIndexDirectoryCleanupThreadForCore-collection1) [n:127.0.0.1:65053_ c:control_collection s:shard1 r:core_node1 x:collection1] o.a.s.c.SolrCore Looking for old index directories to cleanup for core collection1 in /Users/jenkins/workspace/Lucene-Solr-6.x-MacOSX/solr/build/solr-core/test/J0/../../../../../../../../../Users/jenkins/workspace/Lucene-Solr-6.x-MacOSX/solr/build/solr-core/test/J0/temp/solr.cloud.DistribDocExpirationUpdateProcessorTest_161A4A7F16B3230A-001/control-001/cores/collection1/data/
   [junit4]   2> 472169 WARN  (OldIndexDirectoryCleanupThreadForCore-collection1) [n:127.0.0.1:65053_ c:control_collection s:shard1 r:core_node1 x:collection1] o.a.s.c.DirectoryFactory /Users/jenkins/workspace/Lucene-Solr-6.x-MacOSX/solr/build/solr-core/test/J0/../../../../../../../../../Users/jenkins/workspace/Lucene-Solr-6.x-MacOSX/solr/build/solr-core/test/J0/temp/solr.cloud.DistribDocExpirationUpdateProcessorTest_161A4A7F16B3230A-001/control-001/cores/collection1/data/ does not point to a valid data directory; skipping clean-up of old index directories.
   [junit4]   2> 472171 INFO  (coreLoadExecutor-1221-thread-1-processing-n:127.0.0.1:65053_) [n:127.0.0.1:65053_ c:control_collection s:shard1 r:core_node1 x:collection1] o.a.s.u.p.UpdateRequestProcessorChain creating updateRequestProcessorChain "convert-ttl-defaults"
   [junit4]   2> 472272 INFO  (coreLoadExecutor-1221-thread-1-processing-n:127.0.0.1:65053_) [n:127.0.0.1:65053_ c:control_collection s:shard1 r:core_node1 x:collection1] o.a.s.u.p.UpdateRequestProcessorChain creating updateRequestProcessorChain "convert-ttl-field"
   [junit4]   2> 472385 INFO  (coreLoadExecutor-1221-thread-1-processing-n:127.0.0.1:65053_) [n:127.0.0.1:65053_ c:control_collection s:shard1 r:core_node1 x:collection1] o.a.s.u.p.UpdateRequestProcessorChain creating updateRequestProcessorChain "convert-ttl-param"
   [junit4]   2> 472385 INFO  (coreLoadExecutor-1221-thread-1-processing-n:127.0.0.1:65053_) [n:127.0.0.1:65053_ c:control_collection s:shard1 r:core_node1 x:collection1] o.a.s.u.p.UpdateRequestProcessorChain creating updateRequestProcessorChain "convert-ttl-field-with-param-default"
   [junit4]   2> 472385 INFO  (coreLoadExecutor-1221-thread-1-processing-n:127.0.0.1:65053_) [n:127.0.0.1:65053_ c:control_collection s:shard1 r:core_node1 x:collection1] o.a.s.u.p.UpdateRequestProcessorChain creating updateRequestProcessorChain "scheduled-delete" (default)
   [junit4]   2> 472439 INFO  (coreLoadExecutor-1221-thread-1-processing-n:127.0.0.1:65053_) [n:127.0.0.1:65053_ c:control_collection s:shard1 r:core_node1 x:collection1] o.a.s.u.p.UpdateRequestProcessorChain inserting DistributedUpdateProcessorFactory into updateRequestProcessorChain "scheduled-delete" (default)
   [junit4]   2> 472447 INFO  (coreLoadExecutor-1221-thread-1-processing-n:127.0.0.1:65053_) [n:127.0.0.1:65053_ c:control_collection s:shard1 r:core_node1 x:collection1] o.a.s.h.l.XMLLoader xsltCacheLifetimeSeconds=60
   [junit4]   2> 472448 INFO  (coreLoadExecutor-1221-thread-1-processing-n:127.0.0.1:65053_) [n:127.0.0.1:65053_ c:control_collection s:shard1 r:core_node1 x:collection1] o.a.s.h.l.XMLLoader xsltCacheLifetimeSeconds=60
   [junit4]   2> 472448 INFO  (coreLoadExecutor-1221-thread-1-processing-n:127.0.0.1:65053_) [n:127.0.0.1:65053_ c:control_collection s:shard1 r:core_node1 x:collection1] o.a.s.h.l.XMLLoader xsltCacheLifetimeSeconds=60
   [junit4]   2> 472449 INFO  (coreLoadExecutor-1221-thread-1-processing-n:127.0.0.1:65053_) [n:127.0.0.1:65053_ c:control_collection s:shard1 r:core_node1 x:collection1] o.a.s.h.l.XMLLoader xsltCacheLifetimeSeconds=60
   [junit4]   2> 472451 INFO  (coreLoadExecutor-1221-thread-1-processing-n:127.0.0.1:65053_) [n:127.0.0.1:65053_ c:control_collection s:shard1 r:core_node1 x:collection1] o.a.s.c.RequestHandlers Registered paths: /admin/mbeans,,/update/csv,/sql,/update/json/docs,/admin/luke,/export,/select,/admin/segments,/get,/admin/system,/replication,/admin/properties,/config,/stream,/schema,/admin/plugins,/admin/logging,/update/json,/admin/ping,/admin/threads,/update,/admin/file
   [junit4]   2> 472451 INFO  (coreLoadExecutor-1221-thread-1-processing-n:127.0.0.1:65053_) [n:127.0.0.1:65053_ c:control_collection s:shard1 r:core_node1 x:collection1] o.a.s.c.SolrCore Using default statsCache cache: org.apache.solr.search.stats.LocalStatsCache
   [junit4]   2> 472452 INFO  (coreLoadExecutor-1221-thread-1-processing-n:127.0.0.1:65053_) [n:127.0.0.1:65053_ c:control_collection s:shard1 r:core_node1 x:collection1] o.a.s.u.UpdateHandler Using UpdateLog implementation: org.apache.solr.update.UpdateLog
   [junit4]   2> 472452 INFO  (coreLoadExecutor-1221-thread-1-processing-n:127.0.0.1:65053_) [n:127.0.0.1:65053_ c:control_collection s:shard1 r:core_node1 x:collection1] o.a.s.u.UpdateLog Initializing UpdateLog: dataDir= defaultSyncLevel=FLUSH numRecordsToKeep=100 maxNumLogsToKeep=10 numVersionBuckets=65536
   [junit4]   2> 472453 INFO  (coreLoadExecutor-1221-thread-1-processing-n:127.0.0.1:65053_) [n:127.0.0.1:65053_ c:control_collection s:shard1 r:core_node1 x:collection1] o.a.s.u.CommitTracker Hard AutoCommit: disabled
   [junit4]   2> 472453 INFO  (coreLoadExecutor-1221-thread-1-processing-n:127.0.0.1:65053_) [n:127.0.0.1:65053_ c:control_collection s:shard1 r:core_node1 x:collection1] o.a.s.u.CommitTracker Soft AutoCommit: disabled
   [junit4]   2> 472454 INFO  (coreLoadExecutor-1221-thread-1-processing-n:127.0.0.1:65053_) [n:127.0.0.1:65053_ c:control_collection s:shard1 r:core_node1 x:collection1] o.a.s.u.RandomMergePolicy RandomMergePolicy wrapping class org.apache.lucene.index.TieredMergePolicy: [TieredMergePolicy: maxMergeAtOnce=21, maxMergeAtOnceExplicit=44, maxMergedSegmentMB=78.943359375, floorSegmentMB=1.96484375, forceMergeDeletesPctAllowed=22.405680140436065, segmentsPerTier=29.0, maxCFSSegmentSizeMB=8.796093022207999E12, noCFSRatio=0.0
   [junit4]   2> 472465 INFO  (coreLoadExecutor-1221-thread-1-processing-n:127.0.0.1:65053_) [n:127.0.0.1:65053_ c:control_collection s:shard1 r:core_node1 x:collection1] o.a.s.c.SolrDeletionPolicy SolrDeletionPolicy.onInit: commits: num=1
   [junit4]   2> 	commit{dir=MockDirectoryWrapper(RAMDirectory@18887905 lockFactory=org.apache.lucene.store.SingleInstanceLockFactory@70679abe),segFN=segments_1,generation=1}
   [junit4]   2> 472465 INFO  (coreLoadExecutor-1221-thread-1-processing-n:127.0.0.1:65053_) [n:127.0.0.1:65053_ c:control_collection s:shard1 r:core_node1 x:collection1] o.a.s.c.SolrDeletionPolicy newest commit generation = 1
   [junit4]   2> 472466 INFO  (coreLoadExecutor-1221-thread-1-processing-n:127.0.0.1:65053_) [n:127.0.0.1:65053_ c:control_collection s:shard1 r:core_node1 x:collection1] o.a.s.s.SolrIndexSearcher Opening [Searcher@54bada33[collection1] main]
   [junit4]   2> 472466 INFO  (coreLoadExecutor-1221-thread-1-processing-n:127.0.0.1:65053_) [n:127.0.0.1:65053_ c:control_collection s:shard1 r:core_node1 x:collection1] o.a.s.c.c.ZkStateReader Load collection config from: [/collections/control_collection]
   [junit4]   2> 472468 INFO  (coreLoadExecutor-1221-thread-1-processing-n:127.0.0.1:65053_) [n:127.0.0.1:65053_ c:control_collection s:shard1 r:core_node1 x:collection1] o.a.s.c.c.ZkStateReader path=[/collections/control_collection] [configName]=[conf1] specified config exists in ZooKeeper
   [junit4]   2> 472468 INFO  (coreLoadExecutor-1221-thread-1-processing-n:127.0.0.1:65053_) [n:127.0.0.1:65053_ c:control_collection s:shard1 r:core_node1 x:collection1] o.a.s.r.ManagedResourceStorage Setting up ZooKeeper-based storage for the RestManager with znodeBase: /configs/conf1
   [junit4]   2> 472468 INFO  (coreLoadExecutor-1221-thread-1-processing-n:127.0.0.1:65053_) [n:127.0.0.1:65053_ c:control_collection s:shard1 r:core_node1 x:collection1] o.a.s.r.ManagedResourceStorage Configured ZooKeeperStorageIO with znodeBase: /configs/conf1
   [junit4]   2> 472468 INFO  (coreLoadExecutor-1221-thread-1-processing-n:127.0.0.1:65053_) [n:127.0.0.1:65053_ c:control_collection s:shard1 r:core_node1 x:collection1] o.a.s.r.RestManager Initializing RestManager with initArgs: {}
   [junit4]   2> 472468 INFO  (coreLoadExecutor-1221-thread-1-processing-n:127.0.0.1:65053_) [n:127.0.0.1:65053_ c:control_collection s:shard1 r:core_node1 x:collection1] o.a.s.r.ManagedResourceStorage Reading _rest_managed.json using ZooKeeperStorageIO:path=/configs/conf1
   [junit4]   2> 472469 INFO  (coreLoadExecutor-1221-thread-1-processing-n:127.0.0.1:65053_) [n:127.0.0.1:65053_ c:control_collection s:shard1 r:core_node1 x:collection1] o.a.s.r.ManagedResourceStorage No data found for znode /configs/conf1/_rest_managed.json
   [junit4]   2> 472469 INFO  (coreLoadExecutor-1221-thread-1-processing-n:127.0.0.1:65053_) [n:127.0.0.1:65053_ c:control_collection s:shard1 r:core_node1 x:collection1] o.a.s.r.ManagedResourceStorage Loaded null at path _rest_managed.json using ZooKeeperStorageIO:path=/configs/conf1
   [junit4]   2> 472469 INFO  (coreLoadExecutor-1221-thread-1-processing-n:127.0.0.1:65053_) [n:127.0.0.1:65053_ c:control_collection s:shard1 r:core_node1 x:collection1] o.a.s.r.RestManager Initializing 0 registered ManagedResources
   [junit4]   2> 472497 INFO  (coreLoadExecutor-1221-thread-1-processing-n:127.0.0.1:65053_) [n:127.0.0.1:65053_ c:control_collection s:shard1 r:core_node1 x:collection1] o.a.s.h.ReplicationHandler Commits will be reserved for  10000
   [junit4]   2> 472497 INFO  (coreLoadExecutor-1221-thread-1-processing-n:127.0.0.1:65053_) [n:127.0.0.1:65053_ c:control_collection s:shard1 r:core_node1 x:collection1] o.a.s.u.UpdateLog Looking up max value of version field to seed version buckets
   [junit4]   2> 472498 INFO  (coreLoadExecutor-1221-thread-1-processing-n:127.0.0.1:65053_) [n:127.0.0.1:65053_ c:control_collection s:shard1 r:core_node1 x:collection1] o.a.s.u.VersionInfo Refreshing highest value of _version_ for 65536 version buckets from index
   [junit4]   2> 472498 INFO  (searcherExecutor-1222-thread-1-processing-n:127.0.0.1:65053_ x:collection1 s:shard1 c:control_collection r:core_node1) [n:127.0.0.1:65053_ c:control_collection s:shard1 r:core_node1 x:collection1] o.a.s.c.SolrCore [collection1] Registered new searcher Searcher@54bada33[collection1] main{ExitableDirectoryReader(UninvertingDirectoryReader())}
   [junit4]   2> 472498 INFO  (coreLoadExecutor-1221-thread-1-processing-n:127.0.0.1:65053_) [n:127.0.0.1:65053_ c:control_collection s:shard1 r:core_node1 x:collection1] o.a.s.u.VersionInfo No terms found for _version_, cannot seed version bucket highest value from index
   [junit4]   2> 472498 INFO  (coreLoadExecutor-1221-thread-1-processing-n:127.0.0.1:65053_) [n:127.0.0.1:65053_ c:control_collection s:shard1 r:core_node1 x:collection1] o.a.s.u.UpdateLog Could not find max version in index or recent updates, using new clock 1530080041256353792
   [junit4]   2> 472500 INFO  (coreLoadExecutor-1221-thread-1-processing-n:127.0.0.1:65053_) [n:127.0.0.1:65053_ c:control_collection s:shard1 r:core_node1 x:collection1] o.a.s.u.UpdateLog Took 1.0ms to seed version buckets with highest version 1530080041256353792
   [junit4]   2> 472500 INFO  (coreLoadExecutor-1221-thread-1-processing-n:127.0.0.1:65053_) [n:127.0.0.1:65053_ c:control_collection s:shard1 r:core_node1 x:collection1] o.a.s.c.ZkController watch zkdir /configs/conf1
   [junit4]   2> 472501 INFO  (coreLoadExecutor-1221-thread-1-processing-n:127.0.0.1:65053_) [n:127.0.0.1:65053_ c:control_collection s:shard1 r:core_node1 x:collection1] o.a.s.c.CoreContainer registering core: collection1
   [junit4]   2> 472501 INFO  (coreZkRegister-1215-thread-1-processing-n:127.0.0.1:65053_ x:collection1 s:shard1 c:control_collection r:core_node1) [n:127.0.0.1:65053_ c:control_collection s:shard1 r:core_node1 x:collection1] o.a.s.c.ZkController Register replica - core:collection1 address:http://127.0.0.1:65053 collection:control_collection shard:shard1
   [junit4]   2> 472502 INFO  (coreZkRegister-1215-thread-1-processing-n:127.0.0.1:65053_ x:collection1 s:shard1 c:control_collection r:core_node1) [n:127.0.0.1:65053_ c:control_collection s:shard1 r:core_node1 x:collection1] o.a.s.c.c.SolrZkClient makePath: /collections/control_collection/leader_elect/shard1/election
   [junit4]   2> 472508 INFO  (coreZkRegister-1215-thread-1-processing-n:127.0.0.1:65053_ x:collection1 s:shard1 c:control_collection r:core_node1) [n:127.0.0.1:65053_ c:control_collection s:shard1 r:core_node1 x:collection1] o.a.s.c.LeaderElector Joined leadership election with path: /collections/control_collection/leader_elect/shard1/election/95630002423988228-core_node1-n_0000000000
   [junit4]   2> 472509 INFO  (coreZkRegister-1215-thread-1-processing-n:127.0.0.1:65053_ x:collection1 s:shard1 c:control_collection r:core_node1) [n:127.0.0.1:65053_ c:control_collection s:shard1 r:core_node1 x:collection1] o.a.s.c.ShardLeaderElectionContext Running the leader process for shard=shard1 and weAreReplacement=false and leaderVoteWait=10000
   [junit4]   2> 472512 INFO  (coreZkRegister-1215-thread-1-processing-n:127.0.0.1:65053_ x:collection1 s:shard1 c:control_collection r:core_node1) [n:127.0.0.1:65053_ c:control_collection s:shard1 r:core_node1 x:collection1] o.a.s.c.ShardLeaderElectionContext Enough replicas found to continue.
   [junit4]   2> 472512 INFO  (coreZkRegister-1215-thread-1-processing-n:127.0.0.1:65053_ x:collection1 s:shard1 c:control_collection r:core_node1) [n:127.0.0.1:65053_ c:control_collection s:shard1 r:core_node1 x:collection1] o.a.s.c.ShardLeaderElectionContext I may be the new leader - try and sync
   [junit4]   2> 472512 INFO  (coreZkRegister-1215-thread-1-processing-n:127.0.0.1:65053_ x:collection1 s:shard1 c:control_collection r:core_node1) [n:127.0.0.1:65053_ c:control_collection s:shard1 r:core_node1 x:collection1] o.a.s.c.SyncStrategy Sync replicas to http://127.0.0.1:65053/collection1/
   [junit4]   2> 472512 INFO  (coreZkRegister-1215-thread-1-processing-n:127.0.0.1:65053_ x:collection1 s:shard1 c:control_collection r:core_node1) [n:127.0.0.1:65053_ c:control_collection s:shard1 r:core_node1 x:collection1] o.a.s.c.SyncStrategy Sync Success - now sync replicas to me
   [junit4]   2> 472512 INFO  (coreZkRegister-1215-thread-1-processing-n:127.0.0.1:65053_ x:collection1 s:shard1 c:control_collection r:core_node1) [n:127.0.0.1:65053_ c:control_collection s:shard1 r:core_node1 x:collection1] o.a.s.c.SyncStrategy http://127.0.0.1:65053/collection1/ has no replicas
   [junit4]   2> 472512 INFO  (OverseerStateUpdate-95630002423988228-127.0.0.1:65053_-n_0000000000) [n:127.0.0.1:65053_    ] o.a.s.c.Overseer processMessage: queueSize: 1, message = {
   [junit4]   2>   "operation":"leader",
   [junit4]   2>   "shard":"shard1",
   [junit4]   2>   "collection":"control_collection"} current state version: 1
   [junit4]   2> 472513 INFO  (coreZkRegister-1215-thread-1-processing-n:127.0.0.1:65053_ x:collection1 s:shard1 c:control_collection r:core_node1) [n:127.0.0.1:65053_ c:control_collection s:shard1 r:core_node1 x:collection1] o.a.s.c.c.SolrZkClient makePath: /collections/control_collection/leaders/shard1
   [junit4]   2> 472515 INFO  (zkCallback-489-thread-1-processing-n:127.0.0.1:65053_) [n:127.0.0.1:65053_    ] o.a.s.c.c.ZkStateReader A cluster state change: [WatchedEvent state:SyncConnected type:NodeDataChanged path:/clusterstate.json], has occurred - updating... (live nodes size: [1])
   [junit4]   2> 472518 INFO  (coreZkRegister-1215-thread-1-processing-n:127.0.0.1:65053_ x:collection1 s:shard1 c:control_collection r:core_node1) [n:127.0.0.1:65053_ c:control_collection s:shard1 r:core_node1 x:collection1] o.a.s.c.ShardLeaderElectionContextBase Creating leader registration node /collections/control_collection/leaders/shard1/leader after winning as /collections/control_collection/leader_elect/shard1/election/95630002423988228-core_node1-n_0000000000
   [junit4]   2> 472521 INFO  (coreZkRegister-1215-thread-1-processing-n:127.0.0.1:65053_ x:collection1 s:shard1 c:control_collection r:core_node1) [n:127.0.0.1:65053_ c:control_collection s:shard1 r:core_node1 x:collection1] o.a.s.c.ShardLeaderElectionContext I am the new leader: http://127.0.0.1:65053/collection1/ shard1
   [junit4]   2> 472522 INFO  (OverseerStateUpdate-95630002423988228-127.0.0.1:65053_-n_0000000000) [n:127.0.0.1:65053_    ] o.a.s.c.Overseer processMessage: queueSize: 1, message = {
   [junit4]   2>   "operation":"leader",
   [junit4]   2>   "shard":"shard1",
   [junit4]   2>   "collection":"control_collection",
   [junit4]   2>   "base_url":"http://127.0.0.1:65053",
   [junit4]   2>   "core":"collection1",
   [junit4]   2>   "state":"active"} current state version: 2
   [junit4]   2> 472630 INFO  (zkCallback-489-thread-1-processing-n:127.0.0.1:65053_) [n:127.0.0.1:65053_    ] o.a.s.c.c.ZkStateReader A cluster state change: [WatchedEvent state:SyncConnected type:NodeDataChanged path:/clusterstate.json], has occurred - updating... (live nodes size: [1])
   [junit4]   2> 472636 INFO  (coreZkRegister-1215-thread-1-processing-n:127.0.0.1:65053_ x:collection1 s:shard1 c:control_collection r:core_node1) [n:127.0.0.1:65053_ c:control_collection s:shard1 r:core_node1 x:collection1] o.a.s.c.ZkController We are http://127.0.0.1:65053/collection1/ and leader is http://127.0.0.1:65053/collection1/
   [junit4]   2> 472637 INFO  (coreZkRegister-1215-thread-1-processing-n:127.0.0.1:65053_ x:collection1 s:shard1 c:control_collection r:core_node1) [n:127.0.0.1:65053_ c:control_collection s:shard1 r:core_node1 x:collection1] o.a.s.c.ZkController No LogReplay needed for core=collection1 baseURL=http://127.0.0.1:65053
   [junit4]   2> 472637 INFO  (coreZkRegister-1215-thread-1-processing-n:127.0.0.1:65053_ x:collection1 s:shard1 c:control_collection r:core_node1) [n:127.0.0.1:65053_ c:control_collection s:shard1 r:core_node1 x:collection1] o.a.s.c.ZkController I am the leader, no recovery necessary
   [junit4]   2> 472637 INFO  (coreZkRegister-1215-thread-1-processing-n:127.0.0.1:65053_ x:collection1 s:shard1 c:control_collection r:core_node1) [n:127.0.0.1:65053_ c:control_collection s:shard1 r:core_node1 x:collection1] o.a.s.c.ZkController publishing state=active
   [junit4]   2> 472637 INFO  (coreZkRegister-1215-thread-1-processing-n:127.0.0.1:65053_ x:collection1 s:shard1 c:control_collection r:core_node1) [n:127.0.0.1:65053_ c:control_collection s:shard1 r:core_node1 x:collection1] o.a.s.c.ZkController numShards not found on descriptor - reading it from system property
   [junit4]   2> 472640 INFO  (OverseerStateUpdate-95630002423988228-127.0.0.1:65053_-n_0000000000) [n:127.0.0.1:65053_    ] o.a.s.c.Overseer processMessage: queueSize: 1, message = {
   [junit4]   2>   "core":"collection1",
   [junit4]   2>   "core_node_name":"core_node1",
   [junit4]   2>   "roles":null,
   [junit4]   2>   "base_url":"http://127.0.0.1:65053",
   [junit4]   2>   "node_name":"127.0.0.1:65053_",
   [junit4]   2>   "numShards":"1",
   [junit4]   2>   "state":"active",
   [junit4]   2>   "shard":"shard1",
   [junit4]   2>   "collection":"control_collection",
   [junit4]   2>   "operation":"state"} current state version: 3
   [junit4]   2> 472641 INFO  (OverseerStateUpdate-95630002423988228-127.0.0.1:65053_-n_0000000000) [n:127.0.0.1:65053_    ] o.a.s.c.o.ReplicaMutator Update state numShards=1 message={
   [junit4]   2>   "core":"collection1",
   [junit4]   2>   "core_node_name":"core_node1",
   [junit4]   2>   "roles":null,
   [junit4]   2>   "base_url":"http://127.0.0.1:65053",
   [junit4]   2>   "node_name":"127.0.0.1:65053_",
   [junit4]   2>   "numShards":"1",
   [junit4]   2>   "state":"active",
   [junit4]   2>   "shard":"shard1",
   [junit4]   2>   "collection":"control_collection",
   [junit4]   2>   "operation":"state"}
   [junit4]   2> 472747 INFO  (zkCallback-489-thread-1-processing-n:127.0.0.1:65053_) [n:127.0.0.1:65053_    ] o.a.s.c.c.ZkStateReader A cluster state change: [WatchedEvent state:SyncConnected type:NodeDataChanged path:/clusterstate.json], has occurred - updating... (live nodes size: [1])
   [junit4]   2> 472921 INFO  (TEST-DistribDocExpirationUpdateProcessorTest.test-seed#[161A4A7F16B3230A]) [    ] o.a.s.c.c.SolrZkClient Using default ZkCredentialsProvider
   [junit4]   2> 472922 INFO  (TEST-DistribDocExpirationUpdateProcessorTest.test-seed#[161A4A7F16B3230A]) [    ] o.a.s.c.c.ConnectionManager Waiting for client to connect to ZooKeeper
   [junit4]   2> 472924 INFO  (zkCallback-491-thread-1) [    ] o.a.s.c.c.ConnectionManager Watcher org.apache.solr.common.cloud.ConnectionManager@43ea24eb name:ZooKeeperConnection Watcher:127.0.0.1:65050/solr got event WatchedEvent state:SyncConnected type:None path:null path:null type:None
   [junit4]   2> 472924 INFO  (TEST-DistribDocExpirationUpdateProcessorTest.test-seed#[161A4A7F16B3230A]) [    ] o.a.s.c.c.ConnectionManager Client is connected to ZooKeeper
   [junit4]   2> 472924 INFO  (TEST-DistribDocExpirationUpdateProcessorTest.test-seed#[161A4A7F16B3230A]) [    ] o.a.s.c.c.SolrZkClient Using default ZkACLProvider
   [junit4]   2> 472924 INFO  (TEST-DistribDocExpirationUpdateProcessorTest.test-seed#[161A4A7F16B3230A]) [    ] o.a.s.c.c.ZkStateReader Updating cluster state from ZooKeeper... 
   [junit4]   2> 472929 INFO  (TEST-DistribDocExpirationUpdateProcessorTest.test-seed#[161A4A7F16B3230A]) [    ] o.a.s.c.c.ZkStateReader Updated live nodes from ZooKeeper... (0) -> (1)
   [junit4]   2> 472931 INFO  (TEST-DistribDocExpirationUpdateProcessorTest.test-seed#[161A4A7F16B3230A]) [    ] o.a.s.c.ChaosMonkey monkey: init - expire sessions:false cause connection loss:false
   [junit4]   2> 473490 INFO  (TEST-DistribDocExpirationUpdateProcessorTest.test-seed#[161A4A7F16B3230A]) [    ] o.a.s.SolrTestCaseJ4 Writing core.properties file to /Users/jenkins/workspace/Lucene-Solr-6.x-MacOSX/solr/build/solr-core/test/J0/temp/solr.cloud.DistribDocExpirationUpdateProcessorTest_161A4A7F16B3230A-001/shard-1-001/cores/collection1
   [junit4]   2> 473492 INFO  (TEST-DistribDocExpirationUpdateProcessorTest.test-seed#[161A4A7F16B3230A]) [    ] o.a.s.c.AbstractFullDistribZkTestBase create jetty 1 in directory /Users/jenkins/workspace/Lucene-Solr-6.x-MacOSX/solr/build/solr-core/test/J0/temp/solr.cloud.DistribDocExpirationUpdateProcessorTest_161A4A7F16B3230A-001/shard-1-001
   [junit4]   2> 473493 INFO  (TEST-DistribDocExpirationUpdateProcessorTest.test-seed#[161A4A7F16B3230A]) [    ] o.e.j.s.Server jetty-9.3.8.v20160314
   [junit4]   2> 473498 INFO  (TEST-DistribDocExpirationUpdateProcessorTest.test-seed#[161A4A7F16B3230A]) [    ] o.e.j.s.h.ContextHandler Started o.e.j.s.ServletContextHandler@298152b6{/,null,AVAILABLE}
   [junit4]   2> 473500 INFO  (TEST-DistribDocExpirationUpdateProcessorTest.test-seed#[161A4A7F16B3230A]) [    ] o.e.j.s.ServerConnector Started ServerConnector@2d4c48e6{HTTP/1.1,[http/1.1]}{127.0.0.1:65058}
   [junit4]   2> 473500 INFO  (TEST-DistribDocExpirationUpdateProcessorTest.test-seed#[161A4A7F16B3230A]) [    ] o.e.j.s.Server Started @479187ms
   [junit4]   2> 473500 INFO  (TEST-DistribDocExpirationUpdateProcessorTest.test-seed#[161A4A7F16B3230A]) [    ] o.a.s.c.s.e.JettySolrRunner Jetty properties: {solr.data.dir=/Users/jenkins/workspace/Lucene-Solr-6.x-MacOSX/solr/build/solr-core/test/J0/temp/solr.cloud.DistribDocExpirationUpdateProcessorTest_161A4A7F16B3230A-001/tempDir-001/jetty1, solrconfig=solrconfig.xml, hostContext=/, hostPort=65058, coreRootDirectory=/Users/jenkins/workspace/Lucene-Solr-6.x-MacOSX/solr/build/solr-core/test/J0/../../../../../../../../../Users/jenkins/workspace/Lucene-Solr-6.x-MacOSX/solr/build/solr-core/test/J0/temp/solr.cloud.DistribDocExpirationUpdateProcessorTest_161A4A7F16B3230A-001/shard-1-001/cores}
   [junit4]   2> 473500 INFO  (TEST-DistribDocExpirationUpdateProcessorTest.test-seed#[161A4A7F16B3230A]) [    ] o.a.s.s.SolrDispatchFilter SolrDispatchFilter.init(): sun.misc.Launcher$AppClassLoader@4554617c
   [junit4]   2> 473500 INFO  (TEST-DistribDocExpirationUpdateProcessorTest.test-seed#[161A4A7F16B3230A]) [    ] o.a.s.c.SolrResourceLoader new SolrResourceLoader for directory: '/Users/jenkins/workspace/Lucene-Solr-6.x-MacOSX/solr/build/solr-core/test/J0/temp/solr.cloud.DistribDocExpirationUpdateProcessorTest_161A4A7F16B3230A-001/shard-1-001'
   [junit4]   2> 473501 INFO  (TEST-DistribDocExpirationUpdateProcessorTest.test-seed#[161A4A7F16B3230A]) [    ] o.a.s.c.SolrResourceLoader JNDI not configured for solr (NoInitialContextEx)
   [junit4]   2> 473501 INFO  (TEST-DistribDocExpirationUpdateProcessorTest.test-seed#[161A4A7F16B3230A]) [    ] o.a.s.c.SolrResourceLoader solr home defaulted to 'solr/' (could not find system property or JNDI)
   [junit4]   2> 473501 INFO  (TEST-DistribDocExpirationUpdateProcessorTest.test-seed#[161A4A7F16B3230A]) [    ] o.a.s.c.c.SolrZkClient Using default ZkCredentialsProvider
   [junit4]   2> 473504 INFO  (TEST-DistribDocExpirationUpdateProcessorTest.test-seed#[161A4A7F16B3230A]) [    ] o.a.s.c.c.ConnectionManager Waiting for client to connect to ZooKeeper
   [junit4]   2> 473504 INFO  (zkCallback-492-thread-1) [    ] o.a.s.c.c.ConnectionManager Watcher org.apache.solr.common.cloud.ConnectionManager@4d7006c0 name:ZooKeeperConnection Watcher:127.0.0.1:65050/solr got event WatchedEvent state:SyncConnected type:None path:null path:null type:None
   [junit4]   2> 473505 INFO  (TEST-DistribDocExpirationUpdateProcessorTest.test-seed#[161A4A7F16B3230A]) [    ] o.a.s.c.c.ConnectionManager Client is connected to ZooKeeper
   [junit4]   2> 473505 INFO  (TEST-DistribDocExpirationUpdateProcessorTest.test-seed#[161A4A7F16B3230A]) [    ] o.a.s.c.c.SolrZkClient Using default ZkACLProvider
   [junit4]   2> 473508 INFO  (TEST-DistribDocExpirationUpdateProcessorTest.test-seed#[161A4A7F16B3230A]) [    ] o.a.s.s.SolrDispatchFilter Loading solr.xml from SolrHome (not found in ZooKeeper)
   [junit4]   2> 473508 INFO  (TEST-DistribDocExpirationUpdateProcessorTest.test-seed#[161A4A7F16B3230A]) [    ] o.a.s.c.SolrXmlConfig Loading container configuration from /Users/jenkins/workspace/Lucene-Solr-6.x-MacOSX/solr/build/solr-core/test/J0/temp/solr.cloud.DistribDocExpirationUpdateProcessorTest_161A4A7F16B3230A-001/shard-1-001/solr.xml
   [junit4]   2> 473520 INFO  (TEST-DistribDocExpirationUpdateProcessorTest.test-seed#[161A4A7F16B3230A]) [    ] o.a.s.c.CorePropertiesLocator Config-defined core root directory: /Users/jenkins/workspace/Lucene-Solr-6.x-MacOSX/solr/build/solr-core/test/J0/../../../../../../../../../Users/jenkins/workspace/Lucene-Solr-6.x-MacOSX/solr/build/solr-core/test/J0/temp/solr.cloud.DistribDocExpirationUpdateProcessorTest_161A4A7F16B3230A-001/shard-1-001/cores
   [junit4]   2> 473520 INFO  (TEST-DistribDocExpirationUpdateProcessorTest.test-seed#[161A4A7F16B3230A]) [    ] o.a.s.c.CoreContainer New CoreContainer 956027802
   [junit4]   2> 473520 INFO  (TEST-DistribDocExpirationUpdateProcessorTest.test-seed#[161A4A7F16B3230A]) [    ] o.a.s.c.CoreContainer Loading cores into CoreContainer [instanceDir=/Users/jenkins/workspace/Lucene-Solr-6.x-MacOSX/solr/build/solr-core/test/J0/temp/solr.cloud.DistribDocExpirationUpdateProcessorTest_161A4A7F16B3230A-001/shard-1-001]
   [junit4]   2> 473521 WARN  (TEST-DistribDocExpirationUpdateProcessorTest.test-seed#[161A4A7F16B3230A]) [    ] o.a.s.c.CoreContainer Couldn't add files from /Users/jenkins/workspace/Lucene-Solr-6.x-MacOSX/solr/build/solr-core/test/J0/temp/solr.cloud.DistribDocExpirationUpdateProcessorTest_161A4A7F16B3230A-001/shard-1-001/lib to classpath: /Users/jenkins/workspace/Lucene-Solr-6.x-MacOSX/solr/build/solr-core/test/J0/temp/solr.cloud.DistribDocExpirationUpdateProcessorTest_161A4A7F16B3230A-001/shard-1-001/lib
   [junit4]   2> 473521 INFO  (TEST-DistribDocExpirationUpdateProcessorTest.test-seed#[161A4A7F16B3230A]) [    ] o.a.s.h.c.HttpShardHandlerFactory created with socketTimeout : 90000,urlScheme : ,connTimeout : 15000,maxConnectionsPerHost : 20,maxConnections : 10000,corePoolSize : 0,maximumPoolSize : 2147483647,maxThreadIdleTime : 5,sizeOfQueue : -1,fairnessPolicy : false,useRetries : false,
   [junit4]   2> 473525 INFO  (TEST-DistribDocExpirationUpdateProcessorTest.test-seed#[161A4A7F16B3230A]) [    ] o.a.s.u.UpdateShardHandler Creating UpdateShardHandler HTTP client with params: socketTimeout=340000&connTimeout=45000&retry=true
   [junit4]   2> 473526 INFO  (TEST-DistribDocExpirationUpdateProcessorTest.test-seed#[161A4A7F16B3230A]) [    ] o.a.s.l.LogWatcher SLF4J impl is org.slf4j.impl.Log4jLoggerFactory
   [junit4]   2> 473526 INFO  (TEST-DistribDocExpirationUpdateProcessorTest.test-seed#[161A4A7F16B3230A]) [    ] o.a.s.l.LogWatcher Registering Log Listener [Log4j (org.slf4j.impl.Log4jLoggerFactory)]
   [junit4]   2> 473526 INFO  (TEST-DistribDocExpirationUpdateProcessorTest.test-seed#[161A4A7F16B3230A]) [    ] o.a.s.c.ZkContainer Zookeeper client=127.0.0.1:65050/solr
   [junit4]   2> 473526 INFO  (TEST-DistribDocExpirationUpdateProcessorTest.test-seed#[161A4A7F16B3230A]) [    ] o.a.s.c.ZkController zkHost includes chroot
   [junit4]   2> 473526 INFO  (TEST-DistribDocExpirationUpdateProcessorTest.test-seed#[161A4A7F16B3230A]) [    ] o.a.s.c.c.SolrZkClient Using default ZkCredentialsProvider
   [junit4]   2> 473527 INFO  (TEST-DistribDocExpirationUpdateProcessorTest.test-seed#[161A4A7F16B3230A]) [    ] o.a.s.c.c.ConnectionManager Waiting for client to connect to ZooKeeper
   [junit4]   2> 473529 INFO  (zkCallback-495-thread-1) [    ] o.a.s.c.c.ConnectionManager Watcher org.apache.solr.common.cloud.ConnectionManager@23f657ad name:ZooKeeperConnection Watcher:127.0.0.1:65050 got event WatchedEvent state:SyncConnected type:None path:null path:null type:None
   [junit4]   2> 473530 INFO  (TEST-DistribDocExpirationUpdateProcessorTest.test-seed#[161A4A7F16B3230A]) [    ] o.a.s.c.c.ConnectionManager Client is connected to ZooKeeper
   [junit4]   2> 473530 INFO  (TEST-DistribDocExpirationUpdateProcessorTest.test-seed#[161A4A7F16B3230A]) [    ] o.a.s.c.c.SolrZkClient Using default ZkACLProvider
   [junit4]   2> 473534 INFO  (TEST-DistribDocExpirationUpdateProcessorTest.test-seed#[161A4A7F16B3230A]) [n:127.0.0.1:65058_    ] o.a.s.c.c.ConnectionManager Waiting for client to connect to ZooKeeper
   [junit4]   2> 473536 INFO  (zkCallback-496-thread-1-processing-n:127.0.0.1:65058_) [n:127.0.0.1:65058_    ] o.a.s.c.c.ConnectionManager Watcher org.apache.solr.common.cloud.ConnectionManager@3abcdf2 name:ZooKeeperConnection Watcher:127.0.0.1:65050/solr got event WatchedEvent state:SyncConnected type:None path:null path:null type:None
   [junit4]   2> 473537 INFO  (TEST-DistribDocExpirationUpdateProcessorTest.test-seed#[161A4A7F16B3230A]) [n:127.0.0.1:65058_    ] o.a.s.c.c.ConnectionManager Client is connected to ZooKeeper
   [junit4]   2> 473554 INFO  (TEST-DistribDocExpirationUpdateProcessorTest.test-seed#[161A4A7F16B3230A]) [n:127.0.0.1:65058_    ] o.a.s.c.c.ZkStateReader Updating cluster state from ZooKeeper... 
   [junit4]   2> 473557 INFO  (TEST-DistribDocExpirationUpdateProcessorTest.test-seed#[161A4A7F16B3230A]) [n:127.0.0.1:65058_    ] o.a.s.c.c.ZkStateReader Updated live nodes from ZooKeeper... (0) -> (1)
   [junit4]   2> 473562 INFO  (TEST-DistribDocExpirationUpdateProcessorTest.test-seed#[161A4A7F16B3230A]) [n:127.0.0.1:65058_    ] o.a.s.c.Overseer Overseer (id=null) closing
   [junit4]   2> 473563 INFO  (TEST-DistribDocExpirationUpdateProcessorTest.test-seed#[161A4A7F16B3230A]) [n:127.0.0.1:65058_    ] o.a.s.c.LeaderElector Joined leadership election with path: /overseer_elect/election/95630002423988232-127.0.0.1:65058_-n_0000000001
   [junit4]   2> 473565 INFO  (TEST-DistribDocExpirationUpdateProcessorTest.test-seed#[161A4A7F16B3230A]) [n:127.0.0.1:65058_    ] o.a.s.c.LeaderElector Watching path /overseer_elect/election/95630002423988228-127.0.0.1:65053_-n_0000000000 to know if I could be the leader
   [junit4]   2> 473566 INFO  (TEST-DistribDocExpirationUpdateProcessorTest.test-seed#[161A4A7F16B3230A]) [n:127.0.0.1:65058_    ] o.a.s.c.ZkController Publish node=127.0.0.1:65058_ as DOWN
   [junit4]   2> 473570 INFO  (OverseerStateUpdate-95630002423988228-127.0.0.1:65053_-n_0000000000) [n:127.0.0.1:65053_    ] o.a.s.c.Overseer processMessage: queueSize: 1, message = {
   [junit4]   2>   "operation":"downnode",
   [junit4]   2>   "node_name":"127.0.0.1:65058_"} current state version: 4
   [junit4]   2> 473570 INFO  (OverseerStateUpdate-95630002423988228-127.0.0.1:65053_-n_0000000000) [n:127.0.0.1:65053_    ] o.a.s.c.o.NodeMutator DownNode state invoked for node: 127.0.0.1:65058_
   [junit4]   2> 473677 INFO  (zkCallback-491-thread-1) [    ] o.a.s.c.c.ZkStateReader A cluster state change: [WatchedEvent state:SyncConnected type:NodeDataChanged path:/clusterstate.json], has occurred - updating... (live nodes size: [1])
   [junit4]   2> 473677 INFO  (zkCallback-489-thread-1-processing-n:127.0.0.1:65053_) [n:127.0.0.1:65053_    ] o.a.s.c.c.ZkStateReader A cluster state change: [WatchedEvent state:SyncConnected type:NodeDataChanged path:/clusterstate.json], has occurred - updating... (live nodes size: [1])
   [junit4]   2> 473677 INFO  (zkCallback-496-thread-1-processing-n:127.0.0.1:65058_) [n:127.0.0.1:65058_    ] o.a.s.c.c.ZkStateReader A cluster state change: [WatchedEvent state:SyncConnected type:NodeDataChanged path:/clusterstate.json], has occurred - updating... (live nodes size: [1])
   [junit4]   2> 474571 INFO  (TEST-DistribDocExpirationUpdateProcessorTest.test-seed#[161A4A7F16B3230A]) [n:127.0.0.1:65058_    ] o.a.s.c.ZkController Register node as live in ZooKeeper:/live_nodes/127.0.0.1:65058_
   [junit4]   2> 474572 INFO  (TEST-DistribDocExpirationUpdateProcessorTest.test-seed#[161A4A7F16B3230A]) [n:127.0.0.1:65058_    ] o.a.s.c.c.SolrZkClient makePath: /live_nodes/127.0.0.1:65058_
   [junit4]   2> 474574 INFO  (zkCallback-491-thread-1) [    ] o.a.s.c.c.ZkStateReader A live node change: [WatchedEvent state:SyncConnected type:NodeChildrenChanged path:/live_nodes], has occurred - updating... (live nodes size: [1])
   [junit4]   2> 474575 INFO  (zkCallback-496-thread-1-processing-n:127.0.0.1:65058_) [n:127.0.0.1:65058_    ] o.a.s.c.c.ZkStateReader A live node change: [WatchedEvent state:SyncConnected type:NodeChildrenChanged path:/live_nodes], has occurred - updating... (live nodes size: [1])
   [junit4]   2> 474575 INFO  (zkCallback-489-thread-1-processing-n:127.0.0.1:65053_) [n:127.0.0.1:65053_    ] o.a.s.c.c.ZkStateReader A live node change: [WatchedEvent state:SyncConnected type:NodeChildrenChanged path:/live_nodes], has occurred - updating... (live nodes size: [1])
   [junit4]   2> 474575 INFO  (zkCallback-489-thread-1-processing-n:127.0.0.1:65053_) [n:127.0.0.1:65053_    ] o.a.s.c.c.ZkStateReader Updated live nodes from ZooKeeper... (1) -> (2)
   [junit4]   2> 474575 INFO  (zkCallback-491-thread-1) [    ] o.a.s.c.c.ZkStateReader Updated live nodes from ZooKeeper... (1) -> (2)
   [junit4]   2> 474575 INFO  (zkCallback-496-thread-1-processing-n:127.0.0.1:65058_) [n:127.0.0.1:65058_    ] o.a.s.c.c.ZkStateReader Updated live nodes from ZooKeeper... (1) -> (2)
   [junit4]   2> 474584 INFO  (TEST-DistribDocExpirationUpdateProcessorTest.test-seed#[161A4A7F16B3230A]) [n:127.0.0.1:65058_    ] o.a.s.c.CoreContainer Security conf doesn't exist. Skipping setup for authorization module.
   [junit4]   2> 474584 INFO  (TEST-DistribDocExpirationUpdateProcessorTest.test-seed#[161A4A7F16B3230A]) [n:127.0.0.1:65058_    ] o.a.s.c.CoreContainer No authentication plugin used.
   [junit4]   2> 474586 INFO  (TEST-DistribDocExpirationUpdateProcessorTest.test-seed#[161A4A7F16B3230A]) [n:127.0.0.1:65058_    ] o.a.s.c.CorePropertiesLocator Looking for core definitions underneath /Users/jenkins/workspace/Lucene-Solr-6.x-MacOSX/solr/build/solr-core/test/J0/../../../../../../../../../Users/jenkins/workspace/Lucene-Solr-6.x-MacOSX/solr/build/solr-core/test/J0/temp/solr.cloud.DistribDocExpirationUpdateProcessorTest_161A4A7F16B3230A-001/shard-1-001/cores
   [junit4]   2> 474588 INFO  (TEST-DistribDocExpirationUpdateProcessorTest.test-seed#[161A4A7F16B3230A]) [n:127.0.0.1:65058_    ] o.a.s.c.CoreDescriptor Created CoreDescriptor: {name=collection1, config=solrconfig.xml, transient=false, schema=schema.xml, loadOnStartup=true, configSetProperties=configsetprops.json, collection=collection1, coreNodeName=, dataDir=data/, shard=}
   [junit4]   2> 474589 INFO  (TEST-DistribDocExpirationUpdateProcessorTest.test-seed#[161A4A7F16B3230A]) [n:127.0.0.1:65058_    ] o.a.s.c.CorePropertiesLocator Found core collection1 in /Users/jenkins/workspace/Lucene-Solr-6.x-MacOSX/solr/build/solr-core/test/J0/../../../../../../../../../Users/jenkins/workspace/Lucene-Solr-6.x-MacOSX/solr/build/solr-core/test/J0/temp/solr.cloud.DistribDocExpirationUpdateProcessorTest_161A4A7F16B3230A-001/shard-1-001/cores/collection1
   [junit4]   2> 474589 INFO  (TEST-DistribDocExpirationUpdateProcessorTest.test-seed#[161A4A7F16B3230A]) [n:127.0.0.1:65058_    ] o.a.s.c.CorePropertiesLocator Found 1 core definitions
   [junit4]   2> 474592 INFO  (TEST-DistribDocExpirationUpdateProcessorTest.test-seed#[161A4A7F16B3230A]) [n:127.0.0.1:65058_    ] o.a.s.s.SolrDispatchFilter user.dir=/Users/jenkins/workspace/Lucene-Solr-6.x-MacOSX/solr/build/solr-core/test/J0
   [junit4]   2> 474592 INFO  (TEST-DistribDocExpirationUpdateProcessorTest.test-seed#[161A4A7F16B3230A]) [n:127.0.0.1:65058_    ] o.a.s.s.SolrDispatchFilter SolrDispatchFilter.init() done
   [junit4]   2> 474592 INFO  (coreLoadExecutor-1233-thread-1-processing-n:127.0.0.1:65058_) [n:127.0.0.1:65058_ c:collection1   x:collection1] o.a.s.c.ZkController publishing state=down
   [junit4]   2> 474592 INFO  (coreLoadExecutor-1233-thread-1-processing-n:127.0.0.1:65058_) [n:127.0.0.1:65058_ c:collection1   x:collection1] o.a.s.c.ZkController numShards not found on descriptor - reading it from system property
   [junit4]   2> 474595 INFO  (coreLoadExecutor-1233-thread-1-processing-n:127.0.0.1:65058_) [n:127.0.0.1:65058_ c:collection1   x:collection1] o.a.s.c.ZkController look for our core node name
   [junit4]   2> 474596 INFO  (OverseerStateUpdate-95630002423988228-127.0.0.1:65053_-n_0000000000) [n:127.0.0.1:65053_    ] o.a.s.c.Overseer processMessage: queueSize: 1, message = {
   [junit4]   2>   "core":"collection1",
   [junit4]   2>   "roles":null,
   [junit4]   2>   "base_url":"http://127.0.0.1:65058",
   [junit4]   2>   "node_name":"127.0.0.1:65058_",
   [junit4]   2>   "numShards":"2",
   [junit4]   2>   "state":"down",
   [junit4]   2>   "shard":null,
   [junit4]   2>   "collection":"collection1",
   [junit4]   2>   "operation":"state"} current state version: 5
   [junit4]   2> 474596 INFO  (OverseerStateUpdate-95630002423988228-127.0.0.1:65053_-n_0000000000) [n:127.0.0.1:65053_    ] o.a.s.c.o.ReplicaMutator Update state numShards=2 message={
   [junit4]   2>   "core":"collection1",
   [junit4]   2>   "roles":null,
   [junit4]   2>   "base_url":"http://127.0.0.1:65058",
   [junit4]   2>   "node_name":"127.0.0.1:65058_",
   [junit4]   2>   "numShards":"2",
   [junit4]   2>   "state":"down",
   [junit4]   2>   "shard":null,
   [junit4]   2>   "collection":"collection1",
   [junit4]   2>   "operation":"state"}
   [junit4]   2> 474596 INFO  (OverseerStateUpdate-95630002423988228-127.0.0.1:65053_-n_0000000000) [n:127.0.0.1:65053_    ] o.a.s.c.o.ClusterStateMutator building a new cName: collection1
   [junit4]   2> 474597 INFO  (OverseerStateUpdate-95630002423988228-127.0.0.1:65053_-n_0000000000) [n:127.0.0.1:65053_    ] o.a.s.c.o.ReplicaMutator Assigning new node to shard shard=shard2
   [junit4]   2> 474706 INFO  (zkCallback-496-thread-1-processing-n:127.0.0.1:65058_) [n:127.0.0.1:65058_    ] o.a.s.c.c.ZkStateReader A cluster state change: [WatchedEvent state:SyncConnected type:NodeDataChanged path:/clusterstate.json], has occurred - updating... (live nodes size: [2])
   [junit4]   2> 474706 INFO  (zkCallback-491-thread-1) [    ] o.a.s.c.c.ZkStateReader A cluster state change: [WatchedEvent state:SyncConnected type:NodeDataChanged path:/clusterstate.json], has occurred - updating... (live nodes size: [2])
   [junit4]   2> 474706 INFO  (zkCallback-489-thread-1-processing-n:127.0.0.1:65053_) [n:127.0.0.1:65053_    ] o.a.s.c.c.ZkStateReader A cluster state change: [WatchedEvent state:SyncConnected type:NodeDataChanged path:/clusterstate.json], has occurred - updating... (live nodes size: [2])
   [junit4]   2> 475508 INFO  (autoExpireDocs-1227-thread-1) [n:127.0.0.1:65053_ c:control_collection s:shard1 r:core_node1 x:collection1] o.a.s.u.p.DocExpirationUpdateProcessorFactory Begining periodic deletion of expired docs
   [junit4]   2> 475521 INFO  (autoExpireDocs-1227-thread-1) [n:127.0.0.1:65053_ c:control_collection s:shard1 r:core_node1 x:collection1] o.a.s.u.DirectUpdateHandler2 start commit{,optimize=false,openSearcher=true,waitSearcher=true,expungeDeletes=false,softCommit=true,prepareCommit=false}
   [junit4]   2> 475521 INFO  (autoExpireDocs-1227-thread-1) [n:127.0.0.1:65053_ c:control_collection s:shard1 r:core_node1 x:collection1] o.a.s.c.SolrCore SolrIndexSearcher has not changed - not re-opening: org.apache.solr.search.SolrIndexSearcher
   [junit4]   2> 475522 INFO  (autoExpireDocs-1227-thread-1) [n:127.0.0.1:65053_ c:control_collection s:shard1 r:core_node1 x:collection1] o.a.s.u.DirectUpdateHandler2 end_commit_flush
   [junit4]   2> 475523 INFO  (autoExpireDocs-1227-thread-1) [n:127.0.0.1:65053_ c:control_collection s:shard1 r:core_node1 x:collection1] o.a.s.u.p.LogUpdateProcessorFactory [collection1] {deleteByQuery={!cache=false}eXpField_tdt:[* TO 2016-03-28T20:47:20.401Z] (-1530080044413616128),commit=} 0 15
   [junit4]   2> 475523 INFO  (autoExpireDocs-1227-thread-1) [n:127.0.0.1:65053_ c:control_collection s:shard1 r:core_node1 x:collection1] o.a.s.u.p.DocExpirationUpdateProcessorFactory Finished periodic deletion of expired docs
   [junit4]   2> 475600 INFO  (coreLoadExecutor-1233-thread-1-processing-n:127.0.0.1:65058_) [n:127.0.0.1:65058_ c:collection1   x:collection1] o.a.s.c.ZkController waiting to find shard id in clusterstate for collection1
   [junit4]   2> 475600 INFO  (coreLoadExecutor-1233-thread-1-processing-n:127.0.0.1:65058_) [n:127.0.0.1:65058_ c:collection1   x:collection1] o.a.s.c.ZkController Check for collection zkNode:collection1
   [junit4]   2> 475600 INFO  (coreLoadExecutor-1233-thread-1-processing-n:127.0.0.1:65058_) [n:127.0.0.1:65058_ c:collection1   x:collection1] o.a.s.c.ZkController Collection zkNode exists
   [junit4]   2> 475600 INFO  (coreLoadExecutor-1233-thread-1-processing-n:127.0.0.1:65058_) [n:127.0.0.1:65058_ c:collection1   x:collection1] o.a.s.c.c.ZkStateReader Load collection config from: [/collections/collection1]
   [junit4]   2> 475602 INFO  (coreLoadExecutor-1233-thread-1-processing-n:127.0.0.1:65058_) [n:127.0.0.1:65058_ c:collection1   x:collection1] o.a.s.c.c.ZkStateReader path=[/collections/collection1] [configName]=[conf1] specified config exists in ZooKeeper
   [junit4]   2> 475602 INFO  (coreLoadExecutor-1233-thread-1-processing-n:127.0.0.1:65058_) [n:127.0.0.1:65058_ c:collection1   x:collection1] o.a.s.c.SolrResourceLoader new SolrResourceLoader for directory: '/Users/jenkins/workspace/Lucene-Solr-6.x-MacOSX/solr/build/solr-core/test/J0/temp/solr.cloud.DistribDocExpirationUpdateProcessorTest_161A4A7F16B3230A-001/shard-1-001/cores/collection1'
   [junit4]   2> 475602 INFO  (coreLoadExecutor-1233-thread-1-processing-n:127.0.0.1:65058_) [n:127.0.0.1:65058_ c:collection1   x:collection1] o.a.s.c.SolrResourceLoader JNDI not configured for solr (NoInitialContextEx)
   [junit4]   2> 475602 INFO  (coreLoadExecutor-1233-thread-1-processing-n:127.0.0.1:65058_) [n:127.0.0.1:65058_ c:collection1   x:collection1] o.a.s.c.SolrResourceLoader solr home defaulted to 'solr/' (could not find system property or JNDI)
   [junit4]   2> 475604 INFO  (coreLoadExecutor-1233-thread-1-processing-n:127.0.0.1:65058_) [n:127.0.0.1:65058_ c:collection1   x:collection1] o.a.s.c.Config loaded config solrconfig.xml with version 0 
   [junit4]   2> 475615 INFO  (coreLoadExecutor-1233-thread-1-processing-n:127.0.0.1:65058_) [n:127.0.0.1:65058_ c:collection1   x:collection1] o.a.s.c.SolrConfig current version of requestparams : -1
   [junit4]   2> 475617 WARN  (coreLoadExecutor-1233-thread-1-processing-n:127.0.0.1:65058_) [n:127.0.0.1:65058_ c:collection1   x:collection1] o.a.s.c.Config Beginning with Solr 5.5, <mergePolicy> is deprecated, use <mergePolicyFactory> instead.
   [junit4]   2> 475619 INFO  (coreLoadExecutor-1233-thread-1-processing-n:127.0.0.1:65058_) [n:127.0.0.1:65058_ c:collection1   x:collection1] o.a.s.c.SolrConfig Using Lucene MatchVersion: 6.1.0
   [junit4]   2> 475625 INFO  (coreLoadExecutor-1233-thread-1-processing-n:127.0.0.1:65058_) [n:127.0.0.1:65058_ c:collection1   x:collection1] o.a.s.c.SolrConfig Loaded SolrConfig: solrconfig.xml
   [junit4]   2> 475633 INFO  (coreLoadExecutor-1233-thread-1-processing-n:127.0.0.1:65058_) [n:127.0.0.1:65058_ c:collection1   x:collection1] o.a.s.s.IndexSchema [collection1] Schema name=test
   [junit4]   2> 475737 INFO  (coreLoadExecutor-1233-thread-1-processing-n:127.0.0.1:65058_) [n:127.0.0.1:65058_ c:collection1   x:collection1] o.a.s.s.IndexSchema default search field in schema is text
   [junit4]   2> 475738 INFO  (coreLoadExecutor-1233-thread-1-processing-n:127.0.0.1:65058_) [n:127.0.0.1:65058_ c:collection1   x:collection1] o.a.s.s.IndexSchema unique key field: id
   [junit4]   2> 475739 INFO  (coreLoadExecutor-1233-thread-1-processing-n:127.0.0.1:65058_) [n:127.0.0.1:65058_ c:collection1   x:collection1] o.a.s.s.FileExchangeRateProvider Reloading exchange rates from file currency.xml
   [junit4]   2> 475743 INFO  (coreLoadExecutor-1233-thread-1-processing-n:127.0.0.1:65058_) [n:127.0.0.1:65058_ c:collection1   x:collection1] o.a.s.s.FileExchangeRateProvider Reloading exchange rates from file currency.xml
   [junit4]   2> 475786 INFO  (coreLoadExecutor-1233-thread-1-processing-n:127.0.0.1:65058_) [n:127.0.0.1:65058_ c:collection1   x:collection1] o.a.s.c.ConfigSetProperties Did not find ConfigSet properties, assuming default properties: Can't find resource 'configsetprops.json' in classpath or '/configs/conf1', cwd=/Users/jenkins/workspace/Lucene-Solr-6.x-MacOSX/solr/build/solr-core/test/J0
   [junit4]   2> 475786 INFO  (coreLoadExecutor-1233-thread-1-processing-n:127.0.0.1:65058_) [n:127.0.0.1:65058_ c:collection1   x:collection1] o.a.s.c.CoreContainer Creating SolrCore 'collection1' using configuration from collection collection1
   [junit4]   2> 475787 INFO  (coreLoadExecutor-1233-thread-1-processing-n:127.0.0.1:65058_) [n:127.0.0.1:65058_ c:collection1 s:shard2 r:core_node1 x:collection1] o.a.s.c.SolrCore org.apache.solr.core.MockDirectoryFactory
   [junit4]   2> 475787 INFO  (coreLoadExecutor-1233-thread-1-processing-n:127.0.0.1:65058_) [n:127.0.0.1:65058_ c:collection1 s:shard2 r:core_node1 x:collection1] o.a.s.c.SolrCore [[collection1] ] Opening new SolrCore at [/Users/jenkins/workspace/Lucene-Solr-6.x-MacOSX/solr/build/solr-core/test/J0/temp/solr.cloud.DistribDocExpirationUpdateProcessorTest_161A4A7F16B3230A-001/shard-1-001/cores/collection1], dataDir=[/Users/jenkins/workspace/Lucene-Solr-6.x-MacOSX/solr/build/solr-core/test/J0/../../../../../../../../../Users/jenkins/workspace/Lucene-Solr-6.x-MacOSX/solr/build/solr-core

[...truncated too long message...]

core/test/J0/temp/solr.cloud.DistribDocExpirationUpdateProcessorTest_161A4A7F16B3230A-001/shard-4-001/cores/collection1/data/index
   [junit4]   2> 540289 INFO  (coreCloseExecutor-1289-thread-1) [n:127.0.0.1:65080_ c:collection1 s:shard1 r:core_node4 x:collection1] o.a.s.u.p.DocExpirationUpdateProcessorFactory Waiting for close of DocExpiration Executor
   [junit4]   2> 540405 INFO  (zkCallback-512-thread-2-processing-n:127.0.0.1:65080_) [n:127.0.0.1:65080_    ] o.a.s.c.c.ZkStateReader A cluster state change: [WatchedEvent state:SyncConnected type:NodeDataChanged path:/clusterstate.json], has occurred - updating... (live nodes size: [1])
   [junit4]   2> 542978 INFO  (autoExpireDocs-1275-thread-1) [n:127.0.0.1:65080_ c:collection1 s:shard1 r:core_node4 x:collection1] o.a.s.u.p.LogUpdateProcessorFactory [collection1] {} 0 4033
   [junit4]   2> 542978 ERROR (autoExpireDocs-1275-thread-1) [n:127.0.0.1:65080_ c:collection1 s:shard1 r:core_node4 x:collection1] o.a.s.u.p.DocExpirationUpdateProcessorFactory Runtime error in periodic deletion of expired docs: No registered leader was found after waiting for 4000ms , collection: collection1 slice: shard2
   [junit4]   2> org.apache.solr.common.SolrException: No registered leader was found after waiting for 4000ms , collection: collection1 slice: shard2
   [junit4]   2> 	at org.apache.solr.common.cloud.ZkStateReader.getLeaderRetry(ZkStateReader.java:655)
   [junit4]   2> 	at org.apache.solr.common.cloud.ZkStateReader.getLeaderRetry(ZkStateReader.java:641)
   [junit4]   2> 	at org.apache.solr.update.processor.DistributedUpdateProcessor.doDeleteByQuery(DistributedUpdateProcessor.java:1277)
   [junit4]   2> 	at org.apache.solr.update.processor.DistributedUpdateProcessor.processDelete(DistributedUpdateProcessor.java:1140)
   [junit4]   2> 	at org.apache.solr.update.processor.LogUpdateProcessorFactory$LogUpdateProcessor.processDelete(LogUpdateProcessorFactory.java:124)
   [junit4]   2> 	at org.apache.solr.update.processor.UpdateRequestProcessor.processDelete(UpdateRequestProcessor.java:52)
   [junit4]   2> 	at org.apache.solr.update.processor.DocExpirationUpdateProcessorFactory$DeleteExpiredDocsRunnable.run(DocExpirationUpdateProcessorFactory.java:409)
   [junit4]   2> 	at java.util.concurrent.Executors$RunnableAdapter.call(Executors.java:511)
   [junit4]   2> 	at java.util.concurrent.FutureTask.runAndReset(FutureTask.java:308)
   [junit4]   2> 	at java.util.concurrent.ScheduledThreadPoolExecutor$ScheduledFutureTask.access$301(ScheduledThreadPoolExecutor.java:180)
   [junit4]   2> 	at java.util.concurrent.ScheduledThreadPoolExecutor$ScheduledFutureTask.run(ScheduledThreadPoolExecutor.java:294)
   [junit4]   2> 	at java.util.concurrent.ThreadPoolExecutor.runWorker(ThreadPoolExecutor.java:1142)
   [junit4]   2> 	at java.util.concurrent.ThreadPoolExecutor$Worker.run(ThreadPoolExecutor.java:617)
   [junit4]   2> 	at java.lang.Thread.run(Thread.java:745)
   [junit4]   2> 542980 INFO  (TEST-DistribDocExpirationUpdateProcessorTest.test-seed#[161A4A7F16B3230A]) [    ] o.a.s.c.Overseer Overseer (id=95630002423988241-127.0.0.1:65080_-n_0000000004) closing
   [junit4]   2> 542980 INFO  (OverseerStateUpdate-95630002423988241-127.0.0.1:65080_-n_0000000004) [n:127.0.0.1:65080_    ] o.a.s.c.Overseer Overseer Loop exiting : 127.0.0.1:65080_
   [junit4]   2> 542983 INFO  (zkCallback-512-thread-2-processing-n:127.0.0.1:65080_) [n:127.0.0.1:65080_    ] o.a.s.c.c.ZkStateReader A live node change: [WatchedEvent state:SyncConnected type:NodeChildrenChanged path:/live_nodes], has occurred - updating... (live nodes size: [1])
   [junit4]   2> 544483 WARN  (zkCallback-512-thread-2-processing-n:127.0.0.1:65080_) [n:127.0.0.1:65080_    ] o.a.s.c.c.ZkStateReader ZooKeeper watch triggered, but Solr cannot talk to ZK: [KeeperErrorCode = Session expired for /live_nodes]
   [junit4]   2> 544485 INFO  (TEST-DistribDocExpirationUpdateProcessorTest.test-seed#[161A4A7F16B3230A]) [    ] o.e.j.s.ServerConnector Stopped ServerConnector@2050172c{HTTP/1.1,[http/1.1]}{127.0.0.1:0}
   [junit4]   2> 544485 INFO  (TEST-DistribDocExpirationUpdateProcessorTest.test-seed#[161A4A7F16B3230A]) [    ] o.e.j.s.h.ContextHandler Stopped o.e.j.s.ServletContextHandler@6911f5a1{/,null,UNAVAILABLE}
   [junit4]   2> 544489 INFO  (TEST-DistribDocExpirationUpdateProcessorTest.test-seed#[161A4A7F16B3230A]) [    ] o.a.s.c.ZkTestServer connecting to 127.0.0.1:65050 65050
   [junit4]   2> 544509 INFO  (Thread-764) [    ] o.a.s.c.ZkTestServer connecting to 127.0.0.1:65050 65050
   [junit4]   2> 545809 WARN  (Thread-764) [    ] o.a.s.c.ZkTestServer Watch limit violations: 
   [junit4]   2> Maximum concurrent create/delete watches above limit:
   [junit4]   2> 
   [junit4]   2> 	6	/solr/aliases.json
   [junit4]   2> 	5	/solr/security.json
   [junit4]   2> 	5	/solr/configs/conf1
   [junit4]   2> 
   [junit4]   2> Maximum concurrent data watches above limit:
   [junit4]   2> 
   [junit4]   2> 	6	/solr/clusterstate.json
   [junit4]   2> 
   [junit4]   2> Maximum concurrent children watches above limit:
   [junit4]   2> 
   [junit4]   2> 	6	/solr/live_nodes
   [junit4]   2> 	6	/solr/collections
   [junit4]   2> 	5	/solr/overseer/queue
   [junit4]   2> 	5	/solr/overseer/collection-queue-work
   [junit4]   2> 	2	/solr/overseer/queue-work
   [junit4]   2> 
   [junit4]   2> NOTE: reproduce with: ant test  -Dtestcase=DistribDocExpirationUpdateProcessorTest -Dtests.method=test -Dtests.seed=161A4A7F16B3230A -Dtests.slow=true -Dtests.locale=fr-CH -Dtests.timezone=America/Indiana/Knox -Dtests.asserts=true -Dtests.file.encoding=ISO-8859-1
   [junit4] FAILURE 75.7s J0 | DistribDocExpirationUpdateProcessorTest.test <<<
   [junit4]    > Throwable #1: java.lang.AssertionError: There are still nodes recoverying - waited for 45 seconds
   [junit4]    > 	at __randomizedtesting.SeedInfo.seed([161A4A7F16B3230A:9E4E75A5B84F4EF2]:0)
   [junit4]    > 	at org.apache.solr.cloud.AbstractDistribZkTestBase.waitForRecoveriesToFinish(AbstractDistribZkTestBase.java:173)
   [junit4]    > 	at org.apache.solr.cloud.AbstractFullDistribZkTestBase.waitForRecoveriesToFinish(AbstractFullDistribZkTestBase.java:856)
   [junit4]    > 	at org.apache.solr.cloud.DistribDocExpirationUpdateProcessorTest.test(DistribDocExpirationUpdateProcessorTest.java:73)
   [junit4]    > 	at org.apache.solr.BaseDistributedSearchTestCase$ShardsRepeatRule$ShardsFixedStatement.callStatement(BaseDistributedSearchTestCase.java:996)
   [junit4]    > 	at org.apache.solr.BaseDistributedSearchTestCase$ShardsRepeatRule$ShardsStatement.evaluate(BaseDistributedSearchTestCase.java:971)
   [junit4]    > 	at java.lang.Thread.run(Thread.java:745)
   [junit4]   2> 545813 INFO  (SUITE-DistribDocExpirationUpdateProcessorTest-seed#[161A4A7F16B3230A]-worker) [    ] o.a.s.SolrTestCaseJ4 ###deleteCore
   [junit4]   2> NOTE: leaving temporary files on disk at: /Users/jenkins/workspace/Lucene-Solr-6.x-MacOSX/solr/build/solr-core/test/J0/temp/solr.cloud.DistribDocExpirationUpdateProcessorTest_161A4A7F16B3230A-001
   [junit4]   2> NOTE: test params are: codec=Asserting(Lucene60): {_version_=BlockTreeOrds(blocksize=128), id=PostingsFormat(name=Direct)}, docValues:{}, maxPointsInLeafNode=843, maxMBSortInHeap=5.836981152801114, sim=ClassicSimilarity, locale=fr-CH, timezone=America/Indiana/Knox
   [junit4]   2> NOTE: Mac OS X 10.11.3 x86_64/Oracle Corporation 1.8.0_72 (64-bit)/cpus=3,threads=1,free=120348472,total=369098752
   [junit4]   2> NOTE: All tests run in this JVM: [SecurityConfHandlerTest, TestLeaderElectionZkExpiry, SolrIndexConfigTest, TestConfigSetsAPIExclusivity, PrimitiveFieldTypeTest, TestSearchPerf, EnumFieldTest, TestPostingsSolrHighlighter, SliceStateTest, TestIBSimilarityFactory, SystemInfoHandlerTest, TestSort, TestReloadAndDeleteDocs, CircularListTest, HdfsNNFailoverTest, TestQueryWrapperFilter, SimplePostToolTest, TestInitParams, SimpleMLTQParserTest, CloudExitableDirectoryReaderTest, DistributedFacetPivotSmallAdvancedTest, TestLFUCache, DistributedSpellCheckComponentTest, ClusterStateUpdateTest, HardAutoCommitTest, SolrCloudExampleTest, VMParamsZkACLAndCredentialsProvidersTest, BlockDirectoryTest, TestSolrXml, TestSolrConfigHandler, CdcrUpdateLogTest, IndexSchemaTest, DocumentAnalysisRequestHandlerTest, TestExtendedDismaxParser, TestSolrCLIRunExample, FastVectorHighlighterTest, TestRandomRequestDistribution, OverseerRolesTest, LeaderElectionTest, TestSortByMinMaxFunction, TestPivotHelperCode, TestSortingResponseWriter, TestXIncludeConfig, ZkCLITest, DistributedFacetPivotLargeTest, AnalyticsQueryTest, SolrCoreTest, ClusterStateTest, DocValuesMultiTest, DistribDocExpirationUpdateProcessorTest]
   [junit4] Completed [110/585 (1!)] on J0 in 75.72s, 1 test, 1 failure <<< FAILURES!

[...truncated 1544 lines...]
BUILD FAILED
/Users/jenkins/workspace/Lucene-Solr-6.x-MacOSX/build.xml:740: The following error occurred while executing this line:
/Users/jenkins/workspace/Lucene-Solr-6.x-MacOSX/build.xml:684: The following error occurred while executing this line:
/Users/jenkins/workspace/Lucene-Solr-6.x-MacOSX/build.xml:59: The following error occurred while executing this line:
/Users/jenkins/workspace/Lucene-Solr-6.x-MacOSX/solr/build.xml:233: The following error occurred while executing this line:
/Users/jenkins/workspace/Lucene-Solr-6.x-MacOSX/solr/common-build.xml:529: The following error occurred while executing this line:
/Users/jenkins/workspace/Lucene-Solr-6.x-MacOSX/lucene/common-build.xml:1457: The following error occurred while executing this line:
/Users/jenkins/workspace/Lucene-Solr-6.x-MacOSX/lucene/common-build.xml:1014: There were test failures: 585 suites (10 ignored), 2364 tests, 1 failure, 120 ignored (69 assumptions) [seed: 161A4A7F16B3230A]

Total time: 80 minutes 33 seconds
Build step 'Invoke Ant' marked build as failure
Archiving artifacts
[WARNINGS] Skipping publisher since build result is FAILURE
Recording test results
Email was triggered for: Failure - Any
Sending email for trigger: Failure - Any



Mime
View raw message