lucene-dev mailing list archives

Site index · List index
Message view « Date » · « Thread »
Top « Date » · « Thread »
From Policeman Jenkins Server <jenk...@thetaphi.de>
Subject [JENKINS] Lucene-Solr-trunk-Linux (64bit/jdk1.8.0_72) - Build # 16081 - Still Failing!
Date Thu, 03 Mar 2016 02:41:07 GMT
Build: http://jenkins.thetaphi.de/job/Lucene-Solr-trunk-Linux/16081/
Java: 64bit/jdk1.8.0_72 -XX:-UseCompressedOops -XX:+UseSerialGC

1 tests failed.
FAILED:  org.apache.solr.cloud.UnloadDistributedZkTest.test

Error Message:
Captured an uncaught exception in thread: Thread[id=6938, name=testExecutor-2888-thread-10, state=RUNNABLE, group=TGRP-UnloadDistributedZkTest]

Stack Trace:
com.carrotsearch.randomizedtesting.UncaughtExceptionError: Captured an uncaught exception in thread: Thread[id=6938, name=testExecutor-2888-thread-10, state=RUNNABLE, group=TGRP-UnloadDistributedZkTest]
	at __randomizedtesting.SeedInfo.seed([3046F0449A84A995:B812CF9E3478C46D]:0)
Caused by: java.lang.RuntimeException: org.apache.solr.client.solrj.SolrServerException: Timeout occured while waiting response from server at: http://127.0.0.1:44583
	at __randomizedtesting.SeedInfo.seed([3046F0449A84A995]:0)
	at org.apache.solr.cloud.BasicDistributedZkTest$1.run(BasicDistributedZkTest.java:586)
	at org.apache.solr.common.util.ExecutorUtil$MDCAwareThreadPoolExecutor$1.run(ExecutorUtil.java:231)
	at java.util.concurrent.ThreadPoolExecutor.runWorker(ThreadPoolExecutor.java:1142)
	at java.util.concurrent.ThreadPoolExecutor$Worker.run(ThreadPoolExecutor.java:617)
	at java.lang.Thread.run(Thread.java:745)
Caused by: org.apache.solr.client.solrj.SolrServerException: Timeout occured while waiting response from server at: http://127.0.0.1:44583
	at org.apache.solr.client.solrj.impl.HttpSolrClient.executeMethod(HttpSolrClient.java:588)
	at org.apache.solr.client.solrj.impl.HttpSolrClient.request(HttpSolrClient.java:241)
	at org.apache.solr.client.solrj.impl.HttpSolrClient.request(HttpSolrClient.java:230)
	at org.apache.solr.client.solrj.SolrClient.request(SolrClient.java:1219)
	at org.apache.solr.cloud.BasicDistributedZkTest$1.run(BasicDistributedZkTest.java:584)
	... 4 more
Caused by: java.net.SocketTimeoutException: Read timed out
	at java.net.SocketInputStream.socketRead0(Native Method)
	at java.net.SocketInputStream.socketRead(SocketInputStream.java:116)
	at java.net.SocketInputStream.read(SocketInputStream.java:170)
	at java.net.SocketInputStream.read(SocketInputStream.java:141)
	at org.apache.http.impl.io.AbstractSessionInputBuffer.fillBuffer(AbstractSessionInputBuffer.java:160)
	at org.apache.http.impl.io.SocketInputBuffer.fillBuffer(SocketInputBuffer.java:84)
	at org.apache.http.impl.io.AbstractSessionInputBuffer.readLine(AbstractSessionInputBuffer.java:273)
	at org.apache.http.impl.conn.DefaultHttpResponseParser.parseHead(DefaultHttpResponseParser.java:140)
	at org.apache.http.impl.conn.DefaultHttpResponseParser.parseHead(DefaultHttpResponseParser.java:57)
	at org.apache.http.impl.io.AbstractMessageParser.parse(AbstractMessageParser.java:261)
	at org.apache.http.impl.AbstractHttpClientConnection.receiveResponseHeader(AbstractHttpClientConnection.java:283)
	at org.apache.http.impl.conn.DefaultClientConnection.receiveResponseHeader(DefaultClientConnection.java:251)
	at org.apache.http.impl.conn.ManagedClientConnectionImpl.receiveResponseHeader(ManagedClientConnectionImpl.java:197)
	at org.apache.http.protocol.HttpRequestExecutor.doReceiveResponse(HttpRequestExecutor.java:272)
	at org.apache.http.protocol.HttpRequestExecutor.execute(HttpRequestExecutor.java:124)
	at org.apache.http.impl.client.DefaultRequestDirector.tryExecute(DefaultRequestDirector.java:685)
	at org.apache.http.impl.client.DefaultRequestDirector.execute(DefaultRequestDirector.java:487)
	at org.apache.http.impl.client.AbstractHttpClient.doExecute(AbstractHttpClient.java:882)
	at org.apache.http.impl.client.CloseableHttpClient.execute(CloseableHttpClient.java:82)
	at org.apache.http.impl.client.CloseableHttpClient.execute(CloseableHttpClient.java:107)
	at org.apache.http.impl.client.CloseableHttpClient.execute(CloseableHttpClient.java:55)
	at org.apache.solr.client.solrj.impl.HttpSolrClient.executeMethod(HttpSolrClient.java:482)
	... 8 more




Build Log:
[...truncated 11373 lines...]
   [junit4] Suite: org.apache.solr.cloud.UnloadDistributedZkTest
   [junit4]   2> Creating dataDir: /home/jenkins/workspace/Lucene-Solr-trunk-Linux/solr/build/solr-core/test/J2/temp/solr.cloud.UnloadDistributedZkTest_3046F0449A84A995-001/init-core-data-001
   [junit4]   2> 762755 INFO  (SUITE-UnloadDistributedZkTest-seed#[3046F0449A84A995]-worker) [    ] o.a.s.BaseDistributedSearchTestCase Setting hostContext system property: /
   [junit4]   2> 762757 INFO  (TEST-UnloadDistributedZkTest.test-seed#[3046F0449A84A995]) [    ] o.a.s.c.ZkTestServer STARTING ZK TEST SERVER
   [junit4]   2> 762757 INFO  (Thread-2157) [    ] o.a.s.c.ZkTestServer client port:0.0.0.0/0.0.0.0:0
   [junit4]   2> 762757 INFO  (Thread-2157) [    ] o.a.s.c.ZkTestServer Starting server
   [junit4]   2> 762857 INFO  (TEST-UnloadDistributedZkTest.test-seed#[3046F0449A84A995]) [    ] o.a.s.c.ZkTestServer start zk server on port:55720
   [junit4]   2> 762857 INFO  (TEST-UnloadDistributedZkTest.test-seed#[3046F0449A84A995]) [    ] o.a.s.c.c.SolrZkClient Using default ZkCredentialsProvider
   [junit4]   2> 762857 INFO  (TEST-UnloadDistributedZkTest.test-seed#[3046F0449A84A995]) [    ] o.a.s.c.c.ConnectionManager Waiting for client to connect to ZooKeeper
   [junit4]   2> 762859 INFO  (zkCallback-1228-thread-1) [    ] o.a.s.c.c.ConnectionManager Watcher org.apache.solr.common.cloud.ConnectionManager@203a119a name:ZooKeeperConnection Watcher:127.0.0.1:55720 got event WatchedEvent state:SyncConnected type:None path:null path:null type:None
   [junit4]   2> 762859 INFO  (TEST-UnloadDistributedZkTest.test-seed#[3046F0449A84A995]) [    ] o.a.s.c.c.ConnectionManager Client is connected to ZooKeeper
   [junit4]   2> 762859 INFO  (TEST-UnloadDistributedZkTest.test-seed#[3046F0449A84A995]) [    ] o.a.s.c.c.SolrZkClient Using default ZkACLProvider
   [junit4]   2> 762860 INFO  (TEST-UnloadDistributedZkTest.test-seed#[3046F0449A84A995]) [    ] o.a.s.c.c.SolrZkClient makePath: /solr
   [junit4]   2> 762861 INFO  (TEST-UnloadDistributedZkTest.test-seed#[3046F0449A84A995]) [    ] o.a.s.c.c.SolrZkClient Using default ZkCredentialsProvider
   [junit4]   2> 762861 INFO  (TEST-UnloadDistributedZkTest.test-seed#[3046F0449A84A995]) [    ] o.a.s.c.c.ConnectionManager Waiting for client to connect to ZooKeeper
   [junit4]   2> 762863 INFO  (zkCallback-1229-thread-1) [    ] o.a.s.c.c.ConnectionManager Watcher org.apache.solr.common.cloud.ConnectionManager@56a8d735 name:ZooKeeperConnection Watcher:127.0.0.1:55720/solr got event WatchedEvent state:SyncConnected type:None path:null path:null type:None
   [junit4]   2> 762863 INFO  (TEST-UnloadDistributedZkTest.test-seed#[3046F0449A84A995]) [    ] o.a.s.c.c.ConnectionManager Client is connected to ZooKeeper
   [junit4]   2> 762863 INFO  (TEST-UnloadDistributedZkTest.test-seed#[3046F0449A84A995]) [    ] o.a.s.c.c.SolrZkClient Using default ZkACLProvider
   [junit4]   2> 762863 INFO  (TEST-UnloadDistributedZkTest.test-seed#[3046F0449A84A995]) [    ] o.a.s.c.c.SolrZkClient makePath: /collections/collection1
   [junit4]   2> 762864 INFO  (TEST-UnloadDistributedZkTest.test-seed#[3046F0449A84A995]) [    ] o.a.s.c.c.SolrZkClient makePath: /collections/collection1/shards
   [junit4]   2> 762865 INFO  (TEST-UnloadDistributedZkTest.test-seed#[3046F0449A84A995]) [    ] o.a.s.c.c.SolrZkClient makePath: /collections/control_collection
   [junit4]   2> 762865 INFO  (TEST-UnloadDistributedZkTest.test-seed#[3046F0449A84A995]) [    ] o.a.s.c.c.SolrZkClient makePath: /collections/control_collection/shards
   [junit4]   2> 762866 INFO  (TEST-UnloadDistributedZkTest.test-seed#[3046F0449A84A995]) [    ] o.a.s.c.AbstractZkTestCase put /home/jenkins/workspace/Lucene-Solr-trunk-Linux/solr/core/src/test-files/solr/collection1/conf/solrconfig-tlog.xml to /configs/conf1/solrconfig.xml
   [junit4]   2> 762866 INFO  (TEST-UnloadDistributedZkTest.test-seed#[3046F0449A84A995]) [    ] o.a.s.c.c.SolrZkClient makePath: /configs/conf1/solrconfig.xml
   [junit4]   2> 762867 INFO  (TEST-UnloadDistributedZkTest.test-seed#[3046F0449A84A995]) [    ] o.a.s.c.AbstractZkTestCase put /home/jenkins/workspace/Lucene-Solr-trunk-Linux/solr/core/src/test-files/solr/collection1/conf/schema.xml to /configs/conf1/schema.xml
   [junit4]   2> 762867 INFO  (TEST-UnloadDistributedZkTest.test-seed#[3046F0449A84A995]) [    ] o.a.s.c.c.SolrZkClient makePath: /configs/conf1/schema.xml
   [junit4]   2> 762868 INFO  (TEST-UnloadDistributedZkTest.test-seed#[3046F0449A84A995]) [    ] o.a.s.c.AbstractZkTestCase put /home/jenkins/workspace/Lucene-Solr-trunk-Linux/solr/core/src/test-files/solr/collection1/conf/solrconfig.snippet.randomindexconfig.xml to /configs/conf1/solrconfig.snippet.randomindexconfig.xml
   [junit4]   2> 762868 INFO  (TEST-UnloadDistributedZkTest.test-seed#[3046F0449A84A995]) [    ] o.a.s.c.c.SolrZkClient makePath: /configs/conf1/solrconfig.snippet.randomindexconfig.xml
   [junit4]   2> 762869 INFO  (TEST-UnloadDistributedZkTest.test-seed#[3046F0449A84A995]) [    ] o.a.s.c.AbstractZkTestCase put /home/jenkins/workspace/Lucene-Solr-trunk-Linux/solr/core/src/test-files/solr/collection1/conf/stopwords.txt to /configs/conf1/stopwords.txt
   [junit4]   2> 762869 INFO  (TEST-UnloadDistributedZkTest.test-seed#[3046F0449A84A995]) [    ] o.a.s.c.c.SolrZkClient makePath: /configs/conf1/stopwords.txt
   [junit4]   2> 762869 INFO  (TEST-UnloadDistributedZkTest.test-seed#[3046F0449A84A995]) [    ] o.a.s.c.AbstractZkTestCase put /home/jenkins/workspace/Lucene-Solr-trunk-Linux/solr/core/src/test-files/solr/collection1/conf/protwords.txt to /configs/conf1/protwords.txt
   [junit4]   2> 762869 INFO  (TEST-UnloadDistributedZkTest.test-seed#[3046F0449A84A995]) [    ] o.a.s.c.c.SolrZkClient makePath: /configs/conf1/protwords.txt
   [junit4]   2> 762870 INFO  (TEST-UnloadDistributedZkTest.test-seed#[3046F0449A84A995]) [    ] o.a.s.c.AbstractZkTestCase put /home/jenkins/workspace/Lucene-Solr-trunk-Linux/solr/core/src/test-files/solr/collection1/conf/currency.xml to /configs/conf1/currency.xml
   [junit4]   2> 762870 INFO  (TEST-UnloadDistributedZkTest.test-seed#[3046F0449A84A995]) [    ] o.a.s.c.c.SolrZkClient makePath: /configs/conf1/currency.xml
   [junit4]   2> 762871 INFO  (TEST-UnloadDistributedZkTest.test-seed#[3046F0449A84A995]) [    ] o.a.s.c.AbstractZkTestCase put /home/jenkins/workspace/Lucene-Solr-trunk-Linux/solr/core/src/test-files/solr/collection1/conf/enumsConfig.xml to /configs/conf1/enumsConfig.xml
   [junit4]   2> 762871 INFO  (TEST-UnloadDistributedZkTest.test-seed#[3046F0449A84A995]) [    ] o.a.s.c.c.SolrZkClient makePath: /configs/conf1/enumsConfig.xml
   [junit4]   2> 762871 INFO  (TEST-UnloadDistributedZkTest.test-seed#[3046F0449A84A995]) [    ] o.a.s.c.AbstractZkTestCase put /home/jenkins/workspace/Lucene-Solr-trunk-Linux/solr/core/src/test-files/solr/collection1/conf/open-exchange-rates.json to /configs/conf1/open-exchange-rates.json
   [junit4]   2> 762871 INFO  (TEST-UnloadDistributedZkTest.test-seed#[3046F0449A84A995]) [    ] o.a.s.c.c.SolrZkClient makePath: /configs/conf1/open-exchange-rates.json
   [junit4]   2> 762873 INFO  (TEST-UnloadDistributedZkTest.test-seed#[3046F0449A84A995]) [    ] o.a.s.c.AbstractZkTestCase put /home/jenkins/workspace/Lucene-Solr-trunk-Linux/solr/core/src/test-files/solr/collection1/conf/mapping-ISOLatin1Accent.txt to /configs/conf1/mapping-ISOLatin1Accent.txt
   [junit4]   2> 762873 INFO  (TEST-UnloadDistributedZkTest.test-seed#[3046F0449A84A995]) [    ] o.a.s.c.c.SolrZkClient makePath: /configs/conf1/mapping-ISOLatin1Accent.txt
   [junit4]   2> 762874 INFO  (TEST-UnloadDistributedZkTest.test-seed#[3046F0449A84A995]) [    ] o.a.s.c.AbstractZkTestCase put /home/jenkins/workspace/Lucene-Solr-trunk-Linux/solr/core/src/test-files/solr/collection1/conf/old_synonyms.txt to /configs/conf1/old_synonyms.txt
   [junit4]   2> 762874 INFO  (TEST-UnloadDistributedZkTest.test-seed#[3046F0449A84A995]) [    ] o.a.s.c.c.SolrZkClient makePath: /configs/conf1/old_synonyms.txt
   [junit4]   2> 762875 INFO  (TEST-UnloadDistributedZkTest.test-seed#[3046F0449A84A995]) [    ] o.a.s.c.AbstractZkTestCase put /home/jenkins/workspace/Lucene-Solr-trunk-Linux/solr/core/src/test-files/solr/collection1/conf/synonyms.txt to /configs/conf1/synonyms.txt
   [junit4]   2> 762875 INFO  (TEST-UnloadDistributedZkTest.test-seed#[3046F0449A84A995]) [    ] o.a.s.c.c.SolrZkClient makePath: /configs/conf1/synonyms.txt
   [junit4]   2> 762926 INFO  (TEST-UnloadDistributedZkTest.test-seed#[3046F0449A84A995]) [    ] o.a.s.SolrTestCaseJ4 Writing core.properties file to /home/jenkins/workspace/Lucene-Solr-trunk-Linux/solr/build/solr-core/test/J2/temp/solr.cloud.UnloadDistributedZkTest_3046F0449A84A995-001/control-001/cores/collection1
   [junit4]   2> 762927 INFO  (TEST-UnloadDistributedZkTest.test-seed#[3046F0449A84A995]) [    ] o.e.j.s.Server jetty-9.3.6.v20151106
   [junit4]   2> 762928 INFO  (TEST-UnloadDistributedZkTest.test-seed#[3046F0449A84A995]) [    ] o.e.j.s.h.ContextHandler Started o.e.j.s.ServletContextHandler@554c85d9{/,null,AVAILABLE}
   [junit4]   2> 762930 INFO  (TEST-UnloadDistributedZkTest.test-seed#[3046F0449A84A995]) [    ] o.e.j.s.ServerConnector Started ServerConnector@7c2b7480{HTTP/1.1,[http/1.1]}{127.0.0.1:43939}
   [junit4]   2> 762930 INFO  (TEST-UnloadDistributedZkTest.test-seed#[3046F0449A84A995]) [    ] o.e.j.s.Server Started @764925ms
   [junit4]   2> 762930 INFO  (TEST-UnloadDistributedZkTest.test-seed#[3046F0449A84A995]) [    ] o.a.s.c.s.e.JettySolrRunner Jetty properties: {solr.data.dir=/home/jenkins/workspace/Lucene-Solr-trunk-Linux/solr/build/solr-core/test/J2/temp/solr.cloud.UnloadDistributedZkTest_3046F0449A84A995-001/tempDir-001/control/data, hostContext=/, hostPort=43939, coreRootDirectory=/home/jenkins/workspace/Lucene-Solr-trunk-Linux/solr/build/solr-core/test/J2/../../../../../../../../../home/jenkins/workspace/Lucene-Solr-trunk-Linux/solr/build/solr-core/test/J2/temp/solr.cloud.UnloadDistributedZkTest_3046F0449A84A995-001/control-001/cores}
   [junit4]   2> 762931 INFO  (TEST-UnloadDistributedZkTest.test-seed#[3046F0449A84A995]) [    ] o.a.s.s.SolrDispatchFilter SolrDispatchFilter.init(): sun.misc.Launcher$AppClassLoader@73d16e93
   [junit4]   2> 762931 INFO  (TEST-UnloadDistributedZkTest.test-seed#[3046F0449A84A995]) [    ] o.a.s.c.SolrResourceLoader new SolrResourceLoader for directory: '/home/jenkins/workspace/Lucene-Solr-trunk-Linux/solr/build/solr-core/test/J2/temp/solr.cloud.UnloadDistributedZkTest_3046F0449A84A995-001/control-001'
   [junit4]   2> 762931 INFO  (TEST-UnloadDistributedZkTest.test-seed#[3046F0449A84A995]) [    ] o.a.s.c.SolrResourceLoader JNDI not configured for solr (NoInitialContextEx)
   [junit4]   2> 762931 INFO  (TEST-UnloadDistributedZkTest.test-seed#[3046F0449A84A995]) [    ] o.a.s.c.SolrResourceLoader solr home defaulted to 'solr/' (could not find system property or JNDI)
   [junit4]   2> 762931 INFO  (TEST-UnloadDistributedZkTest.test-seed#[3046F0449A84A995]) [    ] o.a.s.c.c.SolrZkClient Using default ZkCredentialsProvider
   [junit4]   2> 762931 INFO  (TEST-UnloadDistributedZkTest.test-seed#[3046F0449A84A995]) [    ] o.a.s.c.c.ConnectionManager Waiting for client to connect to ZooKeeper
   [junit4]   2> 762932 INFO  (zkCallback-1230-thread-1) [    ] o.a.s.c.c.ConnectionManager Watcher org.apache.solr.common.cloud.ConnectionManager@3e64a03b name:ZooKeeperConnection Watcher:127.0.0.1:55720/solr got event WatchedEvent state:SyncConnected type:None path:null path:null type:None
   [junit4]   2> 762932 INFO  (TEST-UnloadDistributedZkTest.test-seed#[3046F0449A84A995]) [    ] o.a.s.c.c.ConnectionManager Client is connected to ZooKeeper
   [junit4]   2> 762932 INFO  (TEST-UnloadDistributedZkTest.test-seed#[3046F0449A84A995]) [    ] o.a.s.c.c.SolrZkClient Using default ZkACLProvider
   [junit4]   2> 762933 INFO  (TEST-UnloadDistributedZkTest.test-seed#[3046F0449A84A995]) [    ] o.a.s.s.SolrDispatchFilter Loading solr.xml from SolrHome (not found in ZooKeeper)
   [junit4]   2> 762933 INFO  (TEST-UnloadDistributedZkTest.test-seed#[3046F0449A84A995]) [    ] o.a.s.c.SolrXmlConfig Loading container configuration from /home/jenkins/workspace/Lucene-Solr-trunk-Linux/solr/build/solr-core/test/J2/temp/solr.cloud.UnloadDistributedZkTest_3046F0449A84A995-001/control-001/solr.xml
   [junit4]   2> 762936 INFO  (TEST-UnloadDistributedZkTest.test-seed#[3046F0449A84A995]) [    ] o.a.s.c.CorePropertiesLocator Config-defined core root directory: /home/jenkins/workspace/Lucene-Solr-trunk-Linux/solr/build/solr-core/test/J2/../../../../../../../../../home/jenkins/workspace/Lucene-Solr-trunk-Linux/solr/build/solr-core/test/J2/temp/solr.cloud.UnloadDistributedZkTest_3046F0449A84A995-001/control-001/cores
   [junit4]   2> 762936 INFO  (TEST-UnloadDistributedZkTest.test-seed#[3046F0449A84A995]) [    ] o.a.s.c.CoreContainer New CoreContainer 1409671999
   [junit4]   2> 762936 INFO  (TEST-UnloadDistributedZkTest.test-seed#[3046F0449A84A995]) [    ] o.a.s.c.CoreContainer Loading cores into CoreContainer [instanceDir=/home/jenkins/workspace/Lucene-Solr-trunk-Linux/solr/build/solr-core/test/J2/temp/solr.cloud.UnloadDistributedZkTest_3046F0449A84A995-001/control-001]
   [junit4]   2> 762936 WARN  (TEST-UnloadDistributedZkTest.test-seed#[3046F0449A84A995]) [    ] o.a.s.c.CoreContainer Couldn't add files from /home/jenkins/workspace/Lucene-Solr-trunk-Linux/solr/build/solr-core/test/J2/temp/solr.cloud.UnloadDistributedZkTest_3046F0449A84A995-001/control-001/lib to classpath: /home/jenkins/workspace/Lucene-Solr-trunk-Linux/solr/build/solr-core/test/J2/temp/solr.cloud.UnloadDistributedZkTest_3046F0449A84A995-001/control-001/lib
   [junit4]   2> 762936 INFO  (TEST-UnloadDistributedZkTest.test-seed#[3046F0449A84A995]) [    ] o.a.s.h.c.HttpShardHandlerFactory created with socketTimeout : 90000,urlScheme : ,connTimeout : 15000,maxConnectionsPerHost : 20,maxConnections : 10000,corePoolSize : 0,maximumPoolSize : 2147483647,maxThreadIdleTime : 5,sizeOfQueue : -1,fairnessPolicy : false,useRetries : false,
   [junit4]   2> 762937 INFO  (TEST-UnloadDistributedZkTest.test-seed#[3046F0449A84A995]) [    ] o.a.s.u.UpdateShardHandler Creating UpdateShardHandler HTTP client with params: socketTimeout=340000&connTimeout=45000&retry=true
   [junit4]   2> 762937 INFO  (TEST-UnloadDistributedZkTest.test-seed#[3046F0449A84A995]) [    ] o.a.s.l.LogWatcher SLF4J impl is org.slf4j.impl.Log4jLoggerFactory
   [junit4]   2> 762937 INFO  (TEST-UnloadDistributedZkTest.test-seed#[3046F0449A84A995]) [    ] o.a.s.l.LogWatcher Registering Log Listener [Log4j (org.slf4j.impl.Log4jLoggerFactory)]
   [junit4]   2> 762937 INFO  (TEST-UnloadDistributedZkTest.test-seed#[3046F0449A84A995]) [    ] o.a.s.c.ZkContainer Zookeeper client=127.0.0.1:55720/solr
   [junit4]   2> 762937 INFO  (TEST-UnloadDistributedZkTest.test-seed#[3046F0449A84A995]) [    ] o.a.s.c.ZkController zkHost includes chroot
   [junit4]   2> 762938 INFO  (TEST-UnloadDistributedZkTest.test-seed#[3046F0449A84A995]) [    ] o.a.s.c.c.SolrZkClient Using default ZkCredentialsProvider
   [junit4]   2> 762938 INFO  (TEST-UnloadDistributedZkTest.test-seed#[3046F0449A84A995]) [    ] o.a.s.c.c.ConnectionManager Waiting for client to connect to ZooKeeper
   [junit4]   2> 762939 INFO  (zkCallback-1233-thread-1) [    ] o.a.s.c.c.ConnectionManager Watcher org.apache.solr.common.cloud.ConnectionManager@571c3a41 name:ZooKeeperConnection Watcher:127.0.0.1:55720 got event WatchedEvent state:SyncConnected type:None path:null path:null type:None
   [junit4]   2> 762939 INFO  (TEST-UnloadDistributedZkTest.test-seed#[3046F0449A84A995]) [    ] o.a.s.c.c.ConnectionManager Client is connected to ZooKeeper
   [junit4]   2> 762939 INFO  (TEST-UnloadDistributedZkTest.test-seed#[3046F0449A84A995]) [    ] o.a.s.c.c.SolrZkClient Using default ZkACLProvider
   [junit4]   2> 762940 INFO  (TEST-UnloadDistributedZkTest.test-seed#[3046F0449A84A995]) [n:127.0.0.1:43939_    ] o.a.s.c.c.ConnectionManager Waiting for client to connect to ZooKeeper
   [junit4]   2> 762940 INFO  (zkCallback-1234-thread-1-processing-n:127.0.0.1:43939_) [n:127.0.0.1:43939_    ] o.a.s.c.c.ConnectionManager Watcher org.apache.solr.common.cloud.ConnectionManager@1d0d3bf3 name:ZooKeeperConnection Watcher:127.0.0.1:55720/solr got event WatchedEvent state:SyncConnected type:None path:null path:null type:None
   [junit4]   2> 762940 INFO  (TEST-UnloadDistributedZkTest.test-seed#[3046F0449A84A995]) [n:127.0.0.1:43939_    ] o.a.s.c.c.ConnectionManager Client is connected to ZooKeeper
   [junit4]   2> 762940 INFO  (TEST-UnloadDistributedZkTest.test-seed#[3046F0449A84A995]) [n:127.0.0.1:43939_    ] o.a.s.c.c.SolrZkClient makePath: /overseer/queue
   [junit4]   2> 762941 INFO  (TEST-UnloadDistributedZkTest.test-seed#[3046F0449A84A995]) [n:127.0.0.1:43939_    ] o.a.s.c.c.SolrZkClient makePath: /overseer/collection-queue-work
   [junit4]   2> 762942 INFO  (TEST-UnloadDistributedZkTest.test-seed#[3046F0449A84A995]) [n:127.0.0.1:43939_    ] o.a.s.c.c.SolrZkClient makePath: /overseer/collection-map-running
   [junit4]   2> 762943 INFO  (TEST-UnloadDistributedZkTest.test-seed#[3046F0449A84A995]) [n:127.0.0.1:43939_    ] o.a.s.c.c.SolrZkClient makePath: /overseer/collection-map-completed
   [junit4]   2> 762943 INFO  (TEST-UnloadDistributedZkTest.test-seed#[3046F0449A84A995]) [n:127.0.0.1:43939_    ] o.a.s.c.c.SolrZkClient makePath: /overseer/collection-map-failure
   [junit4]   2> 762944 INFO  (TEST-UnloadDistributedZkTest.test-seed#[3046F0449A84A995]) [n:127.0.0.1:43939_    ] o.a.s.c.c.SolrZkClient makePath: /live_nodes
   [junit4]   2> 762944 INFO  (TEST-UnloadDistributedZkTest.test-seed#[3046F0449A84A995]) [n:127.0.0.1:43939_    ] o.a.s.c.c.SolrZkClient makePath: /aliases.json
   [junit4]   2> 762944 INFO  (TEST-UnloadDistributedZkTest.test-seed#[3046F0449A84A995]) [n:127.0.0.1:43939_    ] o.a.s.c.c.SolrZkClient makePath: /clusterstate.json
   [junit4]   2> 762945 INFO  (TEST-UnloadDistributedZkTest.test-seed#[3046F0449A84A995]) [n:127.0.0.1:43939_    ] o.a.s.c.c.SolrZkClient makePath: /security.json
   [junit4]   2> 762945 INFO  (TEST-UnloadDistributedZkTest.test-seed#[3046F0449A84A995]) [n:127.0.0.1:43939_    ] o.a.s.c.c.ZkStateReader Updating cluster state from ZooKeeper... 
   [junit4]   2> 762946 INFO  (TEST-UnloadDistributedZkTest.test-seed#[3046F0449A84A995]) [n:127.0.0.1:43939_    ] o.a.s.c.c.ZkStateReader Updated live nodes from ZooKeeper... (0) -> (0)
   [junit4]   2> 762947 INFO  (TEST-UnloadDistributedZkTest.test-seed#[3046F0449A84A995]) [n:127.0.0.1:43939_    ] o.a.s.c.c.SolrZkClient makePath: /overseer_elect
   [junit4]   2> 762947 INFO  (TEST-UnloadDistributedZkTest.test-seed#[3046F0449A84A995]) [n:127.0.0.1:43939_    ] o.a.s.c.c.SolrZkClient makePath: /overseer_elect/election
   [junit4]   2> 762947 INFO  (TEST-UnloadDistributedZkTest.test-seed#[3046F0449A84A995]) [n:127.0.0.1:43939_    ] o.a.s.c.Overseer Overseer (id=null) closing
   [junit4]   2> 762947 INFO  (TEST-UnloadDistributedZkTest.test-seed#[3046F0449A84A995]) [n:127.0.0.1:43939_    ] o.a.s.c.LeaderElector Joined leadership election with path: /overseer_elect/election/95484088345296900-127.0.0.1:43939_-n_0000000000
   [junit4]   2> 762948 INFO  (TEST-UnloadDistributedZkTest.test-seed#[3046F0449A84A995]) [n:127.0.0.1:43939_    ] o.a.s.c.OverseerElectionContext I am going to be the leader 127.0.0.1:43939_
   [junit4]   2> 762948 INFO  (TEST-UnloadDistributedZkTest.test-seed#[3046F0449A84A995]) [n:127.0.0.1:43939_    ] o.a.s.c.c.SolrZkClient makePath: /overseer_elect/leader
   [junit4]   2> 762948 INFO  (TEST-UnloadDistributedZkTest.test-seed#[3046F0449A84A995]) [n:127.0.0.1:43939_    ] o.a.s.c.Overseer Overseer (id=95484088345296900-127.0.0.1:43939_-n_0000000000) starting
   [junit4]   2> 762948 INFO  (TEST-UnloadDistributedZkTest.test-seed#[3046F0449A84A995]) [n:127.0.0.1:43939_    ] o.a.s.c.c.SolrZkClient makePath: /overseer/queue-work
   [junit4]   2> 762950 INFO  (TEST-UnloadDistributedZkTest.test-seed#[3046F0449A84A995]) [n:127.0.0.1:43939_    ] o.a.s.c.OverseerAutoReplicaFailoverThread Starting OverseerAutoReplicaFailoverThread autoReplicaFailoverWorkLoopDelay=10000 autoReplicaFailoverWaitAfterExpiration=10000 autoReplicaFailoverBadNodeExpiration=60000
   [junit4]   2> 762950 INFO  (OverseerCollectionConfigSetProcessor-95484088345296900-127.0.0.1:43939_-n_0000000000) [n:127.0.0.1:43939_    ] o.a.s.c.OverseerTaskProcessor Process current queue of overseer operations
   [junit4]   2> 762950 INFO  (TEST-UnloadDistributedZkTest.test-seed#[3046F0449A84A995]) [n:127.0.0.1:43939_    ] o.a.s.c.ZkController Register node as live in ZooKeeper:/live_nodes/127.0.0.1:43939_
   [junit4]   2> 762950 INFO  (OverseerStateUpdate-95484088345296900-127.0.0.1:43939_-n_0000000000) [n:127.0.0.1:43939_    ] o.a.s.c.Overseer Starting to work on the main queue
   [junit4]   2> 762951 INFO  (TEST-UnloadDistributedZkTest.test-seed#[3046F0449A84A995]) [n:127.0.0.1:43939_    ] o.a.s.c.c.SolrZkClient makePath: /live_nodes/127.0.0.1:43939_
   [junit4]   2> 762951 INFO  (OverseerStateUpdate-95484088345296900-127.0.0.1:43939_-n_0000000000) [n:127.0.0.1:43939_    ] o.a.s.c.c.ZkStateReader Updated live nodes from ZooKeeper... (0) -> (0)
   [junit4]   2> 762951 INFO  (zkCallback-1234-thread-1-processing-n:127.0.0.1:43939_) [n:127.0.0.1:43939_    ] o.a.s.c.c.ZkStateReader A live node change: [WatchedEvent state:SyncConnected type:NodeChildrenChanged path:/live_nodes], has occurred - updating... (live nodes size: [0])
   [junit4]   2> 762951 INFO  (zkCallback-1234-thread-1-processing-n:127.0.0.1:43939_) [n:127.0.0.1:43939_    ] o.a.s.c.c.ZkStateReader Updated live nodes from ZooKeeper... (0) -> (1)
   [junit4]   2> 762961 INFO  (TEST-UnloadDistributedZkTest.test-seed#[3046F0449A84A995]) [n:127.0.0.1:43939_    ] o.a.s.c.CoreContainer Security conf doesn't exist. Skipping setup for authorization module.
   [junit4]   2> 762961 INFO  (TEST-UnloadDistributedZkTest.test-seed#[3046F0449A84A995]) [n:127.0.0.1:43939_    ] o.a.s.c.CoreContainer No authentication plugin used.
   [junit4]   2> 762962 INFO  (TEST-UnloadDistributedZkTest.test-seed#[3046F0449A84A995]) [n:127.0.0.1:43939_    ] o.a.s.c.CorePropertiesLocator Looking for core definitions underneath /home/jenkins/workspace/Lucene-Solr-trunk-Linux/solr/build/solr-core/test/J2/../../../../../../../../../home/jenkins/workspace/Lucene-Solr-trunk-Linux/solr/build/solr-core/test/J2/temp/solr.cloud.UnloadDistributedZkTest_3046F0449A84A995-001/control-001/cores
   [junit4]   2> 762962 INFO  (TEST-UnloadDistributedZkTest.test-seed#[3046F0449A84A995]) [n:127.0.0.1:43939_    ] o.a.s.c.CoreDescriptor Created CoreDescriptor: {name=collection1, config=solrconfig.xml, transient=false, schema=schema.xml, loadOnStartup=true, configSetProperties=configsetprops.json, collection=control_collection, coreNodeName=, dataDir=data/, shard=}
   [junit4]   2> 762962 INFO  (TEST-UnloadDistributedZkTest.test-seed#[3046F0449A84A995]) [n:127.0.0.1:43939_    ] o.a.s.c.CorePropertiesLocator Found core collection1 in /home/jenkins/workspace/Lucene-Solr-trunk-Linux/solr/build/solr-core/test/J2/../../../../../../../../../home/jenkins/workspace/Lucene-Solr-trunk-Linux/solr/build/solr-core/test/J2/temp/solr.cloud.UnloadDistributedZkTest_3046F0449A84A995-001/control-001/cores/collection1
   [junit4]   2> 762962 INFO  (TEST-UnloadDistributedZkTest.test-seed#[3046F0449A84A995]) [n:127.0.0.1:43939_    ] o.a.s.c.CorePropertiesLocator Found 1 core definitions
   [junit4]   2> 762963 INFO  (TEST-UnloadDistributedZkTest.test-seed#[3046F0449A84A995]) [n:127.0.0.1:43939_    ] o.a.s.s.SolrDispatchFilter user.dir=/home/jenkins/workspace/Lucene-Solr-trunk-Linux/solr/build/solr-core/test/J2
   [junit4]   2> 762963 INFO  (TEST-UnloadDistributedZkTest.test-seed#[3046F0449A84A995]) [n:127.0.0.1:43939_    ] o.a.s.s.SolrDispatchFilter SolrDispatchFilter.init() done
   [junit4]   2> 762963 INFO  (coreLoadExecutor-2809-thread-1-processing-n:127.0.0.1:43939_) [n:127.0.0.1:43939_ c:control_collection   x:collection1] o.a.s.c.ZkController publishing state=down
   [junit4]   2> 762963 INFO  (coreLoadExecutor-2809-thread-1-processing-n:127.0.0.1:43939_) [n:127.0.0.1:43939_ c:control_collection   x:collection1] o.a.s.c.ZkController numShards not found on descriptor - reading it from system property
   [junit4]   2> 762964 INFO  (OverseerStateUpdate-95484088345296900-127.0.0.1:43939_-n_0000000000) [n:127.0.0.1:43939_    ] o.a.s.c.Overseer processMessage: queueSize: 1, message = {
   [junit4]   2>   "core":"collection1",
   [junit4]   2>   "roles":null,
   [junit4]   2>   "base_url":"http://127.0.0.1:43939",
   [junit4]   2>   "node_name":"127.0.0.1:43939_",
   [junit4]   2>   "numShards":"1",
   [junit4]   2>   "state":"down",
   [junit4]   2>   "shard":null,
   [junit4]   2>   "collection":"control_collection",
   [junit4]   2>   "operation":"state"} current state version: 0
   [junit4]   2> 762964 INFO  (coreLoadExecutor-2809-thread-1-processing-n:127.0.0.1:43939_) [n:127.0.0.1:43939_ c:control_collection   x:collection1] o.a.s.c.ZkController look for our core node name
   [junit4]   2> 762964 INFO  (OverseerStateUpdate-95484088345296900-127.0.0.1:43939_-n_0000000000) [n:127.0.0.1:43939_    ] o.a.s.c.o.ReplicaMutator Update state numShards=1 message={
   [junit4]   2>   "core":"collection1",
   [junit4]   2>   "roles":null,
   [junit4]   2>   "base_url":"http://127.0.0.1:43939",
   [junit4]   2>   "node_name":"127.0.0.1:43939_",
   [junit4]   2>   "numShards":"1",
   [junit4]   2>   "state":"down",
   [junit4]   2>   "shard":null,
   [junit4]   2>   "collection":"control_collection",
   [junit4]   2>   "operation":"state"}
   [junit4]   2> 762964 INFO  (OverseerStateUpdate-95484088345296900-127.0.0.1:43939_-n_0000000000) [n:127.0.0.1:43939_    ] o.a.s.c.o.ClusterStateMutator building a new cName: control_collection
   [junit4]   2> 762964 INFO  (OverseerStateUpdate-95484088345296900-127.0.0.1:43939_-n_0000000000) [n:127.0.0.1:43939_    ] o.a.s.c.o.ReplicaMutator Assigning new node to shard shard=shard1
   [junit4]   2> 762965 INFO  (zkCallback-1234-thread-1-processing-n:127.0.0.1:43939_) [n:127.0.0.1:43939_    ] o.a.s.c.c.ZkStateReader A cluster state change: [WatchedEvent state:SyncConnected type:NodeDataChanged path:/clusterstate.json], has occurred - updating... (live nodes size: [1])
   [junit4]   2> 763964 INFO  (coreLoadExecutor-2809-thread-1-processing-n:127.0.0.1:43939_) [n:127.0.0.1:43939_ c:control_collection   x:collection1] o.a.s.c.ZkController waiting to find shard id in clusterstate for collection1
   [junit4]   2> 763964 INFO  (coreLoadExecutor-2809-thread-1-processing-n:127.0.0.1:43939_) [n:127.0.0.1:43939_ c:control_collection   x:collection1] o.a.s.c.ZkController Check for collection zkNode:control_collection
   [junit4]   2> 763964 INFO  (coreLoadExecutor-2809-thread-1-processing-n:127.0.0.1:43939_) [n:127.0.0.1:43939_ c:control_collection   x:collection1] o.a.s.c.ZkController Collection zkNode exists
   [junit4]   2> 763964 INFO  (coreLoadExecutor-2809-thread-1-processing-n:127.0.0.1:43939_) [n:127.0.0.1:43939_ c:control_collection   x:collection1] o.a.s.c.c.ZkStateReader Load collection config from: [/collections/control_collection]
   [junit4]   2> 763965 INFO  (coreLoadExecutor-2809-thread-1-processing-n:127.0.0.1:43939_) [n:127.0.0.1:43939_ c:control_collection   x:collection1] o.a.s.c.c.ZkStateReader path=[/collections/control_collection] [configName]=[conf1] specified config exists in ZooKeeper
   [junit4]   2> 763965 INFO  (coreLoadExecutor-2809-thread-1-processing-n:127.0.0.1:43939_) [n:127.0.0.1:43939_ c:control_collection   x:collection1] o.a.s.c.SolrResourceLoader new SolrResourceLoader for directory: '/home/jenkins/workspace/Lucene-Solr-trunk-Linux/solr/build/solr-core/test/J2/temp/solr.cloud.UnloadDistributedZkTest_3046F0449A84A995-001/control-001/cores/collection1'
   [junit4]   2> 763965 INFO  (coreLoadExecutor-2809-thread-1-processing-n:127.0.0.1:43939_) [n:127.0.0.1:43939_ c:control_collection   x:collection1] o.a.s.c.SolrResourceLoader JNDI not configured for solr (NoInitialContextEx)
   [junit4]   2> 763965 INFO  (coreLoadExecutor-2809-thread-1-processing-n:127.0.0.1:43939_) [n:127.0.0.1:43939_ c:control_collection   x:collection1] o.a.s.c.SolrResourceLoader solr home defaulted to 'solr/' (could not find system property or JNDI)
   [junit4]   2> 763966 INFO  (coreLoadExecutor-2809-thread-1-processing-n:127.0.0.1:43939_) [n:127.0.0.1:43939_ c:control_collection   x:collection1] o.a.s.c.Config loaded config solrconfig.xml with version 0 
   [junit4]   2> 763969 INFO  (coreLoadExecutor-2809-thread-1-processing-n:127.0.0.1:43939_) [n:127.0.0.1:43939_ c:control_collection   x:collection1] o.a.s.c.SolrConfig current version of requestparams : -1
   [junit4]   2> 763971 INFO  (coreLoadExecutor-2809-thread-1-processing-n:127.0.0.1:43939_) [n:127.0.0.1:43939_ c:control_collection   x:collection1] o.a.s.c.SolrConfig Using Lucene MatchVersion: 7.0.0
   [junit4]   2> 763977 INFO  (coreLoadExecutor-2809-thread-1-processing-n:127.0.0.1:43939_) [n:127.0.0.1:43939_ c:control_collection   x:collection1] o.a.s.c.SolrConfig Loaded SolrConfig: solrconfig.xml
   [junit4]   2> 763981 INFO  (coreLoadExecutor-2809-thread-1-processing-n:127.0.0.1:43939_) [n:127.0.0.1:43939_ c:control_collection   x:collection1] o.a.s.s.IndexSchema [collection1] Schema name=test
   [junit4]   2> 764054 INFO  (coreLoadExecutor-2809-thread-1-processing-n:127.0.0.1:43939_) [n:127.0.0.1:43939_ c:control_collection   x:collection1] o.a.s.s.OpenExchangeRatesOrgProvider Initialized with rates=open-exchange-rates.json, refreshInterval=1440.
   [junit4]   2> 764058 INFO  (coreLoadExecutor-2809-thread-1-processing-n:127.0.0.1:43939_) [n:127.0.0.1:43939_ c:control_collection   x:collection1] o.a.s.s.IndexSchema default search field in schema is text
   [junit4]   2> 764059 INFO  (coreLoadExecutor-2809-thread-1-processing-n:127.0.0.1:43939_) [n:127.0.0.1:43939_ c:control_collection   x:collection1] o.a.s.s.IndexSchema unique key field: id
   [junit4]   2> 764062 INFO  (coreLoadExecutor-2809-thread-1-processing-n:127.0.0.1:43939_) [n:127.0.0.1:43939_ c:control_collection   x:collection1] o.a.s.s.FileExchangeRateProvider Reloading exchange rates from file currency.xml
   [junit4]   2> 764063 INFO  (coreLoadExecutor-2809-thread-1-processing-n:127.0.0.1:43939_) [n:127.0.0.1:43939_ c:control_collection   x:collection1] o.a.s.s.FileExchangeRateProvider Reloading exchange rates from file currency.xml
   [junit4]   2> 764064 INFO  (coreLoadExecutor-2809-thread-1-processing-n:127.0.0.1:43939_) [n:127.0.0.1:43939_ c:control_collection   x:collection1] o.a.s.s.OpenExchangeRatesOrgProvider Reloading exchange rates from open-exchange-rates.json
   [junit4]   2> 764064 INFO  (coreLoadExecutor-2809-thread-1-processing-n:127.0.0.1:43939_) [n:127.0.0.1:43939_ c:control_collection   x:collection1] o.a.s.s.OpenExchangeRatesOrgProvider Reloading exchange rates from open-exchange-rates.json
   [junit4]   2> 764065 INFO  (coreLoadExecutor-2809-thread-1-processing-n:127.0.0.1:43939_) [n:127.0.0.1:43939_ c:control_collection   x:collection1] o.a.s.c.ConfigSetProperties Did not find ConfigSet properties, assuming default properties: Can't find resource 'configsetprops.json' in classpath or '/configs/conf1', cwd=/home/jenkins/workspace/Lucene-Solr-trunk-Linux/solr/build/solr-core/test/J2
   [junit4]   2> 764065 INFO  (coreLoadExecutor-2809-thread-1-processing-n:127.0.0.1:43939_) [n:127.0.0.1:43939_ c:control_collection   x:collection1] o.a.s.c.CoreContainer Creating SolrCore 'collection1' using configuration from collection control_collection
   [junit4]   2> 764065 INFO  (coreLoadExecutor-2809-thread-1-processing-n:127.0.0.1:43939_) [n:127.0.0.1:43939_ c:control_collection s:shard1 r:core_node1 x:collection1] o.a.s.c.SolrCore org.apache.solr.core.MockDirectoryFactory
   [junit4]   2> 764065 INFO  (coreLoadExecutor-2809-thread-1-processing-n:127.0.0.1:43939_) [n:127.0.0.1:43939_ c:control_collection s:shard1 r:core_node1 x:collection1] o.a.s.c.SolrCore [[collection1] ] Opening new SolrCore at [/home/jenkins/workspace/Lucene-Solr-trunk-Linux/solr/build/solr-core/test/J2/temp/solr.cloud.UnloadDistributedZkTest_3046F0449A84A995-001/control-001/cores/collection1], dataDir=[/home/jenkins/workspace/Lucene-Solr-trunk-Linux/solr/build/solr-core/test/J2/../../../../../../../../../home/jenkins/workspace/Lucene-Solr-trunk-Linux/solr/build/solr-core/test/J2/temp/solr.cloud.UnloadDistributedZkTest_3046F0449A84A995-001/control-001/cores/collection1/data/]
   [junit4]   2> 764066 INFO  (coreLoadExecutor-2809-thread-1-processing-n:127.0.0.1:43939_) [n:127.0.0.1:43939_ c:control_collection s:shard1 r:core_node1 x:collection1] o.a.s.c.JmxMonitoredMap JMX monitoring is enabled. Adding Solr mbeans to JMX Server: com.sun.jmx.mbeanserver.JmxMBeanServer@636af085
   [junit4]   2> 764066 INFO  (coreLoadExecutor-2809-thread-1-processing-n:127.0.0.1:43939_) [n:127.0.0.1:43939_ c:control_collection s:shard1 r:core_node1 x:collection1] o.a.s.c.CachingDirectoryFactory return new directory for /home/jenkins/workspace/Lucene-Solr-trunk-Linux/solr/build/solr-core/test/J2/../../../../../../../../../home/jenkins/workspace/Lucene-Solr-trunk-Linux/solr/build/solr-core/test/J2/temp/solr.cloud.UnloadDistributedZkTest_3046F0449A84A995-001/control-001/cores/collection1/data
   [junit4]   2> 764066 INFO  (coreLoadExecutor-2809-thread-1-processing-n:127.0.0.1:43939_) [n:127.0.0.1:43939_ c:control_collection s:shard1 r:core_node1 x:collection1] o.a.s.c.SolrCore New index directory detected: old=null new=/home/jenkins/workspace/Lucene-Solr-trunk-Linux/solr/build/solr-core/test/J2/../../../../../../../../../home/jenkins/workspace/Lucene-Solr-trunk-Linux/solr/build/solr-core/test/J2/temp/solr.cloud.UnloadDistributedZkTest_3046F0449A84A995-001/control-001/cores/collection1/data/index/
   [junit4]   2> 764066 WARN  (coreLoadExecutor-2809-thread-1-processing-n:127.0.0.1:43939_) [n:127.0.0.1:43939_ c:control_collection s:shard1 r:core_node1 x:collection1] o.a.s.c.SolrCore [collection1] Solr index directory '/home/jenkins/workspace/Lucene-Solr-trunk-Linux/solr/build/solr-core/test/J2/../../../../../../../../../home/jenkins/workspace/Lucene-Solr-trunk-Linux/solr/build/solr-core/test/J2/temp/solr.cloud.UnloadDistributedZkTest_3046F0449A84A995-001/control-001/cores/collection1/data/index' doesn't exist. Creating new index...
   [junit4]   2> 764066 INFO  (coreLoadExecutor-2809-thread-1-processing-n:127.0.0.1:43939_) [n:127.0.0.1:43939_ c:control_collection s:shard1 r:core_node1 x:collection1] o.a.s.c.CachingDirectoryFactory return new directory for /home/jenkins/workspace/Lucene-Solr-trunk-Linux/solr/build/solr-core/test/J2/../../../../../../../../../home/jenkins/workspace/Lucene-Solr-trunk-Linux/solr/build/solr-core/test/J2/temp/solr.cloud.UnloadDistributedZkTest_3046F0449A84A995-001/control-001/cores/collection1/data/index
   [junit4]   2> 764066 INFO  (coreLoadExecutor-2809-thread-1-processing-n:127.0.0.1:43939_) [n:127.0.0.1:43939_ c:control_collection s:shard1 r:core_node1 x:collection1] o.a.s.u.RandomMergePolicy RandomMergePolicy wrapping class org.apache.lucene.index.LogDocMergePolicy: [LogDocMergePolicy: minMergeSize=1000, mergeFactor=25, maxMergeSize=9223372036854775807, maxMergeSizeForForcedMerge=9223372036854775807, calibrateSizeByDeletes=true, maxMergeDocs=2147483647, maxCFSSegmentSizeMB=8.796093022207999E12, noCFSRatio=1.0]
   [junit4]   2> 764067 INFO  (coreLoadExecutor-2809-thread-1-processing-n:127.0.0.1:43939_) [n:127.0.0.1:43939_ c:control_collection s:shard1 r:core_node1 x:collection1] o.a.s.c.SolrDeletionPolicy SolrDeletionPolicy.onCommit: commits: num=1
   [junit4]   2> 	commit{dir=MockDirectoryWrapper(RAMDirectory@69920258 lockFactory=org.apache.lucene.store.SingleInstanceLockFactory@7894fbfc),segFN=segments_1,generation=1}
   [junit4]   2> 764067 INFO  (coreLoadExecutor-2809-thread-1-processing-n:127.0.0.1:43939_) [n:127.0.0.1:43939_ c:control_collection s:shard1 r:core_node1 x:collection1] o.a.s.c.SolrDeletionPolicy newest commit generation = 1
   [junit4]   2> 764067 INFO  (OldIndexDirectoryCleanupThreadForCore-collection1) [n:127.0.0.1:43939_ c:control_collection s:shard1 r:core_node1 x:collection1] o.a.s.c.SolrCore Looking for old index directories to cleanup for core collection1 in /home/jenkins/workspace/Lucene-Solr-trunk-Linux/solr/build/solr-core/test/J2/../../../../../../../../../home/jenkins/workspace/Lucene-Solr-trunk-Linux/solr/build/solr-core/test/J2/temp/solr.cloud.UnloadDistributedZkTest_3046F0449A84A995-001/control-001/cores/collection1/data/
   [junit4]   2> 764067 WARN  (OldIndexDirectoryCleanupThreadForCore-collection1) [n:127.0.0.1:43939_ c:control_collection s:shard1 r:core_node1 x:collection1] o.a.s.c.DirectoryFactory /home/jenkins/workspace/Lucene-Solr-trunk-Linux/solr/build/solr-core/test/J2/../../../../../../../../../home/jenkins/workspace/Lucene-Solr-trunk-Linux/solr/build/solr-core/test/J2/temp/solr.cloud.UnloadDistributedZkTest_3046F0449A84A995-001/control-001/cores/collection1/data/ does not point to a valid data directory; skipping clean-up of old index directories.
   [junit4]   2> 764069 INFO  (coreLoadExecutor-2809-thread-1-processing-n:127.0.0.1:43939_) [n:127.0.0.1:43939_ c:control_collection s:shard1 r:core_node1 x:collection1] o.a.s.u.p.UpdateRequestProcessorChain creating updateRequestProcessorChain "nodistrib"
   [junit4]   2> 764069 INFO  (coreLoadExecutor-2809-thread-1-processing-n:127.0.0.1:43939_) [n:127.0.0.1:43939_ c:control_collection s:shard1 r:core_node1 x:collection1] o.a.s.u.p.UpdateRequestProcessorChain creating updateRequestProcessorChain "dedupe"
   [junit4]   2> 764069 INFO  (coreLoadExecutor-2809-thread-1-processing-n:127.0.0.1:43939_) [n:127.0.0.1:43939_ c:control_collection s:shard1 r:core_node1 x:collection1] o.a.s.u.p.UpdateRequestProcessorChain inserting DistributedUpdateProcessorFactory into updateRequestProcessorChain "dedupe"
   [junit4]   2> 764069 INFO  (coreLoadExecutor-2809-thread-1-processing-n:127.0.0.1:43939_) [n:127.0.0.1:43939_ c:control_collection s:shard1 r:core_node1 x:collection1] o.a.s.u.p.UpdateRequestProcessorChain creating updateRequestProcessorChain "stored_sig"
   [junit4]   2> 764069 INFO  (coreLoadExecutor-2809-thread-1-processing-n:127.0.0.1:43939_) [n:127.0.0.1:43939_ c:control_collection s:shard1 r:core_node1 x:collection1] o.a.s.u.p.UpdateRequestProcessorChain inserting DistributedUpdateProcessorFactory into updateRequestProcessorChain "stored_sig"
   [junit4]   2> 764069 INFO  (coreLoadExecutor-2809-thread-1-processing-n:127.0.0.1:43939_) [n:127.0.0.1:43939_ c:control_collection s:shard1 r:core_node1 x:collection1] o.a.s.u.p.UpdateRequestProcessorChain creating updateRequestProcessorChain "distrib-dup-test-chain-explicit"
   [junit4]   2> 764069 INFO  (coreLoadExecutor-2809-thread-1-processing-n:127.0.0.1:43939_) [n:127.0.0.1:43939_ c:control_collection s:shard1 r:core_node1 x:collection1] o.a.s.u.p.UpdateRequestProcessorChain creating updateRequestProcessorChain "distrib-dup-test-chain-implicit"
   [junit4]   2> 764069 INFO  (coreLoadExecutor-2809-thread-1-processing-n:127.0.0.1:43939_) [n:127.0.0.1:43939_ c:control_collection s:shard1 r:core_node1 x:collection1] o.a.s.u.p.UpdateRequestProcessorChain inserting DistributedUpdateProcessorFactory into updateRequestProcessorChain "distrib-dup-test-chain-implicit"
   [junit4]   2> 764069 INFO  (coreLoadExecutor-2809-thread-1-processing-n:127.0.0.1:43939_) [n:127.0.0.1:43939_ c:control_collection s:shard1 r:core_node1 x:collection1] o.a.s.c.SolrCore no updateRequestProcessorChain defined as default, creating implicit default
   [junit4]   2> 764069 WARN  (coreLoadExecutor-2809-thread-1-processing-n:127.0.0.1:43939_) [n:127.0.0.1:43939_ c:control_collection s:shard1 r:core_node1 x:collection1] o.a.s.c.RequestHandlers INVALID paramSet a in requestHandler {type = requestHandler,name = /dump,class = DumpRequestHandler,args = {defaults={a=A,b=B}}}
   [junit4]   2> 764071 INFO  (coreLoadExecutor-2809-thread-1-processing-n:127.0.0.1:43939_) [n:127.0.0.1:43939_ c:control_collection s:shard1 r:core_node1 x:collection1] o.a.s.h.l.XMLLoader xsltCacheLifetimeSeconds=60
   [junit4]   2> 764071 INFO  (coreLoadExecutor-2809-thread-1-processing-n:127.0.0.1:43939_) [n:127.0.0.1:43939_ c:control_collection s:shard1 r:core_node1 x:collection1] o.a.s.h.l.XMLLoader xsltCacheLifetimeSeconds=60
   [junit4]   2> 764072 INFO  (coreLoadExecutor-2809-thread-1-processing-n:127.0.0.1:43939_) [n:127.0.0.1:43939_ c:control_collection s:shard1 r:core_node1 x:collection1] o.a.s.h.l.XMLLoader xsltCacheLifetimeSeconds=60
   [junit4]   2> 764072 INFO  (coreLoadExecutor-2809-thread-1-processing-n:127.0.0.1:43939_) [n:127.0.0.1:43939_ c:control_collection s:shard1 r:core_node1 x:collection1] o.a.s.h.l.XMLLoader xsltCacheLifetimeSeconds=60
   [junit4]   2> 764074 INFO  (coreLoadExecutor-2809-thread-1-processing-n:127.0.0.1:43939_) [n:127.0.0.1:43939_ c:control_collection s:shard1 r:core_node1 x:collection1] o.a.s.c.RequestHandlers Registered paths: /admin/mbeans,standard,/dump,/update/csv,/sql,/update/json/docs,/admin/luke,/export,/admin/segments,/get,/admin/system,/replication,/admin/properties,/config,/stream,/schema,/admin/plugins,/admin/logging,/update/json,/admin/ping,/admin/threads,/update,/admin/file
   [junit4]   2> 764074 INFO  (coreLoadExecutor-2809-thread-1-processing-n:127.0.0.1:43939_) [n:127.0.0.1:43939_ c:control_collection s:shard1 r:core_node1 x:collection1] o.a.s.c.SolrCore Using default statsCache cache: org.apache.solr.search.stats.LocalStatsCache
   [junit4]   2> 764075 INFO  (coreLoadExecutor-2809-thread-1-processing-n:127.0.0.1:43939_) [n:127.0.0.1:43939_ c:control_collection s:shard1 r:core_node1 x:collection1] o.a.s.u.UpdateHandler Using UpdateLog implementation: org.apache.solr.update.UpdateLog
   [junit4]   2> 764075 INFO  (coreLoadExecutor-2809-thread-1-processing-n:127.0.0.1:43939_) [n:127.0.0.1:43939_ c:control_collection s:shard1 r:core_node1 x:collection1] o.a.s.u.UpdateLog Initializing UpdateLog: dataDir= defaultSyncLevel=FLUSH numRecordsToKeep=100 maxNumLogsToKeep=10 numVersionBuckets=65536
   [junit4]   2> 764075 INFO  (coreLoadExecutor-2809-thread-1-processing-n:127.0.0.1:43939_) [n:127.0.0.1:43939_ c:control_collection s:shard1 r:core_node1 x:collection1] o.a.s.u.CommitTracker Hard AutoCommit: disabled
   [junit4]   2> 764075 INFO  (coreLoadExecutor-2809-thread-1-processing-n:127.0.0.1:43939_) [n:127.0.0.1:43939_ c:control_collection s:shard1 r:core_node1 x:collection1] o.a.s.u.CommitTracker Soft AutoCommit: disabled
   [junit4]   2> 764076 INFO  (coreLoadExecutor-2809-thread-1-processing-n:127.0.0.1:43939_) [n:127.0.0.1:43939_ c:control_collection s:shard1 r:core_node1 x:collection1] o.a.s.u.RandomMergePolicy RandomMergePolicy wrapping class org.apache.lucene.index.LogDocMergePolicy: [LogDocMergePolicy: minMergeSize=1000, mergeFactor=20, maxMergeSize=9223372036854775807, maxMergeSizeForForcedMerge=9223372036854775807, calibrateSizeByDeletes=false, maxMergeDocs=2147483647, maxCFSSegmentSizeMB=8.796093022207999E12, noCFSRatio=0.5941614028620651]
   [junit4]   2> 764076 INFO  (coreLoadExecutor-2809-thread-1-processing-n:127.0.0.1:43939_) [n:127.0.0.1:43939_ c:control_collection s:shard1 r:core_node1 x:collection1] o.a.s.c.SolrDeletionPolicy SolrDeletionPolicy.onInit: commits: num=1
   [junit4]   2> 	commit{dir=MockDirectoryWrapper(RAMDirectory@69920258 lockFactory=org.apache.lucene.store.SingleInstanceLockFactory@7894fbfc),segFN=segments_1,generation=1}
   [junit4]   2> 764076 INFO  (coreLoadExecutor-2809-thread-1-processing-n:127.0.0.1:43939_) [n:127.0.0.1:43939_ c:control_collection s:shard1 r:core_node1 x:collection1] o.a.s.c.SolrDeletionPolicy newest commit generation = 1
   [junit4]   2> 764076 INFO  (coreLoadExecutor-2809-thread-1-processing-n:127.0.0.1:43939_) [n:127.0.0.1:43939_ c:control_collection s:shard1 r:core_node1 x:collection1] o.a.s.s.SolrIndexSearcher Opening [Searcher@41e2f55e[collection1] main]
   [junit4]   2> 764076 INFO  (coreLoadExecutor-2809-thread-1-processing-n:127.0.0.1:43939_) [n:127.0.0.1:43939_ c:control_collection s:shard1 r:core_node1 x:collection1] o.a.s.c.c.ZkStateReader Load collection config from: [/collections/control_collection]
   [junit4]   2> 764076 INFO  (coreLoadExecutor-2809-thread-1-processing-n:127.0.0.1:43939_) [n:127.0.0.1:43939_ c:control_collection s:shard1 r:core_node1 x:collection1] o.a.s.c.c.ZkStateReader path=[/collections/control_collection] [configName]=[conf1] specified config exists in ZooKeeper
   [junit4]   2> 764077 INFO  (coreLoadExecutor-2809-thread-1-processing-n:127.0.0.1:43939_) [n:127.0.0.1:43939_ c:control_collection s:shard1 r:core_node1 x:collection1] o.a.s.r.ManagedResourceStorage Setting up ZooKeeper-based storage for the RestManager with znodeBase: /configs/conf1
   [junit4]   2> 764077 INFO  (coreLoadExecutor-2809-thread-1-processing-n:127.0.0.1:43939_) [n:127.0.0.1:43939_ c:control_collection s:shard1 r:core_node1 x:collection1] o.a.s.r.ManagedResourceStorage Configured ZooKeeperStorageIO with znodeBase: /configs/conf1
   [junit4]   2> 764077 INFO  (coreLoadExecutor-2809-thread-1-processing-n:127.0.0.1:43939_) [n:127.0.0.1:43939_ c:control_collection s:shard1 r:core_node1 x:collection1] o.a.s.r.RestManager Initializing RestManager with initArgs: {}
   [junit4]   2> 764077 INFO  (coreLoadExecutor-2809-thread-1-processing-n:127.0.0.1:43939_) [n:127.0.0.1:43939_ c:control_collection s:shard1 r:core_node1 x:collection1] o.a.s.r.ManagedResourceStorage Reading _rest_managed.json using ZooKeeperStorageIO:path=/configs/conf1
   [junit4]   2> 764077 INFO  (coreLoadExecutor-2809-thread-1-processing-n:127.0.0.1:43939_) [n:127.0.0.1:43939_ c:control_collection s:shard1 r:core_node1 x:collection1] o.a.s.r.ManagedResourceStorage No data found for znode /configs/conf1/_rest_managed.json
   [junit4]   2> 764077 INFO  (coreLoadExecutor-2809-thread-1-processing-n:127.0.0.1:43939_) [n:127.0.0.1:43939_ c:control_collection s:shard1 r:core_node1 x:collection1] o.a.s.r.ManagedResourceStorage Loaded null at path _rest_managed.json using ZooKeeperStorageIO:path=/configs/conf1
   [junit4]   2> 764077 INFO  (coreLoadExecutor-2809-thread-1-processing-n:127.0.0.1:43939_) [n:127.0.0.1:43939_ c:control_collection s:shard1 r:core_node1 x:collection1] o.a.s.r.RestManager Initializing 0 registered ManagedResources
   [junit4]   2> 764077 INFO  (coreLoadExecutor-2809-thread-1-processing-n:127.0.0.1:43939_) [n:127.0.0.1:43939_ c:control_collection s:shard1 r:core_node1 x:collection1] o.a.s.h.ReplicationHandler Commits will be reserved for  10000
   [junit4]   2> 764078 INFO  (searcherExecutor-2810-thread-1-processing-n:127.0.0.1:43939_ x:collection1 s:shard1 c:control_collection r:core_node1) [n:127.0.0.1:43939_ c:control_collection s:shard1 r:core_node1 x:collection1] o.a.s.c.SolrCore [collection1] Registered new searcher Searcher@41e2f55e[collection1] main{ExitableDirectoryReader(UninvertingDirectoryReader())}
   [junit4]   2> 764078 INFO  (coreLoadExecutor-2809-thread-1-processing-n:127.0.0.1:43939_) [n:127.0.0.1:43939_ c:control_collection s:shard1 r:core_node1 x:collection1] o.a.s.u.UpdateLog Looking up max value of version field to seed version buckets
   [junit4]   2> 764078 INFO  (coreLoadExecutor-2809-thread-1-processing-n:127.0.0.1:43939_) [n:127.0.0.1:43939_ c:control_collection s:shard1 r:core_node1 x:collection1] o.a.s.u.VersionInfo Refreshing highest value of _version_ for 65536 version buckets from index
   [junit4]   2> 764078 INFO  (coreLoadExecutor-2809-thread-1-processing-n:127.0.0.1:43939_) [n:127.0.0.1:43939_ c:control_collection s:shard1 r:core_node1 x:collection1] o.a.s.u.VersionInfo No terms found for _version_, cannot seed version bucket highest value from index
   [junit4]   2> 764078 INFO  (coreLoadExecutor-2809-thread-1-processing-n:127.0.0.1:43939_) [n:127.0.0.1:43939_ c:control_collection s:shard1 r:core_node1 x:collection1] o.a.s.u.UpdateLog Could not find max version in index or recent updates, using new clock 1527745414908870656
   [junit4]   2> 764080 INFO  (coreLoadExecutor-2809-thread-1-processing-n:127.0.0.1:43939_) [n:127.0.0.1:43939_ c:control_collection s:shard1 r:core_node1 x:collection1] o.a.s.u.UpdateLog Took 1.0ms to seed version buckets with highest version 1527745414908870656
   [junit4]   2> 764080 INFO  (coreLoadExecutor-2809-thread-1-processing-n:127.0.0.1:43939_) [n:127.0.0.1:43939_ c:control_collection s:shard1 r:core_node1 x:collection1] o.a.s.c.ZkController watch zkdir /configs/conf1
   [junit4]   2> 764080 INFO  (coreLoadExecutor-2809-thread-1-processing-n:127.0.0.1:43939_) [n:127.0.0.1:43939_ c:control_collection s:shard1 r:core_node1 x:collection1] o.a.s.c.CoreContainer registering core: collection1
   [junit4]   2> 764080 INFO  (coreZkRegister-2803-thread-1-processing-n:127.0.0.1:43939_ x:collection1 s:shard1 c:control_collection r:core_node1) [n:127.0.0.1:43939_ c:control_collection s:shard1 r:core_node1 x:collection1] o.a.s.c.ZkController Register replica - core:collection1 address:http://127.0.0.1:43939 collection:control_collection shard:shard1
   [junit4]   2> 764081 INFO  (coreZkRegister-2803-thread-1-processing-n:127.0.0.1:43939_ x:collection1 s:shard1 c:control_collection r:core_node1) [n:127.0.0.1:43939_ c:control_collection s:shard1 r:core_node1 x:collection1] o.a.s.c.c.SolrZkClient makePath: /collections/control_collection/leader_elect/shard1/election
   [junit4]   2> 764082 INFO  (coreZkRegister-2803-thread-1-processing-n:127.0.0.1:43939_ x:collection1 s:shard1 c:control_collection r:core_node1) [n:127.0.0.1:43939_ c:control_collection s:shard1 r:core_node1 x:collection1] o.a.s.c.LeaderElector Joined leadership election with path: /collections/control_collection/leader_elect/shard1/election/95484088345296900-core_node1-n_0000000000
   [junit4]   2> 764082 INFO  (coreZkRegister-2803-thread-1-processing-n:127.0.0.1:43939_ x:collection1 s:shard1 c:control_collection r:core_node1) [n:127.0.0.1:43939_ c:control_collection s:shard1 r:core_node1 x:collection1] o.a.s.c.ShardLeaderElectionContext Running the leader process for shard=shard1 and weAreReplacement=false and leaderVoteWait=180000
   [junit4]   2> 764082 INFO  (coreZkRegister-2803-thread-1-processing-n:127.0.0.1:43939_ x:collection1 s:shard1 c:control_collection r:core_node1) [n:127.0.0.1:43939_ c:control_collection s:shard1 r:core_node1 x:collection1] o.a.s.c.ShardLeaderElectionContext Enough replicas found to continue.
   [junit4]   2> 764082 INFO  (coreZkRegister-2803-thread-1-processing-n:127.0.0.1:43939_ x:collection1 s:shard1 c:control_collection r:core_node1) [n:127.0.0.1:43939_ c:control_collection s:shard1 r:core_node1 x:collection1] o.a.s.c.ShardLeaderElectionContext I may be the new leader - try and sync
   [junit4]   2> 764082 INFO  (coreZkRegister-2803-thread-1-processing-n:127.0.0.1:43939_ x:collection1 s:shard1 c:control_collection r:core_node1) [n:127.0.0.1:43939_ c:control_collection s:shard1 r:core_node1 x:collection1] o.a.s.c.SyncStrategy Sync replicas to http://127.0.0.1:43939/collection1/
   [junit4]   2> 764082 INFO  (coreZkRegister-2803-thread-1-processing-n:127.0.0.1:43939_ x:collection1 s:shard1 c:control_collection r:core_node1) [n:127.0.0.1:43939_ c:control_collection s:shard1 r:core_node1 x:collection1] o.a.s.c.SyncStrategy Sync Success - now sync replicas to me
   [junit4]   2> 764082 INFO  (OverseerStateUpdate-95484088345296900-127.0.0.1:43939_-n_0000000000) [n:127.0.0.1:43939_    ] o.a.s.c.Overseer processMessage: queueSize: 1, message = {
   [junit4]   2>   "operation":"leader",
   [junit4]   2>   "shard":"shard1",
   [junit4]   2>   "collection":"control_collection"} current state version: 1
   [junit4]   2> 764083 INFO  (coreZkRegister-2803-thread-1-processing-n:127.0.0.1:43939_ x:collection1 s:shard1 c:control_collection r:core_node1) [n:127.0.0.1:43939_ c:control_collection s:shard1 r:core_node1 x:collection1] o.a.s.c.SyncStrategy http://127.0.0.1:43939/collection1/ has no replicas
   [junit4]   2> 764083 INFO  (coreZkRegister-2803-thread-1-processing-n:127.0.0.1:43939_ x:collection1 s:shard1 c:control_collection r:core_node1) [n:127.0.0.1:43939_ c:control_collection s:shard1 r:core_node1 x:collection1] o.a.s.c.c.SolrZkClient makePath: /collections/control_collection/leaders/shard1
   [junit4]   2> 764084 INFO  (coreZkRegister-2803-thread-1-processing-n:127.0.0.1:43939_ x:collection1 s:shard1 c:control_collection r:core_node1) [n:127.0.0.1:43939_ c:control_collection s:shard1 r:core_node1 x:collection1] o.a.s.c.ShardLeaderElectionContextBase Creating leader registration node /collections/control_collection/leaders/shard1/leader after winning as /collections/control_collection/leader_elect/shard1/election/95484088345296900-core_node1-n_0000000000
   [junit4]   2> 764084 INFO  (coreZkRegister-2803-thread-1-processing-n:127.0.0.1:43939_ x:collection1 s:shard1 c:control_collection r:core_node1) [n:127.0.0.1:43939_ c:control_collection s:shard1 r:core_node1 x:collection1] o.a.s.c.ShardLeaderElectionContext I am the new leader: http://127.0.0.1:43939/collection1/ shard1
   [junit4]   2> 764085 INFO  (OverseerStateUpdate-95484088345296900-127.0.0.1:43939_-n_0000000000) [n:127.0.0.1:43939_    ] o.a.s.c.Overseer processMessage: queueSize: 1, message = {
   [junit4]   2>   "operation":"leader",
   [junit4]   2>   "shard":"shard1",
   [junit4]   2>   "collection":"control_collection",
   [junit4]   2>   "base_url":"http://127.0.0.1:43939",
   [junit4]   2>   "core":"collection1",
   [junit4]   2>   "state":"active"} current state version: 1
   [junit4]   2> 764186 INFO  (zkCallback-1234-thread-1-processing-n:127.0.0.1:43939_) [n:127.0.0.1:43939_    ] o.a.s.c.c.ZkStateReader A cluster state change: [WatchedEvent state:SyncConnected type:NodeDataChanged path:/clusterstate.json], has occurred - updating... (live nodes size: [1])
   [junit4]   2> 764235 INFO  (coreZkRegister-2803-thread-1-processing-n:127.0.0.1:43939_ x:collection1 s:shard1 c:control_collection r:core_node1) [n:127.0.0.1:43939_ c:control_collection s:shard1 r:core_node1 x:collection1] o.a.s.c.ZkController We are http://127.0.0.1:43939/collection1/ and leader is http://127.0.0.1:43939/collection1/
   [junit4]   2> 764235 INFO  (coreZkRegister-2803-thread-1-processing-n:127.0.0.1:43939_ x:collection1 s:shard1 c:control_collection r:core_node1) [n:127.0.0.1:43939_ c:control_collection s:shard1 r:core_node1 x:collection1] o.a.s.c.ZkController No LogReplay needed for core=collection1 baseURL=http://127.0.0.1:43939
   [junit4]   2> 764235 INFO  (coreZkRegister-2803-thread-1-processing-n:127.0.0.1:43939_ x:collection1 s:shard1 c:control_collection r:core_node1) [n:127.0.0.1:43939_ c:control_collection s:shard1 r:core_node1 x:collection1] o.a.s.c.ZkController I am the leader, no recovery necessary
   [junit4]   2> 764235 INFO  (coreZkRegister-2803-thread-1-processing-n:127.0.0.1:43939_ x:collection1 s:shard1 c:control_collection r:core_node1) [n:127.0.0.1:43939_ c:control_collection s:shard1 r:core_node1 x:collection1] o.a.s.c.ZkController publishing state=active
   [junit4]   2> 764235 INFO  (coreZkRegister-2803-thread-1-processing-n:127.0.0.1:43939_ x:collection1 s:shard1 c:control_collection r:core_node1) [n:127.0.0.1:43939_ c:control_collection s:shard1 r:core_node1 x:collection1] o.a.s.c.ZkController numShards not found on descriptor - reading it from system property
   [junit4]   2> 764236 INFO  (OverseerStateUpdate-95484088345296900-127.0.0.1:43939_-n_0000000000) [n:127.0.0.1:43939_    ] o.a.s.c.Overseer processMessage: queueSize: 1, message = {
   [junit4]   2>   "core":"collection1",
   [junit4]   2>   "core_node_name":"core_node1",
   [junit4]   2>   "roles":null,
   [junit4]   2>   "base_url":"http://127.0.0.1:43939",
   [junit4]   2>   "node_name":"127.0.0.1:43939_",
   [junit4]   2>   "numShards":"1",
   [junit4]   2>   "state":"active",
   [junit4]   2>   "shard":"shard1",
   [junit4]   2>   "collection":"control_collection",
   [junit4]   2>   "operation":"state"} current state version: 2
   [junit4]   2> 764236 INFO  (coreZkRegister-2803-thread-1-processing-n:127.0.0.1:43939_ x:collection1 s:shard1 c:control_collection r:core_node1) [n:127.0.0.1:43939_ c:control_collection s:shard1 r:core_node1 x:collection1] o.a.s.c.c.ZkStateReader Updated live nodes from ZooKeeper... (1) -> (1)
   [junit4]   2> 764236 INFO  (OverseerStateUpdate-95484088345296900-127.0.0.1:43939_-n_0000000000) [n:127.0.0.1:43939_    ] o.a.s.c.o.ReplicaMutator Update state numShards=1 message={
   [junit4]   2>   "core":"collection1",
   [junit4]   2>   "core_node_name":"core_node1",
   [junit4]   2>   "roles":null,
   [junit4]   2>   "base_url":"http://127.0.0.1:43939",
   [junit4]   2>   "node_name":"127.0.0.1:43939_",
   [junit4]   2>   "numShards":"1",
   [junit4]   2>   "state":"active",
   [junit4]   2>   "shard":"shard1",
   [junit4]   2>   "collection":"control_collection",
   [junit4]   2>   "operation":"state"}
   [junit4]   2> 764337 INFO  (zkCallback-1234-thread-1-processing-n:127.0.0.1:43939_) [n:127.0.0.1:43939_    ] o.a.s.c.c.ZkStateReader A cluster state change: [WatchedEvent state:SyncConnected type:NodeDataChanged path:/clusterstate.json], has occurred - updating... (live nodes size: [1])
   [junit4]   2> 764464 INFO  (TEST-UnloadDistributedZkTest.test-seed#[3046F0449A84A995]) [    ] o.a.s.c.c.SolrZkClient Using default ZkCredentialsProvider
   [junit4]   2> 764464 INFO  (TEST-UnloadDistributedZkTest.test-seed#[3046F0449A84A995]) [    ] o.a.s.c.c.ConnectionManager Waiting for client to connect to ZooKeeper
   [junit4]   2> 764465 INFO  (zkCallback-1236-thread-1) [    ] o.a.s.c.c.ConnectionManager Watcher org.apache.solr.common.cloud.ConnectionManager@4de97160 name:ZooKeeperConnection Watcher:127.0.0.1:55720/solr got event WatchedEvent state:SyncConnected type:None path:null path:null type:None
   [junit4]   2> 764465 INFO  (TEST-UnloadDistributedZkTest.test-seed#[3046F0449A84A995]) [    ] o.a.s.c.c.ConnectionManager Client is connected to ZooKeeper
   [junit4]   2> 764465 INFO  (TEST-UnloadDistributedZkTest.test-seed#[3046F0449A84A995]) [    ] o.a.s.c.c.SolrZkClient Using default ZkACLProvider
   [junit4]   2> 764465 INFO  (TEST-UnloadDistributedZkTest.test-seed#[3046F0449A84A995]) [    ] o.a.s.c.c.ZkStateReader Updating cluster state from ZooKeeper... 
   [junit4]   2> 764466 INFO  (TEST-UnloadDistributedZkTest.test-seed#[3046F0449A84A995]) [    ] o.a.s.c.c.ZkStateReader Updated live nodes from ZooKeeper... (0) -> (1)
   [junit4]   2> 764466 INFO  (TEST-UnloadDistributedZkTest.test-seed#[3046F0449A84A995]) [    ] o.a.s.c.ChaosMonkey monkey: init - expire sessions:false cause connection loss:false
   [junit4]   2> 764466 INFO  (TEST-UnloadDistributedZkTest.test-seed#[3046F0449A84A995]) [    ] o.a.s.c.AbstractFullDistribZkTestBase Creating collection1 with stateFormat=2
   [junit4]   2> 764466 INFO  (TEST-UnloadDistributedZkTest.test-seed#[3046F0449A84A995]) [    ] o.a.s.c.c.SolrZkClient Using default ZkCredentialsProvider
   [junit4]   2> 764466 INFO  (TEST-UnloadDistributedZkTest.test-seed#[3046F0449A84A995]) [    ] o.a.s.c.c.ConnectionManager Waiting for client to connect to ZooKeeper
   [junit4]   2> 764467 INFO  (zkCallback-1237-thread-1) [    ] o.a.s.c.c.ConnectionManager Watcher org.apache.solr.common.cloud.ConnectionManager@66aaf288 name:ZooKeeperConnection Watcher:127.0.0.1:55720/solr got event WatchedEvent state:SyncConnected type:None path:null path:null type:None
   [junit4]   2> 764467 INFO  (TEST-UnloadDistributedZkTest.test-seed#[3046F0449A84A995]) [    ] o.a.s.c.c.ConnectionManager Client is connected to ZooKeeper
   [junit4]   2> 764467 INFO  (TEST-UnloadDistributedZkTest.test-seed#[3046F0449A84A995]) [    ] o.a.s.c.c.SolrZkClient Using default ZkACLProvider
   [junit4]   2> 764468 INFO  (OverseerStateUpdate-95484088345296900-127.0.0.1:43939_-n_0000000000) [n:127.0.0.1:43939_    ] o.a.s.c.Overseer processMessage: queueSize: 1, message = {
   [junit4]   2>   "operation":"create",
   [junit4]   2>   "name":"collection1",
   [junit4]   2>   "numShards":"2",
   [junit4]   2>   "stateFormat":"2"} current state version: 3
   [junit4]   2> 764468 INFO  (OverseerStateUpdate-95484088345296900-127.0.0.1:43939_-n_0000000000) [n:127.0.0.1:43939_    ] o.a.s.c.o.ClusterStateMutator building a new cName: collection1
   [junit4]   2> 764516 INFO  (TEST-UnloadDistributedZkTest.test-seed#[3046F0449A84A995]) [    ] o.a.s.SolrTestCaseJ4 Writing core.properties file to /home/jenkins/workspace/Lucene-Solr-trunk-Linux/solr/build/solr-core/test/J2/temp/solr.cloud.UnloadDistributedZkTest_3046F0449A84A995-001/shard-1-001/cores/collection1
   [junit4]   2> 764516 INFO  (TEST-UnloadDistributedZkTest.test-seed#[3046F0449A84A995]) [    ] o.a.s.c.AbstractFullDistribZkTestBase create jetty 1 in directory /home/jenkins/workspace/Lucene-Solr-trunk-Linux/solr/build/solr-core/test/J2/temp/solr.cloud.UnloadDistributedZkTest_3046F0449A84A995-001/shard-1-001
   [junit4]   2> 764517 INFO  (TEST-UnloadDistributedZkTest.test-seed#[3046F0449A84A995]) [    ] o.e.j.s.Server jetty-9.3.6.v20151106
   [junit4]   2> 764517 INFO  (TEST-UnloadDistributedZkTest.test-seed#[3046F0449A84A995]) [    ] o.e.j.s.h.ContextHandler Started o.e.j.s.ServletContextHandler@7c071782{/,null,AVAILABLE}
   [junit4]   2> 764518 INFO  (TEST-UnloadDistributedZkTest.test-seed#[3046F0449A84A995]) [    ] o.e.j.s.ServerConnector Started ServerConnector@114244c1{HTTP/1.1,[http/1.1]}{127.0.0.1:56276}
   [junit4]   2> 764518 INFO  (TEST-UnloadDistributedZkTest.test-seed#[3046F0449A84A995]) [    ] o.e.j.s.Server Started @766513ms
   [junit4]   2> 764519 INFO  (TEST-UnloadDistributedZkTest.test-seed#[3046F0449A84A995]) [    ] o.a.s.c.s.e.JettySolrRunner Jetty properties: {solr.data.dir=/home/jenkins/workspace/Lucene-Solr-trunk-Linux/solr/build/solr-core/test/J2/temp/solr.cloud.UnloadDistributedZkTest_3046F0449A84A995-001/tempDir-001/jetty1, solrconfig=solrconfig.xml, hostContext=/, hostPort=56276, coreRootDirectory=/home/jenkins/workspace/Lucene-Solr-trunk-Linux/solr/build/solr-core/test/J2/temp/solr.cloud.UnloadDistributedZkTest_3046F0449A84A995-001/shard-1-001/cores}
   [junit4]   2> 764519 INFO  (TEST-UnloadDistributedZkTest.test-seed#[3046F0449A84A995]) [    ] o.a.s.s.SolrDispatchFilter SolrDispatchFilter.init(): sun.misc.Launcher$AppClassLoader@73d16e93
   [junit4]   2> 764519 INFO  (TEST-UnloadDistributedZkTest.test-seed#[3046F0449A84A995]) [    ] o.a.s.c.SolrResourceLoader new SolrResourceLoader for directory: '/home/jenkins/workspace/Lucene-Solr-trunk-Linux/solr/build/solr-core/test/J2/temp/solr.cloud.UnloadDistributedZkTest_3046F0449A84A995-001/shard-1-001'
   [junit4]   2> 764519 INFO  (TEST-UnloadDistributedZkTest.test-seed#[3046F0449A84A995]) [    ] o.a.s.c.SolrResourceLoader JNDI not configured for solr (NoInitialContextEx)
   [junit4]   2> 764519 INFO  (TEST-UnloadDistributedZkTest.test-seed#[3046F0449A84A995]) [    ] o.a.s.c.SolrResourceLoader solr home defaulted to 'solr/' (could not find system property or JNDI)
   [junit4]   2> 764519 INFO  (TEST-UnloadDistributedZkTest.test-seed#[3046F0449A84A995]) [    ] o.a.s.c.c.SolrZkClient Using default ZkCredentialsProvider
   [junit4]   2> 764519 INFO  (TEST-UnloadDistributedZkTest.test-seed#[3046F0449A84A995]) [    ] o.a.s.c.c.ConnectionManager Waiting for client to connect to ZooKeeper
   [junit4]   2> 764520 INFO  (zkCallback-1238-thread-1) [    ] o.a.s.c.c.ConnectionManager Watcher org.apache.solr.common.cloud.ConnectionManager@3593a815 name:ZooKeeperConnection Watcher:127.0.0.1:55720/solr got event WatchedEvent state:SyncConnected type:None path:null path:null type:None
   [junit4]   2> 764520 INFO  (TEST-UnloadDistributedZkTest.test-seed#[3046F0449A84A995]) [    ] o.a.s.c.c.ConnectionManager Client is connected to ZooKeeper
   [junit4]   2> 764520 INFO  (TEST-UnloadDistributedZkTest.test-seed#[3046F0449A84A995]) [    ] o.a.s.c.c.SolrZkClient Using default ZkACLProvider
   [junit4]   2> 764521 INFO  (TEST-UnloadDistributedZkTest.test-seed#[3046F0449A84A995]) [    ] o.a.s.s.SolrDispatchFilter Loading solr.xml from SolrHome (not found in ZooKeeper)
   [junit4]   2> 764521 INFO  (TEST-UnloadDistributedZkTest.test-seed#[3046F0449A84A995]) [    ] o.a.s.c.SolrXmlConfig Loading container configuration from /home/jenkins/workspace/Lucene-Solr-trunk-Linux/solr/build/solr-core/test/J2/temp/solr.cloud.UnloadDistributedZkTest_3046F0449A84A995-001/shard-1-001/solr.xml
   [junit4]   2> 764524 INFO  (TEST-UnloadDistributedZkTest.test-seed#[3046F0449A84A995]) [    ] o.a.s.c.CorePropertiesLocator Config-defined core root directory: /home/jenkins/workspace/Lucene-Solr-trunk-Linux/solr/build/solr-core/test/J2/temp/solr.cloud.UnloadDistributedZkTest_3046F0449A84A995-001/shard-1-001/cores
   [junit4]   2> 764524 INFO  (TEST-UnloadDistributedZkTest.test-seed#[3046F0449A84A995]) [    ] o.a.s.c.CoreContainer New CoreContainer 755763814
   [junit4]   2> 764524 INFO  (TEST-UnloadDistributedZkTest.test-seed#[3046F0449A84A995]) [    ] o.a.s.c.CoreContainer Loading cores into CoreContainer [instanceDir=/home/jenkins/workspace/Lucene-Solr-trunk-Linux/solr/build/solr-core/test/J2/temp/solr.cloud.UnloadDistributedZkTest_3046F0449A84A995-001/shard-1-001]
   [junit4]   2> 764524 WARN  (TEST-UnloadDistributedZkTest.test-seed#[3046F0449A84A995]) [    ] o.a.s.c.CoreContainer Couldn't add files from /home/jenkins/workspace/Lucene-Solr-trunk-Linux/solr/build/solr-core/test/J2/temp/solr.cloud.UnloadDistributedZkTest_3046F0449A84A995-001/shard-1-001/lib to classpath: /home/jenkins/workspace/Lucene-Solr-trunk-Linux/solr/build/solr-core/test/J2/temp/solr.cloud.UnloadDistributedZkTest_3046F0449A84A995-001/shard-1-001/lib
   [junit4]   2> 764524 INFO  (TEST-UnloadDistributedZkTest.test-seed#[3046F0449A84A995]) [    ] o.a.s.h.c.HttpShardHandlerFactory created with socketTimeout : 90000,urlScheme : ,connTimeout : 15000,maxConnectionsPerHost : 20,maxConnections : 10000,corePoolSize : 0,maximumPoolSize : 2147483647,maxThreadIdleTime : 5,sizeOfQueue : -1,fairnessPolicy : false,useRetries : false,
   [junit4]   2> 764525 INFO  (TEST-UnloadDistributedZkTest.test-seed#[3046F0449A84A995]) [    ] o.a.s.u.UpdateShardHandler Creating UpdateShardHandler HTTP client with params: socketTimeout=340000&connTimeout=45000&retry=true
   [junit4]   2> 764525 INFO  (TEST-UnloadDistributedZkTest.test-seed#[3046F0449A84A995]) [    ] o.a.s.l.LogWatcher SLF4J impl is org.slf4j.impl.Log4jLoggerFactory
   [junit4]   2> 764525 INFO  (TEST-UnloadDistributedZkTest.test-seed#[3046F0449A84A995]) [    ] o.a.s.l.LogWatcher Registering Log Listener [Log4j (org.slf4j.impl.Log4jLoggerFactory)]
   [junit4]   2> 764525 INFO  (TEST-UnloadDistributedZkTest.test-seed#[3046F0449A84A995]) [    ] o.a.s.c.ZkContainer Zookeeper client=127.0.0.1:55720/solr
   [junit4]   2> 764525 INFO  (TEST-UnloadDistributedZkTest.test-seed#[3046F0449A84A995]) [    ] o.a.s.c.ZkController zkHost includes chroot
   [junit4]   2> 764525 INFO  (TEST-UnloadDistributedZkTest.test-seed#[3046F0449A84A995]) [    ] o.a.s.c.c.SolrZkClient Using default ZkCredentialsProvider
   [junit4]   2> 764526 INFO  (TEST-UnloadDistributedZkTest.test-seed#[3046F0449A84A995]) [    ] o.a.s.c.c.ConnectionManager Waiting for client to connect to ZooKeeper
   [junit4]   2> 764527 INFO  (zkCallback-1241-thread-1) [    ] o.a.s.c.c.ConnectionManager Watcher org.apache.solr.common.cloud.ConnectionManager@68aa53fc name:ZooKeeperConnection Watcher:127.0.0.1:55720 got event WatchedEvent state:SyncConnected type:None path:null path:null type:None
   [junit4]   2> 764527 INFO  (TEST-UnloadDistributedZkTest.test-seed#[3046F0449A84A995]) [    ] o.a.s.c.c.ConnectionManager Client is connected to ZooKeeper
   [junit4]   2> 764527 INFO  (TEST-UnloadDistributedZkTest.test-seed#[3046F0449A84A995]) [    ] o.a.s.c.c.SolrZkClient Using default ZkACLProvider
   [junit4]   2> 764527 INFO  (TEST-UnloadDistributedZkTest.test-seed#[3046F0449A84A995]) [n:127.0.0.1:56276_    ] o.a.s.c.c.ConnectionManager Waiting for client to connect to ZooKeeper
   [junit4]   2> 764528 INFO  (zkCallback-1242-thread-1-processing-n:127.0.0.1:56276_) [n:127.0.0.1:56276_    ] o.a.s.c.c.ConnectionManager Watcher org.apache.solr.common.cloud.ConnectionManager@2eaa1827 name:ZooKeeperConnection Watcher:127.0.0.1:55720/solr got event WatchedEvent state:SyncConnected type:None path:null path:null type:None
   [junit4]   2> 764528 INFO  (TEST-UnloadDistributedZkTest.test-seed#[3046F0449A84A995]) [n:127.0.0.1:56276_    ] o.a.s.c.c.ConnectionManager Client is connected to ZooKeeper
   [junit4]   2> 764530 INFO  (TEST-UnloadDistributedZkTest.test-seed#[3046F0449A84A995]) [n:127.0.0.1:56276_    ] o.a.s.c.c.ZkStateReader Updating cluster state from ZooKeeper... 
   [junit4]   2> 764531 INFO  (TEST-UnloadDistributedZkTest.test-seed#[3046F0449A84A995]) [n:127.0.0.1:56276_    ] o.a.s.c.c.ZkStateReader Updated live nodes from ZooKeeper... (0) -> (1)
   [junit4]   2> 764531 INFO  (TEST-UnloadDistributedZkTest.test-seed#[3046F0449A84A995]) [n:127.0.0.1:56276_    ] o.a.s.c.Overseer Overseer (id=null) closing
   [junit4]   2> 764532 INFO  (TEST-UnloadDistributedZkTest.test-seed#[3046F0449A84A995]) [n:127.0.0.1:56276_    ] o.a.s.c.LeaderElector Joined leadership election with path: /overseer_elect/election/95484088345296905-127.0.0.1:56276_-n_0000000001
   [junit4]   2> 764532 INFO  (TEST-UnloadDistributedZkTest.test-seed#[3046F0449A84A995]) [n:127.0.0.1:56276_    ] o.a.s.c.LeaderElector Watching path /overseer_elect/election/95484088345296900-127.0.0.1:43939_-n_0000000000 to know if I could be the leader
   [junit4]   2> 764532 INFO  (TEST-UnloadDistributedZkTest.test-seed#[3046F0449A84A995]) [n:127.0.0.1:56276_    ] o.a.s.c.ZkController Publish node=127.0.0.1:56276_ as DOWN
   [junit4]   2> 764533 INFO  (OverseerStateUpdate-95484088345296900-127.0.0.1:43939_-n_0000000000) [n:127.0.0.1:43939_    ] o.a.s.c.Overseer processMessage: queueSize: 1, message = {
   [junit4]   2>   "operation":"downnode",
   [junit4]   2>   "node_name":"127.0.0.1:56276_"} current state version: 3
   [junit4]   2> 764533 INFO  (OverseerStateUpdate-95484088345296900-127.0.0.1:43939_-n_0000000000) [n:127.0.0.1:43939_    ] o.a.s.c.o.NodeMutator DownNode state invoked for node: 127.0.0.1:56276_
   [junit4]   2> 764533 INFO  (OverseerStateUpdate-95484088345296900-127.0.0.1:43939_-n_0000000000) [n:127.0.0.1:43939_    ] o.a.s.c.o.ZkStateWriter going to create_collection /collections/collection1/state.json
   [junit4]   2> 764635 INFO  (zkCallback-1234-thread-1-processing-n:127.0.0.1:43939_) [n:127.0.0.1:43939_    ] o.a.s.c.c.ZkStateReader A cluster state change: [WatchedEvent state:SyncConnected type:NodeDataChanged path:/clusterstate.json], has occurred - updating... (live nodes size: [1])
   [junit4]   2> 764635 INFO  (zkCallback-1236-thread-1) [    ] o.a.s.c.c.ZkStateReader A cluster state change: [WatchedEvent state:SyncConnected type:NodeDataChanged path:/clusterstate.json], has occurred - updating... (live nodes size: [1])
   [junit4]   2> 764635 INFO  (zkCallback-1242-thread-1-processing-n:127.0.0.1:56276_) [n:127.0.0.1:56276_    ] o.a.s.c.c.ZkStateReader A cluster state change: [WatchedEvent state:SyncConnected type:NodeDataChanged path:/clusterstate.json], has occurred - updating... (live nodes size: [1])
   [junit4]   2> 765533 INFO  (TEST-UnloadDistributedZkTest.test-seed#[3046F0449A84A995]) [n:127.0.0.1:56276_    ] o.a.s.c.ZkController Register node as live in ZooKeeper:/live_nodes/127.0.0.1:56276_
   [junit4]   2> 765533 INFO  (TEST-UnloadDistributedZkTest.test-seed#[3046F0449A84A995]) [n:127.0.0.1:56276_    ] o.a.s.c.c.SolrZkClient makePath: /live_nodes/127.0.0.1:56276_
   [junit4]   2> 765534 INFO  (zkCallback-1236-thread-1) [    ] o.a.s.c.c.ZkStateReader A live node change: [WatchedEvent state:SyncConnected type:NodeChildrenChanged path:/live_nodes], has occurred - updating... (live nodes size: [1])
   [junit4]   2> 765534 INFO  (zkCallback-1242-thread-1-processing-n:127.0.0.1:56276_) [n:127.0.0.1:56276_    ] o.a.s.c.c.ZkStateReader A live node change: [WatchedEvent state:SyncConnected type:NodeChildrenChanged path:/live_nodes], has occurred - updating... (live nodes size: [1])
   [junit4]   2> 765534 INFO  (zkCallback-1234-thread-1-processing-n:127.0.0.1:43939_) [n:127.0.0.1:43939_    ] o.a.s.c.c.ZkStateReader A live node change: [WatchedEvent state:SyncConnected type:NodeChildrenChanged path:/live_nodes], has occurred - updating... (live nodes size: [1])
   [junit4]   2> 765534 INFO  (zkCallback-1236-thread-1) [    ] o.a.s.c.c.ZkStateReader Updated live nodes from ZooKeeper... (1) -> (2)
   [junit4]   2> 765534 INFO  (zkCallback-1242-thread-1-processing-n:127.0.0.1:56276_) [n:127.0.0.1:56276_    ] o.a.s.c.c.ZkStateReader Updated live nodes from ZooKeeper... (1) -> (2)
   [junit4]   2> 765534 INFO  (zkCallback-1234-thread-1-processing-n:127.0.0.1:43939_) [n:127.0.0.1:43939_    ] o.a.s.c.c.ZkStateReader Updated live nodes from ZooKeeper... (1) -> (2)
   [junit4]   2> 765547 INFO  (TEST-UnloadDistributedZkTest.test-seed#[3046F0449A84A995]) [n:127.0.0.1:56276_    ] o.a.s.c.CoreContainer Security conf doesn't exist. Skipping setup for authorization module.
   [junit4]   2> 765547 INFO  (TEST-UnloadDistributedZkTest.test-seed#[3046F0449A84A995]) [n:127.0.0.1:56276_    ] o.a.s.c.CoreContainer No authentication plugin used.
   [junit4]   2> 765548 INFO  (TEST-UnloadDistributedZkTest.test-seed#[3046F0449A84A995]) [n:127.0.0.1:56276_    ] o.a.s.c.CorePropertiesLocator Looking for core definitions underneath /home/jenkins/workspace/Lucene-Solr-trunk-Linux/solr/build/solr-core/test/J2/temp/solr.cloud.UnloadDistributedZkTest_3046F0449A84A995-001/shard-1-001/cores
   [junit4]   2> 765548 INFO  (TEST-UnloadDistributedZkTest.test-seed#[3046F0449A84A995]) [n:127.0.0.1:56276_    ] o.a.s.c.CoreDescriptor Created CoreDescriptor: {name=collection1, config=solrconfig.xml, transient=false, schema=schema.xml, loadOnStartup=true, configSetProperties=configsetprops.json, collection=collection1, coreNodeName=, dataDir=data/, shard=}
   [junit4]   2> 765548 INFO  (TEST-UnloadDistributedZkTest.test-seed#[3046F0449A84A995]) [n:127.0.0.1:56276_    ] o.a.s.c.CorePropertiesLocator Found core collection1 in /home/jenkins/workspace/Lucene-Solr-trunk-Linux/solr/build/solr-core/test/J2/temp/solr.cloud.UnloadDistributedZkTest_3046F0449A84A995-001/shard-1-001/cores/collection1
   [junit4]   2> 765548 INFO  (TEST-UnloadDistributedZkTest.test-seed#[3046F0449A84A995]) [n:127.0.0.1:56276_    ] o.a.s.c.CorePropertiesLocator Found 1 core definitions
   [junit4]   2> 765549 INFO  (TEST-UnloadDistributedZkTest.test-seed#[3046F0449A84A995]) [n:127.0.0.1:56276_    ] o.a.s.s.SolrDispatchFilter user.dir=/home/jenkins/workspace/Lucene-Solr-trunk-Linux/solr/build/solr-core/test/J2
   [junit4]   2> 765549 INFO  (TEST-UnloadDistributedZkTest.test-seed#[3046F0449A84A995]) [n:127.0.0.1:56276_    ] o.a.s.s.SolrDispatchFilter SolrDispatchFilter.init() done
   [junit4]   2> 765549 INFO  (coreLoadExecutor-2820-thread-1-processing-n:127.0.0.1:56276_) [n:127.0.0.1:56276_ c:collection1   x:collection1] o.a.s.c.ZkController publishing state=down
   [junit4]   2> 765549 INFO  (coreLoadExecutor-2820-thread-1-processing-n:127.0.0.1:56276_) [n:127.0.0.1:56276_ c:collection1   x:collection1] o.a.s.c.ZkController numShards not found on descriptor - reading it from system property
   [junit4]   2> 765549 INFO  (coreLoadExecutor-2820-thread-1-processing-n:127.0.0.1:56276_) [n:127.0.0.1:56276_ c:collection1   x:collection1] o.a.s.c.ZkController Registering watch for collection collection1
   [junit4]   2> 765549 INFO  (coreLoadExecutor-2820-thread-1-processing-n:127.0.0.1:56276_) [n:127.0.0.1:56276_ c:collection1   x:collection1] o.a.s.c.c.ZkStateReader addZkWatch [collection1]
   [junit4]   2> 765550 INFO  (OverseerStateUpdate-95484088345296900-127.0.0.1:43939_-n_0000000000) [n:127.0.0.1:43939_    ] o.a.s.c.Overseer processMessage: queueSize: 1, message = {
   [junit4]   2>   "core":"collection1",
   [junit4]   2>   "roles":null,
   [junit4]   2>   "base_url":"http://127.0.0.1:56276",
   [junit4]   2>   "node_name":"127.0.0.1:56276_",
   [junit4]   2>   "numShards":"2",
   [junit4]   2>   "state":"down",
   [junit4]   2>   "shard":null,
   [junit4]   2>   "collection":"collection1",
   [junit4]   2>   "operation":"state"} current state version: 4
   [junit4]   2> 765550 INFO  (coreLoadExecutor-2820-thread-1-processing-n:127.0.0.1:56276_) [n:127.0.0.1:56276_ c:collection1   x:collection1] o.a.s.c.c.ZkStateReader Add data for [collection1] ver [0]
   [junit4]   2> 765550 INFO  (coreLoadExecutor-2820-thread-1-processing-n:127.0.0.1:56276_) [n:127.0.0.1:56276_ c:collection1   x:collection1] o.a.s.c.ZkController look for our core node name
   [junit4]   2> 765550 INFO  (OverseerStateUpdate-95484088345296900-127.0.0.1:43939_-n_0000000000) [n:127.0.0.1:43939_    ] o.a.s.c.o.ReplicaMutator Update state numShards=2 message={
   [junit4]   2>   "core":"collection1",
   [junit4]   2>   "roles":null,
   [junit4]   2>   "base_url":"http://127.0.0.1:56276",
   [junit4]   2>   "node_name":"127.0.0.1:56276_",
   [junit4]   2>   "numShards":"2",
   [junit4]   2>   "state":"down",
   [junit4]   2>   "shard":null,
   [junit4]   2>   "collection":"collection1",
   [junit4]   2>   "operation":"state"}
   [junit4]   2> 765550 INFO  (OverseerStateUpdate-95484088345296900-127.0.0.1:43939_-n_0000000000) [n:127.0.0.1:43939_    ] o.a.s.c.o.ReplicaMutator Collection already exists with numShards=2
   [junit4]   2> 765550 INFO  (OverseerStateUpdate-95484088345296900-127.0.0.1:43939_-n_0000000000) [n:127.0.0.1:43939_    ] o.a.s.c.o.ReplicaMutator Assigning new node to shard shard=shard2
   [junit4]   2> 765651 INFO  (OverseerStateUpdate-95484088345296900-127.0.0.1:43939_-n_0000000000) [n:127.0.0.1:43939_    ] o.a.s.c.o.ZkStateWriter going to update_collection /collections/collection1/state.json version: 0
   [junit4]   2> 765652 INFO  (zkCallback-1242-thread-1-processing-n:127.0.0.1:56276_) [n:127.0.0.1:56276_    ] o.a.s.c.c.ZkStateReader A cluster state change: [WatchedEvent state:SyncConnected type:NodeDataChanged path:/collections/collection1/state.json] for collection [collection1] has occurred - updating... (live nodes size: [2])
   [junit4]   2> 765652 INFO  (zkCallback-1242-thread-1-processing-n:127.0.0.1:56276_) [n:127.0.0.1:56276_    ] o.a.s.c.c.ZkStateReader Updating data for [collection1] from [0] to [1]
   [junit4]   2> 766550 INFO  (coreLoadExecutor-2820-thread-1-processing-n:127.0.0.1:56276_) [n:127.0.0.1:56276_ c:collection1   x:collection1] o.a.s.c.ZkController waiting to find shard id in clusterstate for collection1
   [junit4]   2> 766550 INFO  (coreLoadExecutor-2820-thread-1-processing-n:127.0.0.1:56276_) [n:127.0.0.1:56276_ c:collection1   x:collection1] o.a.s.c.ZkController Check for collection zkNode:collection1
   [junit4]   2> 766550 INFO  (coreLoadExecutor-2820-thread-1-processing-n:127.0.0.1:56276_) [n:127.0.0.1:56276_ c:collection1   x:collection1] o.a.s.c.ZkController Collection zkNode exists
   [junit4]   2> 766550 INFO  (coreLoadExecutor-2820-thread-1-processing-n:127.0.0.1:56276_) [n:127.0.0.1:56276_ c:collection1   x:collection1] o.a.s.c.c.ZkStateReader Load collection config from: [/collections/collection1]
   [junit4]   2> 766551 INFO  (coreLoadExecutor-2820-thread-1-processing-n:127.0.0.1:56276_) [n:127.0.0.1:56276_ c:collection1   x:collection1] o.a.s.c.c.ZkStateReader path=[/collections/collection1] [configName]=[conf1] specified config exists in ZooKeeper
   [junit4]   2> 766551 INFO  (coreLoadExecutor-2820-thread-1-processing-n:127.0.0.1:56276_) [n:127.0.0.1:56276_ c:collection1   x:collection1] o.a.s.c.SolrResourceLoader new SolrResourceLoader for directory: '/home/jenkins/workspace/Lucene-Solr-trunk-Linux/solr/build/solr-core/test/J2/temp/solr.cloud.UnloadDistributedZkTest_3046F0449A84A995-001/shard-1-001/cores/collection1'
   [junit4]   2> 766551 INFO  (coreLoadExecutor-2820-thread-1-processing-n:127.0.0.1:56276_) [n:127.0.0.1:56276_ c:collection1   x:collection1] o.a.s.c.SolrResourceLoader JNDI not configured for solr (NoInitialContextEx)
   [junit4]   2> 766551 INFO  (coreLoadExecutor-2820-thread-1-processing-n:127.0.0.1:56276_) [n:127.0.0.1:56276_ c:collection1   x:collection1] o.a.s.c.SolrResourceLoader solr home defaulted to 'solr/' (could not find system property or JNDI)
   [junit4]   2> 766551 INFO  (coreLoadExecutor-2820-thread-1-processing-n:127.0.0.1:56276_) [n:127.0.0.1:56276_ c:collection1   x:collection1] o.a.s.c.Config loaded config solrconfig.xml with version 0 
   [junit4]   2> 766554 INFO  (coreLoadExecutor-2820-thread-1-processing-n:127.0.0.1:56276_) [n:127.0.0.1:56276_ c:collection1   x:collection1] o.a.s.c.SolrConfig current version of requestparams : -1
   [junit4]   2> 766557 INFO  (coreLoadExecutor-2820-thread-1-processing-n:127.0.0.1:56276_) [n:127.0.0.1:56276_ c:collection1   x:collection1] o.a.s.c.SolrConfig Using Lucene MatchVersion: 7.0.0
   [junit4]   2> 766575 INFO  (coreLoadExecutor-2820-thread-1-processing-n:127.0.0.1:56276_) [n:127.0.0.1:56276_ c:collection1   x:collection1] o.a.s.c.SolrConfig Loaded SolrConfig: solrconfig.xml
   [junit4]   2> 766579 INFO  (coreLoadExecutor-2820-thread-1-processing-n:127.0.0.1:56276_) [n:127.0.0.1:56276_ c:collection1   x:collection1] o.a.s.s.IndexSchema [collection1] Schema name=test
   [junit4]   2> 766644 INFO  (coreLoadExecutor-2820-thread-1-processing-n:127.0.0.1:56276_) [n:127.0.0.1:56276_ c:collection1   x:collection1] o.a.s.s.OpenExchangeRatesOrgProvider Initialized with rates=open-exchange-rates.json, refreshInterval=1440.
   [junit4]   2> 766648 INFO  (coreLoadExecutor-2820-thread-1-processing-n:127.0.0.1:56276_) [n:127.0.0.1:56276_ c:collection1   x:collection1] o.a.s.s.IndexSchema default search field in schema is text
   [junit4]   2> 766648 INFO  (coreLoadExecutor-2820-thread-1-processing-n:127.0.0.1:56276_) [n:127.0.0.1:56276_ c:collection1   x:collection1] o.a.s.s.IndexSchema unique key field: id
   [junit4]   2> 766651 INFO  (coreLoadExecutor-2820-thread-1-processing-n:127.0.0.1:56276_) [n:127.0.0.1:56276_ c:collection1   x:collection1] o.a.s.s.FileExchangeRateProvider Reloading exchange rates from file currency.xml
   [junit4]   2> 766652 INFO  (coreLoadExecutor-2820-thread-1-processing-n:127.0.0.1:56276_) [n:127.0.0.1:56276_ c:collection1   x:collection1] o.a.s.s.FileExchangeRateProvider Reloading exchange rates from file currency.xml
   [junit4]   2> 766653 INFO  (coreLoadExecutor-2820-thread-1-processing-n:127.0.0.1:56276_) [n:127.0.0.1:56276_ c:collection1   x:collection1] o.a.s.s.OpenExchangeRatesOrgProvider Reloading exchange rates from open-exchange-rates.json
   [junit4]   2> 766653 INFO  (coreLoadExecutor-2820-thread-1-processing-n:127.0.0.1:56276_) [n:127.0.0.1:56276_ c:collection1   x:collection1] o.a.s.s.OpenExchangeRatesOrgProvider Reloading exchange rates from open-exchange-rates.json
   [junit4]   2> 766654 INFO  (coreLoadExecutor-2820-thread-1-processing-n:127.0.0.1:56276_) [n:127.0.0.1:56276_ c:collection1   x:collection1] o.a.s.c.ConfigSetProperties Did not find ConfigSet properties, assuming default properties: Can't find resource 'configsetprops.json' in classpath or '/configs/conf1', cwd=/home/jenkins/workspace/Lucene-Solr-trunk-Linux/solr/build/solr-core/test/J2
   [junit4]   2> 766654 INFO  (coreLoadExecutor-2820-thread-1-processing-n:127.0.0.1:56276_) [n:127.0.0.1:56276_ c:collection1   x:collection1] o.a.s.c.CoreContainer Creating SolrCore 'collection1' using configuration from collection collection1
   [junit4]   2> 766655 INFO  (coreLoadExecutor-2820-thread-1-processing-n:127.0.0.1:56276_) [n:127.0.0.1:56276_ c:collection1 s:shard2 r:core_node1 x:collection1] o.a.s.c.SolrCore org.apache.solr.core.MockDirectoryFactory
   [junit4]   2> 766655 INFO  (coreLoadExecutor-2820-thread-1-processing-n:127.0.0.1:56276_) [n:127.0.0.1:56276_ c:collection1 s:shard2 r:core_node1 x:collection1] o.a.s.c.SolrCore [[collection1] ] Opening new SolrCore at [/home/jenkins/workspace/Lucene-Solr-trunk-Linux/solr/build/solr-core/test/J2/temp/solr.cloud.UnloadDistributedZkTest_3046F0449A84A995-001/shard-1-001/cores/collection1], dataDir=[/home/jenkins/workspace/Lucene-Solr-trunk-Linux/solr/build/solr-core/test/J2/temp/solr.cloud.UnloadDistributedZkTest_3046F0449A84A995-001/shard-1-001/cores/collection1/data/]
   [junit4]   2> 766655 INFO  (coreLoadExecutor-2820-thread-1-processing-n:127.0.0.1:56276_) [n:127.0.0.1:56276_ c:collection1 s:shard2 r:core_node1 x:collection1] o.a.s.c.JmxMonitoredMap JMX monitoring is enabled. Adding Solr mbeans to JMX Server: com.sun.jmx.mbeanserver.JmxMBeanServer@636af085
   [junit4]   2> 766655 INFO  (coreLoadExecutor-2820-thread-1-processing-n:127.0.0.1:56276_) [n:127.0.0.1:56276_ c:collection1 s:shard2 r:core_node1 x:collection1] o.a.s.c.CachingDirectoryFactory return new directory for /home/jenkins/workspace/Lucene-Solr-trunk-Linux/solr/build/solr-core/test/J2/temp/solr.cloud.UnloadDistributedZkTest_3046F0449A84A995-001/shard-1-001/cores/collection1/data
   [junit4]   2> 766655 INFO  (coreLoadExecutor-2820-thread-1-processing-n:127.0.0.1:56276_) [n:127.0.0.1:56276_ c:collection1 s:shard2 r:core_node1 x:collection1] o.a.s.c.SolrCore New index directory detected: old=null new=/home/jenkins/workspace/Lucene-Solr-trunk-Linux/solr/build/solr-core/test/J2/temp/solr.cloud.UnloadDistributedZkTest_3046F0449A84A995-001/shard-1-001/cores/collection1/data/index/
   [junit4]   2> 766655 WARN  (coreLoadExecutor-2820-thread-1-processing-n:127.0.0.1:56276_) [n:127.0.0.1:56276_ c:collection1 s:shard2 r:core_node1 x:collection1] o.a.s.c.SolrCore [collection1] Solr index directory '/home/jenkins/workspace/Lucene-Solr-trunk-Linux/solr/build/solr-core/test/J2/temp/solr.cloud.UnloadDistributedZkTest_3046F0449A84A995-001/shard-1-001/cores/collection1/data/index' doesn't exist

[...truncated too long message...]

junit4]   2> 	2	/solr/collections/multiunload/leader_elect/shard2/election/95484088345296911-core_node5-n_0000000002
   [junit4]   2> 	2	/solr/collections/multiunload/leader_elect/shard1/election/95484088345296911-core_node12-n_0000000000
   [junit4]   2> 	2	/solr/collections/multiunload/leader_elect/shard2/election/95484088345296911-core_node3-n_0000000001
   [junit4]   2> 
   [junit4]   2> Maximum concurrent children watches above limit:
   [junit4]   2> 
   [junit4]   2> 	7	/solr/live_nodes
   [junit4]   2> 	7	/solr/collections
   [junit4]   2> 	5	/solr/overseer/collection-queue-work
   [junit4]   2> 	3	/solr/overseer/queue
   [junit4]   2> 	2	/solr/overseer/queue-work
   [junit4]   2> 
   [junit4]   2> NOTE: reproduce with: ant test  -Dtestcase=UnloadDistributedZkTest -Dtests.method=test -Dtests.seed=3046F0449A84A995 -Dtests.multiplier=3 -Dtests.slow=true -Dtests.locale=sr-Latn-BA -Dtests.timezone=Japan -Dtests.asserts=true -Dtests.file.encoding=UTF-8
   [junit4] ERROR    136s J2 | UnloadDistributedZkTest.test <<<
   [junit4]    > Throwable #1: com.carrotsearch.randomizedtesting.UncaughtExceptionError: Captured an uncaught exception in thread: Thread[id=6938, name=testExecutor-2888-thread-10, state=RUNNABLE, group=TGRP-UnloadDistributedZkTest]
   [junit4]    > 	at __randomizedtesting.SeedInfo.seed([3046F0449A84A995:B812CF9E3478C46D]:0)
   [junit4]    > Caused by: java.lang.RuntimeException: org.apache.solr.client.solrj.SolrServerException: Timeout occured while waiting response from server at: http://127.0.0.1:44583
   [junit4]    > 	at __randomizedtesting.SeedInfo.seed([3046F0449A84A995]:0)
   [junit4]    > 	at org.apache.solr.cloud.BasicDistributedZkTest$1.run(BasicDistributedZkTest.java:586)
   [junit4]    > 	at org.apache.solr.common.util.ExecutorUtil$MDCAwareThreadPoolExecutor$1.run(ExecutorUtil.java:231)
   [junit4]    > 	at java.util.concurrent.ThreadPoolExecutor.runWorker(ThreadPoolExecutor.java:1142)
   [junit4]    > 	at java.util.concurrent.ThreadPoolExecutor$Worker.run(ThreadPoolExecutor.java:617)
   [junit4]    > 	at java.lang.Thread.run(Thread.java:745)
   [junit4]    > Caused by: org.apache.solr.client.solrj.SolrServerException: Timeout occured while waiting response from server at: http://127.0.0.1:44583
   [junit4]    > 	at org.apache.solr.client.solrj.impl.HttpSolrClient.executeMethod(HttpSolrClient.java:588)
   [junit4]    > 	at org.apache.solr.client.solrj.impl.HttpSolrClient.request(HttpSolrClient.java:241)
   [junit4]    > 	at org.apache.solr.client.solrj.impl.HttpSolrClient.request(HttpSolrClient.java:230)
   [junit4]    > 	at org.apache.solr.client.solrj.SolrClient.request(SolrClient.java:1219)
   [junit4]    > 	at org.apache.solr.cloud.BasicDistributedZkTest$1.run(BasicDistributedZkTest.java:584)
   [junit4]    > 	... 4 more
   [junit4]    > Caused by: java.net.SocketTimeoutException: Read timed out
   [junit4]    > 	at java.net.SocketInputStream.socketRead0(Native Method)
   [junit4]    > 	at java.net.SocketInputStream.socketRead(SocketInputStream.java:116)
   [junit4]    > 	at java.net.SocketInputStream.read(SocketInputStream.java:170)
   [junit4]    > 	at java.net.SocketInputStream.read(SocketInputStream.java:141)
   [junit4]    > 	at org.apache.http.impl.io.AbstractSessionInputBuffer.fillBuffer(AbstractSessionInputBuffer.java:160)
   [junit4]    > 	at org.apache.http.impl.io.SocketInputBuffer.fillBuffer(SocketInputBuffer.java:84)
   [junit4]    > 	at org.apache.http.impl.io.AbstractSessionInputBuffer.readLine(AbstractSessionInputBuffer.java:273)
   [junit4]    > 	at org.apache.http.impl.conn.DefaultHttpResponseParser.parseHead(DefaultHttpResponseParser.java:140)
   [junit4]    > 	at org.apache.http.impl.conn.DefaultHttpResponseParser.parseHead(DefaultHttpResponseParser.java:57)
   [junit4]    > 	at org.apache.http.impl.io.AbstractMessageParser.parse(AbstractMessageParser.java:261)
   [junit4]    > 	at org.apache.http.impl.AbstractHttpClientConnection.receiveResponseHeader(AbstractHttpClientConnection.java:283)
   [junit4]    > 	at org.apache.http.impl.conn.DefaultClientConnection.receiveResponseHeader(DefaultClientConnection.java:251)
   [junit4]    > 	at org.apache.http.impl.conn.ManagedClientConnectionImpl.receiveResponseHeader(ManagedClientConnectionImpl.java:197)
   [junit4]    > 	at org.apache.http.protocol.HttpRequestExecutor.doReceiveResponse(HttpRequestExecutor.java:272)
   [junit4]    > 	at org.apache.http.protocol.HttpRequestExecutor.execute(HttpRequestExecutor.java:124)
   [junit4]    > 	at org.apache.http.impl.client.DefaultRequestDirector.tryExecute(DefaultRequestDirector.java:685)
   [junit4]    > 	at org.apache.http.impl.client.DefaultRequestDirector.execute(DefaultRequestDirector.java:487)
   [junit4]    > 	at org.apache.http.impl.client.AbstractHttpClient.doExecute(AbstractHttpClient.java:882)
   [junit4]    > 	at org.apache.http.impl.client.CloseableHttpClient.execute(CloseableHttpClient.java:82)
   [junit4]    > 	at org.apache.http.impl.client.CloseableHttpClient.execute(CloseableHttpClient.java:107)
   [junit4]    > 	at org.apache.http.impl.client.CloseableHttpClient.execute(CloseableHttpClient.java:55)
   [junit4]    > 	at org.apache.solr.client.solrj.impl.HttpSolrClient.executeMethod(HttpSolrClient.java:482)
   [junit4]    > 	... 8 more
   [junit4]   2> 898729 INFO  (SUITE-UnloadDistributedZkTest-seed#[3046F0449A84A995]-worker) [    ] o.a.s.SolrTestCaseJ4 ###deleteCore
   [junit4]   2> NOTE: test params are: codec=Asserting(Lucene60): {other_tl1=PostingsFormat(name=LuceneFixedGap), range_facet_l_dv=BlockTreeOrds(blocksize=128), _version_=PostingsFormat(name=LuceneFixedGap), multiDefault=PostingsFormat(name=LuceneVarGapDocFreqInterval), a_t=PostingsFormat(name=LuceneVarGapDocFreqInterval), intDefault=PostingsFormat(name=LuceneFixedGap), a_i1=PostingsFormat(name=LuceneVarGapDocFreqInterval), id=BlockTreeOrds(blocksize=128), range_facet_i_dv=PostingsFormat(name=LuceneVarGapDocFreqInterval), text=PostingsFormat(name=Direct), range_facet_l=PostingsFormat(name=LuceneVarGapDocFreqInterval), timestamp=PostingsFormat(name=LuceneVarGapDocFreqInterval)}, docValues:{range_facet_l_dv=DocValuesFormat(name=Memory), range_facet_i_dv=DocValuesFormat(name=Lucene54), timestamp=DocValuesFormat(name=Lucene54)}, maxPointsInLeafNode=1059, maxMBSortInHeap=6.605456762432814, sim=RandomSimilarity(queryNorm=true,coord=yes): {}, locale=sr-Latn-BA, timezone=Japan
   [junit4]   2> NOTE: Linux 3.19.0-51-generic amd64/Oracle Corporation 1.8.0_72 (64-bit)/cpus=12,threads=1,free=172051584,total=518979584
   [junit4]   2> NOTE: All tests run in this JVM: [BasicDistributedZk2Test, DistributedQueryComponentOptimizationTest, FieldAnalysisRequestHandlerTest, TestNamedUpdateProcessors, TestObjectReleaseTracker, CloudMLTQParserTest, TestHighFrequencyDictionaryFactory, DistribCursorPagingTest, XmlUpdateRequestHandlerTest, DistributedQueueTest, AddBlockUpdateTest, BadCopyFieldTest, OverseerTest, HdfsChaosMonkeySafeLeaderTest, TestSolrJ, AutoCommitTest, TestDynamicLoading, TestManagedResource, RegexBoostProcessorTest, TestOverriddenPrefixQueryForCustomFieldType, TestAddFieldRealTimeGet, CircularListTest, TestShardHandlerFactory, TestComplexPhraseQParserPlugin, SaslZkACLProviderTest, LeaderElectionTest, TestDistributedMissingSort, SegmentsInfoRequestHandlerTest, TestZkChroot, TermVectorComponentDistributedTest, TestSolrConfigHandlerConcurrent, PluginInfoTest, TestJmxMonitoredMap, QueryParsingTest, TestIndexingPerformance, TestFieldCollectionResource, NoCacheHeaderTest, TestBulkSchemaAPI, DistributedFacetPivotSmallTest, BufferStoreTest, TestStressUserVersions, RecoveryZkTest, TlogReplayBufferedWhileIndexingTest, AtomicUpdatesTest, DistributedFacetPivotLargeTest, TestJettySolrRunner, SuggesterTSTTest, HighlighterConfigTest, RecoveryAfterSoftCommitTest, TestBlendedInfixSuggestions, BlockJoinFacetRandomTest, HardAutoCommitTest, TestFilteredDocIdSet, TestReload, DataDrivenBlockJoinTest, DirectSolrConnectionTest, DocValuesMultiTest, TestConfigReload, TestGroupingSearch, TestPHPSerializedResponseWriter, TestCryptoKeys, TestBulkSchemaConcurrent, TestRawTransformer, HdfsDirectoryFactoryTest, SharedFSAutoReplicaFailoverUtilsTest, TestShortCircuitedRequests, TestConfigSetsAPI, TestCloudInspectUtil, PrimitiveFieldTypeTest, BadIndexSchemaTest, TestStressReorder, TestSortByMinMaxFunction, UpdateParamsTest, TestSerializedLuceneMatchVersion, TestReloadDeadlock, TestSort, SliceStateTest, ResponseHeaderTest, StatelessScriptUpdateProcessorFactoryTest, SuggesterWFSTTest, TestStressRecovery, AssignTest, TestUniqueKeyFieldResource, HdfsBasicDistributedZk2Test, DateMathParserTest, UnloadDistributedZkTest]
   [junit4] Completed [275/581 (1!)] on J2 in 136.15s, 1 test, 1 error <<< FAILURES!

[...truncated 1014 lines...]
BUILD FAILED
/home/jenkins/workspace/Lucene-Solr-trunk-Linux/build.xml:740: The following error occurred while executing this line:
/home/jenkins/workspace/Lucene-Solr-trunk-Linux/build.xml:684: The following error occurred while executing this line:
/home/jenkins/workspace/Lucene-Solr-trunk-Linux/build.xml:59: The following error occurred while executing this line:
/home/jenkins/workspace/Lucene-Solr-trunk-Linux/solr/build.xml:233: The following error occurred while executing this line:
/home/jenkins/workspace/Lucene-Solr-trunk-Linux/solr/common-build.xml:524: The following error occurred while executing this line:
/home/jenkins/workspace/Lucene-Solr-trunk-Linux/lucene/common-build.xml:1457: The following error occurred while executing this line:
/home/jenkins/workspace/Lucene-Solr-trunk-Linux/lucene/common-build.xml:1014: There were test failures: 581 suites (8 ignored), 2345 tests, 1 error, 116 ignored (71 assumptions) [seed: 3046F0449A84A995]

Total time: 55 minutes 25 seconds
Build step 'Invoke Ant' marked build as failure
Archiving artifacts
[WARNINGS] Skipping publisher since build result is FAILURE
Recording test results
Email was triggered for: Failure - Any
Sending email for trigger: Failure - Any



Mime
View raw message