lucene-dev mailing list archives

Site index · List index
Message view « Date » · « Thread »
Top « Date » · « Thread »
From Policeman Jenkins Server <jenk...@thetaphi.de>
Subject [JENKINS] Lucene-Solr-6.x-Solaris (64bit/jdk1.8.0) - Build # 12 - Still Failing!
Date Thu, 17 Mar 2016 12:31:38 GMT
Build: http://jenkins.thetaphi.de/job/Lucene-Solr-6.x-Solaris/12/
Java: 64bit/jdk1.8.0 -XX:-UseCompressedOops -XX:+UseG1GC

1 tests failed.
FAILED:  org.apache.solr.cloud.CustomCollectionTest.test

Error Message:
Error from server at http://127.0.0.1:40227/sc_/p: collection already exists: testCreateShardRepFactor

Stack Trace:
org.apache.solr.client.solrj.impl.HttpSolrClient$RemoteSolrException: Error from server at http://127.0.0.1:40227/sc_/p: collection already exists: testCreateShardRepFactor
	at __randomizedtesting.SeedInfo.seed([EDCAC41103F1DA18:659EFBCBAD0DB7E0]:0)
	at org.apache.solr.client.solrj.impl.HttpSolrClient.executeMethod(HttpSolrClient.java:577)
	at org.apache.solr.client.solrj.impl.HttpSolrClient.request(HttpSolrClient.java:241)
	at org.apache.solr.client.solrj.impl.HttpSolrClient.request(HttpSolrClient.java:230)
	at org.apache.solr.client.solrj.impl.LBHttpSolrClient.doRequest(LBHttpSolrClient.java:372)
	at org.apache.solr.client.solrj.impl.LBHttpSolrClient.request(LBHttpSolrClient.java:325)
	at org.apache.solr.client.solrj.impl.CloudSolrClient.sendRequest(CloudSolrClient.java:1100)
	at org.apache.solr.client.solrj.impl.CloudSolrClient.requestWithRetryOnStaleState(CloudSolrClient.java:870)
	at org.apache.solr.client.solrj.impl.CloudSolrClient.request(CloudSolrClient.java:806)
	at org.apache.solr.client.solrj.SolrClient.request(SolrClient.java:1219)
	at org.apache.solr.cloud.AbstractFullDistribZkTestBase.createCollection(AbstractFullDistribZkTestBase.java:1593)
	at org.apache.solr.cloud.AbstractFullDistribZkTestBase.createCollection(AbstractFullDistribZkTestBase.java:1547)
	at org.apache.solr.cloud.CustomCollectionTest.testCreateShardRepFactor(CustomCollectionTest.java:390)
	at org.apache.solr.cloud.CustomCollectionTest.test(CustomCollectionTest.java:101)
	at sun.reflect.NativeMethodAccessorImpl.invoke0(Native Method)
	at sun.reflect.NativeMethodAccessorImpl.invoke(NativeMethodAccessorImpl.java:62)
	at sun.reflect.DelegatingMethodAccessorImpl.invoke(DelegatingMethodAccessorImpl.java:43)
	at java.lang.reflect.Method.invoke(Method.java:498)
	at com.carrotsearch.randomizedtesting.RandomizedRunner.invoke(RandomizedRunner.java:1764)
	at com.carrotsearch.randomizedtesting.RandomizedRunner$8.evaluate(RandomizedRunner.java:871)
	at com.carrotsearch.randomizedtesting.RandomizedRunner$9.evaluate(RandomizedRunner.java:907)
	at com.carrotsearch.randomizedtesting.RandomizedRunner$10.evaluate(RandomizedRunner.java:921)
	at org.apache.solr.BaseDistributedSearchTestCase$ShardsRepeatRule$ShardsFixedStatement.callStatement(BaseDistributedSearchTestCase.java:996)
	at org.apache.solr.BaseDistributedSearchTestCase$ShardsRepeatRule$ShardsStatement.evaluate(BaseDistributedSearchTestCase.java:971)
	at com.carrotsearch.randomizedtesting.rules.SystemPropertiesRestoreRule$1.evaluate(SystemPropertiesRestoreRule.java:57)
	at org.apache.lucene.util.TestRuleSetupTeardownChained$1.evaluate(TestRuleSetupTeardownChained.java:49)
	at org.apache.lucene.util.AbstractBeforeAfterRule$1.evaluate(AbstractBeforeAfterRule.java:45)
	at org.apache.lucene.util.TestRuleThreadAndTestName$1.evaluate(TestRuleThreadAndTestName.java:48)
	at org.apache.lucene.util.TestRuleIgnoreAfterMaxFailures$1.evaluate(TestRuleIgnoreAfterMaxFailures.java:64)
	at org.apache.lucene.util.TestRuleMarkFailure$1.evaluate(TestRuleMarkFailure.java:47)
	at com.carrotsearch.randomizedtesting.rules.StatementAdapter.evaluate(StatementAdapter.java:36)
	at com.carrotsearch.randomizedtesting.ThreadLeakControl$StatementRunner.run(ThreadLeakControl.java:367)
	at com.carrotsearch.randomizedtesting.ThreadLeakControl.forkTimeoutingTask(ThreadLeakControl.java:809)
	at com.carrotsearch.randomizedtesting.ThreadLeakControl$3.evaluate(ThreadLeakControl.java:460)
	at com.carrotsearch.randomizedtesting.RandomizedRunner.runSingleTest(RandomizedRunner.java:880)
	at com.carrotsearch.randomizedtesting.RandomizedRunner$5.evaluate(RandomizedRunner.java:781)
	at com.carrotsearch.randomizedtesting.RandomizedRunner$6.evaluate(RandomizedRunner.java:816)
	at com.carrotsearch.randomizedtesting.RandomizedRunner$7.evaluate(RandomizedRunner.java:827)
	at com.carrotsearch.randomizedtesting.rules.StatementAdapter.evaluate(StatementAdapter.java:36)
	at com.carrotsearch.randomizedtesting.rules.SystemPropertiesRestoreRule$1.evaluate(SystemPropertiesRestoreRule.java:57)
	at org.apache.lucene.util.AbstractBeforeAfterRule$1.evaluate(AbstractBeforeAfterRule.java:45)
	at com.carrotsearch.randomizedtesting.rules.StatementAdapter.evaluate(StatementAdapter.java:36)
	at org.apache.lucene.util.TestRuleStoreClassName$1.evaluate(TestRuleStoreClassName.java:41)
	at com.carrotsearch.randomizedtesting.rules.NoShadowingOrOverridesOnMethodsRule$1.evaluate(NoShadowingOrOverridesOnMethodsRule.java:40)
	at com.carrotsearch.randomizedtesting.rules.NoShadowingOrOverridesOnMethodsRule$1.evaluate(NoShadowingOrOverridesOnMethodsRule.java:40)
	at com.carrotsearch.randomizedtesting.rules.StatementAdapter.evaluate(StatementAdapter.java:36)
	at com.carrotsearch.randomizedtesting.rules.StatementAdapter.evaluate(StatementAdapter.java:36)
	at com.carrotsearch.randomizedtesting.rules.StatementAdapter.evaluate(StatementAdapter.java:36)
	at org.apache.lucene.util.TestRuleAssertionsRequired$1.evaluate(TestRuleAssertionsRequired.java:53)
	at org.apache.lucene.util.TestRuleMarkFailure$1.evaluate(TestRuleMarkFailure.java:47)
	at org.apache.lucene.util.TestRuleIgnoreAfterMaxFailures$1.evaluate(TestRuleIgnoreAfterMaxFailures.java:64)
	at org.apache.lucene.util.TestRuleIgnoreTestSuites$1.evaluate(TestRuleIgnoreTestSuites.java:54)
	at com.carrotsearch.randomizedtesting.rules.StatementAdapter.evaluate(StatementAdapter.java:36)
	at com.carrotsearch.randomizedtesting.ThreadLeakControl$StatementRunner.run(ThreadLeakControl.java:367)
	at java.lang.Thread.run(Thread.java:745)




Build Log:
[...truncated 11310 lines...]
   [junit4] Suite: org.apache.solr.cloud.CustomCollectionTest
   [junit4]   2> Creating dataDir: /export/home/jenkins/workspace/Lucene-Solr-6.x-Solaris/solr/build/solr-core/test/J1/temp/solr.cloud.CustomCollectionTest_EDCAC41103F1DA18-001/init-core-data-001
   [junit4]   2> 1341521 INFO  (SUITE-CustomCollectionTest-seed#[EDCAC41103F1DA18]-worker) [    ] o.a.s.BaseDistributedSearchTestCase Setting hostContext system property: /sc_/p
   [junit4]   2> 1341524 INFO  (TEST-CustomCollectionTest.test-seed#[EDCAC41103F1DA18]) [    ] o.a.s.c.ZkTestServer STARTING ZK TEST SERVER
   [junit4]   2> 1341524 INFO  (Thread-5097) [    ] o.a.s.c.ZkTestServer client port:0.0.0.0/0.0.0.0:0
   [junit4]   2> 1341524 INFO  (Thread-5097) [    ] o.a.s.c.ZkTestServer Starting server
   [junit4]   2> 1341627 INFO  (TEST-CustomCollectionTest.test-seed#[EDCAC41103F1DA18]) [    ] o.a.s.c.ZkTestServer start zk server on port:35285
   [junit4]   2> 1341627 INFO  (TEST-CustomCollectionTest.test-seed#[EDCAC41103F1DA18]) [    ] o.a.s.c.c.SolrZkClient Using default ZkCredentialsProvider
   [junit4]   2> 1341628 INFO  (TEST-CustomCollectionTest.test-seed#[EDCAC41103F1DA18]) [    ] o.a.s.c.c.ConnectionManager Waiting for client to connect to ZooKeeper
   [junit4]   2> 1341631 INFO  (zkCallback-1504-thread-1) [    ] o.a.s.c.c.ConnectionManager Watcher org.apache.solr.common.cloud.ConnectionManager@381a75d6 name:ZooKeeperConnection Watcher:127.0.0.1:35285 got event WatchedEvent state:SyncConnected type:None path:null path:null type:None
   [junit4]   2> 1341631 INFO  (TEST-CustomCollectionTest.test-seed#[EDCAC41103F1DA18]) [    ] o.a.s.c.c.ConnectionManager Client is connected to ZooKeeper
   [junit4]   2> 1341631 INFO  (TEST-CustomCollectionTest.test-seed#[EDCAC41103F1DA18]) [    ] o.a.s.c.c.SolrZkClient Using default ZkACLProvider
   [junit4]   2> 1341631 INFO  (TEST-CustomCollectionTest.test-seed#[EDCAC41103F1DA18]) [    ] o.a.s.c.c.SolrZkClient makePath: /solr
   [junit4]   2> 1341635 INFO  (TEST-CustomCollectionTest.test-seed#[EDCAC41103F1DA18]) [    ] o.a.s.c.c.SolrZkClient Using default ZkCredentialsProvider
   [junit4]   2> 1341635 INFO  (TEST-CustomCollectionTest.test-seed#[EDCAC41103F1DA18]) [    ] o.a.s.c.c.ConnectionManager Waiting for client to connect to ZooKeeper
   [junit4]   2> 1341636 INFO  (zkCallback-1505-thread-1) [    ] o.a.s.c.c.ConnectionManager Watcher org.apache.solr.common.cloud.ConnectionManager@30e38532 name:ZooKeeperConnection Watcher:127.0.0.1:35285/solr got event WatchedEvent state:SyncConnected type:None path:null path:null type:None
   [junit4]   2> 1341636 INFO  (TEST-CustomCollectionTest.test-seed#[EDCAC41103F1DA18]) [    ] o.a.s.c.c.ConnectionManager Client is connected to ZooKeeper
   [junit4]   2> 1341636 INFO  (TEST-CustomCollectionTest.test-seed#[EDCAC41103F1DA18]) [    ] o.a.s.c.c.SolrZkClient Using default ZkACLProvider
   [junit4]   2> 1341636 INFO  (TEST-CustomCollectionTest.test-seed#[EDCAC41103F1DA18]) [    ] o.a.s.c.c.SolrZkClient makePath: /collections/collection1
   [junit4]   2> 1341639 INFO  (TEST-CustomCollectionTest.test-seed#[EDCAC41103F1DA18]) [    ] o.a.s.c.c.SolrZkClient makePath: /collections/collection1/shards
   [junit4]   2> 1341642 INFO  (TEST-CustomCollectionTest.test-seed#[EDCAC41103F1DA18]) [    ] o.a.s.c.c.SolrZkClient makePath: /collections/control_collection
   [junit4]   2> 1341643 INFO  (TEST-CustomCollectionTest.test-seed#[EDCAC41103F1DA18]) [    ] o.a.s.c.c.SolrZkClient makePath: /collections/control_collection/shards
   [junit4]   2> 1341646 INFO  (TEST-CustomCollectionTest.test-seed#[EDCAC41103F1DA18]) [    ] o.a.s.c.AbstractZkTestCase put /export/home/jenkins/workspace/Lucene-Solr-6.x-Solaris/solr/core/src/test-files/solr/collection1/conf/solrconfig-tlog.xml to /configs/conf1/solrconfig.xml
   [junit4]   2> 1341646 INFO  (TEST-CustomCollectionTest.test-seed#[EDCAC41103F1DA18]) [    ] o.a.s.c.c.SolrZkClient makePath: /configs/conf1/solrconfig.xml
   [junit4]   2> 1341649 INFO  (TEST-CustomCollectionTest.test-seed#[EDCAC41103F1DA18]) [    ] o.a.s.c.AbstractZkTestCase put /export/home/jenkins/workspace/Lucene-Solr-6.x-Solaris/solr/core/src/test-files/solr/collection1/conf/schema.xml to /configs/conf1/schema.xml
   [junit4]   2> 1341650 INFO  (TEST-CustomCollectionTest.test-seed#[EDCAC41103F1DA18]) [    ] o.a.s.c.c.SolrZkClient makePath: /configs/conf1/schema.xml
   [junit4]   2> 1341654 INFO  (TEST-CustomCollectionTest.test-seed#[EDCAC41103F1DA18]) [    ] o.a.s.c.AbstractZkTestCase put /export/home/jenkins/workspace/Lucene-Solr-6.x-Solaris/solr/core/src/test-files/solr/collection1/conf/solrconfig.snippet.randomindexconfig.xml to /configs/conf1/solrconfig.snippet.randomindexconfig.xml
   [junit4]   2> 1341654 INFO  (TEST-CustomCollectionTest.test-seed#[EDCAC41103F1DA18]) [    ] o.a.s.c.c.SolrZkClient makePath: /configs/conf1/solrconfig.snippet.randomindexconfig.xml
   [junit4]   2> 1341656 INFO  (TEST-CustomCollectionTest.test-seed#[EDCAC41103F1DA18]) [    ] o.a.s.c.AbstractZkTestCase put /export/home/jenkins/workspace/Lucene-Solr-6.x-Solaris/solr/core/src/test-files/solr/collection1/conf/stopwords.txt to /configs/conf1/stopwords.txt
   [junit4]   2> 1341656 INFO  (TEST-CustomCollectionTest.test-seed#[EDCAC41103F1DA18]) [    ] o.a.s.c.c.SolrZkClient makePath: /configs/conf1/stopwords.txt
   [junit4]   2> 1341658 INFO  (TEST-CustomCollectionTest.test-seed#[EDCAC41103F1DA18]) [    ] o.a.s.c.AbstractZkTestCase put /export/home/jenkins/workspace/Lucene-Solr-6.x-Solaris/solr/core/src/test-files/solr/collection1/conf/protwords.txt to /configs/conf1/protwords.txt
   [junit4]   2> 1341659 INFO  (TEST-CustomCollectionTest.test-seed#[EDCAC41103F1DA18]) [    ] o.a.s.c.c.SolrZkClient makePath: /configs/conf1/protwords.txt
   [junit4]   2> 1341660 INFO  (TEST-CustomCollectionTest.test-seed#[EDCAC41103F1DA18]) [    ] o.a.s.c.AbstractZkTestCase put /export/home/jenkins/workspace/Lucene-Solr-6.x-Solaris/solr/core/src/test-files/solr/collection1/conf/currency.xml to /configs/conf1/currency.xml
   [junit4]   2> 1341661 INFO  (TEST-CustomCollectionTest.test-seed#[EDCAC41103F1DA18]) [    ] o.a.s.c.c.SolrZkClient makePath: /configs/conf1/currency.xml
   [junit4]   2> 1341663 INFO  (TEST-CustomCollectionTest.test-seed#[EDCAC41103F1DA18]) [    ] o.a.s.c.AbstractZkTestCase put /export/home/jenkins/workspace/Lucene-Solr-6.x-Solaris/solr/core/src/test-files/solr/collection1/conf/enumsConfig.xml to /configs/conf1/enumsConfig.xml
   [junit4]   2> 1341664 INFO  (TEST-CustomCollectionTest.test-seed#[EDCAC41103F1DA18]) [    ] o.a.s.c.c.SolrZkClient makePath: /configs/conf1/enumsConfig.xml
   [junit4]   2> 1341666 INFO  (TEST-CustomCollectionTest.test-seed#[EDCAC41103F1DA18]) [    ] o.a.s.c.AbstractZkTestCase put /export/home/jenkins/workspace/Lucene-Solr-6.x-Solaris/solr/core/src/test-files/solr/collection1/conf/open-exchange-rates.json to /configs/conf1/open-exchange-rates.json
   [junit4]   2> 1341666 INFO  (TEST-CustomCollectionTest.test-seed#[EDCAC41103F1DA18]) [    ] o.a.s.c.c.SolrZkClient makePath: /configs/conf1/open-exchange-rates.json
   [junit4]   2> 1341668 INFO  (TEST-CustomCollectionTest.test-seed#[EDCAC41103F1DA18]) [    ] o.a.s.c.AbstractZkTestCase put /export/home/jenkins/workspace/Lucene-Solr-6.x-Solaris/solr/core/src/test-files/solr/collection1/conf/mapping-ISOLatin1Accent.txt to /configs/conf1/mapping-ISOLatin1Accent.txt
   [junit4]   2> 1341668 INFO  (TEST-CustomCollectionTest.test-seed#[EDCAC41103F1DA18]) [    ] o.a.s.c.c.SolrZkClient makePath: /configs/conf1/mapping-ISOLatin1Accent.txt
   [junit4]   2> 1341671 INFO  (TEST-CustomCollectionTest.test-seed#[EDCAC41103F1DA18]) [    ] o.a.s.c.AbstractZkTestCase put /export/home/jenkins/workspace/Lucene-Solr-6.x-Solaris/solr/core/src/test-files/solr/collection1/conf/old_synonyms.txt to /configs/conf1/old_synonyms.txt
   [junit4]   2> 1341671 INFO  (TEST-CustomCollectionTest.test-seed#[EDCAC41103F1DA18]) [    ] o.a.s.c.c.SolrZkClient makePath: /configs/conf1/old_synonyms.txt
   [junit4]   2> 1341673 INFO  (TEST-CustomCollectionTest.test-seed#[EDCAC41103F1DA18]) [    ] o.a.s.c.AbstractZkTestCase put /export/home/jenkins/workspace/Lucene-Solr-6.x-Solaris/solr/core/src/test-files/solr/collection1/conf/synonyms.txt to /configs/conf1/synonyms.txt
   [junit4]   2> 1341674 INFO  (TEST-CustomCollectionTest.test-seed#[EDCAC41103F1DA18]) [    ] o.a.s.c.c.SolrZkClient makePath: /configs/conf1/synonyms.txt
   [junit4]   2> 1341797 INFO  (TEST-CustomCollectionTest.test-seed#[EDCAC41103F1DA18]) [    ] o.a.s.SolrTestCaseJ4 Writing core.properties file to /export/home/jenkins/workspace/Lucene-Solr-6.x-Solaris/solr/build/solr-core/test/J1/temp/solr.cloud.CustomCollectionTest_EDCAC41103F1DA18-001/control-001/cores/collection1
   [junit4]   2> 1341798 INFO  (TEST-CustomCollectionTest.test-seed#[EDCAC41103F1DA18]) [    ] o.e.j.s.Server jetty-9.3.8.v20160314
   [junit4]   2> 1341800 INFO  (TEST-CustomCollectionTest.test-seed#[EDCAC41103F1DA18]) [    ] o.e.j.s.h.ContextHandler Started o.e.j.s.ServletContextHandler@acd9eec{/sc_/p,null,AVAILABLE}
   [junit4]   2> 1341802 INFO  (TEST-CustomCollectionTest.test-seed#[EDCAC41103F1DA18]) [    ] o.e.j.s.ServerConnector Started ServerConnector@49931708{HTTP/1.1,[http/1.1]}{127.0.0.1:40227}
   [junit4]   2> 1341802 INFO  (TEST-CustomCollectionTest.test-seed#[EDCAC41103F1DA18]) [    ] o.e.j.s.Server Started @1344668ms
   [junit4]   2> 1341802 INFO  (TEST-CustomCollectionTest.test-seed#[EDCAC41103F1DA18]) [    ] o.a.s.c.s.e.JettySolrRunner Jetty properties: {solr.data.dir=/export/home/jenkins/workspace/Lucene-Solr-6.x-Solaris/solr/build/solr-core/test/J1/temp/solr.cloud.CustomCollectionTest_EDCAC41103F1DA18-001/tempDir-001/control/data, hostContext=/sc_/p, hostPort=40227, coreRootDirectory=/export/home/jenkins/workspace/Lucene-Solr-6.x-Solaris/solr/build/solr-core/test/J1/temp/solr.cloud.CustomCollectionTest_EDCAC41103F1DA18-001/control-001/cores}
   [junit4]   2> 1341802 INFO  (TEST-CustomCollectionTest.test-seed#[EDCAC41103F1DA18]) [    ] o.a.s.s.SolrDispatchFilter SolrDispatchFilter.init(): sun.misc.Launcher$AppClassLoader@6d06d69c
   [junit4]   2> 1341802 INFO  (TEST-CustomCollectionTest.test-seed#[EDCAC41103F1DA18]) [    ] o.a.s.c.SolrResourceLoader new SolrResourceLoader for directory: '/export/home/jenkins/workspace/Lucene-Solr-6.x-Solaris/solr/build/solr-core/test/J1/temp/solr.cloud.CustomCollectionTest_EDCAC41103F1DA18-001/control-001'
   [junit4]   2> 1341802 INFO  (TEST-CustomCollectionTest.test-seed#[EDCAC41103F1DA18]) [    ] o.a.s.c.SolrResourceLoader JNDI not configured for solr (NoInitialContextEx)
   [junit4]   2> 1341802 INFO  (TEST-CustomCollectionTest.test-seed#[EDCAC41103F1DA18]) [    ] o.a.s.c.SolrResourceLoader solr home defaulted to 'solr/' (could not find system property or JNDI)
   [junit4]   2> 1341803 INFO  (TEST-CustomCollectionTest.test-seed#[EDCAC41103F1DA18]) [    ] o.a.s.c.c.SolrZkClient Using default ZkCredentialsProvider
   [junit4]   2> 1341803 INFO  (TEST-CustomCollectionTest.test-seed#[EDCAC41103F1DA18]) [    ] o.a.s.c.c.ConnectionManager Waiting for client to connect to ZooKeeper
   [junit4]   2> 1341805 INFO  (zkCallback-1506-thread-1) [    ] o.a.s.c.c.ConnectionManager Watcher org.apache.solr.common.cloud.ConnectionManager@1f807add name:ZooKeeperConnection Watcher:127.0.0.1:35285/solr got event WatchedEvent state:SyncConnected type:None path:null path:null type:None
   [junit4]   2> 1341805 INFO  (TEST-CustomCollectionTest.test-seed#[EDCAC41103F1DA18]) [    ] o.a.s.c.c.ConnectionManager Client is connected to ZooKeeper
   [junit4]   2> 1341805 INFO  (TEST-CustomCollectionTest.test-seed#[EDCAC41103F1DA18]) [    ] o.a.s.c.c.SolrZkClient Using default ZkACLProvider
   [junit4]   2> 1341807 INFO  (TEST-CustomCollectionTest.test-seed#[EDCAC41103F1DA18]) [    ] o.a.s.s.SolrDispatchFilter Loading solr.xml from SolrHome (not found in ZooKeeper)
   [junit4]   2> 1341807 INFO  (TEST-CustomCollectionTest.test-seed#[EDCAC41103F1DA18]) [    ] o.a.s.c.SolrXmlConfig Loading container configuration from /export/home/jenkins/workspace/Lucene-Solr-6.x-Solaris/solr/build/solr-core/test/J1/temp/solr.cloud.CustomCollectionTest_EDCAC41103F1DA18-001/control-001/solr.xml
   [junit4]   2> 1341811 INFO  (TEST-CustomCollectionTest.test-seed#[EDCAC41103F1DA18]) [    ] o.a.s.c.CorePropertiesLocator Config-defined core root directory: /export/home/jenkins/workspace/Lucene-Solr-6.x-Solaris/solr/build/solr-core/test/J1/temp/solr.cloud.CustomCollectionTest_EDCAC41103F1DA18-001/control-001/cores
   [junit4]   2> 1341811 INFO  (TEST-CustomCollectionTest.test-seed#[EDCAC41103F1DA18]) [    ] o.a.s.c.CoreContainer New CoreContainer 1741969570
   [junit4]   2> 1341811 INFO  (TEST-CustomCollectionTest.test-seed#[EDCAC41103F1DA18]) [    ] o.a.s.c.CoreContainer Loading cores into CoreContainer [instanceDir=/export/home/jenkins/workspace/Lucene-Solr-6.x-Solaris/solr/build/solr-core/test/J1/temp/solr.cloud.CustomCollectionTest_EDCAC41103F1DA18-001/control-001]
   [junit4]   2> 1341811 WARN  (TEST-CustomCollectionTest.test-seed#[EDCAC41103F1DA18]) [    ] o.a.s.c.CoreContainer Couldn't add files from /export/home/jenkins/workspace/Lucene-Solr-6.x-Solaris/solr/build/solr-core/test/J1/temp/solr.cloud.CustomCollectionTest_EDCAC41103F1DA18-001/control-001/lib to classpath: /export/home/jenkins/workspace/Lucene-Solr-6.x-Solaris/solr/build/solr-core/test/J1/temp/solr.cloud.CustomCollectionTest_EDCAC41103F1DA18-001/control-001/lib
   [junit4]   2> 1341811 INFO  (TEST-CustomCollectionTest.test-seed#[EDCAC41103F1DA18]) [    ] o.a.s.h.c.HttpShardHandlerFactory created with socketTimeout : 90000,urlScheme : ,connTimeout : 15000,maxConnectionsPerHost : 20,maxConnections : 10000,corePoolSize : 0,maximumPoolSize : 2147483647,maxThreadIdleTime : 5,sizeOfQueue : -1,fairnessPolicy : false,useRetries : false,
   [junit4]   2> 1341812 INFO  (TEST-CustomCollectionTest.test-seed#[EDCAC41103F1DA18]) [    ] o.a.s.u.UpdateShardHandler Creating UpdateShardHandler HTTP client with params: socketTimeout=340000&connTimeout=45000&retry=true
   [junit4]   2> 1341813 INFO  (TEST-CustomCollectionTest.test-seed#[EDCAC41103F1DA18]) [    ] o.a.s.l.LogWatcher SLF4J impl is org.slf4j.impl.Log4jLoggerFactory
   [junit4]   2> 1341813 INFO  (TEST-CustomCollectionTest.test-seed#[EDCAC41103F1DA18]) [    ] o.a.s.l.LogWatcher Registering Log Listener [Log4j (org.slf4j.impl.Log4jLoggerFactory)]
   [junit4]   2> 1341813 INFO  (TEST-CustomCollectionTest.test-seed#[EDCAC41103F1DA18]) [    ] o.a.s.c.ZkContainer Zookeeper client=127.0.0.1:35285/solr
   [junit4]   2> 1341813 INFO  (TEST-CustomCollectionTest.test-seed#[EDCAC41103F1DA18]) [    ] o.a.s.c.ZkController zkHost includes chroot
   [junit4]   2> 1341813 INFO  (TEST-CustomCollectionTest.test-seed#[EDCAC41103F1DA18]) [    ] o.a.s.c.c.SolrZkClient Using default ZkCredentialsProvider
   [junit4]   2> 1341813 INFO  (TEST-CustomCollectionTest.test-seed#[EDCAC41103F1DA18]) [    ] o.a.s.c.c.ConnectionManager Waiting for client to connect to ZooKeeper
   [junit4]   2> 1341815 INFO  (zkCallback-1509-thread-1) [    ] o.a.s.c.c.ConnectionManager Watcher org.apache.solr.common.cloud.ConnectionManager@78b719c0 name:ZooKeeperConnection Watcher:127.0.0.1:35285 got event WatchedEvent state:SyncConnected type:None path:null path:null type:None
   [junit4]   2> 1341815 INFO  (TEST-CustomCollectionTest.test-seed#[EDCAC41103F1DA18]) [    ] o.a.s.c.c.ConnectionManager Client is connected to ZooKeeper
   [junit4]   2> 1341815 INFO  (TEST-CustomCollectionTest.test-seed#[EDCAC41103F1DA18]) [    ] o.a.s.c.c.SolrZkClient Using default ZkACLProvider
   [junit4]   2> 1341817 INFO  (TEST-CustomCollectionTest.test-seed#[EDCAC41103F1DA18]) [n:127.0.0.1:40227_sc_%2Fp    ] o.a.s.c.c.ConnectionManager Waiting for client to connect to ZooKeeper
   [junit4]   2> 1341819 INFO  (zkCallback-1510-thread-1-processing-n:127.0.0.1:40227_sc_%2Fp) [n:127.0.0.1:40227_sc_%2Fp    ] o.a.s.c.c.ConnectionManager Watcher org.apache.solr.common.cloud.ConnectionManager@79c3e057 name:ZooKeeperConnection Watcher:127.0.0.1:35285/solr got event WatchedEvent state:SyncConnected type:None path:null path:null type:None
   [junit4]   2> 1341819 INFO  (TEST-CustomCollectionTest.test-seed#[EDCAC41103F1DA18]) [n:127.0.0.1:40227_sc_%2Fp    ] o.a.s.c.c.ConnectionManager Client is connected to ZooKeeper
   [junit4]   2> 1341820 INFO  (TEST-CustomCollectionTest.test-seed#[EDCAC41103F1DA18]) [n:127.0.0.1:40227_sc_%2Fp    ] o.a.s.c.c.SolrZkClient makePath: /overseer/queue
   [junit4]   2> 1341823 INFO  (TEST-CustomCollectionTest.test-seed#[EDCAC41103F1DA18]) [n:127.0.0.1:40227_sc_%2Fp    ] o.a.s.c.c.SolrZkClient makePath: /overseer/collection-queue-work
   [junit4]   2> 1341827 INFO  (TEST-CustomCollectionTest.test-seed#[EDCAC41103F1DA18]) [n:127.0.0.1:40227_sc_%2Fp    ] o.a.s.c.c.SolrZkClient makePath: /overseer/collection-map-running
   [junit4]   2> 1341830 INFO  (TEST-CustomCollectionTest.test-seed#[EDCAC41103F1DA18]) [n:127.0.0.1:40227_sc_%2Fp    ] o.a.s.c.c.SolrZkClient makePath: /overseer/collection-map-completed
   [junit4]   2> 1341832 INFO  (TEST-CustomCollectionTest.test-seed#[EDCAC41103F1DA18]) [n:127.0.0.1:40227_sc_%2Fp    ] o.a.s.c.c.SolrZkClient makePath: /overseer/collection-map-failure
   [junit4]   2> 1341835 INFO  (TEST-CustomCollectionTest.test-seed#[EDCAC41103F1DA18]) [n:127.0.0.1:40227_sc_%2Fp    ] o.a.s.c.c.SolrZkClient makePath: /live_nodes
   [junit4]   2> 1341837 INFO  (TEST-CustomCollectionTest.test-seed#[EDCAC41103F1DA18]) [n:127.0.0.1:40227_sc_%2Fp    ] o.a.s.c.c.SolrZkClient makePath: /aliases.json
   [junit4]   2> 1341838 INFO  (TEST-CustomCollectionTest.test-seed#[EDCAC41103F1DA18]) [n:127.0.0.1:40227_sc_%2Fp    ] o.a.s.c.c.SolrZkClient makePath: /clusterstate.json
   [junit4]   2> 1341840 INFO  (TEST-CustomCollectionTest.test-seed#[EDCAC41103F1DA18]) [n:127.0.0.1:40227_sc_%2Fp    ] o.a.s.c.c.SolrZkClient makePath: /security.json
   [junit4]   2> 1341842 INFO  (TEST-CustomCollectionTest.test-seed#[EDCAC41103F1DA18]) [n:127.0.0.1:40227_sc_%2Fp    ] o.a.s.c.c.ZkStateReader Updating cluster state from ZooKeeper... 
   [junit4]   2> 1341843 INFO  (TEST-CustomCollectionTest.test-seed#[EDCAC41103F1DA18]) [n:127.0.0.1:40227_sc_%2Fp    ] o.a.s.c.c.ZkStateReader Updated live nodes from ZooKeeper... (0) -> (0)
   [junit4]   2> 1341846 INFO  (TEST-CustomCollectionTest.test-seed#[EDCAC41103F1DA18]) [n:127.0.0.1:40227_sc_%2Fp    ] o.a.s.c.c.SolrZkClient makePath: /overseer_elect
   [junit4]   2> 1341848 INFO  (TEST-CustomCollectionTest.test-seed#[EDCAC41103F1DA18]) [n:127.0.0.1:40227_sc_%2Fp    ] o.a.s.c.c.SolrZkClient makePath: /overseer_elect/election
   [junit4]   2> 1341850 INFO  (TEST-CustomCollectionTest.test-seed#[EDCAC41103F1DA18]) [n:127.0.0.1:40227_sc_%2Fp    ] o.a.s.c.Overseer Overseer (id=null) closing
   [junit4]   2> 1341851 INFO  (TEST-CustomCollectionTest.test-seed#[EDCAC41103F1DA18]) [n:127.0.0.1:40227_sc_%2Fp    ] o.a.s.c.LeaderElector Joined leadership election with path: /overseer_elect/election/95565626741817348-127.0.0.1:40227_sc_%2Fp-n_0000000000
   [junit4]   2> 1341851 INFO  (TEST-CustomCollectionTest.test-seed#[EDCAC41103F1DA18]) [n:127.0.0.1:40227_sc_%2Fp    ] o.a.s.c.OverseerElectionContext I am going to be the leader 127.0.0.1:40227_sc_%2Fp
   [junit4]   2> 1341851 INFO  (TEST-CustomCollectionTest.test-seed#[EDCAC41103F1DA18]) [n:127.0.0.1:40227_sc_%2Fp    ] o.a.s.c.c.SolrZkClient makePath: /overseer_elect/leader
   [junit4]   2> 1341853 INFO  (TEST-CustomCollectionTest.test-seed#[EDCAC41103F1DA18]) [n:127.0.0.1:40227_sc_%2Fp    ] o.a.s.c.Overseer Overseer (id=95565626741817348-127.0.0.1:40227_sc_%2Fp-n_0000000000) starting
   [junit4]   2> 1341856 INFO  (TEST-CustomCollectionTest.test-seed#[EDCAC41103F1DA18]) [n:127.0.0.1:40227_sc_%2Fp    ] o.a.s.c.c.SolrZkClient makePath: /overseer/queue-work
   [junit4]   2> 1341863 INFO  (TEST-CustomCollectionTest.test-seed#[EDCAC41103F1DA18]) [n:127.0.0.1:40227_sc_%2Fp    ] o.a.s.c.OverseerAutoReplicaFailoverThread Starting OverseerAutoReplicaFailoverThread autoReplicaFailoverWorkLoopDelay=10000 autoReplicaFailoverWaitAfterExpiration=10000 autoReplicaFailoverBadNodeExpiration=60000
   [junit4]   2> 1341864 INFO  (OverseerCollectionConfigSetProcessor-95565626741817348-127.0.0.1:40227_sc_%2Fp-n_0000000000) [n:127.0.0.1:40227_sc_%2Fp    ] o.a.s.c.OverseerTaskProcessor Process current queue of overseer operations
   [junit4]   2> 1341865 INFO  (OverseerStateUpdate-95565626741817348-127.0.0.1:40227_sc_%2Fp-n_0000000000) [n:127.0.0.1:40227_sc_%2Fp    ] o.a.s.c.Overseer Starting to work on the main queue
   [junit4]   2> 1341865 INFO  (TEST-CustomCollectionTest.test-seed#[EDCAC41103F1DA18]) [n:127.0.0.1:40227_sc_%2Fp    ] o.a.s.c.ZkController Register node as live in ZooKeeper:/live_nodes/127.0.0.1:40227_sc_%2Fp
   [junit4]   2> 1341866 INFO  (TEST-CustomCollectionTest.test-seed#[EDCAC41103F1DA18]) [n:127.0.0.1:40227_sc_%2Fp    ] o.a.s.c.c.SolrZkClient makePath: /live_nodes/127.0.0.1:40227_sc_%2Fp
   [junit4]   2> 1341869 INFO  (zkCallback-1510-thread-1-processing-n:127.0.0.1:40227_sc_%2Fp) [n:127.0.0.1:40227_sc_%2Fp    ] o.a.s.c.c.ZkStateReader A live node change: [WatchedEvent state:SyncConnected type:NodeChildrenChanged path:/live_nodes], has occurred - updating... (live nodes size: [0])
   [junit4]   2> 1341869 INFO  (OverseerStateUpdate-95565626741817348-127.0.0.1:40227_sc_%2Fp-n_0000000000) [n:127.0.0.1:40227_sc_%2Fp    ] o.a.s.c.c.ZkStateReader Updated live nodes from ZooKeeper... (0) -> (1)
   [junit4]   2> 1341870 INFO  (zkCallback-1510-thread-1-processing-n:127.0.0.1:40227_sc_%2Fp) [n:127.0.0.1:40227_sc_%2Fp    ] o.a.s.c.c.ZkStateReader Updated live nodes from ZooKeeper... (1) -> (1)
   [junit4]   2> 1341880 INFO  (TEST-CustomCollectionTest.test-seed#[EDCAC41103F1DA18]) [n:127.0.0.1:40227_sc_%2Fp    ] o.a.s.c.CoreContainer Security conf doesn't exist. Skipping setup for authorization module.
   [junit4]   2> 1341880 INFO  (TEST-CustomCollectionTest.test-seed#[EDCAC41103F1DA18]) [n:127.0.0.1:40227_sc_%2Fp    ] o.a.s.c.CoreContainer No authentication plugin used.
   [junit4]   2> 1341880 INFO  (TEST-CustomCollectionTest.test-seed#[EDCAC41103F1DA18]) [n:127.0.0.1:40227_sc_%2Fp    ] o.a.s.c.CorePropertiesLocator Looking for core definitions underneath /export/home/jenkins/workspace/Lucene-Solr-6.x-Solaris/solr/build/solr-core/test/J1/temp/solr.cloud.CustomCollectionTest_EDCAC41103F1DA18-001/control-001/cores
   [junit4]   2> 1341881 INFO  (TEST-CustomCollectionTest.test-seed#[EDCAC41103F1DA18]) [n:127.0.0.1:40227_sc_%2Fp    ] o.a.s.c.CoreDescriptor Created CoreDescriptor: {name=collection1, config=solrconfig.xml, transient=false, schema=schema.xml, loadOnStartup=true, configSetProperties=configsetprops.json, collection=control_collection, coreNodeName=, dataDir=data/, shard=}
   [junit4]   2> 1341881 INFO  (TEST-CustomCollectionTest.test-seed#[EDCAC41103F1DA18]) [n:127.0.0.1:40227_sc_%2Fp    ] o.a.s.c.CorePropertiesLocator Found core collection1 in /export/home/jenkins/workspace/Lucene-Solr-6.x-Solaris/solr/build/solr-core/test/J1/temp/solr.cloud.CustomCollectionTest_EDCAC41103F1DA18-001/control-001/cores/collection1
   [junit4]   2> 1341881 INFO  (TEST-CustomCollectionTest.test-seed#[EDCAC41103F1DA18]) [n:127.0.0.1:40227_sc_%2Fp    ] o.a.s.c.CorePropertiesLocator Found 1 core definitions
   [junit4]   2> 1341882 INFO  (TEST-CustomCollectionTest.test-seed#[EDCAC41103F1DA18]) [n:127.0.0.1:40227_sc_%2Fp    ] o.a.s.s.SolrDispatchFilter user.dir=/export/home/jenkins/workspace/Lucene-Solr-6.x-Solaris/solr/build/solr-core/test/J1
   [junit4]   2> 1341882 INFO  (TEST-CustomCollectionTest.test-seed#[EDCAC41103F1DA18]) [n:127.0.0.1:40227_sc_%2Fp    ] o.a.s.s.SolrDispatchFilter SolrDispatchFilter.init() done
   [junit4]   2> 1341883 INFO  (coreLoadExecutor-4380-thread-1-processing-n:127.0.0.1:40227_sc_%2Fp) [n:127.0.0.1:40227_sc_%2Fp c:control_collection   x:collection1] o.a.s.c.ZkController publishing state=down
   [junit4]   2> 1341884 INFO  (coreLoadExecutor-4380-thread-1-processing-n:127.0.0.1:40227_sc_%2Fp) [n:127.0.0.1:40227_sc_%2Fp c:control_collection   x:collection1] o.a.s.c.ZkController numShards not found on descriptor - reading it from system property
   [junit4]   2> 1341886 INFO  (OverseerStateUpdate-95565626741817348-127.0.0.1:40227_sc_%2Fp-n_0000000000) [n:127.0.0.1:40227_sc_%2Fp    ] o.a.s.c.Overseer processMessage: queueSize: 1, message = {
   [junit4]   2>   "core":"collection1",
   [junit4]   2>   "roles":null,
   [junit4]   2>   "base_url":"http://127.0.0.1:40227/sc_/p",
   [junit4]   2>   "node_name":"127.0.0.1:40227_sc_%2Fp",
   [junit4]   2>   "numShards":"1",
   [junit4]   2>   "state":"down",
   [junit4]   2>   "shard":null,
   [junit4]   2>   "collection":"control_collection",
   [junit4]   2>   "operation":"state"} current state version: 0
   [junit4]   2> 1341886 INFO  (coreLoadExecutor-4380-thread-1-processing-n:127.0.0.1:40227_sc_%2Fp) [n:127.0.0.1:40227_sc_%2Fp c:control_collection   x:collection1] o.a.s.c.ZkController look for our core node name
   [junit4]   2> 1341887 INFO  (OverseerStateUpdate-95565626741817348-127.0.0.1:40227_sc_%2Fp-n_0000000000) [n:127.0.0.1:40227_sc_%2Fp    ] o.a.s.c.o.ReplicaMutator Update state numShards=1 message={
   [junit4]   2>   "core":"collection1",
   [junit4]   2>   "roles":null,
   [junit4]   2>   "base_url":"http://127.0.0.1:40227/sc_/p",
   [junit4]   2>   "node_name":"127.0.0.1:40227_sc_%2Fp",
   [junit4]   2>   "numShards":"1",
   [junit4]   2>   "state":"down",
   [junit4]   2>   "shard":null,
   [junit4]   2>   "collection":"control_collection",
   [junit4]   2>   "operation":"state"}
   [junit4]   2> 1341887 INFO  (OverseerStateUpdate-95565626741817348-127.0.0.1:40227_sc_%2Fp-n_0000000000) [n:127.0.0.1:40227_sc_%2Fp    ] o.a.s.c.o.ClusterStateMutator building a new cName: control_collection
   [junit4]   2> 1341888 INFO  (OverseerStateUpdate-95565626741817348-127.0.0.1:40227_sc_%2Fp-n_0000000000) [n:127.0.0.1:40227_sc_%2Fp    ] o.a.s.c.o.ReplicaMutator Assigning new node to shard shard=shard1
   [junit4]   2> 1341890 INFO  (zkCallback-1510-thread-1-processing-n:127.0.0.1:40227_sc_%2Fp) [n:127.0.0.1:40227_sc_%2Fp    ] o.a.s.c.c.ZkStateReader A cluster state change: [WatchedEvent state:SyncConnected type:NodeDataChanged path:/clusterstate.json], has occurred - updating... (live nodes size: [1])
   [junit4]   2> 1342897 INFO  (coreLoadExecutor-4380-thread-1-processing-n:127.0.0.1:40227_sc_%2Fp) [n:127.0.0.1:40227_sc_%2Fp c:control_collection   x:collection1] o.a.s.c.ZkController waiting to find shard id in clusterstate for collection1
   [junit4]   2> 1342897 INFO  (coreLoadExecutor-4380-thread-1-processing-n:127.0.0.1:40227_sc_%2Fp) [n:127.0.0.1:40227_sc_%2Fp c:control_collection   x:collection1] o.a.s.c.ZkController Check for collection zkNode:control_collection
   [junit4]   2> 1342898 INFO  (coreLoadExecutor-4380-thread-1-processing-n:127.0.0.1:40227_sc_%2Fp) [n:127.0.0.1:40227_sc_%2Fp c:control_collection   x:collection1] o.a.s.c.ZkController Collection zkNode exists
   [junit4]   2> 1342898 INFO  (coreLoadExecutor-4380-thread-1-processing-n:127.0.0.1:40227_sc_%2Fp) [n:127.0.0.1:40227_sc_%2Fp c:control_collection   x:collection1] o.a.s.c.c.ZkStateReader Load collection config from: [/collections/control_collection]
   [junit4]   2> 1342899 INFO  (coreLoadExecutor-4380-thread-1-processing-n:127.0.0.1:40227_sc_%2Fp) [n:127.0.0.1:40227_sc_%2Fp c:control_collection   x:collection1] o.a.s.c.c.ZkStateReader path=[/collections/control_collection] [configName]=[conf1] specified config exists in ZooKeeper
   [junit4]   2> 1342899 INFO  (coreLoadExecutor-4380-thread-1-processing-n:127.0.0.1:40227_sc_%2Fp) [n:127.0.0.1:40227_sc_%2Fp c:control_collection   x:collection1] o.a.s.c.SolrResourceLoader new SolrResourceLoader for directory: '/export/home/jenkins/workspace/Lucene-Solr-6.x-Solaris/solr/build/solr-core/test/J1/temp/solr.cloud.CustomCollectionTest_EDCAC41103F1DA18-001/control-001/cores/collection1'
   [junit4]   2> 1342899 INFO  (coreLoadExecutor-4380-thread-1-processing-n:127.0.0.1:40227_sc_%2Fp) [n:127.0.0.1:40227_sc_%2Fp c:control_collection   x:collection1] o.a.s.c.SolrResourceLoader JNDI not configured for solr (NoInitialContextEx)
   [junit4]   2> 1342900 INFO  (coreLoadExecutor-4380-thread-1-processing-n:127.0.0.1:40227_sc_%2Fp) [n:127.0.0.1:40227_sc_%2Fp c:control_collection   x:collection1] o.a.s.c.SolrResourceLoader solr home defaulted to 'solr/' (could not find system property or JNDI)
   [junit4]   2> 1342902 INFO  (coreLoadExecutor-4380-thread-1-processing-n:127.0.0.1:40227_sc_%2Fp) [n:127.0.0.1:40227_sc_%2Fp c:control_collection   x:collection1] o.a.s.c.Config loaded config solrconfig.xml with version 0 
   [junit4]   2> 1342906 INFO  (coreLoadExecutor-4380-thread-1-processing-n:127.0.0.1:40227_sc_%2Fp) [n:127.0.0.1:40227_sc_%2Fp c:control_collection   x:collection1] o.a.s.c.SolrConfig current version of requestparams : -1
   [junit4]   2> 1342909 WARN  (coreLoadExecutor-4380-thread-1-processing-n:127.0.0.1:40227_sc_%2Fp) [n:127.0.0.1:40227_sc_%2Fp c:control_collection   x:collection1] o.a.s.c.Config Beginning with Solr 5.5, <mergePolicy> is deprecated, use <mergePolicyFactory> instead.
   [junit4]   2> 1342910 INFO  (coreLoadExecutor-4380-thread-1-processing-n:127.0.0.1:40227_sc_%2Fp) [n:127.0.0.1:40227_sc_%2Fp c:control_collection   x:collection1] o.a.s.c.SolrConfig Using Lucene MatchVersion: 6.1.0
   [junit4]   2> 1342917 INFO  (coreLoadExecutor-4380-thread-1-processing-n:127.0.0.1:40227_sc_%2Fp) [n:127.0.0.1:40227_sc_%2Fp c:control_collection   x:collection1] o.a.s.c.SolrConfig Loaded SolrConfig: solrconfig.xml
   [junit4]   2> 1342923 INFO  (coreLoadExecutor-4380-thread-1-processing-n:127.0.0.1:40227_sc_%2Fp) [n:127.0.0.1:40227_sc_%2Fp c:control_collection   x:collection1] o.a.s.s.IndexSchema [collection1] Schema name=test
   [junit4]   2> 1343008 INFO  (coreLoadExecutor-4380-thread-1-processing-n:127.0.0.1:40227_sc_%2Fp) [n:127.0.0.1:40227_sc_%2Fp c:control_collection   x:collection1] o.a.s.s.OpenExchangeRatesOrgProvider Initialized with rates=open-exchange-rates.json, refreshInterval=1440.
   [junit4]   2> 1343012 INFO  (coreLoadExecutor-4380-thread-1-processing-n:127.0.0.1:40227_sc_%2Fp) [n:127.0.0.1:40227_sc_%2Fp c:control_collection   x:collection1] o.a.s.s.IndexSchema default search field in schema is text
   [junit4]   2> 1343013 INFO  (coreLoadExecutor-4380-thread-1-processing-n:127.0.0.1:40227_sc_%2Fp) [n:127.0.0.1:40227_sc_%2Fp c:control_collection   x:collection1] o.a.s.s.IndexSchema unique key field: id
   [junit4]   2> 1343024 INFO  (coreLoadExecutor-4380-thread-1-processing-n:127.0.0.1:40227_sc_%2Fp) [n:127.0.0.1:40227_sc_%2Fp c:control_collection   x:collection1] o.a.s.s.FileExchangeRateProvider Reloading exchange rates from file currency.xml
   [junit4]   2> 1343026 INFO  (coreLoadExecutor-4380-thread-1-processing-n:127.0.0.1:40227_sc_%2Fp) [n:127.0.0.1:40227_sc_%2Fp c:control_collection   x:collection1] o.a.s.s.FileExchangeRateProvider Reloading exchange rates from file currency.xml
   [junit4]   2> 1343028 INFO  (coreLoadExecutor-4380-thread-1-processing-n:127.0.0.1:40227_sc_%2Fp) [n:127.0.0.1:40227_sc_%2Fp c:control_collection   x:collection1] o.a.s.s.OpenExchangeRatesOrgProvider Reloading exchange rates from open-exchange-rates.json
   [junit4]   2> 1343030 INFO  (coreLoadExecutor-4380-thread-1-processing-n:127.0.0.1:40227_sc_%2Fp) [n:127.0.0.1:40227_sc_%2Fp c:control_collection   x:collection1] o.a.s.s.OpenExchangeRatesOrgProvider Reloading exchange rates from open-exchange-rates.json
   [junit4]   2> 1343031 INFO  (coreLoadExecutor-4380-thread-1-processing-n:127.0.0.1:40227_sc_%2Fp) [n:127.0.0.1:40227_sc_%2Fp c:control_collection   x:collection1] o.a.s.c.ConfigSetProperties Did not find ConfigSet properties, assuming default properties: Can't find resource 'configsetprops.json' in classpath or '/configs/conf1', cwd=/export/home/jenkins/workspace/Lucene-Solr-6.x-Solaris/solr/build/solr-core/test/J1
   [junit4]   2> 1343031 INFO  (coreLoadExecutor-4380-thread-1-processing-n:127.0.0.1:40227_sc_%2Fp) [n:127.0.0.1:40227_sc_%2Fp c:control_collection   x:collection1] o.a.s.c.CoreContainer Creating SolrCore 'collection1' using configuration from collection control_collection
   [junit4]   2> 1343032 INFO  (coreLoadExecutor-4380-thread-1-processing-n:127.0.0.1:40227_sc_%2Fp) [n:127.0.0.1:40227_sc_%2Fp c:control_collection s:shard1 r:core_node1 x:collection1] o.a.s.c.SolrCore org.apache.solr.core.MockDirectoryFactory
   [junit4]   2> 1343032 INFO  (coreLoadExecutor-4380-thread-1-processing-n:127.0.0.1:40227_sc_%2Fp) [n:127.0.0.1:40227_sc_%2Fp c:control_collection s:shard1 r:core_node1 x:collection1] o.a.s.c.SolrCore [[collection1] ] Opening new SolrCore at [/export/home/jenkins/workspace/Lucene-Solr-6.x-Solaris/solr/build/solr-core/test/J1/temp/solr.cloud.CustomCollectionTest_EDCAC41103F1DA18-001/control-001/cores/collection1], dataDir=[/export/home/jenkins/workspace/Lucene-Solr-6.x-Solaris/solr/build/solr-core/test/J1/temp/solr.cloud.CustomCollectionTest_EDCAC41103F1DA18-001/control-001/cores/collection1/data/]
   [junit4]   2> 1343032 INFO  (coreLoadExecutor-4380-thread-1-processing-n:127.0.0.1:40227_sc_%2Fp) [n:127.0.0.1:40227_sc_%2Fp c:control_collection s:shard1 r:core_node1 x:collection1] o.a.s.c.JmxMonitoredMap JMX monitoring is enabled. Adding Solr mbeans to JMX Server: com.sun.jmx.mbeanserver.JmxMBeanServer@6309d588
   [junit4]   2> 1343032 INFO  (coreLoadExecutor-4380-thread-1-processing-n:127.0.0.1:40227_sc_%2Fp) [n:127.0.0.1:40227_sc_%2Fp c:control_collection s:shard1 r:core_node1 x:collection1] o.a.s.c.CachingDirectoryFactory return new directory for /export/home/jenkins/workspace/Lucene-Solr-6.x-Solaris/solr/build/solr-core/test/J1/temp/solr.cloud.CustomCollectionTest_EDCAC41103F1DA18-001/control-001/cores/collection1/data
   [junit4]   2> 1343032 INFO  (coreLoadExecutor-4380-thread-1-processing-n:127.0.0.1:40227_sc_%2Fp) [n:127.0.0.1:40227_sc_%2Fp c:control_collection s:shard1 r:core_node1 x:collection1] o.a.s.c.SolrCore New index directory detected: old=null new=/export/home/jenkins/workspace/Lucene-Solr-6.x-Solaris/solr/build/solr-core/test/J1/temp/solr.cloud.CustomCollectionTest_EDCAC41103F1DA18-001/control-001/cores/collection1/data/index/
   [junit4]   2> 1343032 WARN  (coreLoadExecutor-4380-thread-1-processing-n:127.0.0.1:40227_sc_%2Fp) [n:127.0.0.1:40227_sc_%2Fp c:control_collection s:shard1 r:core_node1 x:collection1] o.a.s.c.SolrCore [collection1] Solr index directory '/export/home/jenkins/workspace/Lucene-Solr-6.x-Solaris/solr/build/solr-core/test/J1/temp/solr.cloud.CustomCollectionTest_EDCAC41103F1DA18-001/control-001/cores/collection1/data/index' doesn't exist. Creating new index...
   [junit4]   2> 1343032 INFO  (coreLoadExecutor-4380-thread-1-processing-n:127.0.0.1:40227_sc_%2Fp) [n:127.0.0.1:40227_sc_%2Fp c:control_collection s:shard1 r:core_node1 x:collection1] o.a.s.c.CachingDirectoryFactory return new directory for /export/home/jenkins/workspace/Lucene-Solr-6.x-Solaris/solr/build/solr-core/test/J1/temp/solr.cloud.CustomCollectionTest_EDCAC41103F1DA18-001/control-001/cores/collection1/data/index
   [junit4]   2> 1343033 INFO  (coreLoadExecutor-4380-thread-1-processing-n:127.0.0.1:40227_sc_%2Fp) [n:127.0.0.1:40227_sc_%2Fp c:control_collection s:shard1 r:core_node1 x:collection1] o.a.s.u.RandomMergePolicy RandomMergePolicy wrapping class org.apache.lucene.index.TieredMergePolicy: [TieredMergePolicy: maxMergeAtOnce=44, maxMergeAtOnceExplicit=35, maxMergedSegmentMB=43.857421875, floorSegmentMB=1.48828125, forceMergeDeletesPctAllowed=4.277899210172601, segmentsPerTier=25.0, maxCFSSegmentSizeMB=8.796093022207999E12, noCFSRatio=1.0
   [junit4]   2> 1343033 INFO  (coreLoadExecutor-4380-thread-1-processing-n:127.0.0.1:40227_sc_%2Fp) [n:127.0.0.1:40227_sc_%2Fp c:control_collection s:shard1 r:core_node1 x:collection1] o.a.s.c.SolrDeletionPolicy SolrDeletionPolicy.onCommit: commits: num=1
   [junit4]   2> 	commit{dir=MockDirectoryWrapper(RAMDirectory@74174715 lockFactory=org.apache.lucene.store.SingleInstanceLockFactory@4abba5bc),segFN=segments_1,generation=1}
   [junit4]   2> 1343033 INFO  (coreLoadExecutor-4380-thread-1-processing-n:127.0.0.1:40227_sc_%2Fp) [n:127.0.0.1:40227_sc_%2Fp c:control_collection s:shard1 r:core_node1 x:collection1] o.a.s.c.SolrDeletionPolicy newest commit generation = 1
   [junit4]   2> 1343033 INFO  (OldIndexDirectoryCleanupThreadForCore-collection1) [n:127.0.0.1:40227_sc_%2Fp c:control_collection s:shard1 r:core_node1 x:collection1] o.a.s.c.SolrCore Looking for old index directories to cleanup for core collection1 in /export/home/jenkins/workspace/Lucene-Solr-6.x-Solaris/solr/build/solr-core/test/J1/temp/solr.cloud.CustomCollectionTest_EDCAC41103F1DA18-001/control-001/cores/collection1/data/
   [junit4]   2> 1343034 WARN  (OldIndexDirectoryCleanupThreadForCore-collection1) [n:127.0.0.1:40227_sc_%2Fp c:control_collection s:shard1 r:core_node1 x:collection1] o.a.s.c.DirectoryFactory /export/home/jenkins/workspace/Lucene-Solr-6.x-Solaris/solr/build/solr-core/test/J1/temp/solr.cloud.CustomCollectionTest_EDCAC41103F1DA18-001/control-001/cores/collection1/data/ does not point to a valid data directory; skipping clean-up of old index directories.
   [junit4]   2> 1343039 INFO  (coreLoadExecutor-4380-thread-1-processing-n:127.0.0.1:40227_sc_%2Fp) [n:127.0.0.1:40227_sc_%2Fp c:control_collection s:shard1 r:core_node1 x:collection1] o.a.s.u.p.UpdateRequestProcessorChain creating updateRequestProcessorChain "nodistrib"
   [junit4]   2> 1343039 INFO  (coreLoadExecutor-4380-thread-1-processing-n:127.0.0.1:40227_sc_%2Fp) [n:127.0.0.1:40227_sc_%2Fp c:control_collection s:shard1 r:core_node1 x:collection1] o.a.s.u.p.UpdateRequestProcessorChain creating updateRequestProcessorChain "dedupe"
   [junit4]   2> 1343040 INFO  (coreLoadExecutor-4380-thread-1-processing-n:127.0.0.1:40227_sc_%2Fp) [n:127.0.0.1:40227_sc_%2Fp c:control_collection s:shard1 r:core_node1 x:collection1] o.a.s.u.p.UpdateRequestProcessorChain inserting DistributedUpdateProcessorFactory into updateRequestProcessorChain "dedupe"
   [junit4]   2> 1343040 INFO  (coreLoadExecutor-4380-thread-1-processing-n:127.0.0.1:40227_sc_%2Fp) [n:127.0.0.1:40227_sc_%2Fp c:control_collection s:shard1 r:core_node1 x:collection1] o.a.s.u.p.UpdateRequestProcessorChain creating updateRequestProcessorChain "stored_sig"
   [junit4]   2> 1343040 INFO  (coreLoadExecutor-4380-thread-1-processing-n:127.0.0.1:40227_sc_%2Fp) [n:127.0.0.1:40227_sc_%2Fp c:control_collection s:shard1 r:core_node1 x:collection1] o.a.s.u.p.UpdateRequestProcessorChain inserting DistributedUpdateProcessorFactory into updateRequestProcessorChain "stored_sig"
   [junit4]   2> 1343040 INFO  (coreLoadExecutor-4380-thread-1-processing-n:127.0.0.1:40227_sc_%2Fp) [n:127.0.0.1:40227_sc_%2Fp c:control_collection s:shard1 r:core_node1 x:collection1] o.a.s.u.p.UpdateRequestProcessorChain creating updateRequestProcessorChain "distrib-dup-test-chain-explicit"
   [junit4]   2> 1343040 INFO  (coreLoadExecutor-4380-thread-1-processing-n:127.0.0.1:40227_sc_%2Fp) [n:127.0.0.1:40227_sc_%2Fp c:control_collection s:shard1 r:core_node1 x:collection1] o.a.s.u.p.UpdateRequestProcessorChain creating updateRequestProcessorChain "distrib-dup-test-chain-implicit"
   [junit4]   2> 1343040 INFO  (coreLoadExecutor-4380-thread-1-processing-n:127.0.0.1:40227_sc_%2Fp) [n:127.0.0.1:40227_sc_%2Fp c:control_collection s:shard1 r:core_node1 x:collection1] o.a.s.u.p.UpdateRequestProcessorChain inserting DistributedUpdateProcessorFactory into updateRequestProcessorChain "distrib-dup-test-chain-implicit"
   [junit4]   2> 1343040 INFO  (coreLoadExecutor-4380-thread-1-processing-n:127.0.0.1:40227_sc_%2Fp) [n:127.0.0.1:40227_sc_%2Fp c:control_collection s:shard1 r:core_node1 x:collection1] o.a.s.c.SolrCore no updateRequestProcessorChain defined as default, creating implicit default
   [junit4]   2> 1343040 WARN  (coreLoadExecutor-4380-thread-1-processing-n:127.0.0.1:40227_sc_%2Fp) [n:127.0.0.1:40227_sc_%2Fp c:control_collection s:shard1 r:core_node1 x:collection1] o.a.s.c.RequestHandlers INVALID paramSet a in requestHandler {type = requestHandler,name = /dump,class = DumpRequestHandler,args = {defaults={a=A,b=B}}}
   [junit4]   2> 1343042 INFO  (coreLoadExecutor-4380-thread-1-processing-n:127.0.0.1:40227_sc_%2Fp) [n:127.0.0.1:40227_sc_%2Fp c:control_collection s:shard1 r:core_node1 x:collection1] o.a.s.h.l.XMLLoader xsltCacheLifetimeSeconds=60
   [junit4]   2> 1343043 INFO  (coreLoadExecutor-4380-thread-1-processing-n:127.0.0.1:40227_sc_%2Fp) [n:127.0.0.1:40227_sc_%2Fp c:control_collection s:shard1 r:core_node1 x:collection1] o.a.s.h.l.XMLLoader xsltCacheLifetimeSeconds=60
   [junit4]   2> 1343044 INFO  (coreLoadExecutor-4380-thread-1-processing-n:127.0.0.1:40227_sc_%2Fp) [n:127.0.0.1:40227_sc_%2Fp c:control_collection s:shard1 r:core_node1 x:collection1] o.a.s.h.l.XMLLoader xsltCacheLifetimeSeconds=60
   [junit4]   2> 1343045 INFO  (coreLoadExecutor-4380-thread-1-processing-n:127.0.0.1:40227_sc_%2Fp) [n:127.0.0.1:40227_sc_%2Fp c:control_collection s:shard1 r:core_node1 x:collection1] o.a.s.h.l.XMLLoader xsltCacheLifetimeSeconds=60
   [junit4]   2> 1343048 INFO  (coreLoadExecutor-4380-thread-1-processing-n:127.0.0.1:40227_sc_%2Fp) [n:127.0.0.1:40227_sc_%2Fp c:control_collection s:shard1 r:core_node1 x:collection1] o.a.s.c.RequestHandlers Registered paths: /admin/mbeans,standard,/dump,/update/csv,/sql,/update/json/docs,/admin/luke,/export,/admin/segments,/get,/admin/system,/replication,/admin/properties,/config,/stream,/schema,/admin/plugins,/admin/logging,/update/json,/admin/ping,/admin/threads,/update,/admin/file
   [junit4]   2> 1343048 INFO  (coreLoadExecutor-4380-thread-1-processing-n:127.0.0.1:40227_sc_%2Fp) [n:127.0.0.1:40227_sc_%2Fp c:control_collection s:shard1 r:core_node1 x:collection1] o.a.s.c.SolrCore Using default statsCache cache: org.apache.solr.search.stats.LocalStatsCache
   [junit4]   2> 1343048 INFO  (coreLoadExecutor-4380-thread-1-processing-n:127.0.0.1:40227_sc_%2Fp) [n:127.0.0.1:40227_sc_%2Fp c:control_collection s:shard1 r:core_node1 x:collection1] o.a.s.u.UpdateHandler Using UpdateLog implementation: org.apache.solr.update.UpdateLog
   [junit4]   2> 1343048 INFO  (coreLoadExecutor-4380-thread-1-processing-n:127.0.0.1:40227_sc_%2Fp) [n:127.0.0.1:40227_sc_%2Fp c:control_collection s:shard1 r:core_node1 x:collection1] o.a.s.u.UpdateLog Initializing UpdateLog: dataDir= defaultSyncLevel=FLUSH numRecordsToKeep=100 maxNumLogsToKeep=10 numVersionBuckets=65536
   [junit4]   2> 1343050 INFO  (coreLoadExecutor-4380-thread-1-processing-n:127.0.0.1:40227_sc_%2Fp) [n:127.0.0.1:40227_sc_%2Fp c:control_collection s:shard1 r:core_node1 x:collection1] o.a.s.u.CommitTracker Hard AutoCommit: disabled
   [junit4]   2> 1343050 INFO  (coreLoadExecutor-4380-thread-1-processing-n:127.0.0.1:40227_sc_%2Fp) [n:127.0.0.1:40227_sc_%2Fp c:control_collection s:shard1 r:core_node1 x:collection1] o.a.s.u.CommitTracker Soft AutoCommit: disabled
   [junit4]   2> 1343050 INFO  (coreLoadExecutor-4380-thread-1-processing-n:127.0.0.1:40227_sc_%2Fp) [n:127.0.0.1:40227_sc_%2Fp c:control_collection s:shard1 r:core_node1 x:collection1] o.a.s.u.RandomMergePolicy RandomMergePolicy wrapping class org.apache.lucene.index.TieredMergePolicy: [TieredMergePolicy: maxMergeAtOnce=24, maxMergeAtOnceExplicit=12, maxMergedSegmentMB=19.1611328125, floorSegmentMB=0.3779296875, forceMergeDeletesPctAllowed=13.293287053960963, segmentsPerTier=29.0, maxCFSSegmentSizeMB=8.796093022207999E12, noCFSRatio=0.0
   [junit4]   2> 1343050 INFO  (coreLoadExecutor-4380-thread-1-processing-n:127.0.0.1:40227_sc_%2Fp) [n:127.0.0.1:40227_sc_%2Fp c:control_collection s:shard1 r:core_node1 x:collection1] o.a.s.c.SolrDeletionPolicy SolrDeletionPolicy.onInit: commits: num=1
   [junit4]   2> 	commit{dir=MockDirectoryWrapper(RAMDirectory@74174715 lockFactory=org.apache.lucene.store.SingleInstanceLockFactory@4abba5bc),segFN=segments_1,generation=1}
   [junit4]   2> 1343050 INFO  (coreLoadExecutor-4380-thread-1-processing-n:127.0.0.1:40227_sc_%2Fp) [n:127.0.0.1:40227_sc_%2Fp c:control_collection s:shard1 r:core_node1 x:collection1] o.a.s.c.SolrDeletionPolicy newest commit generation = 1
   [junit4]   2> 1343050 INFO  (coreLoadExecutor-4380-thread-1-processing-n:127.0.0.1:40227_sc_%2Fp) [n:127.0.0.1:40227_sc_%2Fp c:control_collection s:shard1 r:core_node1 x:collection1] o.a.s.s.SolrIndexSearcher Opening [Searcher@592b1d86[collection1] main]
   [junit4]   2> 1343051 INFO  (coreLoadExecutor-4380-thread-1-processing-n:127.0.0.1:40227_sc_%2Fp) [n:127.0.0.1:40227_sc_%2Fp c:control_collection s:shard1 r:core_node1 x:collection1] o.a.s.c.c.ZkStateReader Load collection config from: [/collections/control_collection]
   [junit4]   2> 1343052 INFO  (coreLoadExecutor-4380-thread-1-processing-n:127.0.0.1:40227_sc_%2Fp) [n:127.0.0.1:40227_sc_%2Fp c:control_collection s:shard1 r:core_node1 x:collection1] o.a.s.c.c.ZkStateReader path=[/collections/control_collection] [configName]=[conf1] specified config exists in ZooKeeper
   [junit4]   2> 1343052 INFO  (coreLoadExecutor-4380-thread-1-processing-n:127.0.0.1:40227_sc_%2Fp) [n:127.0.0.1:40227_sc_%2Fp c:control_collection s:shard1 r:core_node1 x:collection1] o.a.s.r.ManagedResourceStorage Setting up ZooKeeper-based storage for the RestManager with znodeBase: /configs/conf1
   [junit4]   2> 1343052 INFO  (coreLoadExecutor-4380-thread-1-processing-n:127.0.0.1:40227_sc_%2Fp) [n:127.0.0.1:40227_sc_%2Fp c:control_collection s:shard1 r:core_node1 x:collection1] o.a.s.r.ManagedResourceStorage Configured ZooKeeperStorageIO with znodeBase: /configs/conf1
   [junit4]   2> 1343052 INFO  (coreLoadExecutor-4380-thread-1-processing-n:127.0.0.1:40227_sc_%2Fp) [n:127.0.0.1:40227_sc_%2Fp c:control_collection s:shard1 r:core_node1 x:collection1] o.a.s.r.RestManager Initializing RestManager with initArgs: {}
   [junit4]   2> 1343052 INFO  (coreLoadExecutor-4380-thread-1-processing-n:127.0.0.1:40227_sc_%2Fp) [n:127.0.0.1:40227_sc_%2Fp c:control_collection s:shard1 r:core_node1 x:collection1] o.a.s.r.ManagedResourceStorage Reading _rest_managed.json using ZooKeeperStorageIO:path=/configs/conf1
   [junit4]   2> 1343053 INFO  (coreLoadExecutor-4380-thread-1-processing-n:127.0.0.1:40227_sc_%2Fp) [n:127.0.0.1:40227_sc_%2Fp c:control_collection s:shard1 r:core_node1 x:collection1] o.a.s.r.ManagedResourceStorage No data found for znode /configs/conf1/_rest_managed.json
   [junit4]   2> 1343053 INFO  (coreLoadExecutor-4380-thread-1-processing-n:127.0.0.1:40227_sc_%2Fp) [n:127.0.0.1:40227_sc_%2Fp c:control_collection s:shard1 r:core_node1 x:collection1] o.a.s.r.ManagedResourceStorage Loaded null at path _rest_managed.json using ZooKeeperStorageIO:path=/configs/conf1
   [junit4]   2> 1343053 INFO  (coreLoadExecutor-4380-thread-1-processing-n:127.0.0.1:40227_sc_%2Fp) [n:127.0.0.1:40227_sc_%2Fp c:control_collection s:shard1 r:core_node1 x:collection1] o.a.s.r.RestManager Initializing 0 registered ManagedResources
   [junit4]   2> 1343053 INFO  (coreLoadExecutor-4380-thread-1-processing-n:127.0.0.1:40227_sc_%2Fp) [n:127.0.0.1:40227_sc_%2Fp c:control_collection s:shard1 r:core_node1 x:collection1] o.a.s.h.ReplicationHandler Commits will be reserved for  10000
   [junit4]   2> 1343054 INFO  (searcherExecutor-4381-thread-1-processing-n:127.0.0.1:40227_sc_%2Fp x:collection1 s:shard1 c:control_collection r:core_node1) [n:127.0.0.1:40227_sc_%2Fp c:control_collection s:shard1 r:core_node1 x:collection1] o.a.s.c.SolrCore [collection1] Registered new searcher Searcher@592b1d86[collection1] main{ExitableDirectoryReader(UninvertingDirectoryReader())}
   [junit4]   2> 1343054 INFO  (coreLoadExecutor-4380-thread-1-processing-n:127.0.0.1:40227_sc_%2Fp) [n:127.0.0.1:40227_sc_%2Fp c:control_collection s:shard1 r:core_node1 x:collection1] o.a.s.u.UpdateLog Looking up max value of version field to seed version buckets
   [junit4]   2> 1343054 INFO  (coreLoadExecutor-4380-thread-1-processing-n:127.0.0.1:40227_sc_%2Fp) [n:127.0.0.1:40227_sc_%2Fp c:control_collection s:shard1 r:core_node1 x:collection1] o.a.s.u.VersionInfo Refreshing highest value of _version_ for 65536 version buckets from index
   [junit4]   2> 1343054 INFO  (coreLoadExecutor-4380-thread-1-processing-n:127.0.0.1:40227_sc_%2Fp) [n:127.0.0.1:40227_sc_%2Fp c:control_collection s:shard1 r:core_node1 x:collection1] o.a.s.u.VersionInfo No terms found for _version_, cannot seed version bucket highest value from index
   [junit4]   2> 1343054 INFO  (coreLoadExecutor-4380-thread-1-processing-n:127.0.0.1:40227_sc_%2Fp) [n:127.0.0.1:40227_sc_%2Fp c:control_collection s:shard1 r:core_node1 x:collection1] o.a.s.u.UpdateLog Could not find max version in index or recent updates, using new clock 1529050029472350208
   [junit4]   2> 1343056 INFO  (coreLoadExecutor-4380-thread-1-processing-n:127.0.0.1:40227_sc_%2Fp) [n:127.0.0.1:40227_sc_%2Fp c:control_collection s:shard1 r:core_node1 x:collection1] o.a.s.u.UpdateLog Took 1.0ms to seed version buckets with highest version 1529050029472350208
   [junit4]   2> 1343056 INFO  (coreLoadExecutor-4380-thread-1-processing-n:127.0.0.1:40227_sc_%2Fp) [n:127.0.0.1:40227_sc_%2Fp c:control_collection s:shard1 r:core_node1 x:collection1] o.a.s.c.ZkController watch zkdir /configs/conf1
   [junit4]   2> 1343056 INFO  (coreLoadExecutor-4380-thread-1-processing-n:127.0.0.1:40227_sc_%2Fp) [n:127.0.0.1:40227_sc_%2Fp c:control_collection s:shard1 r:core_node1 x:collection1] o.a.s.c.CoreContainer registering core: collection1
   [junit4]   2> 1343057 INFO  (coreZkRegister-4374-thread-1-processing-n:127.0.0.1:40227_sc_%2Fp x:collection1 s:shard1 c:control_collection r:core_node1) [n:127.0.0.1:40227_sc_%2Fp c:control_collection s:shard1 r:core_node1 x:collection1] o.a.s.c.ZkController Register replica - core:collection1 address:http://127.0.0.1:40227/sc_/p collection:control_collection shard:shard1
   [junit4]   2> 1343058 INFO  (coreZkRegister-4374-thread-1-processing-n:127.0.0.1:40227_sc_%2Fp x:collection1 s:shard1 c:control_collection r:core_node1) [n:127.0.0.1:40227_sc_%2Fp c:control_collection s:shard1 r:core_node1 x:collection1] o.a.s.c.c.SolrZkClient makePath: /collections/control_collection/leader_elect/shard1/election
   [junit4]   2> 1343062 INFO  (coreZkRegister-4374-thread-1-processing-n:127.0.0.1:40227_sc_%2Fp x:collection1 s:shard1 c:control_collection r:core_node1) [n:127.0.0.1:40227_sc_%2Fp c:control_collection s:shard1 r:core_node1 x:collection1] o.a.s.c.LeaderElector Joined leadership election with path: /collections/control_collection/leader_elect/shard1/election/95565626741817348-core_node1-n_0000000000
   [junit4]   2> 1343063 INFO  (coreZkRegister-4374-thread-1-processing-n:127.0.0.1:40227_sc_%2Fp x:collection1 s:shard1 c:control_collection r:core_node1) [n:127.0.0.1:40227_sc_%2Fp c:control_collection s:shard1 r:core_node1 x:collection1] o.a.s.c.ShardLeaderElectionContext Running the leader process for shard=shard1 and weAreReplacement=false and leaderVoteWait=180000
   [junit4]   2> 1343065 INFO  (coreZkRegister-4374-thread-1-processing-n:127.0.0.1:40227_sc_%2Fp x:collection1 s:shard1 c:control_collection r:core_node1) [n:127.0.0.1:40227_sc_%2Fp c:control_collection s:shard1 r:core_node1 x:collection1] o.a.s.c.ShardLeaderElectionContext Enough replicas found to continue.
   [junit4]   2> 1343065 INFO  (coreZkRegister-4374-thread-1-processing-n:127.0.0.1:40227_sc_%2Fp x:collection1 s:shard1 c:control_collection r:core_node1) [n:127.0.0.1:40227_sc_%2Fp c:control_collection s:shard1 r:core_node1 x:collection1] o.a.s.c.ShardLeaderElectionContext I may be the new leader - try and sync
   [junit4]   2> 1343066 INFO  (coreZkRegister-4374-thread-1-processing-n:127.0.0.1:40227_sc_%2Fp x:collection1 s:shard1 c:control_collection r:core_node1) [n:127.0.0.1:40227_sc_%2Fp c:control_collection s:shard1 r:core_node1 x:collection1] o.a.s.c.SyncStrategy Sync replicas to http://127.0.0.1:40227/sc_/p/collection1/
   [junit4]   2> 1343066 INFO  (coreZkRegister-4374-thread-1-processing-n:127.0.0.1:40227_sc_%2Fp x:collection1 s:shard1 c:control_collection r:core_node1) [n:127.0.0.1:40227_sc_%2Fp c:control_collection s:shard1 r:core_node1 x:collection1] o.a.s.c.SyncStrategy Sync Success - now sync replicas to me
   [junit4]   2> 1343066 INFO  (coreZkRegister-4374-thread-1-processing-n:127.0.0.1:40227_sc_%2Fp x:collection1 s:shard1 c:control_collection r:core_node1) [n:127.0.0.1:40227_sc_%2Fp c:control_collection s:shard1 r:core_node1 x:collection1] o.a.s.c.SyncStrategy http://127.0.0.1:40227/sc_/p/collection1/ has no replicas
   [junit4]   2> 1343066 INFO  (OverseerStateUpdate-95565626741817348-127.0.0.1:40227_sc_%2Fp-n_0000000000) [n:127.0.0.1:40227_sc_%2Fp    ] o.a.s.c.Overseer processMessage: queueSize: 1, message = {
   [junit4]   2>   "operation":"leader",
   [junit4]   2>   "shard":"shard1",
   [junit4]   2>   "collection":"control_collection"} current state version: 1
   [junit4]   2> 1343068 INFO  (coreZkRegister-4374-thread-1-processing-n:127.0.0.1:40227_sc_%2Fp x:collection1 s:shard1 c:control_collection r:core_node1) [n:127.0.0.1:40227_sc_%2Fp c:control_collection s:shard1 r:core_node1 x:collection1] o.a.s.c.c.SolrZkClient makePath: /collections/control_collection/leaders/shard1
   [junit4]   2> 1343071 INFO  (coreZkRegister-4374-thread-1-processing-n:127.0.0.1:40227_sc_%2Fp x:collection1 s:shard1 c:control_collection r:core_node1) [n:127.0.0.1:40227_sc_%2Fp c:control_collection s:shard1 r:core_node1 x:collection1] o.a.s.c.ShardLeaderElectionContextBase Creating leader registration node /collections/control_collection/leaders/shard1/leader after winning as /collections/control_collection/leader_elect/shard1/election/95565626741817348-core_node1-n_0000000000
   [junit4]   2> 1343073 INFO  (coreZkRegister-4374-thread-1-processing-n:127.0.0.1:40227_sc_%2Fp x:collection1 s:shard1 c:control_collection r:core_node1) [n:127.0.0.1:40227_sc_%2Fp c:control_collection s:shard1 r:core_node1 x:collection1] o.a.s.c.ShardLeaderElectionContext I am the new leader: http://127.0.0.1:40227/sc_/p/collection1/ shard1
   [junit4]   2> 1343074 INFO  (OverseerStateUpdate-95565626741817348-127.0.0.1:40227_sc_%2Fp-n_0000000000) [n:127.0.0.1:40227_sc_%2Fp    ] o.a.s.c.Overseer processMessage: queueSize: 1, message = {
   [junit4]   2>   "operation":"leader",
   [junit4]   2>   "shard":"shard1",
   [junit4]   2>   "collection":"control_collection",
   [junit4]   2>   "base_url":"http://127.0.0.1:40227/sc_/p",
   [junit4]   2>   "core":"collection1",
   [junit4]   2>   "state":"active"} current state version: 1
   [junit4]   2> 1343177 INFO  (zkCallback-1510-thread-1-processing-n:127.0.0.1:40227_sc_%2Fp) [n:127.0.0.1:40227_sc_%2Fp    ] o.a.s.c.c.ZkStateReader A cluster state change: [WatchedEvent state:SyncConnected type:NodeDataChanged path:/clusterstate.json], has occurred - updating... (live nodes size: [1])
   [junit4]   2> 1343225 INFO  (coreZkRegister-4374-thread-1-processing-n:127.0.0.1:40227_sc_%2Fp x:collection1 s:shard1 c:control_collection r:core_node1) [n:127.0.0.1:40227_sc_%2Fp c:control_collection s:shard1 r:core_node1 x:collection1] o.a.s.c.ZkController We are http://127.0.0.1:40227/sc_/p/collection1/ and leader is http://127.0.0.1:40227/sc_/p/collection1/
   [junit4]   2> 1343225 INFO  (coreZkRegister-4374-thread-1-processing-n:127.0.0.1:40227_sc_%2Fp x:collection1 s:shard1 c:control_collection r:core_node1) [n:127.0.0.1:40227_sc_%2Fp c:control_collection s:shard1 r:core_node1 x:collection1] o.a.s.c.ZkController No LogReplay needed for core=collection1 baseURL=http://127.0.0.1:40227/sc_/p
   [junit4]   2> 1343225 INFO  (coreZkRegister-4374-thread-1-processing-n:127.0.0.1:40227_sc_%2Fp x:collection1 s:shard1 c:control_collection r:core_node1) [n:127.0.0.1:40227_sc_%2Fp c:control_collection s:shard1 r:core_node1 x:collection1] o.a.s.c.ZkController I am the leader, no recovery necessary
   [junit4]   2> 1343225 INFO  (coreZkRegister-4374-thread-1-processing-n:127.0.0.1:40227_sc_%2Fp x:collection1 s:shard1 c:control_collection r:core_node1) [n:127.0.0.1:40227_sc_%2Fp c:control_collection s:shard1 r:core_node1 x:collection1] o.a.s.c.ZkController publishing state=active
   [junit4]   2> 1343225 INFO  (coreZkRegister-4374-thread-1-processing-n:127.0.0.1:40227_sc_%2Fp x:collection1 s:shard1 c:control_collection r:core_node1) [n:127.0.0.1:40227_sc_%2Fp c:control_collection s:shard1 r:core_node1 x:collection1] o.a.s.c.ZkController numShards not found on descriptor - reading it from system property
   [junit4]   2> 1343228 INFO  (OverseerStateUpdate-95565626741817348-127.0.0.1:40227_sc_%2Fp-n_0000000000) [n:127.0.0.1:40227_sc_%2Fp    ] o.a.s.c.Overseer processMessage: queueSize: 1, message = {
   [junit4]   2>   "core":"collection1",
   [junit4]   2>   "core_node_name":"core_node1",
   [junit4]   2>   "roles":null,
   [junit4]   2>   "base_url":"http://127.0.0.1:40227/sc_/p",
   [junit4]   2>   "node_name":"127.0.0.1:40227_sc_%2Fp",
   [junit4]   2>   "numShards":"1",
   [junit4]   2>   "state":"active",
   [junit4]   2>   "shard":"shard1",
   [junit4]   2>   "collection":"control_collection",
   [junit4]   2>   "operation":"state"} current state version: 2
   [junit4]   2> 1343228 INFO  (OverseerStateUpdate-95565626741817348-127.0.0.1:40227_sc_%2Fp-n_0000000000) [n:127.0.0.1:40227_sc_%2Fp    ] o.a.s.c.o.ReplicaMutator Update state numShards=1 message={
   [junit4]   2>   "core":"collection1",
   [junit4]   2>   "core_node_name":"core_node1",
   [junit4]   2>   "roles":null,
   [junit4]   2>   "base_url":"http://127.0.0.1:40227/sc_/p",
   [junit4]   2>   "node_name":"127.0.0.1:40227_sc_%2Fp",
   [junit4]   2>   "numShards":"1",
   [junit4]   2>   "state":"active",
   [junit4]   2>   "shard":"shard1",
   [junit4]   2>   "collection":"control_collection",
   [junit4]   2>   "operation":"state"}
   [junit4]   2> 1343332 INFO  (zkCallback-1510-thread-1-processing-n:127.0.0.1:40227_sc_%2Fp) [n:127.0.0.1:40227_sc_%2Fp    ] o.a.s.c.c.ZkStateReader A cluster state change: [WatchedEvent state:SyncConnected type:NodeDataChanged path:/clusterstate.json], has occurred - updating... (live nodes size: [1])
   [junit4]   2> 1343390 INFO  (TEST-CustomCollectionTest.test-seed#[EDCAC41103F1DA18]) [    ] o.a.s.c.c.SolrZkClient Using default ZkCredentialsProvider
   [junit4]   2> 1343391 INFO  (TEST-CustomCollectionTest.test-seed#[EDCAC41103F1DA18]) [    ] o.a.s.c.c.ConnectionManager Waiting for client to connect to ZooKeeper
   [junit4]   2> 1343392 INFO  (zkCallback-1512-thread-1) [    ] o.a.s.c.c.ConnectionManager Watcher org.apache.solr.common.cloud.ConnectionManager@1afcb712 name:ZooKeeperConnection Watcher:127.0.0.1:35285/solr got event WatchedEvent state:SyncConnected type:None path:null path:null type:None
   [junit4]   2> 1343392 INFO  (TEST-CustomCollectionTest.test-seed#[EDCAC41103F1DA18]) [    ] o.a.s.c.c.ConnectionManager Client is connected to ZooKeeper
   [junit4]   2> 1343392 INFO  (TEST-CustomCollectionTest.test-seed#[EDCAC41103F1DA18]) [    ] o.a.s.c.c.SolrZkClient Using default ZkACLProvider
   [junit4]   2> 1343392 INFO  (TEST-CustomCollectionTest.test-seed#[EDCAC41103F1DA18]) [    ] o.a.s.c.c.ZkStateReader Updating cluster state from ZooKeeper... 
   [junit4]   2> 1343394 INFO  (TEST-CustomCollectionTest.test-seed#[EDCAC41103F1DA18]) [    ] o.a.s.c.c.ZkStateReader Updated live nodes from ZooKeeper... (0) -> (1)
   [junit4]   2> 1343395 INFO  (TEST-CustomCollectionTest.test-seed#[EDCAC41103F1DA18]) [    ] o.a.s.c.ChaosMonkey monkey: init - expire sessions:false cause connection loss:false
   [junit4]   2> 1343395 INFO  (TEST-CustomCollectionTest.test-seed#[EDCAC41103F1DA18]) [    ] o.a.s.c.AbstractFullDistribZkTestBase Creating collection1 with stateFormat=2
   [junit4]   2> 1343395 INFO  (TEST-CustomCollectionTest.test-seed#[EDCAC41103F1DA18]) [    ] o.a.s.c.c.SolrZkClient Using default ZkCredentialsProvider
   [junit4]   2> 1343396 INFO  (TEST-CustomCollectionTest.test-seed#[EDCAC41103F1DA18]) [    ] o.a.s.c.c.ConnectionManager Waiting for client to connect to ZooKeeper
   [junit4]   2> 1343397 INFO  (zkCallback-1513-thread-1) [    ] o.a.s.c.c.ConnectionManager Watcher org.apache.solr.common.cloud.ConnectionManager@75dbd3bb name:ZooKeeperConnection Watcher:127.0.0.1:35285/solr got event WatchedEvent state:SyncConnected type:None path:null path:null type:None
   [junit4]   2> 1343398 INFO  (TEST-CustomCollectionTest.test-seed#[EDCAC41103F1DA18]) [    ] o.a.s.c.c.ConnectionManager Client is connected to ZooKeeper
   [junit4]   2> 1343398 INFO  (TEST-CustomCollectionTest.test-seed#[EDCAC41103F1DA18]) [    ] o.a.s.c.c.SolrZkClient Using default ZkACLProvider
   [junit4]   2> 1343402 INFO  (OverseerStateUpdate-95565626741817348-127.0.0.1:40227_sc_%2Fp-n_0000000000) [n:127.0.0.1:40227_sc_%2Fp    ] o.a.s.c.Overseer processMessage: queueSize: 1, message = {
   [junit4]   2>   "operation":"create",
   [junit4]   2>   "name":"collection1",
   [junit4]   2>   "numShards":"2",
   [junit4]   2>   "stateFormat":"2"} current state version: 3
   [junit4]   2> 1343402 INFO  (OverseerStateUpdate-95565626741817348-127.0.0.1:40227_sc_%2Fp-n_0000000000) [n:127.0.0.1:40227_sc_%2Fp    ] o.a.s.c.o.ClusterStateMutator building a new cName: collection1
   [junit4]   2> 1343505 INFO  (OverseerStateUpdate-95565626741817348-127.0.0.1:40227_sc_%2Fp-n_0000000000) [n:127.0.0.1:40227_sc_%2Fp    ] o.a.s.c.o.ZkStateWriter going to create_collection /collections/collection1/state.json
   [junit4]   2> 1343652 INFO  (TEST-CustomCollectionTest.test-seed#[EDCAC41103F1DA18]) [    ] o.a.s.SolrTestCaseJ4 Writing core.properties file to /export/home/jenkins/workspace/Lucene-Solr-6.x-Solaris/solr/build/solr-core/test/J1/temp/solr.cloud.CustomCollectionTest_EDCAC41103F1DA18-001/shard-1-001/cores/collection1
   [junit4]   2> 1343653 INFO  (TEST-CustomCollectionTest.test-seed#[EDCAC41103F1DA18]) [    ] o.a.s.c.AbstractFullDistribZkTestBase create jetty 1 in directory /export/home/jenkins/workspace/Lucene-Solr-6.x-Solaris/solr/build/solr-core/test/J1/temp/solr.cloud.CustomCollectionTest_EDCAC41103F1DA18-001/shard-1-001
   [junit4]   2> 1343654 INFO  (TEST-CustomCollectionTest.test-seed#[EDCAC41103F1DA18]) [    ] o.e.j.s.Server jetty-9.3.8.v20160314
   [junit4]   2> 1343655 INFO  (TEST-CustomCollectionTest.test-seed#[EDCAC41103F1DA18]) [    ] o.e.j.s.h.ContextHandler Started o.e.j.s.ServletContextHandler@71099a81{/sc_/p,null,AVAILABLE}
   [junit4]   2> 1343655 INFO  (TEST-CustomCollectionTest.test-seed#[EDCAC41103F1DA18]) [    ] o.e.j.s.ServerConnector Started ServerConnector@3d660987{HTTP/1.1,[http/1.1]}{127.0.0.1:47982}
   [junit4]   2> 1343656 INFO  (TEST-CustomCollectionTest.test-seed#[EDCAC41103F1DA18]) [    ] o.e.j.s.Server Started @1346522ms
   [junit4]   2> 1343656 INFO  (TEST-CustomCollectionTest.test-seed#[EDCAC41103F1DA18]) [    ] o.a.s.c.s.e.JettySolrRunner Jetty properties: {solr.data.dir=/export/home/jenkins/workspace/Lucene-Solr-6.x-Solaris/solr/build/solr-core/test/J1/temp/solr.cloud.CustomCollectionTest_EDCAC41103F1DA18-001/tempDir-001/jetty1, solrconfig=solrconfig.xml, hostContext=/sc_/p, hostPort=47982, coreRootDirectory=/export/home/jenkins/workspace/Lucene-Solr-6.x-Solaris/solr/build/solr-core/test/J1/temp/solr.cloud.CustomCollectionTest_EDCAC41103F1DA18-001/shard-1-001/cores}
   [junit4]   2> 1343657 INFO  (TEST-CustomCollectionTest.test-seed#[EDCAC41103F1DA18]) [    ] o.a.s.s.SolrDispatchFilter SolrDispatchFilter.init(): sun.misc.Launcher$AppClassLoader@6d06d69c
   [junit4]   2> 1343657 INFO  (TEST-CustomCollectionTest.test-seed#[EDCAC41103F1DA18]) [    ] o.a.s.c.SolrResourceLoader new SolrResourceLoader for directory: '/export/home/jenkins/workspace/Lucene-Solr-6.x-Solaris/solr/build/solr-core/test/J1/temp/solr.cloud.CustomCollectionTest_EDCAC41103F1DA18-001/shard-1-001'
   [junit4]   2> 1343657 INFO  (TEST-CustomCollectionTest.test-seed#[EDCAC41103F1DA18]) [    ] o.a.s.c.SolrResourceLoader JNDI not configured for solr (NoInitialContextEx)
   [junit4]   2> 1343657 INFO  (TEST-CustomCollectionTest.test-seed#[EDCAC41103F1DA18]) [    ] o.a.s.c.SolrResourceLoader solr home defaulted to 'solr/' (could not find system property or JNDI)
   [junit4]   2> 1343657 INFO  (TEST-CustomCollectionTest.test-seed#[EDCAC41103F1DA18]) [    ] o.a.s.c.c.SolrZkClient Using default ZkCredentialsProvider
   [junit4]   2> 1343658 INFO  (TEST-CustomCollectionTest.test-seed#[EDCAC41103F1DA18]) [    ] o.a.s.c.c.ConnectionManager Waiting for client to connect to ZooKeeper
   [junit4]   2> 1343659 INFO  (zkCallback-1514-thread-1) [    ] o.a.s.c.c.ConnectionManager Watcher org.apache.solr.common.cloud.ConnectionManager@6d7e0541 name:ZooKeeperConnection Watcher:127.0.0.1:35285/solr got event WatchedEvent state:SyncConnected type:None path:null path:null type:None
   [junit4]   2> 1343660 INFO  (TEST-CustomCollectionTest.test-seed#[EDCAC41103F1DA18]) [    ] o.a.s.c.c.ConnectionManager Client is connected to ZooKeeper
   [junit4]   2> 1343660 INFO  (TEST-CustomCollectionTest.test-seed#[EDCAC41103F1DA18]) [    ] o.a.s.c.c.SolrZkClient Using default ZkACLProvider
   [junit4]   2> 1343661 INFO  (TEST-CustomCollectionTest.test-seed#[EDCAC41103F1DA18]) [    ] o.a.s.s.SolrDispatchFilter Loading solr.xml from SolrHome (not found in ZooKeeper)
   [junit4]   2> 1343661 INFO  (TEST-CustomCollectionTest.test-seed#[EDCAC41103F1DA18]) [    ] o.a.s.c.SolrXmlConfig Loading container configuration from /export/home/jenkins/workspace/Lucene-Solr-6.x-Solaris/solr/build/solr-core/test/J1/temp/solr.cloud.CustomCollectionTest_EDCAC41103F1DA18-001/shard-1-001/solr.xml
   [junit4]   2> 1343666 INFO  (TEST-CustomCollectionTest.test-seed#[EDCAC41103F1DA18]) [    ] o.a.s.c.CorePropertiesLocator Config-defined core root directory: /export/home/jenkins/workspace/Lucene-Solr-6.x-Solaris/solr/build/solr-core/test/J1/temp/solr.cloud.CustomCollectionTest_EDCAC41103F1DA18-001/shard-1-001/cores
   [junit4]   2> 1343666 INFO  (TEST-CustomCollectionTest.test-seed#[EDCAC41103F1DA18]) [    ] o.a.s.c.CoreContainer New CoreContainer 1847227022
   [junit4]   2> 1343666 INFO  (TEST-CustomCollectionTest.test-seed#[EDCAC41103F1DA18]) [    ] o.a.s.c.CoreContainer Loading cores into CoreContainer [instanceDir=/export/home/jenkins/workspace/Lucene-Solr-6.x-Solaris/solr/build/solr-core/test/J1/temp/solr.cloud.CustomCollectionTest_EDCAC41103F1DA18-001/shard-1-001]
   [junit4]   2> 1343666 WARN  (TEST-CustomCollectionTest.test-seed#[EDCAC41103F1DA18]) [    ] o.a.s.c.CoreContainer Couldn't add files from /export/home/jenkins/workspace/Lucene-Solr-6.x-Solaris/solr/build/solr-core/test/J1/temp/solr.cloud.CustomCollectionTest_EDCAC41103F1DA18-001/shard-1-001/lib to classpath: /export/home/jenkins/workspace/Lucene-Solr-6.x-Solaris/solr/build/solr-core/test/J1/temp/solr.cloud.CustomCollectionTest_EDCAC41103F1DA18-001/shard-1-001/lib
   [junit4]   2> 1343666 INFO  (TEST-CustomCollectionTest.test-seed#[EDCAC41103F1DA18]) [    ] o.a.s.h.c.HttpShardHandlerFactory created with socketTimeout : 90000,urlScheme : ,connTimeout : 15000,maxConnectionsPerHost : 20,maxConnections : 10000,corePoolSize : 0,maximumPoolSize : 2147483647,maxThreadIdleTime : 5,sizeOfQueue : -1,fairnessPolicy : false,useRetries : false,
   [junit4]   2> 1343667 INFO  (TEST-CustomCollectionTest.test-seed#[EDCAC41103F1DA18]) [    ] o.a.s.u.UpdateShardHandler Creating UpdateShardHandler HTTP client with params: socketTimeout=340000&connTimeout=45000&retry=true
   [junit4]   2> 1343668 INFO  (TEST-CustomCollectionTest.test-seed#[EDCAC41103F1DA18]) [    ] o.a.s.l.LogWatcher SLF4J impl is org.slf4j.impl.Log4jLoggerFactory
   [junit4]   2> 1343668 INFO  (TEST-CustomCollectionTest.test-seed#[EDCAC41103F1DA18]) [    ] o.a.s.l.LogWatcher Registering Log Listener [Log4j (org.slf4j.impl.Log4jLoggerFactory)]
   [junit4]   2> 1343668 INFO  (TEST-CustomCollectionTest.test-seed#[EDCAC41103F1DA18]) [    ] o.a.s.c.ZkContainer Zookeeper client=127.0.0.1:35285/solr
   [junit4]   2> 1343668 INFO  (TEST-CustomCollectionTest.test-seed#[EDCAC41103F1DA18]) [    ] o.a.s.c.ZkController zkHost includes chroot
   [junit4]   2> 1343668 INFO  (TEST-CustomCollectionTest.test-seed#[EDCAC41103F1DA18]) [    ] o.a.s.c.c.SolrZkClient Using default ZkCredentialsProvider
   [junit4]   2> 1343668 INFO  (TEST-CustomCollectionTest.test-seed#[EDCAC41103F1DA18]) [    ] o.a.s.c.c.ConnectionManager Waiting for client to connect to ZooKeeper
   [junit4]   2> 1343670 INFO  (zkCallback-1517-thread-1) [    ] o.a.s.c.c.ConnectionManager Watcher org.apache.solr.common.cloud.ConnectionManager@515ae34c name:ZooKeeperConnection Watcher:127.0.0.1:35285 got event WatchedEvent state:SyncConnected type:None path:null path:null type:None
   [junit4]   2> 1343670 INFO  (TEST-CustomCollectionTest.test-seed#[EDCAC41103F1DA18]) [    ] o.a.s.c.c.ConnectionManager Client is connected to ZooKeeper
   [junit4]   2> 1343670 INFO  (TEST-CustomCollectionTest.test-seed#[EDCAC41103F1DA18]) [    ] o.a.s.c.c.SolrZkClient Using default ZkACLProvider
   [junit4]   2> 1343672 INFO  (TEST-CustomCollectionTest.test-seed#[EDCAC41103F1DA18]) [n:127.0.0.1:47982_sc_%2Fp    ] o.a.s.c.c.ConnectionManager Waiting for client to connect to ZooKeeper
   [junit4]   2> 1343674 INFO  (zkCallback-1518-thread-1-processing-n:127.0.0.1:47982_sc_%2Fp) [n:127.0.0.1:47982_sc_%2Fp    ] o.a.s.c.c.ConnectionManager Watcher org.apache.solr.common.cloud.ConnectionManager@53e90bcf name:ZooKeeperConnection Watcher:127.0.0.1:35285/solr got event WatchedEvent state:SyncConnected type:None path:null path:null type:None
   [junit4]   2> 1343674 INFO  (TEST-CustomCollectionTest.test-seed#[EDCAC41103F1DA18]) [n:127.0.0.1:47982_sc_%2Fp    ] o.a.s.c.c.ConnectionManager Client is connected to ZooKeeper
   [junit4]   2> 1343683 INFO  (TEST-CustomCollectionTest.test-seed#[EDCAC41103F1DA18]) [n:127.0.0.1:47982_sc_%2Fp    ] o.a.s.c.c.ZkStateReader Updating cluster state from ZooKeeper... 
   [junit4]   2> 1343685 INFO  (TEST-CustomCollectionTest.test-seed#[EDCAC41103F1DA18]) [n:127.0.0.1:47982_sc_%2Fp    ] o.a.s.c.c.ZkStateReader Updated live nodes from ZooKeeper... (0) -> (1)
   [junit4]   2> 1343688 INFO  (TEST-CustomCollectionTest.test-seed#[EDCAC41103F1DA18]) [n:127.0.0.1:47982_sc_%2Fp    ] o.a.s.c.Overseer Overseer (id=null) closing
   [junit4]   2> 1343688 INFO  (TEST-CustomCollectionTest.test-seed#[EDCAC41103F1DA18]) [n:127.0.0.1:47982_sc_%2Fp    ] o.a.s.c.LeaderElector Joined leadership election with path: /overseer_elect/election/95565626741817353-127.0.0.1:47982_sc_%2Fp-n_0000000001
   [junit4]   2> 1343690 INFO  (TEST-CustomCollectionTest.test-seed#[EDCAC41103F1DA18]) [n:127.0.0.1:47982_sc_%2Fp    ] o.a.s.c.LeaderElector Watching path /overseer_elect/election/95565626741817348-127.0.0.1:40227_sc_%2Fp-n_0000000000 to know if I could be the leader
   [junit4]   2> 1343690 INFO  (TEST-CustomCollectionTest.test-seed#[EDCAC41103F1DA18]) [n:127.0.0.1:47982_sc_%2Fp    ] o.a.s.c.ZkController Publish node=127.0.0.1:47982_sc_%2Fp as DOWN
   [junit4]   2> 1343692 INFO  (OverseerStateUpdate-95565626741817348-127.0.0.1:40227_sc_%2Fp-n_0000000000) [n:127.0.0.1:40227_sc_%2Fp    ] o.a.s.c.Overseer processMessage: queueSize: 1, message = {
   [junit4]   2>   "operation":"downnode",
   [junit4]   2>   "node_name":"127.0.0.1:47982_sc_%2Fp"} current state version: 3
   [junit4]   2> 1343693 INFO  (OverseerStateUpdate-95565626741817348-127.0.0.1:40227_sc_%2Fp-n_0000000000) [n:127.0.0.1:40227_sc_%2Fp    ] o.a.s.c.o.NodeMutator DownNode state invoked for node: 127.0.0.1:47982_sc_%2Fp
   [junit4]   2> 1343694 INFO  (OverseerStateUpdate-95565626741817348-127.0.0.1:40227_sc_%2Fp-n_0000000000) [n:127.0.0.1:40227_sc_%2Fp    ] o.a.s.c.o.ZkStateWriter going to update_collection /collections/collection1/state.json version: 0
   [junit4]   2> 1343801 INFO  (zkCallback-1510-thread-2-processing-n:127.0.0.1:40227_sc_%2Fp) [n:127.0.0.1:40227_sc_%2Fp    ] o.a.s.c.c.ZkStateReader A cluster state change: [WatchedEvent state:SyncConnected type:NodeDataChanged path:/clusterstate.json], has occurred - updating... (live nodes size: [1])
   [junit4]   2> 1343801 INFO  (zkCallback-1512-thread-1) [    ] o.a.s.c.c.ZkStateReader A cluster state change: [WatchedEvent state:SyncConnected type:NodeDataChanged path:/clusterstate.json], has occurred - updating... (live nodes size: [1])
   [junit4]   2> 1343802 INFO  (zkCallback-1518-thread-1-processing-n:127.0.0.1:47982_sc_%2Fp) [n:127.0.0.1:47982_sc_%2Fp    ] o.a.s.c.c.ZkStateReader A cluster state change: [WatchedEvent state:SyncConnected type:NodeDataChanged path:/clusterstate.json], has occurred - updating... (live nodes size: [1])
   [junit4]   2> 1344694 INFO  (TEST-CustomCollectionTest.test-seed#[EDCAC41103F1DA18]) [n:127.0.0.1:47982_sc_%2Fp    ] o.a.s.c.ZkController Register node as live in ZooKeeper:/live_nodes/127.0.0.1:47982_sc_%2Fp
   [junit4]   2> 1344695 INFO  (TEST-CustomCollectionTest.test-seed#[EDCAC41103F1DA18]) [n:127.0.0.1:47982_sc_%2Fp    ] o.a.s.c.c.SolrZkClient makePath: /live_nodes/127.0.0.1:47982_sc_%2Fp
   [junit4]   2> 1344697 INFO  (zkCallback-1512-thread-1) [    ] o.a.s.c.c.ZkStateReader A live node change: [WatchedEvent state:SyncConnected type:NodeChildrenChanged path:/live_nodes], has occurred - updating... (live nodes size: [1])
   [junit4]   2> 1344697 INFO  (zkCallback-1512-thread-1) [    ] o.a.s.c.c.ZkStateReader Updated live nodes from ZooKeeper... (1) -> (2)
   [junit4]   2> 1344701 INFO  (zkCallback-1510-thread-2-processing-n:127.0.0.1:40227_sc_%2Fp) [n:127.0.0.1:40227_sc_%2Fp    ] o.a.s.c.c.ZkStateReader A live node change: [WatchedEvent state:SyncConnected type:NodeChildrenChanged path:/live_nodes], has occurred - updating... (live nodes size: [1])
   [junit4]   2> 1344717 INFO  (zkCallback-1510-thread-2-processing-n:127.0.0.1:40227_sc_%2Fp) [n:127.0.0.1:40227_sc_%2Fp    ] o.a.s.c.c.ZkStateReader Updated live nodes from ZooKeeper... (1) -> (2)
   [junit4]   2> 1344737 INFO  (zkCallback-1518-thread-1-processing-n:127.0.0.1:47982_sc_%2Fp) [n:127.0.0.1:47982_sc_%2Fp    ] o.a.s.c.c.ZkStateReader A live node change: [WatchedEvent state:SyncConnected type:NodeChildrenChanged path:/live_nodes], has occurred - updating... (live nodes size: [1])
   [junit4]   2> 1344737 INFO  (zkCallback-1518-thread-1-processing-n:127.0.0.1:47982_sc_%2Fp) [n:127.0.0.1:47982_sc_%2Fp    ] o.a.s.c.c.ZkStateReader Updated live nodes from ZooKeeper... (1) -> (2)
   [junit4]   2> 1344740 INFO  (TEST-CustomCollectionTest.test-seed#[EDCAC41103F1DA18]) [n:127.0.0.1:47982_sc_%2Fp    ] o.a.s.c.CoreContainer Security conf doesn't exist. Skipping setup for authorization module.
   [junit4]   2> 1344740 INFO  (TEST-CustomCollectionTest.test-seed#[EDCAC41103F1DA18]) [n:127.0.0.1:47982_sc_%2Fp    ] o.a.s.c.CoreContainer No authentication plugin used.
   [junit4]   2> 1344741 INFO  (TEST-CustomCollectionTest.test-seed#[EDCAC41103F1DA18]) [n:127.0.0.1:47982_sc_%2Fp    ] o.a.s.c.CorePropertiesLocator Looking for core definitions underneath /export/home/jenkins/workspace/Lucene-Solr-6.x-Solaris/solr/build/solr-core/test/J1/temp/solr.cloud.CustomCollectionTest_EDCAC41103F1DA18-001/shard-1-001/cores
   [junit4]   2> 1344742 INFO  (TEST-CustomCollectionTest.test-seed#[EDCAC41103F1DA18]) [n:127.0.0.1:47982_sc_%2Fp    ] o.a.s.c.CoreDescriptor Created CoreDescriptor: {name=collection1, config=solrconfig.xml, transient=false, schema=schema.xml, loadOnStartup=true, configSetProperties=configsetprops.json, collection=collection1, coreNodeName=, dataDir=data/, shard=}
   [junit4]   2> 1344742 INFO  (TEST-CustomCollectionTest.test-seed#[EDCAC41103F1DA18]) [n:127.0.0.1:47982_sc_%2Fp    ] o.a.s.c.CorePropertiesLocator Found core collection1 in /export/home/jenkins/workspace/Lucene-Solr-6.x-Solaris/solr/build/solr-core/test/J1/temp/solr.cloud.CustomCollectionTest_EDCAC41103F1DA18-001/shard-1-001/cores/collection1
   [junit4]   2> 1344742 INFO  (TEST-CustomCollectionTest.test-seed#[EDCAC41103F1DA18]) [n:127.0.0.1:47982_sc_%2Fp    ] o.a.s.c.CorePropertiesLocator Found 1 core definitions
   [junit4]   2> 1344743 INFO  (coreLoadExecutor-4391-thread-1-processing-n:127.0.0.1:47982_sc_%2Fp) [n:127.0.0.1:47982_sc_%2Fp c:collection1   x:collection1] o.a.s.c.ZkController publishing state=down
   [junit4]   2> 1344743 INFO  (coreLoadExecutor-4391-thread-1-processing-n:127.0.0.1:47982_sc_%2Fp) [n:127.0.0.1:47982_sc_%2Fp c:collection1   x:collection1] o.a.s.c.ZkController numShards not found on descriptor - reading it from system property
   [junit4]   2> 1344744 INFO  (TEST-CustomCollectionTest.test-seed#[EDCAC41103F1DA18]) [n:127.0.0.1:47982_sc_%2Fp    ] o.a.s.s.SolrDispatchFilter user.dir=/export/home/jenkins/workspace/Lucene-Solr-6.x-Solaris/solr/build/solr-core/test/J1
   [junit4]   2> 1344744 INFO  (TEST-CustomCollectionTest.test-seed#[EDCAC41103F1DA18]) [n:127.0.0.1:47982_sc_%2Fp    ] o.a.s.s.SolrDispatchFilter SolrDispatchFilter.init() done
   [junit4]   2> 1344745 INFO  (coreLoadExecutor-4391-thread-1-processing-n:127.0.0.1:47982_sc_%2Fp) [n:127.0.0.1:47982_sc_%2Fp c:collection1   x:collection1] o.a.s.c.ZkController Registering watch for collection collection1
   [junit4]   2> 1344745 INFO  (coreLoadExecutor-4391-thread-1-processing-n:127.0.0.1:47982_sc_%2Fp) [n:127.0.0.1:47982_sc_%2Fp c:collection1   x:collection1] o.a.s.c.c.ZkStateReader addZkWatch [collection1]
   [junit4]   2> 1344746 INFO  (coreLoadExecutor-4391-thread-1-processing-n:127.0.0.1:47982_sc_%2Fp) [n:127.0.0.1:47982_sc_%2Fp c:collection1   x:collection1] o.a.s.c.c.ZkStateReader Add data for [collection1] ver [1]
   [junit4]   2> 1344746 INFO  (coreLoadExecutor-4391-thread-1-processing-n:127.0.0.1:47982_sc_%2Fp) [n:127.0.0.1:47982_sc_%2Fp c:collection1   x:collection1] o.a.s.c.ZkController look for our core node name
   [junit4]   2> 1344747 INFO  (OverseerStateUpdate-95565626741817348-127.0.0.1:40227_sc_%2Fp-n_0000000000) [n:127.0.0.1:40227_sc_%2Fp    ] o.a.s.c.Overseer processMessage: queueSize: 1, message = {
   [junit4]   2>   "core":"collection1",
   [junit4]   2>   "roles":null,
   [junit4]   2>   "base_url":"http://127.0.0.1:47982/sc_/p",
   [junit4]   2>   "node_name":"127.0.0.1:47982_sc_%2Fp",
   [junit4]   2>   "numShards":"2",
   [junit4]   2>   "state":"down",
   [junit4]   2>   "shard":null,
   [junit4]   2>   "collection":"collection1",
   [junit4]   2>   "operation":"state"} current state version: 4
   [junit4]   2> 1344747 INFO  (OverseerStateUpdate-95565626741817348-127.0.0.1:40227_sc_%2Fp-n_0000000000) [n:127.0.0.1:40227_sc_%2Fp    ] o.a.s.c.o.ReplicaMutator Update state numShards=2 message={
   [junit4]   2>   "core":"collection1",
   [junit4]   2>   "roles":null,
   [junit4]   2>   "base_url":"http://127.0.0.1:47982/sc_/p",
   [junit4]   2>   "node_name":"127.0.0.1:47982_sc_%2Fp",
   [junit4]   2>   "numShards":"2",
   [junit4]   2>   "state":"down",
   [junit4]   2>   "shard":null,
   [junit4]   2>   "collection":"collection1",
   [junit4]   2>   "operation":"state"}
   [junit4]   2> 1344747 INFO  (OverseerStateUpdate-95565626741817348-127.0.0.1:40227_sc_%2Fp-n_0000000000) [n:127.0.0.1:40227_sc_%2Fp    ] o.a.s.c.o.ReplicaMutator Collection already exists with numShards=2
   [junit4]   2> 1344747 INFO  (OverseerStateUpdate-95565626741817348-127.0.0.1:40227_sc_%2Fp-n_0000000000) [n:127.0.0.1:40227_sc_%2Fp    ] o.a.s.c.o.ReplicaMutator Assigning new node to shard shard=shard2
   [junit4]   2> 1344850 INFO  (OverseerStateUpdate-95565626741817348-127.0.0.1:40227_sc_%2Fp-n_0000000000) [n:127.0.0.1:40227_sc_%2Fp    ] o.a.s.c.o.ZkStateWriter going to update_collection /collections/collection1/state.json version: 1
   [junit4]   2> 1344852 INFO  (zkCallback-1518-thread-1-processing-n:127.0.0.1:47982_sc_%2Fp) [n:127.0.0.1:47982_sc_%2Fp    ] o.a.s.c.c.ZkStateReader A cluster state change: [WatchedEvent state:SyncConnected type:NodeDataChanged path:/collections/collection1/state.json] for collection [collection1] has occurred - updating... (live nodes size: [2])
   [junit4]   2> 1344852 INFO  (zkCallback-1518-thread-1-processing-n:127.0.0.1:47982_sc_%2Fp) [n:127.0.0.1:47982_sc_%2Fp    ] o.a.s.c.c.ZkStateReader Updating data for [collection1] from [1] to [2]
   [junit4]   2> 1345747 INFO  (coreLoadExecutor-4391-thread-1-processing-n:127.0.0.1:47982_sc_%2Fp) [n:127.0.0.1:47982_sc_%2Fp c:collection1   x:collection1] o.a.s.c.ZkController waiting to find shard id in clusterstate for collection1
   [junit4]   2> 1345747 INFO  (coreLoadExecutor-4391-thread-1-processing-n:127.0.0.1:47982_sc_%2Fp) [n:127.0.0.1:47982_sc_%2Fp c:collection1   x:collection1] o.a.s.c.ZkController Check for collection zkNode:collection1
   [junit4]   2> 1345747 INFO  (coreLoadExecutor-4391-thread-1-processing-n:127.0.0.1:47982_sc_%2Fp) [n:127.0.0.1:47982_sc_%2Fp c:collection1   x:collection1] o.a.s.c.ZkController Collection zkNode exists
   [junit4]   2> 1345747 INFO  (coreLoadExecutor-4391-thread-1-processing-n:127.0.0.1:47982_sc_%2Fp) [n:127.0.0.1:47982_sc_%2Fp c:collection1   x:collection1] o.a.s.c.c.ZkStateReader Load collection config from: [/collections/collection1]
   [junit4]   2> 1345748 INFO  (coreLoadExecutor-4391-thread-1-processing-n:127.0.0.1:47982_sc_%2Fp) [n:127.0.0.1:47982_sc_%2Fp c:collection1   x:collection1] o.a.s.c.c.ZkStateReader path=[/collections/collection1] [configName]=[conf1] specified config exists in ZooKeeper
   [junit4]   2> 1345748 INFO  (coreLoadExecutor-4391-thread-1-processing-n:127.0.0.1:47982_sc_%2Fp) [n:127.0.0.1:47982_sc_%2Fp c:collection1   x:collection1] o.a.s.c.SolrResourceLoader new SolrResourceLoader for directory: '/export/home/jenkins/workspace/Lucene-Solr-6.x-Solaris/solr/build/solr-core/test/J1/temp/solr.cloud.CustomCollectionTest_EDCAC41103F1DA18-001/shard-1-001/cores/collection1'
   [junit4]   2> 1345749 INFO  (coreLoadExecutor-4391-thread-1-processing-n:127.0.0.1:47982_sc_%2Fp) [n:127.0.0.1:47982_sc_%2Fp c:collection1   x:collection1] o.a.s.c.SolrResourceLoader JNDI not configured for solr (NoInitialContextEx)
   [junit4]   2> 1345749 INFO  (coreLoadExecutor-4391-thread-1-processing-n:127.0.0.1:47982_sc_%2Fp) [n:127.0.0.1:47982_sc_%2Fp c:collection1   x:collection1] o.a.s.c.SolrResourceLoader solr home defaulted to 'solr/' (could not find system property or JNDI)
   [junit4]   2> 1345750 INFO  (coreLoadExecutor-4391-thread-1-processing-n:127.0.0.1:47982_sc_%2Fp) [n:127.0.0.1:47982_sc_%2Fp c:collection1   x:collection1] o.a.s.c.Config loaded config solrconfig.xml with version 0 
   [junit4]   2> 1345756 INFO  (coreLoadExecutor-4391-thread-1-processing-n:127.0.0.1:47982_sc_%2Fp) [n:127.0.0.1:47982_sc_%2Fp c:collection1   x:collection1] o.a.s.c.SolrConfig current version of requestparams : -1
   [junit4]   2> 1345758 WARN  (coreLoadExecutor-4391-thread-1-processing-n:127.0.0.1:47982_sc_%2Fp) [n:127.0.0.1:47982_sc_%2Fp c:collection1   x:collection1] o.a.s.c.Config Beginning with Solr 5.5, <mergePolicy> is deprecated, use <mergePolicyFactory> instead.
   [junit4]   2> 1345759 INFO  (coreLoadExecutor-4391-thread-1-processing-n:127.0.0.1:47982_sc_%2Fp) [n:127.0.0.1:47982_sc_%2Fp c:collection1   x:collection1] o.a.s.c.SolrConfig Using Lucene MatchVersion: 6.1.0
   [junit4]   2> 1345766 INFO  (coreLoadExecutor-4391-thread-1-processing-n:127.0.0.1:47982_sc_%2Fp) [n:127.0.0.1:47982_sc_%2Fp c:collection1   x:collection1] o.a.s.c.SolrConfig Loaded SolrConfig: solrconfig.xml
   [junit4]   2> 1345791 INFO  (coreLoadExecutor-4391-thread-1-processing-n:127.0.0.1:47982_sc_%2Fp) [n:127.0.0.1:47982_sc_%2Fp c:collection1   x:collection1] o.a.s.s.IndexSchema [collection1] Schema name=test
   [junit4]   2> 1345852 INFO  (coreLoadExecutor-4391-thread-1-processing-n:127.0.0.1:47982_sc_%2Fp) [n:127.0.0.1:47982_sc_%2Fp c:collection1   x:collection1] o.a.s.s.OpenExchangeRatesOrgProvider Initialized with rates=open-exchange-rates.json, refreshInterval=1440.
   [junit4]   2> 1345857 INFO  (coreLoadExecutor-4391-thread-1-processing-n:127.0.0.1:47982_sc_%2Fp) [n:127.0.0.1:47982_sc_%2Fp c:collection1   x:collection1] o.a.s.s.IndexSchema default search field in schema is text
   [junit4]   2> 1345858 INFO 

[...truncated too long message...]

lection/95565626741817362-core_node4-n_0000000002
   [junit4]   2> 	2	/solr/collections/implicitcoll1/leader_elect/c/election/95565626741817362-core_node10-n_0000000002
   [junit4]   2> 	2	/solr/collections/implicitcoll1/leader_elect/a/election/95565626741817362-core_node11-n_0000000003
   [junit4]   2> 	2	/solr/collections/implicitcoll4/leader_elect/a/election/95565626741817356-core_node3-n_0000000000
   [junit4]   2> 	2	/solr/collections/implicitcoll2/leader_elect/b/election/95565626741817359-core_node14-n_0000000002
   [junit4]   2> 	2	/solr/collections/implicitcollwithShardField/leader_elect/a/election/95565626741817356-core_node2-n_0000000000
   [junit4]   2> 	2	/solr/collections/implicitcollwithShardField/leader_elect/d/election/95565626741817356-core_node9-n_0000000000
   [junit4]   2> 	2	/solr/collections/implicitcollwithShardField/leader_elect/c/election/95565626741817362-core_node3-n_0000000001
   [junit4]   2> 	2	/solr/collections/implicitcollwithShardField/leader_elect/b/election/95565626741817356-core_node12-n_0000000001
   [junit4]   2> 	2	/solr/collections/implicitcoll5/leader_elect/c/election/95565626741817362-core_node7-n_0000000002
   [junit4]   2> 	2	/solr/collections/implicitcoll4/leader_elect/b/election/95565626741817356-core_node8-n_0000000002
   [junit4]   2> 	2	/solr/collections/implicitcollwithShardField/leader_elect/d/election/95565626741817353-core_node4-n_0000000001
   [junit4]   2> 	2	/solr/collections/implicitcoll4/leader_elect/a/election/95565626741817362-core_node4-n_0000000002
   [junit4]   2> 	2	/solr/collections/implicitcollwithShardField/leader_elect/c/election/95565626741817353-core_node18-n_0000000002
   [junit4]   2> 	2	/solr/collections/implicitcoll2/leader_elect/a/election/95565626741817356-core_node13-n_0000000000
   [junit4]   2> 
   [junit4]   2> Maximum concurrent children watches above limit:
   [junit4]   2> 
   [junit4]   2> 	13	/solr/live_nodes
   [junit4]   2> 	13	/solr/collections
   [junit4]   2> 	5	/solr/overseer/collection-queue-work
   [junit4]   2> 	4	/solr/overseer/queue
   [junit4]   2> 	4	/solr/overseer/queue-work
   [junit4]   2> 
   [junit4]   2> NOTE: reproduce with: ant test  -Dtestcase=CustomCollectionTest -Dtests.method=test -Dtests.seed=EDCAC41103F1DA18 -Dtests.slow=true -Dtests.locale=sr -Dtests.timezone=America/Argentina/San_Juan -Dtests.asserts=true -Dtests.file.encoding=UTF-8
   [junit4] ERROR    365s J1 | CustomCollectionTest.test <<<
   [junit4]    > Throwable #1: org.apache.solr.client.solrj.impl.HttpSolrClient$RemoteSolrException: Error from server at http://127.0.0.1:40227/sc_/p: collection already exists: testCreateShardRepFactor
   [junit4]    > 	at __randomizedtesting.SeedInfo.seed([EDCAC41103F1DA18:659EFBCBAD0DB7E0]:0)
   [junit4]    > 	at org.apache.solr.client.solrj.impl.HttpSolrClient.executeMethod(HttpSolrClient.java:577)
   [junit4]    > 	at org.apache.solr.client.solrj.impl.HttpSolrClient.request(HttpSolrClient.java:241)
   [junit4]    > 	at org.apache.solr.client.solrj.impl.HttpSolrClient.request(HttpSolrClient.java:230)
   [junit4]    > 	at org.apache.solr.client.solrj.impl.LBHttpSolrClient.doRequest(LBHttpSolrClient.java:372)
   [junit4]    > 	at org.apache.solr.client.solrj.impl.LBHttpSolrClient.request(LBHttpSolrClient.java:325)
   [junit4]    > 	at org.apache.solr.client.solrj.impl.CloudSolrClient.sendRequest(CloudSolrClient.java:1100)
   [junit4]    > 	at org.apache.solr.client.solrj.impl.CloudSolrClient.requestWithRetryOnStaleState(CloudSolrClient.java:870)
   [junit4]    > 	at org.apache.solr.client.solrj.impl.CloudSolrClient.request(CloudSolrClient.java:806)
   [junit4]    > 	at org.apache.solr.client.solrj.SolrClient.request(SolrClient.java:1219)
   [junit4]    > 	at org.apache.solr.cloud.AbstractFullDistribZkTestBase.createCollection(AbstractFullDistribZkTestBase.java:1593)
   [junit4]    > 	at org.apache.solr.cloud.AbstractFullDistribZkTestBase.createCollection(AbstractFullDistribZkTestBase.java:1547)
   [junit4]    > 	at org.apache.solr.cloud.CustomCollectionTest.testCreateShardRepFactor(CustomCollectionTest.java:390)
   [junit4]    > 	at org.apache.solr.cloud.CustomCollectionTest.test(CustomCollectionTest.java:101)
   [junit4]    > 	at org.apache.solr.BaseDistributedSearchTestCase$ShardsRepeatRule$ShardsFixedStatement.callStatement(BaseDistributedSearchTestCase.java:996)
   [junit4]    > 	at org.apache.solr.BaseDistributedSearchTestCase$ShardsRepeatRule$ShardsStatement.evaluate(BaseDistributedSearchTestCase.java:971)
   [junit4]    > 	at java.lang.Thread.run(Thread.java:745)
   [junit4]   2> 1706282 INFO  (SUITE-CustomCollectionTest-seed#[EDCAC41103F1DA18]-worker) [    ] o.a.s.SolrTestCaseJ4 ###deleteCore
   [junit4]   2> NOTE: leaving temporary files on disk at: /export/home/jenkins/workspace/Lucene-Solr-6.x-Solaris/solr/build/solr-core/test/J1/temp/solr.cloud.CustomCollectionTest_EDCAC41103F1DA18-001
   [junit4]   2> Mar 17, 2016 12:01:44 PM com.carrotsearch.randomizedtesting.ThreadLeakControl checkThreadLeaks
   [junit4]   2> WARNING: Will linger awaiting termination of 1 leaked thread(s).
   [junit4]   2> NOTE: test params are: codec=Asserting(Lucene60): {shard_s=FST50, other_tl1=FST50, range_facet_l_dv=PostingsFormat(name=Memory doPackFST= true), multiDefault=TestBloomFilteredLucenePostings(BloomFilteringPostingsFormat(Lucene50(blocksize=128))), intDefault=FST50, a_i1=FST50, range_facet_l=FST50, _version_=FST50, a_t=FST50, id=PostingsFormat(name=Memory doPackFST= true), range_facet_i_dv=FST50, text=PostingsFormat(name=Direct), _route_=PostingsFormat(name=Direct), timestamp=FST50}, docValues:{range_facet_l_dv=DocValuesFormat(name=Memory), range_facet_i_dv=DocValuesFormat(name=Lucene54), timestamp=DocValuesFormat(name=Lucene54)}, maxPointsInLeafNode=1884, maxMBSortInHeap=4.9427423524220355, sim=RandomSimilarity(queryNorm=true,coord=yes): {}, locale=sr, timezone=America/Argentina/San_Juan
   [junit4]   2> NOTE: SunOS 5.11 amd64/Oracle Corporation 1.8.0_72 (64-bit)/cpus=3,threads=1,free=139383080,total=536870912
   [junit4]   2> NOTE: All tests run in this JVM: [TestCustomDocTransformer, EchoParamsTest, TestFilteredDocIdSet, RollingRestartTest, TestRTGBase, ResourceLoaderTest, TestCustomSort, FileBasedSpellCheckerTest, ZkStateReaderTest, CheckHdfsIndexTest, DistanceUnitsTest, OpenCloseCoreStressTest, TestIndexSearcher, AsyncCallRequestStatusResponseTest, DefaultValueUpdateProcessorTest, TestTestInjection, TestAddFieldRealTimeGet, TestSystemIdResolver, TestSQLHandler, DistributedFacetPivotSmallTest, SimpleCollectionCreateDeleteTest, TestShardHandlerFactory, DirectUpdateHandlerOptimizeTest, TestCollationField, TestUniqueKeyFieldResource, TestLMJelinekMercerSimilarityFactory, ZkSolrClientTest, BlockDirectoryTest, TestFiltering, SolrCoreCheckLockOnStartupTest, BigEndianAscendingWordSerializerTest, WordBreakSolrSpellCheckerTest, ParsingFieldUpdateProcessorsTest, UniqFieldsUpdateProcessorFactoryTest, CollectionsAPIDistributedZkTest, BasicZkTest, TestRangeQuery, CollectionsAPISolrJTest, SaslZkACLProviderTest, TestZkChroot, TestFieldResource, SpellingQueryConverterTest, OutOfBoxZkACLAndCredentialsProvidersTest, InfoHandlerTest, TestFieldTypeResource, TestReqParamsAPI, RankQueryTest, TestStressRecovery, SpatialHeatmapFacetsTest, TestAnalyzeInfixSuggestions, TestSuggestSpellingConverter, TestConfigSetsAPI, FullSolrCloudDistribCmdsTest, TestSolrQueryParser, TestSchemaVersionResource, NoCacheHeaderTest, SpellCheckComponentTest, BasicAuthIntegrationTest, ResponseHeaderTest, LeaderInitiatedRecoveryOnCommitTest, DistributedVersionInfoTest, AliasIntegrationTest, AutoCommitTest, SuggestComponentTest, NumericFieldsTest, AnalyticsMergeStrategyTest, ReplicationFactorTest, TestCloudPivotFacet, BaseCdcrDistributedZkTest, TestPerFieldSimilarity, TestRTimerTree, TestTrie, AddBlockUpdateTest, CollectionTooManyReplicasTest, DeleteLastCustomShardedReplicaTest, BlockJoinFacetDistribTest, LukeRequestHandlerTest, HighlighterConfigTest, DeleteShardTest, TestAuthorizationFramework, TestCloudManagedSchema, TermVectorComponentTest, TestStressUserVersions, HdfsDirectoryTest, DistributedTermsComponentTest, OverseerStatusTest, AddSchemaFieldsUpdateProcessorFactoryTest, CoreAdminHandlerTest, StatsComponentTest, BadIndexSchemaTest, TestFileDictionaryLookup, TestMissingGroups, TestDefaultSearchFieldResource, SparseHLLTest, CdcrReplicationHandlerTest, TestSolr4Spatial, TestMiniSolrCloudClusterSSL, SolrInfoMBeanTest, TestSolrConfigHandlerConcurrent, TestSolrDynamicMBean, TestRuleBasedAuthorizationPlugin, TestRandomFaceting, DistributedQueryComponentCustomSortTest, CustomCollectionTest]
   [junit4] Completed [250/581 (1!)] on J1 in 365.04s, 1 test, 1 error <<< FAILURES!

[...truncated 1086 lines...]
BUILD FAILED
/export/home/jenkins/workspace/Lucene-Solr-6.x-Solaris/build.xml:740: The following error occurred while executing this line:
/export/home/jenkins/workspace/Lucene-Solr-6.x-Solaris/build.xml:684: The following error occurred while executing this line:
/export/home/jenkins/workspace/Lucene-Solr-6.x-Solaris/build.xml:59: The following error occurred while executing this line:
/export/home/jenkins/workspace/Lucene-Solr-6.x-Solaris/solr/build.xml:233: The following error occurred while executing this line:
/export/home/jenkins/workspace/Lucene-Solr-6.x-Solaris/solr/common-build.xml:526: The following error occurred while executing this line:
/export/home/jenkins/workspace/Lucene-Solr-6.x-Solaris/lucene/common-build.xml:1457: The following error occurred while executing this line:
/export/home/jenkins/workspace/Lucene-Solr-6.x-Solaris/lucene/common-build.xml:1014: There were test failures: 581 suites (10 ignored), 2325 tests, 1 error, 86 ignored (70 assumptions) [seed: EDCAC41103F1DA18]

Total time: 79 minutes 10 seconds
Build step 'Invoke Ant' marked build as failure
Archiving artifacts
[WARNINGS] Skipping publisher since build result is FAILURE
Recording test results
Email was triggered for: Failure - Any
Sending email for trigger: Failure - Any



Mime
View raw message