lucene-dev mailing list archives

Site index · List index
Message view « Date » · « Thread »
Top « Date » · « Thread »
From Policeman Jenkins Server <jenk...@thetaphi.de>
Subject [JENKINS-EA] Lucene-Solr-6.x-Linux (64bit/jdk-9-jigsaw-ea+110) - Build # 235 - Failure!
Date Fri, 25 Mar 2016 00:34:30 GMT
Build: http://jenkins.thetaphi.de/job/Lucene-Solr-6.x-Linux/235/
Java: 64bit/jdk-9-jigsaw-ea+110 -XX:-UseCompressedOops -XX:+UseConcMarkSweepGC -XX:-CompactStrings

1 tests failed.
FAILED:  org.apache.solr.handler.TestReqParamsAPI.test

Error Message:
Could not get expected value  'CY val' for path 'params/c' full output: {   "responseHeader":{     "status":0,     "QTime":0},   "params":{     "a":"A val",     "b":"B val",     "wt":"json",     "useParams":""},   "context":{     "webapp":"",     "path":"/dump1",     "httpMethod":"GET"}}

Stack Trace:
java.lang.AssertionError: Could not get expected value  'CY val' for path 'params/c' full output: {
  "responseHeader":{
    "status":0,
    "QTime":0},
  "params":{
    "a":"A val",
    "b":"B val",
    "wt":"json",
    "useParams":""},
  "context":{
    "webapp":"",
    "path":"/dump1",
    "httpMethod":"GET"}}
	at __randomizedtesting.SeedInfo.seed([D6177184D9890A3F:5E434E5E777567C7]:0)
	at org.junit.Assert.fail(Assert.java:93)
	at org.junit.Assert.assertTrue(Assert.java:43)
	at org.apache.solr.core.TestSolrConfigHandler.testForResponseElement(TestSolrConfigHandler.java:458)
	at org.apache.solr.handler.TestReqParamsAPI.testReqParams(TestReqParamsAPI.java:177)
	at org.apache.solr.handler.TestReqParamsAPI.test(TestReqParamsAPI.java:67)
	at sun.reflect.NativeMethodAccessorImpl.invoke0(java.base@9-ea/Native Method)
	at sun.reflect.NativeMethodAccessorImpl.invoke(java.base@9-ea/NativeMethodAccessorImpl.java:62)
	at sun.reflect.DelegatingMethodAccessorImpl.invoke(java.base@9-ea/DelegatingMethodAccessorImpl.java:43)
	at java.lang.reflect.Method.invoke(java.base@9-ea/Method.java:531)
	at com.carrotsearch.randomizedtesting.RandomizedRunner.invoke(RandomizedRunner.java:1764)
	at com.carrotsearch.randomizedtesting.RandomizedRunner$8.evaluate(RandomizedRunner.java:871)
	at com.carrotsearch.randomizedtesting.RandomizedRunner$9.evaluate(RandomizedRunner.java:907)
	at com.carrotsearch.randomizedtesting.RandomizedRunner$10.evaluate(RandomizedRunner.java:921)
	at org.apache.solr.BaseDistributedSearchTestCase$ShardsRepeatRule$ShardsFixedStatement.callStatement(BaseDistributedSearchTestCase.java:996)
	at org.apache.solr.BaseDistributedSearchTestCase$ShardsRepeatRule$ShardsStatement.evaluate(BaseDistributedSearchTestCase.java:971)
	at com.carrotsearch.randomizedtesting.rules.SystemPropertiesRestoreRule$1.evaluate(SystemPropertiesRestoreRule.java:57)
	at org.apache.lucene.util.TestRuleSetupTeardownChained$1.evaluate(TestRuleSetupTeardownChained.java:49)
	at org.apache.lucene.util.AbstractBeforeAfterRule$1.evaluate(AbstractBeforeAfterRule.java:45)
	at org.apache.lucene.util.TestRuleThreadAndTestName$1.evaluate(TestRuleThreadAndTestName.java:48)
	at org.apache.lucene.util.TestRuleIgnoreAfterMaxFailures$1.evaluate(TestRuleIgnoreAfterMaxFailures.java:64)
	at org.apache.lucene.util.TestRuleMarkFailure$1.evaluate(TestRuleMarkFailure.java:47)
	at com.carrotsearch.randomizedtesting.rules.StatementAdapter.evaluate(StatementAdapter.java:36)
	at com.carrotsearch.randomizedtesting.ThreadLeakControl$StatementRunner.run(ThreadLeakControl.java:367)
	at com.carrotsearch.randomizedtesting.ThreadLeakControl.forkTimeoutingTask(ThreadLeakControl.java:809)
	at com.carrotsearch.randomizedtesting.ThreadLeakControl$3.evaluate(ThreadLeakControl.java:460)
	at com.carrotsearch.randomizedtesting.RandomizedRunner.runSingleTest(RandomizedRunner.java:880)
	at com.carrotsearch.randomizedtesting.RandomizedRunner$5.evaluate(RandomizedRunner.java:781)
	at com.carrotsearch.randomizedtesting.RandomizedRunner$6.evaluate(RandomizedRunner.java:816)
	at com.carrotsearch.randomizedtesting.RandomizedRunner$7.evaluate(RandomizedRunner.java:827)
	at com.carrotsearch.randomizedtesting.rules.StatementAdapter.evaluate(StatementAdapter.java:36)
	at com.carrotsearch.randomizedtesting.rules.SystemPropertiesRestoreRule$1.evaluate(SystemPropertiesRestoreRule.java:57)
	at org.apache.lucene.util.AbstractBeforeAfterRule$1.evaluate(AbstractBeforeAfterRule.java:45)
	at com.carrotsearch.randomizedtesting.rules.StatementAdapter.evaluate(StatementAdapter.java:36)
	at org.apache.lucene.util.TestRuleStoreClassName$1.evaluate(TestRuleStoreClassName.java:41)
	at com.carrotsearch.randomizedtesting.rules.NoShadowingOrOverridesOnMethodsRule$1.evaluate(NoShadowingOrOverridesOnMethodsRule.java:40)
	at com.carrotsearch.randomizedtesting.rules.NoShadowingOrOverridesOnMethodsRule$1.evaluate(NoShadowingOrOverridesOnMethodsRule.java:40)
	at com.carrotsearch.randomizedtesting.rules.StatementAdapter.evaluate(StatementAdapter.java:36)
	at com.carrotsearch.randomizedtesting.rules.StatementAdapter.evaluate(StatementAdapter.java:36)
	at com.carrotsearch.randomizedtesting.rules.StatementAdapter.evaluate(StatementAdapter.java:36)
	at org.apache.lucene.util.TestRuleAssertionsRequired$1.evaluate(TestRuleAssertionsRequired.java:53)
	at org.apache.lucene.util.TestRuleMarkFailure$1.evaluate(TestRuleMarkFailure.java:47)
	at org.apache.lucene.util.TestRuleIgnoreAfterMaxFailures$1.evaluate(TestRuleIgnoreAfterMaxFailures.java:64)
	at org.apache.lucene.util.TestRuleIgnoreTestSuites$1.evaluate(TestRuleIgnoreTestSuites.java:54)
	at com.carrotsearch.randomizedtesting.rules.StatementAdapter.evaluate(StatementAdapter.java:36)
	at com.carrotsearch.randomizedtesting.ThreadLeakControl$StatementRunner.run(ThreadLeakControl.java:367)
	at java.lang.Thread.run(java.base@9-ea/Thread.java:804)




Build Log:
[...truncated 12224 lines...]
   [junit4] Suite: org.apache.solr.handler.TestReqParamsAPI
   [junit4]   2> Creating dataDir: /home/jenkins/workspace/Lucene-Solr-6.x-Linux/solr/build/solr-core/test/J0/temp/solr.handler.TestReqParamsAPI_D6177184D9890A3F-001/init-core-data-001
   [junit4]   2> 1788266 INFO  (SUITE-TestReqParamsAPI-seed#[D6177184D9890A3F]-worker) [    ] o.a.s.SolrTestCaseJ4 Randomized ssl (false) and clientAuth (false)
   [junit4]   2> 1788266 INFO  (SUITE-TestReqParamsAPI-seed#[D6177184D9890A3F]-worker) [    ] o.a.s.BaseDistributedSearchTestCase Setting hostContext system property: /
   [junit4]   2> 1788268 INFO  (TEST-TestReqParamsAPI.test-seed#[D6177184D9890A3F]) [    ] o.a.s.c.ZkTestServer STARTING ZK TEST SERVER
   [junit4]   2> 1788268 INFO  (Thread-4984) [    ] o.a.s.c.ZkTestServer client port:0.0.0.0/0.0.0.0:0
   [junit4]   2> 1788268 INFO  (Thread-4984) [    ] o.a.s.c.ZkTestServer Starting server
   [junit4]   2> 1788368 INFO  (TEST-TestReqParamsAPI.test-seed#[D6177184D9890A3F]) [    ] o.a.s.c.ZkTestServer start zk server on port:45173
   [junit4]   2> 1788368 INFO  (TEST-TestReqParamsAPI.test-seed#[D6177184D9890A3F]) [    ] o.a.s.c.c.SolrZkClient Using default ZkCredentialsProvider
   [junit4]   2> 1788368 INFO  (TEST-TestReqParamsAPI.test-seed#[D6177184D9890A3F]) [    ] o.a.s.c.c.ConnectionManager Waiting for client to connect to ZooKeeper
   [junit4]   2> 1788370 INFO  (zkCallback-2183-thread-1) [    ] o.a.s.c.c.ConnectionManager Watcher org.apache.solr.common.cloud.ConnectionManager@27d4f6da name:ZooKeeperConnection Watcher:127.0.0.1:45173 got event WatchedEvent state:SyncConnected type:None path:null path:null type:None
   [junit4]   2> 1788370 INFO  (TEST-TestReqParamsAPI.test-seed#[D6177184D9890A3F]) [    ] o.a.s.c.c.ConnectionManager Client is connected to ZooKeeper
   [junit4]   2> 1788370 INFO  (TEST-TestReqParamsAPI.test-seed#[D6177184D9890A3F]) [    ] o.a.s.c.c.SolrZkClient Using default ZkACLProvider
   [junit4]   2> 1788370 INFO  (TEST-TestReqParamsAPI.test-seed#[D6177184D9890A3F]) [    ] o.a.s.c.c.SolrZkClient makePath: /solr
   [junit4]   2> 1788371 INFO  (TEST-TestReqParamsAPI.test-seed#[D6177184D9890A3F]) [    ] o.a.s.c.c.SolrZkClient Using default ZkCredentialsProvider
   [junit4]   2> 1788371 INFO  (TEST-TestReqParamsAPI.test-seed#[D6177184D9890A3F]) [    ] o.a.s.c.c.ConnectionManager Waiting for client to connect to ZooKeeper
   [junit4]   2> 1788372 INFO  (zkCallback-2184-thread-1) [    ] o.a.s.c.c.ConnectionManager Watcher org.apache.solr.common.cloud.ConnectionManager@2882fdb7 name:ZooKeeperConnection Watcher:127.0.0.1:45173/solr got event WatchedEvent state:SyncConnected type:None path:null path:null type:None
   [junit4]   2> 1788372 INFO  (TEST-TestReqParamsAPI.test-seed#[D6177184D9890A3F]) [    ] o.a.s.c.c.ConnectionManager Client is connected to ZooKeeper
   [junit4]   2> 1788372 INFO  (TEST-TestReqParamsAPI.test-seed#[D6177184D9890A3F]) [    ] o.a.s.c.c.SolrZkClient Using default ZkACLProvider
   [junit4]   2> 1788372 INFO  (TEST-TestReqParamsAPI.test-seed#[D6177184D9890A3F]) [    ] o.a.s.c.c.SolrZkClient makePath: /collections/collection1
   [junit4]   2> 1788372 INFO  (TEST-TestReqParamsAPI.test-seed#[D6177184D9890A3F]) [    ] o.a.s.c.c.SolrZkClient makePath: /collections/collection1/shards
   [junit4]   2> 1788373 INFO  (TEST-TestReqParamsAPI.test-seed#[D6177184D9890A3F]) [    ] o.a.s.c.c.SolrZkClient makePath: /collections/control_collection
   [junit4]   2> 1788373 INFO  (TEST-TestReqParamsAPI.test-seed#[D6177184D9890A3F]) [    ] o.a.s.c.c.SolrZkClient makePath: /collections/control_collection/shards
   [junit4]   2> 1788374 INFO  (TEST-TestReqParamsAPI.test-seed#[D6177184D9890A3F]) [    ] o.a.s.c.AbstractZkTestCase put /home/jenkins/workspace/Lucene-Solr-6.x-Linux/solr/core/src/test-files/solr/collection1/conf/solrconfig-tlog.xml to /configs/conf1/solrconfig.xml
   [junit4]   2> 1788374 INFO  (TEST-TestReqParamsAPI.test-seed#[D6177184D9890A3F]) [    ] o.a.s.c.c.SolrZkClient makePath: /configs/conf1/solrconfig.xml
   [junit4]   2> 1788375 INFO  (TEST-TestReqParamsAPI.test-seed#[D6177184D9890A3F]) [    ] o.a.s.c.AbstractZkTestCase put /home/jenkins/workspace/Lucene-Solr-6.x-Linux/solr/core/src/test-files/solr/collection1/conf/schema.xml to /configs/conf1/schema.xml
   [junit4]   2> 1788375 INFO  (TEST-TestReqParamsAPI.test-seed#[D6177184D9890A3F]) [    ] o.a.s.c.c.SolrZkClient makePath: /configs/conf1/schema.xml
   [junit4]   2> 1788375 INFO  (TEST-TestReqParamsAPI.test-seed#[D6177184D9890A3F]) [    ] o.a.s.c.AbstractZkTestCase put /home/jenkins/workspace/Lucene-Solr-6.x-Linux/solr/core/src/test-files/solr/collection1/conf/solrconfig.snippet.randomindexconfig.xml to /configs/conf1/solrconfig.snippet.randomindexconfig.xml
   [junit4]   2> 1788375 INFO  (TEST-TestReqParamsAPI.test-seed#[D6177184D9890A3F]) [    ] o.a.s.c.c.SolrZkClient makePath: /configs/conf1/solrconfig.snippet.randomindexconfig.xml
   [junit4]   2> 1788376 INFO  (TEST-TestReqParamsAPI.test-seed#[D6177184D9890A3F]) [    ] o.a.s.c.AbstractZkTestCase put /home/jenkins/workspace/Lucene-Solr-6.x-Linux/solr/core/src/test-files/solr/collection1/conf/stopwords.txt to /configs/conf1/stopwords.txt
   [junit4]   2> 1788376 INFO  (TEST-TestReqParamsAPI.test-seed#[D6177184D9890A3F]) [    ] o.a.s.c.c.SolrZkClient makePath: /configs/conf1/stopwords.txt
   [junit4]   2> 1788376 INFO  (TEST-TestReqParamsAPI.test-seed#[D6177184D9890A3F]) [    ] o.a.s.c.AbstractZkTestCase put /home/jenkins/workspace/Lucene-Solr-6.x-Linux/solr/core/src/test-files/solr/collection1/conf/protwords.txt to /configs/conf1/protwords.txt
   [junit4]   2> 1788377 INFO  (TEST-TestReqParamsAPI.test-seed#[D6177184D9890A3F]) [    ] o.a.s.c.c.SolrZkClient makePath: /configs/conf1/protwords.txt
   [junit4]   2> 1788377 INFO  (TEST-TestReqParamsAPI.test-seed#[D6177184D9890A3F]) [    ] o.a.s.c.AbstractZkTestCase put /home/jenkins/workspace/Lucene-Solr-6.x-Linux/solr/core/src/test-files/solr/collection1/conf/currency.xml to /configs/conf1/currency.xml
   [junit4]   2> 1788377 INFO  (TEST-TestReqParamsAPI.test-seed#[D6177184D9890A3F]) [    ] o.a.s.c.c.SolrZkClient makePath: /configs/conf1/currency.xml
   [junit4]   2> 1788378 INFO  (TEST-TestReqParamsAPI.test-seed#[D6177184D9890A3F]) [    ] o.a.s.c.AbstractZkTestCase put /home/jenkins/workspace/Lucene-Solr-6.x-Linux/solr/core/src/test-files/solr/collection1/conf/enumsConfig.xml to /configs/conf1/enumsConfig.xml
   [junit4]   2> 1788378 INFO  (TEST-TestReqParamsAPI.test-seed#[D6177184D9890A3F]) [    ] o.a.s.c.c.SolrZkClient makePath: /configs/conf1/enumsConfig.xml
   [junit4]   2> 1788378 INFO  (TEST-TestReqParamsAPI.test-seed#[D6177184D9890A3F]) [    ] o.a.s.c.AbstractZkTestCase put /home/jenkins/workspace/Lucene-Solr-6.x-Linux/solr/core/src/test-files/solr/collection1/conf/open-exchange-rates.json to /configs/conf1/open-exchange-rates.json
   [junit4]   2> 1788379 INFO  (TEST-TestReqParamsAPI.test-seed#[D6177184D9890A3F]) [    ] o.a.s.c.c.SolrZkClient makePath: /configs/conf1/open-exchange-rates.json
   [junit4]   2> 1788379 INFO  (TEST-TestReqParamsAPI.test-seed#[D6177184D9890A3F]) [    ] o.a.s.c.AbstractZkTestCase put /home/jenkins/workspace/Lucene-Solr-6.x-Linux/solr/core/src/test-files/solr/collection1/conf/mapping-ISOLatin1Accent.txt to /configs/conf1/mapping-ISOLatin1Accent.txt
   [junit4]   2> 1788379 INFO  (TEST-TestReqParamsAPI.test-seed#[D6177184D9890A3F]) [    ] o.a.s.c.c.SolrZkClient makePath: /configs/conf1/mapping-ISOLatin1Accent.txt
   [junit4]   2> 1788379 INFO  (TEST-TestReqParamsAPI.test-seed#[D6177184D9890A3F]) [    ] o.a.s.c.AbstractZkTestCase put /home/jenkins/workspace/Lucene-Solr-6.x-Linux/solr/core/src/test-files/solr/collection1/conf/old_synonyms.txt to /configs/conf1/old_synonyms.txt
   [junit4]   2> 1788380 INFO  (TEST-TestReqParamsAPI.test-seed#[D6177184D9890A3F]) [    ] o.a.s.c.c.SolrZkClient makePath: /configs/conf1/old_synonyms.txt
   [junit4]   2> 1788380 INFO  (TEST-TestReqParamsAPI.test-seed#[D6177184D9890A3F]) [    ] o.a.s.c.AbstractZkTestCase put /home/jenkins/workspace/Lucene-Solr-6.x-Linux/solr/core/src/test-files/solr/collection1/conf/synonyms.txt to /configs/conf1/synonyms.txt
   [junit4]   2> 1788380 INFO  (TEST-TestReqParamsAPI.test-seed#[D6177184D9890A3F]) [    ] o.a.s.c.c.SolrZkClient makePath: /configs/conf1/synonyms.txt
   [junit4]   2> 1788431 INFO  (TEST-TestReqParamsAPI.test-seed#[D6177184D9890A3F]) [    ] o.a.s.SolrTestCaseJ4 Writing core.properties file to /home/jenkins/workspace/Lucene-Solr-6.x-Linux/solr/build/solr-core/test/J0/temp/solr.handler.TestReqParamsAPI_D6177184D9890A3F-001/control-001/cores/collection1
   [junit4]   2> 1788432 INFO  (TEST-TestReqParamsAPI.test-seed#[D6177184D9890A3F]) [    ] o.e.j.s.Server jetty-9.3.8.v20160314
   [junit4]   2> 1788432 INFO  (TEST-TestReqParamsAPI.test-seed#[D6177184D9890A3F]) [    ] o.e.j.s.h.ContextHandler Started o.e.j.s.ServletContextHandler@5f7af4f4{/,null,AVAILABLE}
   [junit4]   2> 1788433 INFO  (TEST-TestReqParamsAPI.test-seed#[D6177184D9890A3F]) [    ] o.e.j.s.ServerConnector Started ServerConnector@e6990a4{HTTP/1.1,[http/1.1]}{127.0.0.1:38885}
   [junit4]   2> 1788433 INFO  (TEST-TestReqParamsAPI.test-seed#[D6177184D9890A3F]) [    ] o.e.j.s.Server Started @1790456ms
   [junit4]   2> 1788433 INFO  (TEST-TestReqParamsAPI.test-seed#[D6177184D9890A3F]) [    ] o.a.s.c.s.e.JettySolrRunner Jetty properties: {solr.data.dir=/home/jenkins/workspace/Lucene-Solr-6.x-Linux/solr/build/solr-core/test/J0/temp/solr.handler.TestReqParamsAPI_D6177184D9890A3F-001/tempDir-001/control/data, hostContext=/, hostPort=38885, coreRootDirectory=/home/jenkins/workspace/Lucene-Solr-6.x-Linux/solr/build/solr-core/test/J0/temp/solr.handler.TestReqParamsAPI_D6177184D9890A3F-001/control-001/cores}
   [junit4]   2> 1788434 INFO  (TEST-TestReqParamsAPI.test-seed#[D6177184D9890A3F]) [    ] o.a.s.s.SolrDispatchFilter SolrDispatchFilter.init(): jdk.internal.loader.ClassLoaders$AppClassLoader@61443d8f
   [junit4]   2> 1788434 INFO  (TEST-TestReqParamsAPI.test-seed#[D6177184D9890A3F]) [    ] o.a.s.c.SolrResourceLoader new SolrResourceLoader for directory: '/home/jenkins/workspace/Lucene-Solr-6.x-Linux/solr/build/solr-core/test/J0/temp/solr.handler.TestReqParamsAPI_D6177184D9890A3F-001/control-001'
   [junit4]   2> 1788434 INFO  (TEST-TestReqParamsAPI.test-seed#[D6177184D9890A3F]) [    ] o.a.s.c.SolrResourceLoader JNDI not configured for solr (NoInitialContextEx)
   [junit4]   2> 1788434 INFO  (TEST-TestReqParamsAPI.test-seed#[D6177184D9890A3F]) [    ] o.a.s.c.SolrResourceLoader solr home defaulted to 'solr/' (could not find system property or JNDI)
   [junit4]   2> 1788434 INFO  (TEST-TestReqParamsAPI.test-seed#[D6177184D9890A3F]) [    ] o.a.s.c.c.SolrZkClient Using default ZkCredentialsProvider
   [junit4]   2> 1788434 INFO  (TEST-TestReqParamsAPI.test-seed#[D6177184D9890A3F]) [    ] o.a.s.c.c.ConnectionManager Waiting for client to connect to ZooKeeper
   [junit4]   2> 1788435 INFO  (zkCallback-2185-thread-1) [    ] o.a.s.c.c.ConnectionManager Watcher org.apache.solr.common.cloud.ConnectionManager@4002e934 name:ZooKeeperConnection Watcher:127.0.0.1:45173/solr got event WatchedEvent state:SyncConnected type:None path:null path:null type:None
   [junit4]   2> 1788435 INFO  (TEST-TestReqParamsAPI.test-seed#[D6177184D9890A3F]) [    ] o.a.s.c.c.ConnectionManager Client is connected to ZooKeeper
   [junit4]   2> 1788435 INFO  (TEST-TestReqParamsAPI.test-seed#[D6177184D9890A3F]) [    ] o.a.s.c.c.SolrZkClient Using default ZkACLProvider
   [junit4]   2> 1788436 INFO  (TEST-TestReqParamsAPI.test-seed#[D6177184D9890A3F]) [    ] o.a.s.s.SolrDispatchFilter Loading solr.xml from SolrHome (not found in ZooKeeper)
   [junit4]   2> 1788436 INFO  (TEST-TestReqParamsAPI.test-seed#[D6177184D9890A3F]) [    ] o.a.s.c.SolrXmlConfig Loading container configuration from /home/jenkins/workspace/Lucene-Solr-6.x-Linux/solr/build/solr-core/test/J0/temp/solr.handler.TestReqParamsAPI_D6177184D9890A3F-001/control-001/solr.xml
   [junit4]   2> 1788439 INFO  (TEST-TestReqParamsAPI.test-seed#[D6177184D9890A3F]) [    ] o.a.s.c.CorePropertiesLocator Config-defined core root directory: /home/jenkins/workspace/Lucene-Solr-6.x-Linux/solr/build/solr-core/test/J0/temp/solr.handler.TestReqParamsAPI_D6177184D9890A3F-001/control-001/cores
   [junit4]   2> 1788439 INFO  (TEST-TestReqParamsAPI.test-seed#[D6177184D9890A3F]) [    ] o.a.s.c.CoreContainer New CoreContainer 353855856
   [junit4]   2> 1788439 INFO  (TEST-TestReqParamsAPI.test-seed#[D6177184D9890A3F]) [    ] o.a.s.c.CoreContainer Loading cores into CoreContainer [instanceDir=/home/jenkins/workspace/Lucene-Solr-6.x-Linux/solr/build/solr-core/test/J0/temp/solr.handler.TestReqParamsAPI_D6177184D9890A3F-001/control-001]
   [junit4]   2> 1788439 WARN  (TEST-TestReqParamsAPI.test-seed#[D6177184D9890A3F]) [    ] o.a.s.c.CoreContainer Couldn't add files from /home/jenkins/workspace/Lucene-Solr-6.x-Linux/solr/build/solr-core/test/J0/temp/solr.handler.TestReqParamsAPI_D6177184D9890A3F-001/control-001/lib to classpath: /home/jenkins/workspace/Lucene-Solr-6.x-Linux/solr/build/solr-core/test/J0/temp/solr.handler.TestReqParamsAPI_D6177184D9890A3F-001/control-001/lib
   [junit4]   2> 1788439 INFO  (TEST-TestReqParamsAPI.test-seed#[D6177184D9890A3F]) [    ] o.a.s.h.c.HttpShardHandlerFactory created with socketTimeout : 90000,urlScheme : ,connTimeout : 15000,maxConnectionsPerHost : 20,maxConnections : 10000,corePoolSize : 0,maximumPoolSize : 2147483647,maxThreadIdleTime : 5,sizeOfQueue : -1,fairnessPolicy : false,useRetries : false,
   [junit4]   2> 1788440 INFO  (TEST-TestReqParamsAPI.test-seed#[D6177184D9890A3F]) [    ] o.a.s.u.UpdateShardHandler Creating UpdateShardHandler HTTP client with params: socketTimeout=340000&connTimeout=45000&retry=true
   [junit4]   2> 1788440 INFO  (TEST-TestReqParamsAPI.test-seed#[D6177184D9890A3F]) [    ] o.a.s.l.LogWatcher SLF4J impl is org.slf4j.impl.Log4jLoggerFactory
   [junit4]   2> 1788440 INFO  (TEST-TestReqParamsAPI.test-seed#[D6177184D9890A3F]) [    ] o.a.s.l.LogWatcher Registering Log Listener [Log4j (org.slf4j.impl.Log4jLoggerFactory)]
   [junit4]   2> 1788440 INFO  (TEST-TestReqParamsAPI.test-seed#[D6177184D9890A3F]) [    ] o.a.s.c.ZkContainer Zookeeper client=127.0.0.1:45173/solr
   [junit4]   2> 1788440 INFO  (TEST-TestReqParamsAPI.test-seed#[D6177184D9890A3F]) [    ] o.a.s.c.ZkController zkHost includes chroot
   [junit4]   2> 1788440 INFO  (TEST-TestReqParamsAPI.test-seed#[D6177184D9890A3F]) [    ] o.a.s.c.c.SolrZkClient Using default ZkCredentialsProvider
   [junit4]   2> 1788441 INFO  (TEST-TestReqParamsAPI.test-seed#[D6177184D9890A3F]) [    ] o.a.s.c.c.ConnectionManager Waiting for client to connect to ZooKeeper
   [junit4]   2> 1788441 INFO  (zkCallback-2188-thread-1) [    ] o.a.s.c.c.ConnectionManager Watcher org.apache.solr.common.cloud.ConnectionManager@4631501e name:ZooKeeperConnection Watcher:127.0.0.1:45173 got event WatchedEvent state:SyncConnected type:None path:null path:null type:None
   [junit4]   2> 1788441 INFO  (TEST-TestReqParamsAPI.test-seed#[D6177184D9890A3F]) [    ] o.a.s.c.c.ConnectionManager Client is connected to ZooKeeper
   [junit4]   2> 1788441 INFO  (TEST-TestReqParamsAPI.test-seed#[D6177184D9890A3F]) [    ] o.a.s.c.c.SolrZkClient Using default ZkACLProvider
   [junit4]   2> 1788442 INFO  (TEST-TestReqParamsAPI.test-seed#[D6177184D9890A3F]) [    ] o.a.s.c.c.ConnectionManager Waiting for client to connect to ZooKeeper
   [junit4]   2> 1788442 INFO  (zkCallback-2189-thread-1) [    ] o.a.s.c.c.ConnectionManager Watcher org.apache.solr.common.cloud.ConnectionManager@6d2120ba name:ZooKeeperConnection Watcher:127.0.0.1:45173/solr got event WatchedEvent state:SyncConnected type:None path:null path:null type:None
   [junit4]   2> 1788442 INFO  (TEST-TestReqParamsAPI.test-seed#[D6177184D9890A3F]) [    ] o.a.s.c.c.ConnectionManager Client is connected to ZooKeeper
   [junit4]   2> 1788443 INFO  (TEST-TestReqParamsAPI.test-seed#[D6177184D9890A3F]) [    ] o.a.s.c.c.SolrZkClient makePath: /overseer/queue
   [junit4]   2> 1788443 INFO  (TEST-TestReqParamsAPI.test-seed#[D6177184D9890A3F]) [    ] o.a.s.c.c.SolrZkClient makePath: /overseer/collection-queue-work
   [junit4]   2> 1788444 INFO  (TEST-TestReqParamsAPI.test-seed#[D6177184D9890A3F]) [    ] o.a.s.c.c.SolrZkClient makePath: /overseer/collection-map-running
   [junit4]   2> 1788445 INFO  (TEST-TestReqParamsAPI.test-seed#[D6177184D9890A3F]) [    ] o.a.s.c.c.SolrZkClient makePath: /overseer/collection-map-completed
   [junit4]   2> 1788445 INFO  (TEST-TestReqParamsAPI.test-seed#[D6177184D9890A3F]) [    ] o.a.s.c.c.SolrZkClient makePath: /overseer/collection-map-failure
   [junit4]   2> 1788446 INFO  (TEST-TestReqParamsAPI.test-seed#[D6177184D9890A3F]) [    ] o.a.s.c.c.SolrZkClient makePath: /live_nodes
   [junit4]   2> 1788446 INFO  (TEST-TestReqParamsAPI.test-seed#[D6177184D9890A3F]) [    ] o.a.s.c.c.SolrZkClient makePath: /aliases.json
   [junit4]   2> 1788447 INFO  (TEST-TestReqParamsAPI.test-seed#[D6177184D9890A3F]) [    ] o.a.s.c.c.SolrZkClient makePath: /clusterstate.json
   [junit4]   2> 1788447 INFO  (TEST-TestReqParamsAPI.test-seed#[D6177184D9890A3F]) [    ] o.a.s.c.c.SolrZkClient makePath: /security.json
   [junit4]   2> 1788447 INFO  (TEST-TestReqParamsAPI.test-seed#[D6177184D9890A3F]) [    ] o.a.s.c.c.ZkStateReader Updating cluster state from ZooKeeper... 
   [junit4]   2> 1788448 INFO  (TEST-TestReqParamsAPI.test-seed#[D6177184D9890A3F]) [    ] o.a.s.c.c.ZkStateReader Updated live nodes from ZooKeeper... (0) -> (0)
   [junit4]   2> 1788448 INFO  (TEST-TestReqParamsAPI.test-seed#[D6177184D9890A3F]) [    ] o.a.s.c.c.SolrZkClient makePath: /overseer_elect
   [junit4]   2> 1788449 INFO  (TEST-TestReqParamsAPI.test-seed#[D6177184D9890A3F]) [    ] o.a.s.c.c.SolrZkClient makePath: /overseer_elect/election
   [junit4]   2> 1788449 INFO  (TEST-TestReqParamsAPI.test-seed#[D6177184D9890A3F]) [    ] o.a.s.c.Overseer Overseer (id=null) closing
   [junit4]   2> 1788449 INFO  (TEST-TestReqParamsAPI.test-seed#[D6177184D9890A3F]) [    ] o.a.s.c.LeaderElector Joined leadership election with path: /overseer_elect/election/95608234358538244-127.0.0.1:38885_-n_0000000000
   [junit4]   2> 1788449 INFO  (TEST-TestReqParamsAPI.test-seed#[D6177184D9890A3F]) [    ] o.a.s.c.OverseerElectionContext I am going to be the leader 127.0.0.1:38885_
   [junit4]   2> 1788449 INFO  (TEST-TestReqParamsAPI.test-seed#[D6177184D9890A3F]) [    ] o.a.s.c.c.SolrZkClient makePath: /overseer_elect/leader
   [junit4]   2> 1788450 INFO  (TEST-TestReqParamsAPI.test-seed#[D6177184D9890A3F]) [    ] o.a.s.c.Overseer Overseer (id=95608234358538244-127.0.0.1:38885_-n_0000000000) starting
   [junit4]   2> 1788451 INFO  (TEST-TestReqParamsAPI.test-seed#[D6177184D9890A3F]) [    ] o.a.s.c.c.SolrZkClient makePath: /overseer/queue-work
   [junit4]   2> 1788452 INFO  (TEST-TestReqParamsAPI.test-seed#[D6177184D9890A3F]) [    ] o.a.s.c.OverseerAutoReplicaFailoverThread Starting OverseerAutoReplicaFailoverThread autoReplicaFailoverWorkLoopDelay=10000 autoReplicaFailoverWaitAfterExpiration=30000 autoReplicaFailoverBadNodeExpiration=60000
   [junit4]   2> 1788452 INFO  (OverseerCollectionConfigSetProcessor-95608234358538244-127.0.0.1:38885_-n_0000000000) [    ] o.a.s.c.OverseerTaskProcessor Process current queue of overseer operations
   [junit4]   2> 1788453 INFO  (OverseerStateUpdate-95608234358538244-127.0.0.1:38885_-n_0000000000) [    ] o.a.s.c.Overseer Starting to work on the main queue
   [junit4]   2> 1788453 INFO  (TEST-TestReqParamsAPI.test-seed#[D6177184D9890A3F]) [    ] o.a.s.c.ZkController Register node as live in ZooKeeper:/live_nodes/127.0.0.1:38885_
   [junit4]   2> 1788453 INFO  (TEST-TestReqParamsAPI.test-seed#[D6177184D9890A3F]) [    ] o.a.s.c.c.SolrZkClient makePath: /live_nodes/127.0.0.1:38885_
   [junit4]   2> 1788454 INFO  (OverseerStateUpdate-95608234358538244-127.0.0.1:38885_-n_0000000000) [    ] o.a.s.c.c.ZkStateReader Updated live nodes from ZooKeeper... (0) -> (0)
   [junit4]   2> 1788454 INFO  (zkCallback-2189-thread-1) [    ] o.a.s.c.c.ZkStateReader A live node change: [WatchedEvent state:SyncConnected type:NodeChildrenChanged path:/live_nodes], has occurred - updating... (live nodes size: [0])
   [junit4]   2> 1788454 INFO  (zkCallback-2189-thread-1) [    ] o.a.s.c.c.ZkStateReader Updated live nodes from ZooKeeper... (0) -> (1)
   [junit4]   2> 1788458 INFO  (TEST-TestReqParamsAPI.test-seed#[D6177184D9890A3F]) [    ] o.a.s.c.CoreContainer Security conf doesn't exist. Skipping setup for authorization module.
   [junit4]   2> 1788458 INFO  (TEST-TestReqParamsAPI.test-seed#[D6177184D9890A3F]) [    ] o.a.s.c.CoreContainer No authentication plugin used.
   [junit4]   2> 1788458 INFO  (TEST-TestReqParamsAPI.test-seed#[D6177184D9890A3F]) [    ] o.a.s.c.CorePropertiesLocator Looking for core definitions underneath /home/jenkins/workspace/Lucene-Solr-6.x-Linux/solr/build/solr-core/test/J0/temp/solr.handler.TestReqParamsAPI_D6177184D9890A3F-001/control-001/cores
   [junit4]   2> 1788459 INFO  (TEST-TestReqParamsAPI.test-seed#[D6177184D9890A3F]) [    ] o.a.s.c.CoreDescriptor Created CoreDescriptor: {name=collection1, config=solrconfig.xml, transient=false, schema=schema.xml, loadOnStartup=true, configSetProperties=configsetprops.json, collection=control_collection, coreNodeName=, dataDir=data/, shard=}
   [junit4]   2> 1788459 INFO  (TEST-TestReqParamsAPI.test-seed#[D6177184D9890A3F]) [    ] o.a.s.c.CorePropertiesLocator Found core collection1 in /home/jenkins/workspace/Lucene-Solr-6.x-Linux/solr/build/solr-core/test/J0/temp/solr.handler.TestReqParamsAPI_D6177184D9890A3F-001/control-001/cores/collection1
   [junit4]   2> 1788459 INFO  (TEST-TestReqParamsAPI.test-seed#[D6177184D9890A3F]) [    ] o.a.s.c.CorePropertiesLocator Found 1 core definitions
   [junit4]   2> 1788459 INFO  (TEST-TestReqParamsAPI.test-seed#[D6177184D9890A3F]) [    ] o.a.s.s.SolrDispatchFilter user.dir=/home/jenkins/workspace/Lucene-Solr-6.x-Linux/solr/build/solr-core/test/J0
   [junit4]   2> 1788459 INFO  (TEST-TestReqParamsAPI.test-seed#[D6177184D9890A3F]) [    ] o.a.s.s.SolrDispatchFilter SolrDispatchFilter.init() done
   [junit4]   2> 1788459 INFO  (coreLoadExecutor-6852-thread-1) [    ] o.a.s.c.ZkController publishing state=down
   [junit4]   2> 1788459 INFO  (coreLoadExecutor-6852-thread-1) [    ] o.a.s.c.ZkController numShards not found on descriptor - reading it from system property
   [junit4]   2> 1788460 INFO  (OverseerStateUpdate-95608234358538244-127.0.0.1:38885_-n_0000000000) [    ] o.a.s.c.Overseer processMessage: queueSize: 1, message = {
   [junit4]   2>   "core":"collection1",
   [junit4]   2>   "roles":null,
   [junit4]   2>   "base_url":"http://127.0.0.1:38885",
   [junit4]   2>   "node_name":"127.0.0.1:38885_",
   [junit4]   2>   "numShards":"1",
   [junit4]   2>   "state":"down",
   [junit4]   2>   "shard":null,
   [junit4]   2>   "collection":"control_collection",
   [junit4]   2>   "operation":"state"} current state version: 0
   [junit4]   2> 1788460 INFO  (coreLoadExecutor-6852-thread-1) [    ] o.a.s.c.ZkController look for our core node name
   [junit4]   2> 1788460 INFO  (OverseerStateUpdate-95608234358538244-127.0.0.1:38885_-n_0000000000) [    ] o.a.s.c.o.ReplicaMutator Update state numShards=1 message={
   [junit4]   2>   "core":"collection1",
   [junit4]   2>   "roles":null,
   [junit4]   2>   "base_url":"http://127.0.0.1:38885",
   [junit4]   2>   "node_name":"127.0.0.1:38885_",
   [junit4]   2>   "numShards":"1",
   [junit4]   2>   "state":"down",
   [junit4]   2>   "shard":null,
   [junit4]   2>   "collection":"control_collection",
   [junit4]   2>   "operation":"state"}
   [junit4]   2> 1788460 INFO  (OverseerStateUpdate-95608234358538244-127.0.0.1:38885_-n_0000000000) [    ] o.a.s.c.o.ClusterStateMutator building a new cName: control_collection
   [junit4]   2> 1788460 INFO  (OverseerStateUpdate-95608234358538244-127.0.0.1:38885_-n_0000000000) [    ] o.a.s.c.o.ReplicaMutator Assigning new node to shard shard=shard1
   [junit4]   2> 1788461 INFO  (zkCallback-2189-thread-1) [    ] o.a.s.c.c.ZkStateReader A cluster state change: [WatchedEvent state:SyncConnected type:NodeDataChanged path:/clusterstate.json], has occurred - updating... (live nodes size: [1])
   [junit4]   2> 1789460 INFO  (coreLoadExecutor-6852-thread-1) [    ] o.a.s.c.ZkController waiting to find shard id in clusterstate for collection1
   [junit4]   2> 1789460 INFO  (coreLoadExecutor-6852-thread-1) [    ] o.a.s.c.ZkController Check for collection zkNode:control_collection
   [junit4]   2> 1789461 INFO  (coreLoadExecutor-6852-thread-1) [    ] o.a.s.c.ZkController Collection zkNode exists
   [junit4]   2> 1789461 INFO  (coreLoadExecutor-6852-thread-1) [    ] o.a.s.c.c.ZkStateReader Load collection config from: [/collections/control_collection]
   [junit4]   2> 1789461 INFO  (coreLoadExecutor-6852-thread-1) [    ] o.a.s.c.c.ZkStateReader path=[/collections/control_collection] [configName]=[conf1] specified config exists in ZooKeeper
   [junit4]   2> 1789461 INFO  (coreLoadExecutor-6852-thread-1) [    ] o.a.s.c.SolrResourceLoader new SolrResourceLoader for directory: '/home/jenkins/workspace/Lucene-Solr-6.x-Linux/solr/build/solr-core/test/J0/temp/solr.handler.TestReqParamsAPI_D6177184D9890A3F-001/control-001/cores/collection1'
   [junit4]   2> 1789461 INFO  (coreLoadExecutor-6852-thread-1) [    ] o.a.s.c.SolrResourceLoader JNDI not configured for solr (NoInitialContextEx)
   [junit4]   2> 1789461 INFO  (coreLoadExecutor-6852-thread-1) [    ] o.a.s.c.SolrResourceLoader solr home defaulted to 'solr/' (could not find system property or JNDI)
   [junit4]   2> 1789462 INFO  (coreLoadExecutor-6852-thread-1) [    ] o.a.s.c.Config loaded config solrconfig.xml with version 0 
   [junit4]   2> 1789464 INFO  (coreLoadExecutor-6852-thread-1) [    ] o.a.s.c.SolrConfig current version of requestparams : -1
   [junit4]   2> 1789467 WARN  (coreLoadExecutor-6852-thread-1) [    ] o.a.s.c.Config Beginning with Solr 5.5, <mergePolicy> is deprecated, use <mergePolicyFactory> instead.
   [junit4]   2> 1789468 INFO  (coreLoadExecutor-6852-thread-1) [    ] o.a.s.c.SolrConfig Using Lucene MatchVersion: 6.1.0
   [junit4]   2> 1789474 INFO  (coreLoadExecutor-6852-thread-1) [    ] o.a.s.c.SolrConfig Loaded SolrConfig: solrconfig.xml
   [junit4]   2> 1789477 INFO  (coreLoadExecutor-6852-thread-1) [    ] o.a.s.s.IndexSchema [collection1] Schema name=test
   [junit4]   2> 1789541 INFO  (coreLoadExecutor-6852-thread-1) [    ] o.a.s.s.OpenExchangeRatesOrgProvider Initialized with rates=open-exchange-rates.json, refreshInterval=1440.
   [junit4]   2> 1789544 INFO  (coreLoadExecutor-6852-thread-1) [    ] o.a.s.s.IndexSchema default search field in schema is text
   [junit4]   2> 1789545 INFO  (coreLoadExecutor-6852-thread-1) [    ] o.a.s.s.IndexSchema unique key field: id
   [junit4]   2> 1789548 INFO  (coreLoadExecutor-6852-thread-1) [    ] o.a.s.s.FileExchangeRateProvider Reloading exchange rates from file currency.xml
   [junit4]   2> 1789549 INFO  (coreLoadExecutor-6852-thread-1) [    ] o.a.s.s.FileExchangeRateProvider Reloading exchange rates from file currency.xml
   [junit4]   2> 1789549 INFO  (coreLoadExecutor-6852-thread-1) [    ] o.a.s.s.OpenExchangeRatesOrgProvider Reloading exchange rates from open-exchange-rates.json
   [junit4]   2> 1789550 INFO  (coreLoadExecutor-6852-thread-1) [    ] o.a.s.s.OpenExchangeRatesOrgProvider Reloading exchange rates from open-exchange-rates.json
   [junit4]   2> 1789550 INFO  (coreLoadExecutor-6852-thread-1) [    ] o.a.s.c.ConfigSetProperties Did not find ConfigSet properties, assuming default properties: Can't find resource 'configsetprops.json' in classpath or '/configs/conf1', cwd=/home/jenkins/workspace/Lucene-Solr-6.x-Linux/solr/build/solr-core/test/J0
   [junit4]   2> 1789550 INFO  (coreLoadExecutor-6852-thread-1) [    ] o.a.s.c.CoreContainer Creating SolrCore 'collection1' using configuration from collection control_collection
   [junit4]   2> 1789550 INFO  (coreLoadExecutor-6852-thread-1) [    ] o.a.s.c.SolrCore org.apache.solr.core.MockDirectoryFactory
   [junit4]   2> 1789550 INFO  (coreLoadExecutor-6852-thread-1) [    ] o.a.s.c.SolrCore [[collection1] ] Opening new SolrCore at [/home/jenkins/workspace/Lucene-Solr-6.x-Linux/solr/build/solr-core/test/J0/temp/solr.handler.TestReqParamsAPI_D6177184D9890A3F-001/control-001/cores/collection1], dataDir=[/home/jenkins/workspace/Lucene-Solr-6.x-Linux/solr/build/solr-core/test/J0/temp/solr.handler.TestReqParamsAPI_D6177184D9890A3F-001/control-001/cores/collection1/data/]
   [junit4]   2> 1789551 INFO  (coreLoadExecutor-6852-thread-1) [    ] o.a.s.c.JmxMonitoredMap JMX monitoring is enabled. Adding Solr mbeans to JMX Server: com.sun.jmx.mbeanserver.JmxMBeanServer@52e83a0b
   [junit4]   2> 1789551 INFO  (coreLoadExecutor-6852-thread-1) [    ] o.a.s.c.CachingDirectoryFactory return new directory for /home/jenkins/workspace/Lucene-Solr-6.x-Linux/solr/build/solr-core/test/J0/temp/solr.handler.TestReqParamsAPI_D6177184D9890A3F-001/control-001/cores/collection1/data
   [junit4]   2> 1789551 INFO  (coreLoadExecutor-6852-thread-1) [    ] o.a.s.c.SolrCore New index directory detected: old=null new=/home/jenkins/workspace/Lucene-Solr-6.x-Linux/solr/build/solr-core/test/J0/temp/solr.handler.TestReqParamsAPI_D6177184D9890A3F-001/control-001/cores/collection1/data/index/
   [junit4]   2> 1789551 WARN  (coreLoadExecutor-6852-thread-1) [    ] o.a.s.c.SolrCore [collection1] Solr index directory '/home/jenkins/workspace/Lucene-Solr-6.x-Linux/solr/build/solr-core/test/J0/temp/solr.handler.TestReqParamsAPI_D6177184D9890A3F-001/control-001/cores/collection1/data/index' doesn't exist. Creating new index...
   [junit4]   2> 1789551 INFO  (coreLoadExecutor-6852-thread-1) [    ] o.a.s.c.CachingDirectoryFactory return new directory for /home/jenkins/workspace/Lucene-Solr-6.x-Linux/solr/build/solr-core/test/J0/temp/solr.handler.TestReqParamsAPI_D6177184D9890A3F-001/control-001/cores/collection1/data/index
   [junit4]   2> 1789551 INFO  (coreLoadExecutor-6852-thread-1) [    ] o.a.s.u.RandomMergePolicy RandomMergePolicy wrapping class org.apache.lucene.index.LogDocMergePolicy: [LogDocMergePolicy: minMergeSize=1000, mergeFactor=36, maxMergeSize=9223372036854775807, maxMergeSizeForForcedMerge=9223372036854775807, calibrateSizeByDeletes=true, maxMergeDocs=2147483647, maxCFSSegmentSizeMB=8.796093022207999E12, noCFSRatio=0.739140258321421]
   [junit4]   2> 1789552 INFO  (coreLoadExecutor-6852-thread-1) [    ] o.a.s.c.SolrDeletionPolicy SolrDeletionPolicy.onCommit: commits: num=1
   [junit4]   2> 	commit{dir=MockDirectoryWrapper(RAMDirectory@693f491c lockFactory=org.apache.lucene.store.SingleInstanceLockFactory@421e5e11),segFN=segments_1,generation=1}
   [junit4]   2> 1789552 INFO  (coreLoadExecutor-6852-thread-1) [    ] o.a.s.c.SolrDeletionPolicy newest commit generation = 1
   [junit4]   2> 1789552 INFO  (OldIndexDirectoryCleanupThreadForCore-collection1) [    ] o.a.s.c.SolrCore Looking for old index directories to cleanup for core collection1 in /home/jenkins/workspace/Lucene-Solr-6.x-Linux/solr/build/solr-core/test/J0/temp/solr.handler.TestReqParamsAPI_D6177184D9890A3F-001/control-001/cores/collection1/data/
   [junit4]   2> 1789552 WARN  (OldIndexDirectoryCleanupThreadForCore-collection1) [    ] o.a.s.c.DirectoryFactory /home/jenkins/workspace/Lucene-Solr-6.x-Linux/solr/build/solr-core/test/J0/temp/solr.handler.TestReqParamsAPI_D6177184D9890A3F-001/control-001/cores/collection1/data/ does not point to a valid data directory; skipping clean-up of old index directories.
   [junit4]   2> 1789553 INFO  (coreLoadExecutor-6852-thread-1) [    ] o.a.s.u.p.UpdateRequestProcessorChain creating updateRequestProcessorChain "nodistrib"
   [junit4]   2> 1789553 INFO  (coreLoadExecutor-6852-thread-1) [    ] o.a.s.u.p.UpdateRequestProcessorChain creating updateRequestProcessorChain "dedupe"
   [junit4]   2> 1789553 INFO  (coreLoadExecutor-6852-thread-1) [    ] o.a.s.u.p.UpdateRequestProcessorChain inserting DistributedUpdateProcessorFactory into updateRequestProcessorChain "dedupe"
   [junit4]   2> 1789553 INFO  (coreLoadExecutor-6852-thread-1) [    ] o.a.s.u.p.UpdateRequestProcessorChain creating updateRequestProcessorChain "stored_sig"
   [junit4]   2> 1789553 INFO  (coreLoadExecutor-6852-thread-1) [    ] o.a.s.u.p.UpdateRequestProcessorChain inserting DistributedUpdateProcessorFactory into updateRequestProcessorChain "stored_sig"
   [junit4]   2> 1789553 INFO  (coreLoadExecutor-6852-thread-1) [    ] o.a.s.u.p.UpdateRequestProcessorChain creating updateRequestProcessorChain "distrib-dup-test-chain-explicit"
   [junit4]   2> 1789553 INFO  (coreLoadExecutor-6852-thread-1) [    ] o.a.s.u.p.UpdateRequestProcessorChain creating updateRequestProcessorChain "distrib-dup-test-chain-implicit"
   [junit4]   2> 1789554 INFO  (coreLoadExecutor-6852-thread-1) [    ] o.a.s.u.p.UpdateRequestProcessorChain inserting DistributedUpdateProcessorFactory into updateRequestProcessorChain "distrib-dup-test-chain-implicit"
   [junit4]   2> 1789554 INFO  (coreLoadExecutor-6852-thread-1) [    ] o.a.s.c.SolrCore no updateRequestProcessorChain defined as default, creating implicit default
   [junit4]   2> 1789554 WARN  (coreLoadExecutor-6852-thread-1) [    ] o.a.s.c.RequestHandlers INVALID paramSet a in requestHandler {type = requestHandler,name = /dump,class = DumpRequestHandler,args = {defaults={a=A,b=B}}}
   [junit4]   2> 1789556 INFO  (coreLoadExecutor-6852-thread-1) [    ] o.a.s.h.l.XMLLoader xsltCacheLifetimeSeconds=60
   [junit4]   2> 1789556 INFO  (coreLoadExecutor-6852-thread-1) [    ] o.a.s.h.l.XMLLoader xsltCacheLifetimeSeconds=60
   [junit4]   2> 1789557 INFO  (coreLoadExecutor-6852-thread-1) [    ] o.a.s.h.l.XMLLoader xsltCacheLifetimeSeconds=60
   [junit4]   2> 1789557 INFO  (coreLoadExecutor-6852-thread-1) [    ] o.a.s.h.l.XMLLoader xsltCacheLifetimeSeconds=60
   [junit4]   2> 1789559 INFO  (coreLoadExecutor-6852-thread-1) [    ] o.a.s.c.RequestHandlers Registered paths: /admin/mbeans,standard,/dump,/update/csv,/sql,/update/json/docs,/admin/luke,/export,/admin/segments,/get,/admin/system,/replication,/admin/properties,/config,/stream,/schema,/admin/plugins,/admin/logging,/update/json,/admin/ping,/admin/threads,/update,/admin/file
   [junit4]   2> 1789559 INFO  (coreLoadExecutor-6852-thread-1) [    ] o.a.s.c.SolrCore Using default statsCache cache: org.apache.solr.search.stats.LocalStatsCache
   [junit4]   2> 1789559 INFO  (coreLoadExecutor-6852-thread-1) [    ] o.a.s.u.UpdateHandler Using UpdateLog implementation: org.apache.solr.update.UpdateLog
   [junit4]   2> 1789559 INFO  (coreLoadExecutor-6852-thread-1) [    ] o.a.s.u.UpdateLog Initializing UpdateLog: dataDir= defaultSyncLevel=FLUSH numRecordsToKeep=100 maxNumLogsToKeep=10 numVersionBuckets=65536
   [junit4]   2> 1789560 INFO  (coreLoadExecutor-6852-thread-1) [    ] o.a.s.u.CommitTracker Hard AutoCommit: disabled
   [junit4]   2> 1789560 INFO  (coreLoadExecutor-6852-thread-1) [    ] o.a.s.u.CommitTracker Soft AutoCommit: disabled
   [junit4]   2> 1789560 INFO  (coreLoadExecutor-6852-thread-1) [    ] o.a.s.u.RandomMergePolicy RandomMergePolicy wrapping class org.apache.lucene.index.TieredMergePolicy: [TieredMergePolicy: maxMergeAtOnce=17, maxMergeAtOnceExplicit=15, maxMergedSegmentMB=94.7060546875, floorSegmentMB=1.0302734375, forceMergeDeletesPctAllowed=3.6305636158173504, segmentsPerTier=12.0, maxCFSSegmentSizeMB=8.796093022207999E12, noCFSRatio=0.45662561102419985
   [junit4]   2> 1789560 INFO  (coreLoadExecutor-6852-thread-1) [    ] o.a.s.c.SolrDeletionPolicy SolrDeletionPolicy.onInit: commits: num=1
   [junit4]   2> 	commit{dir=MockDirectoryWrapper(RAMDirectory@693f491c lockFactory=org.apache.lucene.store.SingleInstanceLockFactory@421e5e11),segFN=segments_1,generation=1}
   [junit4]   2> 1789560 INFO  (coreLoadExecutor-6852-thread-1) [    ] o.a.s.c.SolrDeletionPolicy newest commit generation = 1
   [junit4]   2> 1789560 INFO  (coreLoadExecutor-6852-thread-1) [    ] o.a.s.s.SolrIndexSearcher Opening [Searcher@56d007c8[collection1] main]
   [junit4]   2> 1789560 INFO  (coreLoadExecutor-6852-thread-1) [    ] o.a.s.c.c.ZkStateReader Load collection config from: [/collections/control_collection]
   [junit4]   2> 1789561 INFO  (coreLoadExecutor-6852-thread-1) [    ] o.a.s.c.c.ZkStateReader path=[/collections/control_collection] [configName]=[conf1] specified config exists in ZooKeeper
   [junit4]   2> 1789561 INFO  (coreLoadExecutor-6852-thread-1) [    ] o.a.s.r.ManagedResourceStorage Setting up ZooKeeper-based storage for the RestManager with znodeBase: /configs/conf1
   [junit4]   2> 1789561 INFO  (coreLoadExecutor-6852-thread-1) [    ] o.a.s.r.ManagedResourceStorage Configured ZooKeeperStorageIO with znodeBase: /configs/conf1
   [junit4]   2> 1789561 INFO  (coreLoadExecutor-6852-thread-1) [    ] o.a.s.r.RestManager Initializing RestManager with initArgs: {}
   [junit4]   2> 1789561 INFO  (coreLoadExecutor-6852-thread-1) [    ] o.a.s.r.ManagedResourceStorage Reading _rest_managed.json using ZooKeeperStorageIO:path=/configs/conf1
   [junit4]   2> 1789561 INFO  (coreLoadExecutor-6852-thread-1) [    ] o.a.s.r.ManagedResourceStorage No data found for znode /configs/conf1/_rest_managed.json
   [junit4]   2> 1789561 INFO  (coreLoadExecutor-6852-thread-1) [    ] o.a.s.r.ManagedResourceStorage Loaded null at path _rest_managed.json using ZooKeeperStorageIO:path=/configs/conf1
   [junit4]   2> 1789561 INFO  (coreLoadExecutor-6852-thread-1) [    ] o.a.s.r.RestManager Initializing 0 registered ManagedResources
   [junit4]   2> 1789561 INFO  (coreLoadExecutor-6852-thread-1) [    ] o.a.s.h.ReplicationHandler Commits will be reserved for  10000
   [junit4]   2> 1789562 INFO  (searcherExecutor-6853-thread-1) [    ] o.a.s.c.SolrCore [collection1] Registered new searcher Searcher@56d007c8[collection1] main{ExitableDirectoryReader(UninvertingDirectoryReader())}
   [junit4]   2> 1789562 INFO  (coreLoadExecutor-6852-thread-1) [    ] o.a.s.u.UpdateLog Looking up max value of version field to seed version buckets
   [junit4]   2> 1789562 INFO  (coreLoadExecutor-6852-thread-1) [    ] o.a.s.u.VersionInfo Refreshing highest value of _version_ for 65536 version buckets from index
   [junit4]   2> 1789562 INFO  (coreLoadExecutor-6852-thread-1) [    ] o.a.s.u.VersionInfo No terms found for _version_, cannot seed version bucket highest value from index
   [junit4]   2> 1789562 INFO  (coreLoadExecutor-6852-thread-1) [    ] o.a.s.u.UpdateLog Could not find max version in index or recent updates, using new clock 1529731751092420608
   [junit4]   2> 1789563 INFO  (coreLoadExecutor-6852-thread-1) [    ] o.a.s.u.UpdateLog Took 1.0ms to seed version buckets with highest version 1529731751092420608
   [junit4]   2> 1789564 INFO  (coreLoadExecutor-6852-thread-1) [    ] o.a.s.c.ZkController watch zkdir /configs/conf1
   [junit4]   2> 1789564 INFO  (coreLoadExecutor-6852-thread-1) [    ] o.a.s.c.CoreContainer registering core: collection1
   [junit4]   2> 1789564 INFO  (coreZkRegister-6846-thread-1) [    ] o.a.s.c.ZkController Register replica - core:collection1 address:http://127.0.0.1:38885 collection:control_collection shard:shard1
   [junit4]   2> 1789564 INFO  (coreZkRegister-6846-thread-1) [    ] o.a.s.c.c.SolrZkClient makePath: /collections/control_collection/leader_elect/shard1/election
   [junit4]   2> 1789565 INFO  (coreZkRegister-6846-thread-1) [    ] o.a.s.c.LeaderElector Joined leadership election with path: /collections/control_collection/leader_elect/shard1/election/95608234358538244-core_node1-n_0000000000
   [junit4]   2> 1789566 INFO  (coreZkRegister-6846-thread-1) [    ] o.a.s.c.ShardLeaderElectionContext Running the leader process for shard=shard1 and weAreReplacement=false and leaderVoteWait=10000
   [junit4]   2> 1789567 INFO  (coreZkRegister-6846-thread-1) [    ] o.a.s.c.ShardLeaderElectionContext Enough replicas found to continue.
   [junit4]   2> 1789567 INFO  (coreZkRegister-6846-thread-1) [    ] o.a.s.c.ShardLeaderElectionContext I may be the new leader - try and sync
   [junit4]   2> 1789567 INFO  (coreZkRegister-6846-thread-1) [    ] o.a.s.c.SyncStrategy Sync replicas to http://127.0.0.1:38885/collection1/
   [junit4]   2> 1789567 INFO  (coreZkRegister-6846-thread-1) [    ] o.a.s.c.SyncStrategy Sync Success - now sync replicas to me
   [junit4]   2> 1789567 INFO  (coreZkRegister-6846-thread-1) [    ] o.a.s.c.SyncStrategy http://127.0.0.1:38885/collection1/ has no replicas
   [junit4]   2> 1789567 INFO  (OverseerStateUpdate-95608234358538244-127.0.0.1:38885_-n_0000000000) [    ] o.a.s.c.Overseer processMessage: queueSize: 1, message = {
   [junit4]   2>   "operation":"leader",
   [junit4]   2>   "shard":"shard1",
   [junit4]   2>   "collection":"control_collection"} current state version: 1
   [junit4]   2> 1789568 INFO  (coreZkRegister-6846-thread-1) [    ] o.a.s.c.c.SolrZkClient makePath: /collections/control_collection/leaders/shard1
   [junit4]   2> 1789568 INFO  (coreZkRegister-6846-thread-1) [    ] o.a.s.c.ShardLeaderElectionContextBase Creating leader registration node /collections/control_collection/leaders/shard1/leader after winning as /collections/control_collection/leader_elect/shard1/election/95608234358538244-core_node1-n_0000000000
   [junit4]   2> 1789569 INFO  (coreZkRegister-6846-thread-1) [    ] o.a.s.c.ShardLeaderElectionContext I am the new leader: http://127.0.0.1:38885/collection1/ shard1
   [junit4]   2> 1789569 INFO  (OverseerStateUpdate-95608234358538244-127.0.0.1:38885_-n_0000000000) [    ] o.a.s.c.Overseer processMessage: queueSize: 1, message = {
   [junit4]   2>   "operation":"leader",
   [junit4]   2>   "shard":"shard1",
   [junit4]   2>   "collection":"control_collection",
   [junit4]   2>   "base_url":"http://127.0.0.1:38885",
   [junit4]   2>   "core":"collection1",
   [junit4]   2>   "state":"active"} current state version: 1
   [junit4]   2> 1789670 INFO  (zkCallback-2189-thread-1) [    ] o.a.s.c.c.ZkStateReader A cluster state change: [WatchedEvent state:SyncConnected type:NodeDataChanged path:/clusterstate.json], has occurred - updating... (live nodes size: [1])
   [junit4]   2> 1789720 INFO  (coreZkRegister-6846-thread-1) [    ] o.a.s.c.ZkController We are http://127.0.0.1:38885/collection1/ and leader is http://127.0.0.1:38885/collection1/
   [junit4]   2> 1789720 INFO  (coreZkRegister-6846-thread-1) [    ] o.a.s.c.ZkController No LogReplay needed for core=collection1 baseURL=http://127.0.0.1:38885
   [junit4]   2> 1789720 INFO  (coreZkRegister-6846-thread-1) [    ] o.a.s.c.ZkController I am the leader, no recovery necessary
   [junit4]   2> 1789720 INFO  (coreZkRegister-6846-thread-1) [    ] o.a.s.c.ZkController publishing state=active
   [junit4]   2> 1789720 INFO  (coreZkRegister-6846-thread-1) [    ] o.a.s.c.ZkController numShards not found on descriptor - reading it from system property
   [junit4]   2> 1789720 INFO  (OverseerStateUpdate-95608234358538244-127.0.0.1:38885_-n_0000000000) [    ] o.a.s.c.Overseer processMessage: queueSize: 1, message = {
   [junit4]   2>   "core":"collection1",
   [junit4]   2>   "core_node_name":"core_node1",
   [junit4]   2>   "roles":null,
   [junit4]   2>   "base_url":"http://127.0.0.1:38885",
   [junit4]   2>   "node_name":"127.0.0.1:38885_",
   [junit4]   2>   "numShards":"1",
   [junit4]   2>   "state":"active",
   [junit4]   2>   "shard":"shard1",
   [junit4]   2>   "collection":"control_collection",
   [junit4]   2>   "operation":"state"} current state version: 2
   [junit4]   2> 1789721 INFO  (OverseerStateUpdate-95608234358538244-127.0.0.1:38885_-n_0000000000) [    ] o.a.s.c.o.ReplicaMutator Update state numShards=1 message={
   [junit4]   2>   "core":"collection1",
   [junit4]   2>   "core_node_name":"core_node1",
   [junit4]   2>   "roles":null,
   [junit4]   2>   "base_url":"http://127.0.0.1:38885",
   [junit4]   2>   "node_name":"127.0.0.1:38885_",
   [junit4]   2>   "numShards":"1",
   [junit4]   2>   "state":"active",
   [junit4]   2>   "shard":"shard1",
   [junit4]   2>   "collection":"control_collection",
   [junit4]   2>   "operation":"state"}
   [junit4]   2> 1789822 INFO  (zkCallback-2189-thread-1) [    ] o.a.s.c.c.ZkStateReader A cluster state change: [WatchedEvent state:SyncConnected type:NodeDataChanged path:/clusterstate.json], has occurred - updating... (live nodes size: [1])
   [junit4]   2> 1789960 INFO  (TEST-TestReqParamsAPI.test-seed#[D6177184D9890A3F]) [    ] o.a.s.c.c.SolrZkClient Using default ZkCredentialsProvider
   [junit4]   2> 1789961 INFO  (TEST-TestReqParamsAPI.test-seed#[D6177184D9890A3F]) [    ] o.a.s.c.c.ConnectionManager Waiting for client to connect to ZooKeeper
   [junit4]   2> 1789961 INFO  (zkCallback-2191-thread-1) [    ] o.a.s.c.c.ConnectionManager Watcher org.apache.solr.common.cloud.ConnectionManager@5953caaf name:ZooKeeperConnection Watcher:127.0.0.1:45173/solr got event WatchedEvent state:SyncConnected type:None path:null path:null type:None
   [junit4]   2> 1789961 INFO  (TEST-TestReqParamsAPI.test-seed#[D6177184D9890A3F]) [    ] o.a.s.c.c.ConnectionManager Client is connected to ZooKeeper
   [junit4]   2> 1789961 INFO  (TEST-TestReqParamsAPI.test-seed#[D6177184D9890A3F]) [    ] o.a.s.c.c.SolrZkClient Using default ZkACLProvider
   [junit4]   2> 1789961 INFO  (TEST-TestReqParamsAPI.test-seed#[D6177184D9890A3F]) [    ] o.a.s.c.c.ZkStateReader Updating cluster state from ZooKeeper... 
   [junit4]   2> 1789962 INFO  (TEST-TestReqParamsAPI.test-seed#[D6177184D9890A3F]) [    ] o.a.s.c.c.ZkStateReader Updated live nodes from ZooKeeper... (0) -> (1)
   [junit4]   2> 1789962 INFO  (TEST-TestReqParamsAPI.test-seed#[D6177184D9890A3F]) [    ] o.a.s.c.ChaosMonkey monkey: init - expire sessions:false cause connection loss:false
   [junit4]   2> 1789962 INFO  (TEST-TestReqParamsAPI.test-seed#[D6177184D9890A3F]) [    ] o.a.s.c.AbstractFullDistribZkTestBase Creating collection1 with stateFormat=2
   [junit4]   2> 1789963 INFO  (TEST-TestReqParamsAPI.test-seed#[D6177184D9890A3F]) [    ] o.a.s.c.c.SolrZkClient Using default ZkCredentialsProvider
   [junit4]   2> 1789963 INFO  (TEST-TestReqParamsAPI.test-seed#[D6177184D9890A3F]) [    ] o.a.s.c.c.ConnectionManager Waiting for client to connect to ZooKeeper
   [junit4]   2> 1789963 INFO  (zkCallback-2192-thread-1) [    ] o.a.s.c.c.ConnectionManager Watcher org.apache.solr.common.cloud.ConnectionManager@1be1c4 name:ZooKeeperConnection Watcher:127.0.0.1:45173/solr got event WatchedEvent state:SyncConnected type:None path:null path:null type:None
   [junit4]   2> 1789963 INFO  (TEST-TestReqParamsAPI.test-seed#[D6177184D9890A3F]) [    ] o.a.s.c.c.ConnectionManager Client is connected to ZooKeeper
   [junit4]   2> 1789963 INFO  (TEST-TestReqParamsAPI.test-seed#[D6177184D9890A3F]) [    ] o.a.s.c.c.SolrZkClient Using default ZkACLProvider
   [junit4]   2> 1789964 INFO  (OverseerStateUpdate-95608234358538244-127.0.0.1:38885_-n_0000000000) [    ] o.a.s.c.Overseer processMessage: queueSize: 1, message = {
   [junit4]   2>   "operation":"create",
   [junit4]   2>   "name":"collection1",
   [junit4]   2>   "numShards":"2",
   [junit4]   2>   "stateFormat":"2"} current state version: 3
   [junit4]   2> 1789964 INFO  (OverseerStateUpdate-95608234358538244-127.0.0.1:38885_-n_0000000000) [    ] o.a.s.c.o.ClusterStateMutator building a new cName: collection1
   [junit4]   2> 1790011 INFO  (TEST-TestReqParamsAPI.test-seed#[D6177184D9890A3F]) [    ] o.a.s.SolrTestCaseJ4 Writing core.properties file to /home/jenkins/workspace/Lucene-Solr-6.x-Linux/solr/build/solr-core/test/J0/temp/solr.handler.TestReqParamsAPI_D6177184D9890A3F-001/shard-1-001/cores/collection1
   [junit4]   2> 1790011 INFO  (TEST-TestReqParamsAPI.test-seed#[D6177184D9890A3F]) [    ] o.a.s.c.AbstractFullDistribZkTestBase create jetty 1 in directory /home/jenkins/workspace/Lucene-Solr-6.x-Linux/solr/build/solr-core/test/J0/temp/solr.handler.TestReqParamsAPI_D6177184D9890A3F-001/shard-1-001
   [junit4]   2> 1790012 INFO  (TEST-TestReqParamsAPI.test-seed#[D6177184D9890A3F]) [    ] o.e.j.s.Server jetty-9.3.8.v20160314
   [junit4]   2> 1790013 INFO  (TEST-TestReqParamsAPI.test-seed#[D6177184D9890A3F]) [    ] o.e.j.s.h.ContextHandler Started o.e.j.s.ServletContextHandler@60cc1a6{/,null,AVAILABLE}
   [junit4]   2> 1790013 INFO  (TEST-TestReqParamsAPI.test-seed#[D6177184D9890A3F]) [    ] o.e.j.s.ServerConnector Started ServerConnector@4cef73e0{HTTP/1.1,[http/1.1]}{127.0.0.1:39806}
   [junit4]   2> 1790013 INFO  (TEST-TestReqParamsAPI.test-seed#[D6177184D9890A3F]) [    ] o.e.j.s.Server Started @1792035ms
   [junit4]   2> 1790013 INFO  (TEST-TestReqParamsAPI.test-seed#[D6177184D9890A3F]) [    ] o.a.s.c.s.e.JettySolrRunner Jetty properties: {solr.data.dir=/home/jenkins/workspace/Lucene-Solr-6.x-Linux/solr/build/solr-core/test/J0/temp/solr.handler.TestReqParamsAPI_D6177184D9890A3F-001/tempDir-001/jetty1, solrconfig=solrconfig.xml, hostContext=/, hostPort=39806, coreRootDirectory=/home/jenkins/workspace/Lucene-Solr-6.x-Linux/solr/build/solr-core/test/J0/../../../../../../../../../home/jenkins/workspace/Lucene-Solr-6.x-Linux/solr/build/solr-core/test/J0/temp/solr.handler.TestReqParamsAPI_D6177184D9890A3F-001/shard-1-001/cores}
   [junit4]   2> 1790013 INFO  (TEST-TestReqParamsAPI.test-seed#[D6177184D9890A3F]) [    ] o.a.s.s.SolrDispatchFilter SolrDispatchFilter.init(): jdk.internal.loader.ClassLoaders$AppClassLoader@61443d8f
   [junit4]   2> 1790013 INFO  (TEST-TestReqParamsAPI.test-seed#[D6177184D9890A3F]) [    ] o.a.s.c.SolrResourceLoader new SolrResourceLoader for directory: '/home/jenkins/workspace/Lucene-Solr-6.x-Linux/solr/build/solr-core/test/J0/temp/solr.handler.TestReqParamsAPI_D6177184D9890A3F-001/shard-1-001'
   [junit4]   2> 1790013 INFO  (TEST-TestReqParamsAPI.test-seed#[D6177184D9890A3F]) [    ] o.a.s.c.SolrResourceLoader JNDI not configured for solr (NoInitialContextEx)
   [junit4]   2> 1790013 INFO  (TEST-TestReqParamsAPI.test-seed#[D6177184D9890A3F]) [    ] o.a.s.c.SolrResourceLoader solr home defaulted to 'solr/' (could not find system property or JNDI)
   [junit4]   2> 1790013 INFO  (TEST-TestReqParamsAPI.test-seed#[D6177184D9890A3F]) [    ] o.a.s.c.c.SolrZkClient Using default ZkCredentialsProvider
   [junit4]   2> 1790014 INFO  (TEST-TestReqParamsAPI.test-seed#[D6177184D9890A3F]) [    ] o.a.s.c.c.ConnectionManager Waiting for client to connect to ZooKeeper
   [junit4]   2> 1790014 INFO  (zkCallback-2193-thread-1) [    ] o.a.s.c.c.ConnectionManager Watcher org.apache.solr.common.cloud.ConnectionManager@2871a3dc name:ZooKeeperConnection Watcher:127.0.0.1:45173/solr got event WatchedEvent state:SyncConnected type:None path:null path:null type:None
   [junit4]   2> 1790014 INFO  (TEST-TestReqParamsAPI.test-seed#[D6177184D9890A3F]) [    ] o.a.s.c.c.ConnectionManager Client is connected to ZooKeeper
   [junit4]   2> 1790015 INFO  (TEST-TestReqParamsAPI.test-seed#[D6177184D9890A3F]) [    ] o.a.s.c.c.SolrZkClient Using default ZkACLProvider
   [junit4]   2> 1790015 INFO  (TEST-TestReqParamsAPI.test-seed#[D6177184D9890A3F]) [    ] o.a.s.s.SolrDispatchFilter Loading solr.xml from SolrHome (not found in ZooKeeper)
   [junit4]   2> 1790015 INFO  (TEST-TestReqParamsAPI.test-seed#[D6177184D9890A3F]) [    ] o.a.s.c.SolrXmlConfig Loading container configuration from /home/jenkins/workspace/Lucene-Solr-6.x-Linux/solr/build/solr-core/test/J0/temp/solr.handler.TestReqParamsAPI_D6177184D9890A3F-001/shard-1-001/solr.xml
   [junit4]   2> 1790018 INFO  (TEST-TestReqParamsAPI.test-seed#[D6177184D9890A3F]) [    ] o.a.s.c.CorePropertiesLocator Config-defined core root directory: /home/jenkins/workspace/Lucene-Solr-6.x-Linux/solr/build/solr-core/test/J0/../../../../../../../../../home/jenkins/workspace/Lucene-Solr-6.x-Linux/solr/build/solr-core/test/J0/temp/solr.handler.TestReqParamsAPI_D6177184D9890A3F-001/shard-1-001/cores
   [junit4]   2> 1790018 INFO  (TEST-TestReqParamsAPI.test-seed#[D6177184D9890A3F]) [    ] o.a.s.c.CoreContainer New CoreContainer 990117692
   [junit4]   2> 1790018 INFO  (TEST-TestReqParamsAPI.test-seed#[D6177184D9890A3F]) [    ] o.a.s.c.CoreContainer Loading cores into CoreContainer [instanceDir=/home/jenkins/workspace/Lucene-Solr-6.x-Linux/solr/build/solr-core/test/J0/temp/solr.handler.TestReqParamsAPI_D6177184D9890A3F-001/shard-1-001]
   [junit4]   2> 1790018 WARN  (TEST-TestReqParamsAPI.test-seed#[D6177184D9890A3F]) [    ] o.a.s.c.CoreContainer Couldn't add files from /home/jenkins/workspace/Lucene-Solr-6.x-Linux/solr/build/solr-core/test/J0/temp/solr.handler.TestReqParamsAPI_D6177184D9890A3F-001/shard-1-001/lib to classpath: /home/jenkins/workspace/Lucene-Solr-6.x-Linux/solr/build/solr-core/test/J0/temp/solr.handler.TestReqParamsAPI_D6177184D9890A3F-001/shard-1-001/lib
   [junit4]   2> 1790018 INFO  (TEST-TestReqParamsAPI.test-seed#[D6177184D9890A3F]) [    ] o.a.s.h.c.HttpShardHandlerFactory created with socketTimeout : 90000,urlScheme : ,connTimeout : 15000,maxConnectionsPerHost : 20,maxConnections : 10000,corePoolSize : 0,maximumPoolSize : 2147483647,maxThreadIdleTime : 5,sizeOfQueue : -1,fairnessPolicy : false,useRetries : false,
   [junit4]   2> 1790019 INFO  (TEST-TestReqParamsAPI.test-seed#[D6177184D9890A3F]) [    ] o.a.s.u.UpdateShardHandler Creating UpdateShardHandler HTTP client with params: socketTimeout=340000&connTimeout=45000&retry=true
   [junit4]   2> 1790019 INFO  (TEST-TestReqParamsAPI.test-seed#[D6177184D9890A3F]) [    ] o.a.s.l.LogWatcher SLF4J impl is org.slf4j.impl.Log4jLoggerFactory
   [junit4]   2> 1790019 INFO  (TEST-TestReqParamsAPI.test-seed#[D6177184D9890A3F]) [    ] o.a.s.l.LogWatcher Registering Log Listener [Log4j (org.slf4j.impl.Log4jLoggerFactory)]
   [junit4]   2> 1790019 INFO  (TEST-TestReqParamsAPI.test-seed#[D6177184D9890A3F]) [    ] o.a.s.c.ZkContainer Zookeeper client=127.0.0.1:45173/solr
   [junit4]   2> 1790019 INFO  (TEST-TestReqParamsAPI.test-seed#[D6177184D9890A3F]) [    ] o.a.s.c.ZkController zkHost includes chroot
   [junit4]   2> 1790019 INFO  (TEST-TestReqParamsAPI.test-seed#[D6177184D9890A3F]) [    ] o.a.s.c.c.SolrZkClient Using default ZkCredentialsProvider
   [junit4]   2> 1790019 INFO  (TEST-TestReqParamsAPI.test-seed#[D6177184D9890A3F]) [    ] o.a.s.c.c.ConnectionManager Waiting for client to connect to ZooKeeper
   [junit4]   2> 1790020 INFO  (zkCallback-2196-thread-1) [    ] o.a.s.c.c.ConnectionManager Watcher org.apache.solr.common.cloud.ConnectionManager@ec8357e name:ZooKeeperConnection Watcher:127.0.0.1:45173 got event WatchedEvent state:SyncConnected type:None path:null path:null type:None
   [junit4]   2> 1790020 INFO  (TEST-TestReqParamsAPI.test-seed#[D6177184D9890A3F]) [    ] o.a.s.c.c.ConnectionManager Client is connected to ZooKeeper
   [junit4]   2> 1790020 INFO  (TEST-TestReqParamsAPI.test-seed#[D6177184D9890A3F]) [    ] o.a.s.c.c.SolrZkClient Using default ZkACLProvider
   [junit4]   2> 1790021 INFO  (TEST-TestReqParamsAPI.test-seed#[D6177184D9890A3F]) [    ] o.a.s.c.c.ConnectionManager Waiting for client to connect to ZooKeeper
   [junit4]   2> 1790021 INFO  (zkCallback-2197-thread-1) [    ] o.a.s.c.c.ConnectionManager Watcher org.apache.solr.common.cloud.ConnectionManager@4b10ee15 name:ZooKeeperConnection Watcher:127.0.0.1:45173/solr got event WatchedEvent state:SyncConnected type:None path:null path:null type:None
   [junit4]   2> 1790021 INFO  (TEST-TestReqParamsAPI.test-seed#[D6177184D9890A3F]) [    ] o.a.s.c.c.ConnectionManager Client is connected to ZooKeeper
   [junit4]   2> 1790023 INFO  (TEST-TestReqParamsAPI.test-seed#[D6177184D9890A3F]) [    ] o.a.s.c.c.ZkStateReader Updating cluster state from ZooKeeper... 
   [junit4]   2> 1790024 INFO  (TEST-TestReqParamsAPI.test-seed#[D6177184D9890A3F]) [    ] o.a.s.c.c.ZkStateReader Updated live nodes from ZooKeeper... (0) -> (1)
   [junit4]   2> 1790024 INFO  (TEST-TestReqParamsAPI.test-seed#[D6177184D9890A3F]) [    ] o.a.s.c.Overseer Overseer (id=null) closing
   [junit4]   2> 1790025 INFO  (TEST-TestReqParamsAPI.test-seed#[D6177184D9890A3F]) [    ] o.a.s.c.LeaderElector Joined leadership election with path: /overseer_elect/election/95608234358538249-127.0.0.1:39806_-n_0000000001
   [junit4]   2> 1790025 INFO  (TEST-TestReqParamsAPI.test-seed#[D6177184D9890A3F]) [    ] o.a.s.c.LeaderElector Watching path /overseer_elect/election/95608234358538244-127.0.0.1:38885_-n_0000000000 to know if I could be the leader
   [junit4]   2> 1790025 INFO  (TEST-TestReqParamsAPI.test-seed#[D6177184D9890A3F]) [    ] o.a.s.c.ZkController Publish node=127.0.0.1:39806_ as DOWN
   [junit4]   2> 1790026 INFO  (OverseerStateUpdate-95608234358538244-127.0.0.1:38885_-n_0000000000) [    ] o.a.s.c.Overseer processMessage: queueSize: 1, message = {
   [junit4]   2>   "operation":"downnode",
   [junit4]   2>   "node_name":"127.0.0.1:39806_"} current state version: 3
   [junit4]   2> 1790026 INFO  (OverseerStateUpdate-95608234358538244-127.0.0.1:38885_-n_0000000000) [    ] o.a.s.c.o.NodeMutator DownNode state invoked for node: 127.0.0.1:39806_
   [junit4]   2> 1790026 INFO  (OverseerStateUpdate-95608234358538244-127.0.0.1:38885_-n_0000000000) [    ] o.a.s.c.o.ZkStateWriter going to create_collection /collections/collection1/state.json
   [junit4]   2> 1790127 INFO  (zkCallback-2189-thread-2) [    ] o.a.s.c.c.ZkStateReader A cluster state change: [WatchedEvent state:SyncConnected type:NodeDataChanged path:/clusterstate.json], has occurred - updating... (live nodes size: [1])
   [junit4]   2> 1790127 INFO  (zkCallback-2197-thread-1) [    ] o.a.s.c.c.ZkStateReader A cluster state change: [WatchedEvent state:SyncConnected type:NodeDataChanged path:/clusterstate.json], has occurred - updating... (live nodes size: [1])
   [junit4]   2> 1790127 INFO  (zkCallback-2191-thread-1) [    ] o.a.s.c.c.ZkStateReader A cluster state change: [WatchedEvent state:SyncConnected type:NodeDataChanged path:/clusterstate.json], has occurred - updating... (live nodes size: [1])
   [junit4]   2> 1791026 INFO  (TEST-TestReqParamsAPI.test-seed#[D6177184D9890A3F]) [    ] o.a.s.c.ZkController Register node as live in ZooKeeper:/live_nodes/127.0.0.1:39806_
   [junit4]   2> 1791026 INFO  (TEST-TestReqParamsAPI.test-seed#[D6177184D9890A3F]) [    ] o.a.s.c.c.SolrZkClient makePath: /live_nodes/127.0.0.1:39806_
   [junit4]   2> 1791027 INFO  (zkCallback-2189-thread-2) [    ] o.a.s.c.c.ZkStateReader A live node change: [WatchedEvent state:SyncConnected type:NodeChildrenChanged path:/live_nodes], has occurred - updating... (live nodes size: [1])
   [junit4]   2> 1791027 INFO  (zkCallback-2191-thread-1) [    ] o.a.s.c.c.ZkStateReader A live node change: [WatchedEvent state:SyncConnected type:NodeChildrenChanged path:/live_nodes], has occurred - updating... (live nodes size: [1])
   [junit4]   2> 1791027 INFO  (zkCallback-2197-thread-1) [    ] o.a.s.c.c.ZkStateReader A live node change: [WatchedEvent state:SyncConnected type:NodeChildrenChanged path:/live_nodes], has occurred - updating... (live nodes size: [1])
   [junit4]   2> 1791027 INFO  (zkCallback-2189-thread-2) [    ] o.a.s.c.c.ZkStateReader Updated live nodes from ZooKeeper... (1) -> (2)
   [junit4]   2> 1791027 INFO  (zkCallback-2191-thread-1) [    ] o.a.s.c.c.ZkStateReader Updated live nodes from ZooKeeper... (1) -> (2)
   [junit4]   2> 1791027 INFO  (zkCallback-2197-thread-1) [    ] o.a.s.c.c.ZkStateReader Updated live nodes from ZooKeeper... (1) -> (2)
   [junit4]   2> 1791030 INFO  (TEST-TestReqParamsAPI.test-seed#[D6177184D9890A3F]) [    ] o.a.s.c.CoreContainer Security conf doesn't exist. Skipping setup for authorization module.
   [junit4]   2> 1791030 INFO  (TEST-TestReqParamsAPI.test-seed#[D6177184D9890A3F]) [    ] o.a.s.c.CoreContainer No authentication plugin used.
   [junit4]   2> 1791031 INFO  (TEST-TestReqParamsAPI.test-seed#[D6177184D9890A3F]) [    ] o.a.s.c.CorePropertiesLocator Looking for core definitions underneath /home/jenkins/workspace/Lucene-Solr-6.x-Linux/solr/build/solr-core/test/J0/../../../../../../../../../home/jenkins/workspace/Lucene-Solr-6.x-Linux/solr/build/solr-core/test/J0/temp/solr.handler.TestReqParamsAPI_D6177184D9890A3F-001/shard-1-001/cores
   [junit4]   2> 1791031 INFO  (TEST-TestReqParamsAPI.test-seed#[D6177184D9890A3F]) [    ] o.a.s.c.CoreDescriptor Created CoreDescriptor: {name=collection1, config=solrconfig.xml, transient=false, schema=schema.xml, loadOnStartup=true, configSetProperties=configsetprops.json, collection=collection1, coreNodeName=, dataDir=data/, shard=}
   [junit4]   2> 1791031 INFO  (TEST-TestReqParamsAPI.test-seed#[D6177184D9890A3F]) [    ] o.a.s.c.CorePropertiesLocator Found core collection1 in /home/jenkins/workspace/Lucene-Solr-6.x-Linux/solr/build/solr-core/test/J0/../../../../../../../../../home/jenkins/workspace/Lucene-Solr-6.x-Linux/solr/build/solr-core/test/J0/temp/solr.handler.TestReqParamsAPI_D6177184D9890A3F-001/shard-1-001/cores/collection1
   [junit4]   2> 1791031 INFO  (TEST-TestReqParamsAPI.test-seed#[D6177184D9890A3F]) [    ] o.a.s.c.CorePropertiesLocator Found 1 core definitions
   [junit4]   2> 1791032 INFO  (TEST-TestReqParamsAPI.test-seed#[D6177184D9890A3F]) [    ] o.a.s.s.SolrDispatchFilter user.dir=/home/jenkins/workspace/Lucene-Solr-6.x-Linux/solr/build/solr-core/test/J0
   [junit4]   2> 1791032 INFO  (TEST-TestReqParamsAPI.test-seed#[D6177184D9890A3F]) [    ] o.a.s.s.SolrDispatchFilter SolrDispatchFilter.init() done
   [junit4]   2> 1791032 INFO  (coreLoadExecutor-6863-thread-1) [    ] o.a.s.c.ZkController publishing state=down
   [junit4]   2> 1791032 INFO  (coreLoadExecutor-6863-thread-1) [    ] o.a.s.c.ZkController numShards not found on descriptor - reading it from system property
   [junit4]   2> 1791032 INFO  (coreLoadExecutor-6863-thread-1) [    ] o.a.s.c.ZkController Registering watch for collection collection1
   [junit4]   2> 1791032 INFO  (coreLoadExecutor-6863-thread-1) [    ] o.a.s.c.c.ZkStateReader addZkWatch [collection1]
   [junit4]   2> 1791033 INFO  (OverseerStateUpdate-95608234358538244-127.0.0.1:38885_-n_0000000000) [    ] o.a.s.c.Overseer processMessage: queueSize: 1, message = {
   [junit4]   2>   "core":"collection1",
   [junit4]   2>   "roles":null,
   [junit4]   2>   "base_url":"http://127.0.0.1:39806",
   [junit4]   2>   "node_name":"127.0.0.1:39806_",
   [junit4]   2>   "numShards":"2",
   [junit4]   2>   "state":"down",
   [junit4]   2>   "shard":null,
   [junit4]   2>   "collection":"collection1",
   [junit4]   2>   "operation":"state"} current state version: 4
   [junit4]   2> 1791033 INFO  (coreLoadExecutor-6863-thread-1) [    ] o.a.s.c.c.ZkStateReader Add data for [collection1] ver [0]
   [junit4]   2> 1791033 INFO  (coreLoadExecutor-6863-thread-1) [    ] o.a.s.c.ZkController look for our core node name
   [junit4]   2> 1791033 INFO  (OverseerStateUpdate-95608234358538244-127.0.0.1:38885_-n_0000000000) [    ] o.a.s.c.o.ReplicaMutator Update state numShards=2 message={
   [junit4]   2>   "core":"collection1",
   [junit4]   2>   "roles":null,
   [junit4]   2>   "base_url":"http://127.0.0.1:39806",
   [junit4]   2>   "node_name":"127.0.0.1:39806_",
   [junit4]   2>   "numShards":"2",
   [junit4]   2>   "state":"down",
   [junit4]   2>   "shard":null,
   [junit4]   2>   "collection":"collection1",
   [junit4]   2>   "operation":"state"}
   [junit4]   2> 1791033 INFO  (OverseerStateUpdate-95608234358538244-127.0.0.1:38885_-n_0000000000) [    ] o.a.s.c.o.ReplicaMutator Collection already exists with numShards=2
   [junit4]   2> 1791033 INFO  (OverseerStateUpdate-95608234358538244-127.0.0.1:38885_-n_0000000000) [    ] o.a.s.c.o.ReplicaMutator Assigning new node to shard shard=shard2
   [junit4]   2> 1791134 INFO  (OverseerStateUpdate-95608234358538244-127.0.0.1:38885_-n_0000000000) [    ] o.a.s.c.o.ZkStateWriter going to update_collection /collections/collection1/state.json version: 0
   [junit4]   2> 1791134 INFO  (zkCallback-2197-thread-1) [    ] o.a.s.c.c.ZkStateReader A cluster state change: [WatchedEvent state:SyncConnected type:NodeDataChanged path:/collections/collection1/state.json] for collection [collection1] has occurred - updating... (live nodes size: [2])
   [junit4]   2> 1791134 INFO  (zkCallback-2197-thread-1) [    ] o.a.s.c.c.ZkStateReader Updating data for [collection1] from [0] to [1]
   [junit4]   2> 1792033 INFO  (coreLoadExecutor-6863-thread-1) [    ] o.a.s.c.ZkController waiting to find shard id in clusterstate for collection1
   [junit4]   2> 1792033 INFO  (coreLoadExecutor-6863-thread-1) [    ] o.a.s.c.ZkController Check for collection zkNode:collection1
   [junit4]   2> 1792033 INFO  (coreLoadExecutor-6863-thread-1) [    ] o.a.s.c.ZkController Collection zkNode exists
   [junit4]   2> 1792033 INFO  (coreLoadExecutor-6863-thread-1) [    ] o.a.s.c.c.ZkStateReader Load collection config from: [/collections/collection1]
   [junit4]   2> 1792034 INFO  (coreLoadExecutor-6863-thread-1) [    ] o.a.s.c.c.ZkStateReader path=[/collections/collection1] [configName]=[conf1] specified config exists in ZooKeeper
   [junit4]   2> 1792034 INFO  (coreLoadExecutor-6863-thread-1) [    ] o.a.s.c.SolrResourceLoader new SolrResourceLoader for directory: '/home/jenkins/workspace/Lucene-Solr-6.x-Linux/solr/build/solr-core/test/J0/temp/solr.handler.TestReqParamsAPI_D6177184D9890A3F-001/shard-1-001/cores/collection1'
   [junit4]   2> 1792034 INFO  (coreLoadExecutor-6863-thread-1) [    ] o.a.s.c.SolrResourceLoader JNDI not configured for solr (NoInitialContextEx)
   [junit4]   2> 1792034 INFO  (coreLoadExecutor-6863-thread-1) [    ] o.a.s.c.SolrResourceLoader solr home defaulted to 'solr/' (could not find system property or JNDI)
   [junit4]   2> 1792034 INFO  (coreLoadExecutor-6863-thread-1) [    ] o.a.s.c.Config loaded config solrconfig.xml with version 0 
   [junit4]   2> 1792037 INFO  (coreLoadExecutor-6863-thread-1) [    ] o.a.s.c.SolrConfig current version of requestparams : -1
   [junit4]   2> 1792040 WARN  (coreLoadExecutor-6863-thread-1) [    ] o.a.s.c.Config Beginning with Solr 5.5, <mergePolicy> is deprecated, use <mergePolicyFactory> instead.
   [junit4]   2> 1792040 INFO  (coreLoadExecutor-6863-thread-1) [    ] o.a.s.c.SolrConfig Using Lucene MatchVersion: 6.1.0
   [junit4]   2> 1792047 INFO  (coreLoadExecutor-6863-thread-1) [    ] o.a.s.c.SolrConfig Loaded SolrConfig: solrconfig.xml
   [junit4]   2> 1792050 INFO  (coreLoadExecutor-6863-thread-1) [    ] o.a.s.s.IndexSchema [collection1] Schema name=test
   [junit4]   2> 1792116 INFO  (coreLoadExecutor-6863-thread-1) [    ] o.a.s.s.OpenExchangeRatesOrgProvider Initialized with rates=open-exchange-rates.json, refreshInterval=1440.
   [junit4]   2> 1792119 INFO  (coreLoadExecutor-6863-thread-1) [    ] o.a.s.s.IndexSchema default search field in schema is text
   [junit4]   2> 1792120 INFO  (coreLoadExecutor-6863-thread-1) [    ] o.a.s.s.IndexSchema unique key field: id
   [junit4]   2> 1792123 INFO  (coreLoadExecutor-6863-thread-1) [    ] o.a.s.s.FileExchangeRateProvider Reloading exchange rates from file currency.xml
   [junit4]   2> 1792124 INFO  (coreLoadExecutor-6863-thread-1) [    ] o.a.s.s.FileExchangeRateProvider Reloading exchange rates from file currency.xml
   [junit4]   2> 1792124 INFO  (coreLoadExecutor-6863-thread-1) [    ] o.a.s.s.OpenExchangeRatesOrgProvider Reloading exchange rates from open-exchange-rates.json
   [junit4]   2> 1792125 INFO  (coreLoadExecutor-6863-thread-1) [    ] o.a.s.s.OpenExchangeRatesOrgProvider Reloading exchange rates from open-exchange-rates.json
   [junit4]   2> 1792125 INFO  (coreLoadExecutor-6863-thread-1) [    ] o.a.s.c.ConfigSetProperties Did not find ConfigSet properties, assuming default properties: Can't find resource 'configsetprops.json' in classpath or '/configs/conf1', cwd=/home/jenkins/workspace/Lucene-Solr-6.x-Linux/solr/build/solr-core/test/J0
   [junit4]   2> 1792125 INFO  (coreLoadExecutor-6863-thread-1) [    ] o.a.s.c.CoreContainer Creating SolrCore 'collection1' using configuration from collection collection1
   [junit4]   2> 1792125 INFO  (coreLoadExecutor-6863-thread-1) [    ] o.a.s.c.SolrCore org.apache.solr.core.MockDirectoryFactory
   [junit4]   2> 1792125 INFO  (coreLoadExecutor-6863-thread-1) [    ] o.a.s.c.SolrCore [[collection1] ] Opening new SolrCore at [/home/jenkins/workspace/Lucene-Solr-6.x-Linux/solr/build/solr-core/test/J0/temp/solr.handler.TestReqParamsAPI_D6177184D9890A3F-001/shard-1-001/cores/collection1], dataDir=[/home/jenkins/workspace/Lucene-Solr-6.x-Linux/solr/build/solr-core/test/J0/../../../../../../../../../home/jenkins/workspace/Lucene-Solr-6.x-Linux/solr/build/solr-core/test/J0/temp/solr.handler.TestReqParamsAPI_D6177184D9890A3F-001/shard-1-001/cores/collection1/data/]
   [junit4]   2> 1792125 INFO  (coreLoadExecutor-6863-thread-1) [    ] o.a.s.c.JmxMonitoredMap JMX monitoring is enabled. Adding Solr mbeans to JMX Server: com.sun.jmx.mbeanserver.JmxMBeanServer@52e83a0b
   [junit4]   2> 1792126 INFO  (coreLoadExecutor-6863-thread-1) [    ] o.a.s.c.CachingDirectoryFactory return new directory for /home/jenkins/workspace/Lucene-Solr-6.x-Linux/solr/build/solr-core/test/J0/../../../../../../../../../home/jenkins/workspace/Lucene-Solr-6.x-Linux/solr/build/solr-core/test/J0/temp/solr.handler.TestReqParamsAPI_D6177184D9890A3F-001/shard-1-001/cores/collection1/data
   [junit4]   2> 1792126 INFO  (coreLoadExecutor-6863-thread-1) [    ] o.a.s.c.SolrCore New index directory detected: old=null new=/home/jenkins/workspace/Lucene-Solr-6.x-Linux/solr/build/solr-core/test/J0/../../../../../../../../../home/jenkins/workspace/Lucene-Solr-6.x-Linux/solr/build/solr-core/test/J0/temp/solr.handler.TestReqParamsAPI_D6177184D9890A3F-001/shard-1-001/cores/collection1/data/index/
   [junit4]   2> 1792126 WARN  (coreLoadExecutor-6863-thread-1) [    ] o.a.s.c.SolrCore [collection1] Solr index directory '/home/jenkins/workspace/Lucene-Solr-6.x-Linux/solr/build/solr-core/test/J0/../../../../../../../../../home/jenkins/workspace/Lucene-Solr-6.x-Linux/solr/build/solr-core/test/J0/temp/solr.handler.TestReqParamsAPI_D6177184D9890A3F-001/shard-1-001/cores/collection1/data/index' doesn't exist. Creating new index...
   [junit4]   2> 1792126 INFO  (coreLoadExecutor-6863-thread-1) [    ] o.a.s.c.CachingDirectoryFactory return new directory for /home/jenkins/workspace/Lucene-Solr-6.x-Linux/solr/build/solr-core/test/J0/../../../../../../../../../home/jenkins/workspace/Lucene-Solr-6.x-Linux/solr/build/solr-core/test/J0/temp/solr.handler.TestReqParamsAPI_D6177184D9890A3F-001/shard-1-001/cores/collection1/data/index
   [junit4]   2> 1792126 INFO  (coreLoadExecutor-6863-thread-1) [    ] o.a.s.u.RandomMergePolicy RandomMergePolicy wrapping class org.apache.lucene.index.LogDocMergePolicy: [LogDocMergePolicy: minMergeSize=1000, mergeFactor=36, maxMergeSize=9223372036854775807, maxMergeSizeForForcedMerge=9223372036854775807, calibrateSizeByDeletes=true, maxMergeDocs=2147483647, maxCFSSegmentSizeMB=8.796093022207999E12, noCFSRatio=0.739140258321421]
   [junit4]   2> 1792127 INFO  (coreLoadExecutor-6863-thread-1) [    ] o.a.s.c.SolrDeletionPolicy SolrDeletionPolicy.onCommit: commits: num=1
   [junit4]   2> 	commit{dir=MockDirectoryWrapper(RAMDirectory@3e635c75 lockFactory=org.apache.lucene.store.SingleInstanceLockFactory@38cdeab5),segFN=segments_1,generation=1}
   [junit4]   2> 1792127 INFO  (coreLoadExecutor-6863-thread-1) [    ] o.a.s.c.SolrDeletionPolicy newest commit generation = 1
   [junit4]   2> 1792127 INFO  (OldIndexDirectoryCleanupThreadForCore-collection1) [    ] o.a.s.c.SolrCore Looking for old index directories to cleanup for core collection1 in /home/jenkins/workspace/Lucene-Solr-6.x-Linux/solr/build/solr-core/test/J0/../../../../../../../../../home/jenkins/workspace/Lucene-Solr-6.x-Linux/solr/build/solr-core/test/J0/temp/solr.handler.TestReqParamsAPI_D6177184D9890A3F-001/shard-1-001/cores/collection1/data/
   [junit4]   2> 1792127 WARN  (OldIndexDirectoryCleanupThreadForCore-collection1) [    ] o.a.s.c.DirectoryFactory /home/jenkins/workspace/Lucene-Solr-6.x-Linux/solr/build/solr-core/test/J0/../../../../../../../../../home/jenkins/workspace/Lucene-Solr-6.x-Linux/solr/build/solr-core/test/J0/temp/solr.handler.TestReqParamsAPI_D6177184D9890A3F-001/shard-1-001/cores/collection1/data/ does not point to a valid data directory; skipping clean-up of old index directories.
   [junit4]   2> 1792128 INFO  (coreLoadExecutor-6863-thread-1) [    ] o.a.s.u.p.UpdateRequestProcessorChain creating updateRequestProcessorChain "nodistrib"
   [junit4]   2> 1792128 INFO  (coreLoadExecutor-6863-thread-1) [    ] o.a.s.u.p.UpdateRequestProcessorChain creating updateRequestProcessorChain "dedupe"
   [junit4]   2> 1792129 INFO  (coreLoadExecutor-6863-thread-1) [    ] o.a.s.u.p.UpdateRequestProcessorChain inserting DistributedUpdateProcessorFactory into updateRequestProcessorChain "dedupe"
   [junit4]   2> 1792129 INFO  (coreLoadExecutor-6863-thread-1) [    ] o.a.s.u.p.UpdateRequestProcessorChain creating updateRequestProcessorChain "stored_sig"
   [junit4]   2> 1792129 INFO  (coreLoadExecutor-6863-thread-1) [    ] o.a.s.u.p.UpdateRequestProcessorChain inserting DistributedUpdateProcessorFactory into updateRequestProcessorChain "stored_sig"
   [junit4]   2> 1792129 INFO  (coreLoadExecutor-6863-thread-1) [    ] o.a.s.u.p.UpdateRequestProcessorChain creating updateRequestProcessorChain "distrib-dup-test-chain-explicit"
   [junit4]   2> 1792129 INFO  (coreLoadExecutor-6863-thread-1) [    ] o.a.s.u.p.UpdateRequestProcessorChain creating updateRequestProcessorChain "distrib-dup-test-chain-implicit"
   [junit4]   2> 1792129 INFO  (coreLoadExecutor-6863-thread-1) [    ] o.a.s.u.p.UpdateRequestProcessorChain inserting DistributedUpdateProcessorFactory into updateRequestProcessorChain "distrib-dup-test-chain-implicit"
   [junit4]   2> 1792129 INFO  (coreLoadExecutor-6863-thread-1) [    ] o.a.s.c.SolrCore no updateRequestProcessorChain defined as default, creating implicit default
   [junit4]   2> 1792129 WARN  (coreLoadExecutor-6863-thread-1) [    ] o.a.s.c.RequestHandlers INVALID paramSet a in requestHandler {type = requestHandler,name = /dump,class = DumpRequestHandler,args = {defaults={a=A,b=B}}}
   [junit4]   2> 1792130 INFO  (coreLoadExecutor-6863-thread-1) [    ] o.a.s.h.l.XMLLoader xsltCacheLifetimeSeconds=60
   [junit4]   2> 1792131 INFO  (coreLoadExecutor-6863-thread-1) [    ] o.a.s.h.l.XMLLoader xsltCacheLifetimeSeconds=60
   [junit4]   2> 1792131 INFO  (coreLoadExecutor-6863-thread-1) [    ] o.a.s.h.l.XMLLoader xsltCacheLifetimeSeconds=60
   [junit4]   2> 1792132 INFO  (coreLoadExecutor-6863-thread-1) [    ] o.a.s.h.l.XMLLoader xsltCacheLifetimeSeconds=60
   [junit4]   2> 1792134 INFO  (coreLoadExecutor-6863-thread-1) [    ] o.a.s.c.RequestHandlers Registered paths: /admin/mbeans,standard,/dump,/update/csv,/sql,/update/json/docs,/admin/luke,/export,/admin/segments,/get,/admin/system,/replication,/admin/properties,/config,/stream,/schema,/admin/plugins,/admin/logging,/update/json,/admin/ping,/admin/threads,/update,/admin/file
   [junit4]   2> 1792134 INFO  (coreLoadExecutor-6863-thread-1) [    ] o.a.s.c.SolrCore Using default statsCache cache: org.apache.solr.search.stats.LocalStatsCache
   [junit4]   2> 1792134 INFO  (coreLoadExecutor-6863-thread-1) [    ] o.a.s.u.UpdateHandler Using UpdateLog implementation: org.apache.solr.update.UpdateLog
   [junit4]   2> 1792134 INFO  (coreLoadExecutor-6863-thread-1) [    ] o.a.s.u.UpdateLog Initializing UpdateLog: dataDir= defaultSyncLevel=FLUSH numRecordsToKeep=100 maxNumLogsToKeep=10 numVersionBuckets=65536
   [junit4]   2> 1792135 INFO  (coreLoadExecutor-6863-thread-1) [    ] o.a.s.u.CommitTracker Hard AutoCommit: disabled
   [junit4]   2> 1792135 INFO  (coreLoadExecutor-6863-thread-1) [    ] o.a.s.u.CommitTracker Soft AutoCommit: disabled
   [junit4]   2> 1792136 INFO  (coreLoadExecutor-6863-thread-1) [    ] o.a.s.u.RandomMergePolicy RandomMergePolicy wrapping class org.apache.lucene.index.TieredMergePolicy: [TieredMergePolicy: maxMergeAtOnce=17, maxMergeAtOnceExplicit=15, maxMergedSegmentMB=94.7060546875, floorSegmentMB=1.0302734375, forceMergeDeletesPctAllowed=3.6305636158173504, segmentsPerTier=12.0, maxCFSSegmentSizeMB=8.796093022207999E12, noCFSRatio=0.45662561102419985
   [junit4]   2> 1792136 INFO  (coreLoadExecutor-6863-thread-1) [    ] o.a.s.c.SolrDeletionPolicy SolrDeletionPolicy.onInit: commits: num=1
   [junit4]   2> 	commit{dir=MockDirectoryWrapper(RAMDirectory@3e635c75 lockFactory=org.apache.lucene.store.SingleInstanceLockFactory@38cdeab5),segFN=segments_1,generation=1}
   [junit4]   2> 1792136 INFO  (coreLoadExecutor-6863-thread-1) [    ] o.a.s.c.SolrDeletionPolicy newest commit generation = 1
   [junit4]   2> 1792136 INFO  (coreLoadExecutor-6863-thread-1) [    ] o.a.s.s.SolrIndexSearcher Opening [Searcher@15b9a2fa[collection1] main]
   [junit4]   2> 1792136 INFO  (coreLoadExecutor-6863-thread-1) [    ] o.a.s.c.c.ZkStateReader Load collection config from: [/collections/collection1]
   [junit4]   2> 1792136 INFO  (coreLoadExecutor-6863-thread-1) [    ] o.a.s.c.c.ZkStateReader path=[/collections/collection1] [configName]=[conf1] specified config exists in ZooKeeper
   [junit4]   2> 1792136 INFO  (coreLoadExecutor-6863-thread-1) [    ] o.a.s.r.ManagedResourceStorage Setting up ZooKeeper-based storage for the RestManager with znodeBase: /configs/conf1
   [junit4]   2> 1792137 INFO  (coreLoadExecutor-6863-thread-1) [    ] o.a.s.r.ManagedResourceStorage Configured ZooKeeperStorageIO with znodeBase: /configs/conf1
   [junit4]   2> 1792137 INFO  (coreLoadExecutor-6863-thread-1) [    ] o.a.s.r.RestManager Initializing RestManager with initArgs: {}
   [junit4]   2> 1792137 INFO  (coreLoadExecutor-6863-thread-1) [    ] o.a.s.r.ManagedResourceStorage Reading _rest_managed.json using ZooKeeperStorageIO:path=/configs/conf1
   [junit4]   2> 1792137 INFO  (coreLoadExecutor-6863-thread-1) [    ] o.a.s.r.ManagedResourceStorage No data found for znode /configs/conf1/_rest_managed.json
   [junit4]   2> 1792137 INFO  (coreLoadExecutor-6863-thread-1) [    ] o.a.s.r.ManagedResourceStorage Loaded null at path _rest_managed.json using ZooKeeperStorageIO:path=/configs/conf1
   [junit4]   2> 1792137 INFO  (coreLoadExecutor-6863-thread-1) [    ] o.a.s.r.RestManager Initializing 0 registered ManagedResources
   [junit4]   2> 1792137 INFO  (coreLoadExecutor-6863-thread-1) [    ] o.a.s.h.ReplicationHandler Commits will be reserved for  10000
   [junit4]   2> 1792138 INFO  (searcherExecutor-6864-thread-1) [    ] o.a.s.c.SolrCore [collection1] Registered new searcher Searcher@15b9a2fa[collection1] main{ExitableDirectoryReader(UninvertingDirectoryReader())}
   [junit4]   2> 1792138 INFO  (coreLoadExecutor-6863-thread-1) [    ] o.a.s.u.UpdateLog Looking up max value of version field to seed version buckets
   [junit4]   2> 1792138 INFO  (coreLoadExecutor-6863-thread-1) [    ] o.a.s.u.VersionInfo Refreshing highest value of _version_ for 65536 version buckets from index
   [junit4]   2> 1792138 INFO  (coreLoadExecutor-6863-thread-1) [    ] o.a.s.u.VersionInfo No terms found for _version_, cannot seed version bucket highest value from index
   [junit4]   2> 1792138 INFO  (coreLoadExecutor-6863-thread-1) [    ] o.a.s.u.UpdateLog Could not find max version in index or recent updates, using new clock 1529731753793552384
   [junit4]   2> 1792139 INFO  (coreLoadExecutor-6863-thread-1) [    ] o.a.s.u.UpdateLog Took 1.0ms to seed version buckets with highest version 1529731753793552384
   [junit4]   2> 1792140 INFO  (coreLoadExecutor-6863-thread-1) [    ] o.a.s.c.ZkController watch zkdir /configs/conf1
   [junit4]   2> 1792140 INFO  (coreLoadExecutor-6863-thread-1) [    ] o.a.s.c.CoreContainer registering core: collection1
   [junit4]   2> 1792140 INFO  (coreZkRegister-6858-thread-1) [    ] o.a.s.c.ZkController Register replica - core:collection1 address:http://127.0.0.1:39806 collection:collection1 shard:shard2
   [junit4]   2> 1792140 INFO  (coreZkRegister-6858-thread-1) [    ] o.a.s.c.c.SolrZkClient makePath: /collections/collection1/leader_elect/shard2/election
   [junit4]   2> 1792141 INFO  (coreZkRegister-6858-thread-1) [    ] o.a.s.c.LeaderElector Joined leadership election with path: /collections/collection1/leader_elect/shard2/election/95608234358538249-core_node1-n_0000000000
   [junit4]   2> 1792141 INFO  (coreZkRegister-6858-thread-1) [    ] o.a.s.c.ShardLeaderElectionContext Running the leader process for shard=shard2 and weAreReplacement=false and leaderVoteWait=10000
   [junit4]   2> 1792142 INFO  (coreZkRegister-6858-thread-1) [    ] o.a.s.c.ShardLeaderElectionContext Enough replicas found to continue.
   [junit4]   2> 1792142 INFO  (coreZkRegister-6858-thread-1) [    ] o.a.s.c.ShardLeaderElectionContext I may be the new leader - try and sync
   [junit4]   2> 1792142 INFO  (coreZkRegister-6858-thread-1) [    ] o.a.s.c.SyncStrategy Sync replicas to http://127.0.0.1:39806/collection1/
   [junit4]   2> 1792142 INFO  (OverseerStateUpdate-95608234358538244-127.0.0.1:38885_-n_0000000000) [    ] o.a.s.c.Overseer processMessage: queueSize: 1, message = {
   [junit4]   2>   "operation":"leader",
   [junit4]   2>   "shard":"shard2",
   [junit4]   2>   "collection":"collection1"} current state version: 4
   [junit4]   2> 1792142 INFO  (coreZkRegister-6858-thread-1) [    ] o.a.s.c.SyncStrategy Sync Success - now sync replicas to me
   [junit4]   2> 1792142 INFO  (coreZkRegister-6858-thread-1) [    ] o.a.s.c.SyncStrategy http://127.0.0.1:39806/collection1/ has no replicas
   [junit4]   2> 1792142 INFO  (coreZkRegister-6858-thread-1) [    ] o.a.s.c.c.SolrZkClient makePath: /collections/collection1/leaders/shard2
   [junit4]   2> 1792143 INFO  (coreZkRegister-6858-thread-1) [    ] o.a.s.c.ShardLeaderElectionContextBase Creating leader registration node /collections/collection1/leaders/shard2/leader after winning as /collections/collection1/leader_elect/shard2/election/95608234358538249-core_node1-n_0000000000
   [junit4]   2> 1792144 INFO  (coreZkRegister-6858-thread-1) [    ] o.a.s.c.ShardLeaderElectionContext I am the new leader: http://127.0.0.1:39806/collection1/ shard2
   [junit4]   2> 1792144 INFO  (OverseerStateUpdate-95608234358538244-127.0.0.1:38885_-n_0000000000) [    ] o.a.s.c.Overseer processMessage: queueSize: 1, message = {
   [junit4]   2>   "operation":"leader",
   [junit4]   2>   "shard":"shard2",
   [junit4]   2>   "collection":"collection1",
   [junit4]   2>   "base_url":"http://127.0.0.1:39806",
   [junit4]   2>   "core":"collection1",
   [junit4]   2>   "state":"active"} current state version: 4
   [junit4]   2> 1792245 INFO  (OverseerStateUpdate-95608234358538244-127.0.0.1:38885_-n_0000000000) [    ] o.a.s.c.o.ZkStateWriter going to update_collection /collections/collection1/state.json version: 1
   [junit4]   2> 1792245 INFO  (zkCallback-2197-thread-1) [    ] o.a.s.c.c.ZkStateReader A cluster state change: [WatchedEvent state:SyncConnected type:NodeDataChanged path:/collections/collection1/state.json] for collection [collection1] has occurred - updating... (live nodes size: [2])
   [junit4]   2> 1792245 INFO  (zkCallback-2197-thread-1) [    ] o.a.s.c.c.ZkStateReader Updating data for [collection1] from [1] to [2]
   [junit4]   2> 1792294 INFO  (coreZkRegister-6858-thread-1) [    ] o.a.s.c.ZkController We are http://127.0.0.1:39806/collection1/ and leader is http://127.0.0.1:39806/collection1/
   [junit4]   2> 1792294 INFO  (coreZkRegister-6858-thread-1) [    ] o.a.s.c.ZkController No LogReplay needed for core=collection1 baseURL=http://127.0.0.1:39806
   [junit4]   2> 1792294 INFO  (coreZkRegister-6858-thread-1) [    ] o.a.s.c.ZkController I am the leader, no recovery necessary
   [junit4]   2> 1792295 INFO  (coreZkRegister-6858-thread-1) [    ] o.a.s.c.ZkController publishing state=active
   [junit4]   2> 1792295 INFO  (coreZkRegister-6858-thread-1) [    ] o.a.s.c.ZkController numShards not found on descriptor - reading it from system property
   [junit4]   2> 1792295 INFO  (OverseerStateUpdate-95608234358538244-127.0.0.1:38885_-n_0000000000) [    ] o.a.s.c.Overseer processMessage: queueSize: 1, message = {
   [junit4]   2>   "core":"collection1",
   [junit4]   2>   "core_node_name":"core_node1",
   [junit4]   2>   "roles":null,
   [junit4]   2>   "base_url":"http://127.0.0.1:39806",
   [junit4]   2>   "node_name":"127.0.0.1:39806_",
   [junit4]   2>   "numShards":"2",
   [junit4]   2>   "state":"active",
   [junit4]   2>   "shard":"shard2",
   [junit4]   2>   "collection":"collection1",
   [junit4]   2>   "operation":"state"} current state version: 4
   [junit4]   2> 1792295 INFO 

[...truncated too long message...]

lib/antlr4-runtime-4.5.1-1.jar:/home/jenkins/workspace/Lucene-Solr-6.x-Linux/solr/core/test-lib/apacheds-core-2.0.0-M15.jar:/home/jenkins/workspace/Lucene-Solr-6.x-Linux/solr/core/test-lib/apacheds-core-api-2.0.0-M15.jar:/home/jenkins/workspace/Lucene-Solr-6.x-Linux/solr/core/test-lib/apacheds-core-avl-2.0.0-M15.jar:/home/jenkins/workspace/Lucene-Solr-6.x-Linux/solr/core/test-lib/apacheds-core-shared-2.0.0-M15.jar:/home/jenkins/workspace/Lucene-Solr-6.x-Linux/solr/core/test-lib/apacheds-i18n-2.0.0-M15.jar:/home/jenkins/workspace/Lucene-Solr-6.x-Linux/solr/core/test-lib/apacheds-interceptor-kerberos-2.0.0-M15.jar:/home/jenkins/workspace/Lucene-Solr-6.x-Linux/solr/core/test-lib/apacheds-interceptors-admin-2.0.0-M15.jar:/home/jenkins/workspace/Lucene-Solr-6.x-Linux/solr/core/test-lib/apacheds-interceptors-authn-2.0.0-M15.jar:/home/jenkins/workspace/Lucene-Solr-6.x-Linux/solr/core/test-lib/apacheds-interceptors-authz-2.0.0-M15.jar:/home/jenkins/workspace/Lucene-Solr-6.x-Linux/solr/core/test-lib/apacheds-interceptors-changelog-2.0.0-M15.jar:/home/jenkins/workspace/Lucene-Solr-6.x-Linux/solr/core/test-lib/apacheds-interceptors-collective-2.0.0-M15.jar:/home/jenkins/workspace/Lucene-Solr-6.x-Linux/solr/core/test-lib/apacheds-interceptors-event-2.0.0-M15.jar:/home/jenkins/workspace/Lucene-Solr-6.x-Linux/solr/core/test-lib/apacheds-interceptors-exception-2.0.0-M15.jar:/home/jenkins/workspace/Lucene-Solr-6.x-Linux/solr/core/test-lib/apacheds-interceptors-journal-2.0.0-M15.jar:/home/jenkins/workspace/Lucene-Solr-6.x-Linux/solr/core/test-lib/apacheds-interceptors-normalization-2.0.0-M15.jar:/home/jenkins/workspace/Lucene-Solr-6.x-Linux/solr/core/test-lib/apacheds-interceptors-operational-2.0.0-M15.jar:/home/jenkins/workspace/Lucene-Solr-6.x-Linux/solr/core/test-lib/apacheds-interceptors-referral-2.0.0-M15.jar:/home/jenkins/workspace/Lucene-Solr-6.x-Linux/solr/core/test-lib/apacheds-interceptors-schema-2.0.0-M15.jar:/home/jenkins/workspace/Lucene-Solr-6.x-Linux/solr/core/test-lib/apacheds-interceptors-subtree-2.0.0-M15.jar:/home/jenkins/workspace/Lucene-Solr-6.x-Linux/solr/core/test-lib/apacheds-interceptors-trigger-2.0.0-M15.jar:/home/jenkins/workspace/Lucene-Solr-6.x-Linux/solr/core/test-lib/apacheds-jdbm-partition-2.0.0-M15.jar:/home/jenkins/workspace/Lucene-Solr-6.x-Linux/solr/core/test-lib/apacheds-jdbm1-2.0.0-M2.jar:/home/jenkins/workspace/Lucene-Solr-6.x-Linux/solr/core/test-lib/apacheds-kerberos-codec-2.0.0-M15.jar:/home/jenkins/workspace/Lucene-Solr-6.x-Linux/solr/core/test-lib/apacheds-ldif-partition-2.0.0-M15.jar:/home/jenkins/workspace/Lucene-Solr-6.x-Linux/solr/core/test-lib/apacheds-mavibot-partition-2.0.0-M15.jar:/home/jenkins/workspace/Lucene-Solr-6.x-Linux/solr/core/test-lib/apacheds-protocol-kerberos-2.0.0-M15.jar:/home/jenkins/workspace/Lucene-Solr-6.x-Linux/solr/core/test-lib/apacheds-protocol-ldap-2.0.0-M15.jar:/home/jenkins/workspace/Lucene-Solr-6.x-Linux/solr/core/test-lib/apacheds-protocol-shared-2.0.0-M15.jar:/home/jenkins/workspace/Lucene-Solr-6.x-Linux/solr/core/test-lib/apacheds-xdbm-partition-2.0.0-M15.jar:/home/jenkins/workspace/Lucene-Solr-6.x-Linux/solr/core/test-lib/api-all-1.0.0-M20.jar:/home/jenkins/workspace/Lucene-Solr-6.x-Linux/solr/core/test-lib/bcprov-jdk15-1.45.jar:/home/jenkins/workspace/Lucene-Solr-6.x-Linux/solr/core/test-lib/cglib-nodep-2.2.jar:/home/jenkins/workspace/Lucene-Solr-6.x-Linux/solr/core/test-lib/commons-collections-3.2.2.jar:/home/jenkins/workspace/Lucene-Solr-6.x-Linux/solr/core/test-lib/commons-math3-3.4.1.jar:/home/jenkins/workspace/Lucene-Solr-6.x-Linux/solr/core/test-lib/easymock-3.0.jar:/home/jenkins/workspace/Lucene-Solr-6.x-Linux/solr/core/test-lib/ehcache-core-2.4.4.jar:/home/jenkins/workspace/Lucene-Solr-6.x-Linux/solr/core/test-lib/hadoop-common-2.6.0-tests.jar:/home/jenkins/workspace/Lucene-Solr-6.x-Linux/solr/core/test-lib/hadoop-hdfs-2.6.0-tests.jar:/home/jenkins/workspace/Lucene-Solr-6.x-Linux/solr/core/test-lib/hadoop-minikdc-2.6.0.jar:/home/jenkins/workspace/Lucene-Solr-6.x-Linux/solr/core/test-lib/jackson-annotations-2.5.4.jar:/home/jenkins/workspace/Lucene-Solr-6.x-Linux/solr/core/test-lib/jackson-databind-2.5.4.jar:/home/jenkins/workspace/Lucene-Solr-6.x-Linux/solr/core/test-lib/jersey-core-1.9.jar:/home/jenkins/workspace/Lucene-Solr-6.x-Linux/solr/core/test-lib/jersey-server-1.9.jar:/home/jenkins/workspace/Lucene-Solr-6.x-Linux/solr/core/test-lib/jetty-6.1.26.jar:/home/jenkins/workspace/Lucene-Solr-6.x-Linux/solr/core/test-lib/jetty-util-6.1.26.jar:/home/jenkins/workspace/Lucene-Solr-6.x-Linux/solr/core/test-lib/mina-core-2.0.0-M5.jar:/home/jenkins/workspace/Lucene-Solr-6.x-Linux/solr/core/test-lib/mockito-core-1.9.5.jar:/home/jenkins/workspace/Lucene-Solr-6.x-Linux/solr/core/test-lib/objenesis-1.2.jar:/home/jenkins/workspace/Lucene-Solr-6.x-Linux/solr/core/test-lib/presto-parser-0.122.jar:/home/jenkins/workspace/Lucene-Solr-6.x-Linux/solr/core/test-lib/slice-0.10.jar:/home/jenkins/workspace/Lucene-Solr-6.x-Linux/lucene/build/analysis/icu/lucene-analyzers-icu-6.1.0-SNAPSHOT.jar:/home/jenkins/workspace/Lucene-Solr-6.x-Linux/solr/build/contrib/solr-analysis-extras/classes/java:/home/jenkins/workspace/Lucene-Solr-6.x-Linux/lucene/build/queryparser/classes/test:/home/jenkins/workspace/Lucene-Solr-6.x-Linux/solr/contrib/analysis-extras/lib/icu4j-56.1.jar:/var/lib/jenkins/tools/hudson.tasks.Ant_AntInstallation/ANT_1.8.2/lib/ant-launcher.jar:/var/lib/jenkins/.ant/lib/ivy-2.3.0.jar:/var/lib/jenkins/tools/hudson.tasks.Ant_AntInstallation/ANT_1.8.2/lib/ant-jdepend.jar:/var/lib/jenkins/tools/hudson.tasks.Ant_AntInstallation/ANT_1.8.2/lib/ant.jar:/var/lib/jenkins/tools/hudson.tasks.Ant_AntInstallation/ANT_1.8.2/lib/ant-apache-bcel.jar:/var/lib/jenkins/tools/hudson.tasks.Ant_AntInstallation/ANT_1.8.2/lib/ant-jmf.jar:/var/lib/jenkins/tools/hudson.tasks.Ant_AntInstallation/ANT_1.8.2/lib/ant-junit4.jar:/var/lib/jenkins/tools/hudson.tasks.Ant_AntInstallation/ANT_1.8.2/lib/ant-apache-xalan2.jar:/var/lib/jenkins/tools/hudson.tasks.Ant_AntInstallation/ANT_1.8.2/lib/ant-javamail.jar:/var/lib/jenkins/tools/hudson.tasks.Ant_AntInstallation/ANT_1.8.2/lib/ant-jai.jar:/var/lib/jenkins/tools/hudson.tasks.Ant_AntInstallation/ANT_1.8.2/lib/ant-apache-bsf.jar:/var/lib/jenkins/tools/hudson.tasks.Ant_AntInstallation/ANT_1.8.2/lib/ant-commons-logging.jar:/var/lib/jenkins/tools/hudson.tasks.Ant_AntInstallation/ANT_1.8.2/lib/ant-commons-net.jar:/var/lib/jenkins/tools/hudson.tasks.Ant_AntInstallation/ANT_1.8.2/lib/ant-apache-resolver.jar:/var/lib/jenkins/tools/hudson.tasks.Ant_AntInstallation/ANT_1.8.2/lib/ant-apache-log4j.jar:/var/lib/jenkins/tools/hudson.tasks.Ant_AntInstallation/ANT_1.8.2/lib/ant-junit.jar:/var/lib/jenkins/tools/hudson.tasks.Ant_AntInstallation/ANT_1.8.2/lib/ant-apache-oro.jar:/var/lib/jenkins/tools/hudson.tasks.Ant_AntInstallation/ANT_1.8.2/lib/ant-antlr.jar:/var/lib/jenkins/tools/hudson.tasks.Ant_AntInstallation/ANT_1.8.2/lib/ant-jsch.jar:/var/lib/jenkins/tools/hudson.tasks.Ant_AntInstallation/ANT_1.8.2/lib/ant-apache-regexp.jar:/var/lib/jenkins/tools/hudson.tasks.Ant_AntInstallation/ANT_1.8.2/lib/ant-swing.jar:/var/lib/jenkins/tools/hudson.tasks.Ant_AntInstallation/ANT_1.8.2/lib/ant-testutil.jar:/var/lib/jenkins/tools/hudson.tasks.Ant_AntInstallation/ANT_1.8.2/lib/ant-netrexx.jar:/var/lib/jenkins/.ivy2/cache/com.carrotsearch.randomizedtesting/junit4-ant/jars/junit4-ant-2.3.2.jar com.carrotsearch.ant.tasks.junit4.slave.SlaveMainSafe -eventsfile /home/jenkins/workspace/Lucene-Solr-6.x-Linux/solr/build/solr-core/test/temp/junit4-J0-20160325_000130_384.events @/home/jenkins/workspace/Lucene-Solr-6.x-Linux/solr/build/solr-core/test/temp/junit4-J0-20160325_000130_384.suites -stdin
   [junit4] ERROR: JVM J0 ended with an exception: Forked process returned with error code: 134. Very likely a JVM crash.  See process stdout at: /home/jenkins/workspace/Lucene-Solr-6.x-Linux/solr/build/solr-core/test/temp/junit4-J0-20160325_000130_384.sysout
   [junit4] 	at com.carrotsearch.ant.tasks.junit4.JUnit4.executeSlave(JUnit4.java:1481)
   [junit4] 	at com.carrotsearch.ant.tasks.junit4.JUnit4.access$000(JUnit4.java:121)
   [junit4] 	at com.carrotsearch.ant.tasks.junit4.JUnit4$2.call(JUnit4.java:955)
   [junit4] 	at com.carrotsearch.ant.tasks.junit4.JUnit4$2.call(JUnit4.java:952)
   [junit4] 	at java.util.concurrent.FutureTask.run(java.base@9-ea/FutureTask.java:266)
   [junit4] 	at java.util.concurrent.ThreadPoolExecutor.runWorker(java.base@9-ea/ThreadPoolExecutor.java:1158)
   [junit4] 	at java.util.concurrent.ThreadPoolExecutor$Worker.run(java.base@9-ea/ThreadPoolExecutor.java:632)
   [junit4] 	at java.lang.Thread.run(java.base@9-ea/Thread.java:804)

BUILD FAILED
/home/jenkins/workspace/Lucene-Solr-6.x-Linux/build.xml:740: The following error occurred while executing this line:
/home/jenkins/workspace/Lucene-Solr-6.x-Linux/build.xml:684: The following error occurred while executing this line:
/home/jenkins/workspace/Lucene-Solr-6.x-Linux/build.xml:59: The following error occurred while executing this line:
/home/jenkins/workspace/Lucene-Solr-6.x-Linux/solr/build.xml:233: The following error occurred while executing this line:
/home/jenkins/workspace/Lucene-Solr-6.x-Linux/solr/common-build.xml:529: The following error occurred while executing this line:
/home/jenkins/workspace/Lucene-Solr-6.x-Linux/lucene/common-build.xml:1457: The following error occurred while executing this line:
/home/jenkins/workspace/Lucene-Solr-6.x-Linux/lucene/common-build.xml:1014: At least one slave process threw an exception, first: Forked process returned with error code: 134. Very likely a JVM crash.  See process stdout at: /home/jenkins/workspace/Lucene-Solr-6.x-Linux/solr/build/solr-core/test/temp/junit4-J0-20160325_000130_384.sysout

Total time: 51 minutes 59 seconds
Build step 'Invoke Ant' marked build as failure
Archiving artifacts
[WARNINGS] Skipping publisher since build result is FAILURE
Recording test results
Email was triggered for: Failure - Any
Sending email for trigger: Failure - Any



Mime
View raw message