lucene-dev mailing list archives

Site index · List index
Message view « Date » · « Thread »
Top « Date » · « Thread »
From Policeman Jenkins Server <jenk...@thetaphi.de>
Subject [JENKINS] Lucene-Solr-master-Windows (64bit/jdk1.8.0_72) - Build # 5714 - Still Failing!
Date Thu, 17 Mar 2016 04:23:02 GMT
Build: http://jenkins.thetaphi.de/job/Lucene-Solr-master-Windows/5714/
Java: 64bit/jdk1.8.0_72 -XX:-UseCompressedOops -XX:+UseConcMarkSweepGC

1 tests failed.
FAILED:  org.apache.solr.handler.TestReplicationHandler.doTestStressReplication

Error Message:
[index.20160317003713803, index.20160317003716670, index.properties, replication.properties] expected:<1> but was:<2>

Stack Trace:
java.lang.AssertionError: [index.20160317003713803, index.20160317003716670, index.properties, replication.properties] expected:<1> but was:<2>
	at __randomizedtesting.SeedInfo.seed([1DE0945A78842956:C64B949C7DAC40E5]:0)
	at org.junit.Assert.fail(Assert.java:93)
	at org.junit.Assert.failNotEquals(Assert.java:647)
	at org.junit.Assert.assertEquals(Assert.java:128)
	at org.junit.Assert.assertEquals(Assert.java:472)
	at org.apache.solr.handler.TestReplicationHandler.checkForSingleIndex(TestReplicationHandler.java:823)
	at org.apache.solr.handler.TestReplicationHandler.doTestStressReplication(TestReplicationHandler.java:790)
	at sun.reflect.NativeMethodAccessorImpl.invoke0(Native Method)
	at sun.reflect.NativeMethodAccessorImpl.invoke(NativeMethodAccessorImpl.java:62)
	at sun.reflect.DelegatingMethodAccessorImpl.invoke(DelegatingMethodAccessorImpl.java:43)
	at java.lang.reflect.Method.invoke(Method.java:498)
	at com.carrotsearch.randomizedtesting.RandomizedRunner.invoke(RandomizedRunner.java:1764)
	at com.carrotsearch.randomizedtesting.RandomizedRunner$8.evaluate(RandomizedRunner.java:871)
	at com.carrotsearch.randomizedtesting.RandomizedRunner$9.evaluate(RandomizedRunner.java:907)
	at com.carrotsearch.randomizedtesting.RandomizedRunner$10.evaluate(RandomizedRunner.java:921)
	at com.carrotsearch.randomizedtesting.rules.SystemPropertiesRestoreRule$1.evaluate(SystemPropertiesRestoreRule.java:57)
	at org.apache.lucene.util.TestRuleSetupTeardownChained$1.evaluate(TestRuleSetupTeardownChained.java:49)
	at org.apache.lucene.util.AbstractBeforeAfterRule$1.evaluate(AbstractBeforeAfterRule.java:45)
	at org.apache.lucene.util.TestRuleThreadAndTestName$1.evaluate(TestRuleThreadAndTestName.java:48)
	at org.apache.lucene.util.TestRuleIgnoreAfterMaxFailures$1.evaluate(TestRuleIgnoreAfterMaxFailures.java:64)
	at org.apache.lucene.util.TestRuleMarkFailure$1.evaluate(TestRuleMarkFailure.java:47)
	at com.carrotsearch.randomizedtesting.rules.StatementAdapter.evaluate(StatementAdapter.java:36)
	at com.carrotsearch.randomizedtesting.ThreadLeakControl$StatementRunner.run(ThreadLeakControl.java:367)
	at com.carrotsearch.randomizedtesting.ThreadLeakControl.forkTimeoutingTask(ThreadLeakControl.java:809)
	at com.carrotsearch.randomizedtesting.ThreadLeakControl$3.evaluate(ThreadLeakControl.java:460)
	at com.carrotsearch.randomizedtesting.RandomizedRunner.runSingleTest(RandomizedRunner.java:880)
	at com.carrotsearch.randomizedtesting.RandomizedRunner$5.evaluate(RandomizedRunner.java:781)
	at com.carrotsearch.randomizedtesting.RandomizedRunner$6.evaluate(RandomizedRunner.java:816)
	at com.carrotsearch.randomizedtesting.RandomizedRunner$7.evaluate(RandomizedRunner.java:827)
	at com.carrotsearch.randomizedtesting.rules.StatementAdapter.evaluate(StatementAdapter.java:36)
	at com.carrotsearch.randomizedtesting.rules.SystemPropertiesRestoreRule$1.evaluate(SystemPropertiesRestoreRule.java:57)
	at org.apache.lucene.util.AbstractBeforeAfterRule$1.evaluate(AbstractBeforeAfterRule.java:45)
	at com.carrotsearch.randomizedtesting.rules.StatementAdapter.evaluate(StatementAdapter.java:36)
	at org.apache.lucene.util.TestRuleStoreClassName$1.evaluate(TestRuleStoreClassName.java:41)
	at com.carrotsearch.randomizedtesting.rules.NoShadowingOrOverridesOnMethodsRule$1.evaluate(NoShadowingOrOverridesOnMethodsRule.java:40)
	at com.carrotsearch.randomizedtesting.rules.NoShadowingOrOverridesOnMethodsRule$1.evaluate(NoShadowingOrOverridesOnMethodsRule.java:40)
	at com.carrotsearch.randomizedtesting.rules.StatementAdapter.evaluate(StatementAdapter.java:36)
	at com.carrotsearch.randomizedtesting.rules.StatementAdapter.evaluate(StatementAdapter.java:36)
	at com.carrotsearch.randomizedtesting.rules.StatementAdapter.evaluate(StatementAdapter.java:36)
	at org.apache.lucene.util.TestRuleAssertionsRequired$1.evaluate(TestRuleAssertionsRequired.java:53)
	at org.apache.lucene.util.TestRuleMarkFailure$1.evaluate(TestRuleMarkFailure.java:47)
	at org.apache.lucene.util.TestRuleIgnoreAfterMaxFailures$1.evaluate(TestRuleIgnoreAfterMaxFailures.java:64)
	at org.apache.lucene.util.TestRuleIgnoreTestSuites$1.evaluate(TestRuleIgnoreTestSuites.java:54)
	at com.carrotsearch.randomizedtesting.rules.StatementAdapter.evaluate(StatementAdapter.java:36)
	at com.carrotsearch.randomizedtesting.ThreadLeakControl$StatementRunner.run(ThreadLeakControl.java:367)
	at java.lang.Thread.run(Thread.java:745)




Build Log:
[...truncated 10780 lines...]
   [junit4] Suite: org.apache.solr.handler.TestReplicationHandler
   [junit4]   2> Creating dataDir: C:\Users\jenkins\workspace\Lucene-Solr-master-Windows\solr\build\solr-core\test\J0\temp\solr.handler.TestReplicationHandler_1DE0945A78842956-001\init-core-data-001
   [junit4]   2> 268141 INFO  (TEST-TestReplicationHandler.doTestStressReplication-seed#[1DE0945A78842956]) [    ] o.a.s.SolrTestCaseJ4 ###Starting doTestStressReplication
   [junit4]   2> 268142 INFO  (TEST-TestReplicationHandler.doTestStressReplication-seed#[1DE0945A78842956]) [    ] o.a.s.SolrTestCaseJ4 Writing core.properties file to C:\Users\jenkins\workspace\Lucene-Solr-master-Windows\solr\build\solr-core\test\J0\temp\solr.handler.TestReplicationHandler_1DE0945A78842956-001\solr-instance-001\collection1
   [junit4]   2> 268152 INFO  (TEST-TestReplicationHandler.doTestStressReplication-seed#[1DE0945A78842956]) [    ] o.e.j.s.Server jetty-9.3.6.v20151106
   [junit4]   2> 268153 INFO  (TEST-TestReplicationHandler.doTestStressReplication-seed#[1DE0945A78842956]) [    ] o.e.j.s.h.ContextHandler Started o.e.j.s.ServletContextHandler@4e020153{/solr,null,AVAILABLE}
   [junit4]   2> 268154 INFO  (TEST-TestReplicationHandler.doTestStressReplication-seed#[1DE0945A78842956]) [    ] o.e.j.s.ServerConnector Started ServerConnector@2202b2fe{HTTP/1.1,[http/1.1]}{127.0.0.1:49481}
   [junit4]   2> 268154 INFO  (TEST-TestReplicationHandler.doTestStressReplication-seed#[1DE0945A78842956]) [    ] o.e.j.s.Server Started @273079ms
   [junit4]   2> 268154 INFO  (TEST-TestReplicationHandler.doTestStressReplication-seed#[1DE0945A78842956]) [    ] o.a.s.c.s.e.JettySolrRunner Jetty properties: {solr.data.dir=C:\Users\jenkins\workspace\Lucene-Solr-master-Windows\solr\build\solr-core\test\J0\temp\solr.handler.TestReplicationHandler_1DE0945A78842956-001\solr-instance-001\collection1\data, hostContext=/solr, hostPort=49481}
   [junit4]   2> 268155 INFO  (TEST-TestReplicationHandler.doTestStressReplication-seed#[1DE0945A78842956]) [    ] o.a.s.s.SolrDispatchFilter SolrDispatchFilter.init(): sun.misc.Launcher$AppClassLoader@73d16e93
   [junit4]   2> 268155 INFO  (TEST-TestReplicationHandler.doTestStressReplication-seed#[1DE0945A78842956]) [    ] o.a.s.c.SolrResourceLoader new SolrResourceLoader for directory: 'C:\Users\jenkins\workspace\Lucene-Solr-master-Windows\solr\build\solr-core\test\J0\temp\solr.handler.TestReplicationHandler_1DE0945A78842956-001\solr-instance-001'
   [junit4]   2> 268155 INFO  (TEST-TestReplicationHandler.doTestStressReplication-seed#[1DE0945A78842956]) [    ] o.a.s.c.SolrResourceLoader JNDI not configured for solr (NoInitialContextEx)
   [junit4]   2> 268155 INFO  (TEST-TestReplicationHandler.doTestStressReplication-seed#[1DE0945A78842956]) [    ] o.a.s.c.SolrResourceLoader solr home defaulted to 'solr/' (could not find system property or JNDI)
   [junit4]   2> 268156 INFO  (TEST-TestReplicationHandler.doTestStressReplication-seed#[1DE0945A78842956]) [    ] o.a.s.c.SolrXmlConfig Loading container configuration from C:\Users\jenkins\workspace\Lucene-Solr-master-Windows\solr\build\solr-core\test\J0\temp\solr.handler.TestReplicationHandler_1DE0945A78842956-001\solr-instance-001\solr.xml
   [junit4]   2> 268168 INFO  (TEST-TestReplicationHandler.doTestStressReplication-seed#[1DE0945A78842956]) [    ] o.a.s.c.CorePropertiesLocator Config-defined core root directory: C:\Users\jenkins\workspace\Lucene-Solr-master-Windows\solr\build\solr-core\test\J0\temp\solr.handler.TestReplicationHandler_1DE0945A78842956-001\solr-instance-001\.
   [junit4]   2> 268168 INFO  (TEST-TestReplicationHandler.doTestStressReplication-seed#[1DE0945A78842956]) [    ] o.a.s.c.CoreContainer New CoreContainer 660970731
   [junit4]   2> 268168 INFO  (TEST-TestReplicationHandler.doTestStressReplication-seed#[1DE0945A78842956]) [    ] o.a.s.c.CoreContainer Loading cores into CoreContainer [instanceDir=C:\Users\jenkins\workspace\Lucene-Solr-master-Windows\solr\build\solr-core\test\J0\temp\solr.handler.TestReplicationHandler_1DE0945A78842956-001\solr-instance-001]
   [junit4]   2> 268168 WARN  (TEST-TestReplicationHandler.doTestStressReplication-seed#[1DE0945A78842956]) [    ] o.a.s.c.CoreContainer Couldn't add files from C:\Users\jenkins\workspace\Lucene-Solr-master-Windows\solr\build\solr-core\test\J0\temp\solr.handler.TestReplicationHandler_1DE0945A78842956-001\solr-instance-001\lib to classpath: C:\Users\jenkins\workspace\Lucene-Solr-master-Windows\solr\build\solr-core\test\J0\temp\solr.handler.TestReplicationHandler_1DE0945A78842956-001\solr-instance-001\lib
   [junit4]   2> 268169 INFO  (TEST-TestReplicationHandler.doTestStressReplication-seed#[1DE0945A78842956]) [    ] o.a.s.h.c.HttpShardHandlerFactory created with socketTimeout : 90000,urlScheme : ,connTimeout : 15000,maxConnectionsPerHost : 20,maxConnections : 10000,corePoolSize : 0,maximumPoolSize : 2147483647,maxThreadIdleTime : 5,sizeOfQueue : -1,fairnessPolicy : false,useRetries : false,
   [junit4]   2> 268172 INFO  (TEST-TestReplicationHandler.doTestStressReplication-seed#[1DE0945A78842956]) [    ] o.a.s.u.UpdateShardHandler Creating UpdateShardHandler HTTP client with params: socketTimeout=340000&connTimeout=45000&retry=true
   [junit4]   2> 268172 INFO  (TEST-TestReplicationHandler.doTestStressReplication-seed#[1DE0945A78842956]) [    ] o.a.s.l.LogWatcher SLF4J impl is org.slf4j.impl.Log4jLoggerFactory
   [junit4]   2> 268173 INFO  (TEST-TestReplicationHandler.doTestStressReplication-seed#[1DE0945A78842956]) [    ] o.a.s.l.LogWatcher Registering Log Listener [Log4j (org.slf4j.impl.Log4jLoggerFactory)]
   [junit4]   2> 268173 INFO  (TEST-TestReplicationHandler.doTestStressReplication-seed#[1DE0945A78842956]) [    ] o.a.s.c.CoreContainer Security conf doesn't exist. Skipping setup for authorization module.
   [junit4]   2> 268173 INFO  (TEST-TestReplicationHandler.doTestStressReplication-seed#[1DE0945A78842956]) [    ] o.a.s.c.CoreContainer No authentication plugin used.
   [junit4]   2> 268173 INFO  (TEST-TestReplicationHandler.doTestStressReplication-seed#[1DE0945A78842956]) [    ] o.a.s.c.CorePropertiesLocator Looking for core definitions underneath C:\Users\jenkins\workspace\Lucene-Solr-master-Windows\solr\build\solr-core\test\J0\temp\solr.handler.TestReplicationHandler_1DE0945A78842956-001\solr-instance-001\.
   [junit4]   2> 268177 INFO  (TEST-TestReplicationHandler.doTestStressReplication-seed#[1DE0945A78842956]) [    ] o.a.s.c.CoreDescriptor Created CoreDescriptor: {name=collection1, config=solrconfig.xml, loadOnStartup=true, schema=schema.xml, configSetProperties=configsetprops.json, transient=false, dataDir=data\}
   [junit4]   2> 268177 INFO  (TEST-TestReplicationHandler.doTestStressReplication-seed#[1DE0945A78842956]) [    ] o.a.s.c.CorePropertiesLocator Found core collection1 in C:\Users\jenkins\workspace\Lucene-Solr-master-Windows\solr\build\solr-core\test\J0\temp\solr.handler.TestReplicationHandler_1DE0945A78842956-001\solr-instance-001\.\collection1
   [junit4]   2> 268178 INFO  (TEST-TestReplicationHandler.doTestStressReplication-seed#[1DE0945A78842956]) [    ] o.a.s.c.CorePropertiesLocator Found 1 core definitions
   [junit4]   2> 268178 INFO  (TEST-TestReplicationHandler.doTestStressReplication-seed#[1DE0945A78842956]) [    ] o.a.s.s.SolrDispatchFilter user.dir=C:\Users\jenkins\workspace\Lucene-Solr-master-Windows\solr\build\solr-core\test\J0
   [junit4]   2> 268178 INFO  (TEST-TestReplicationHandler.doTestStressReplication-seed#[1DE0945A78842956]) [    ] o.a.s.s.SolrDispatchFilter SolrDispatchFilter.init() done
   [junit4]   2> 268179 INFO  (coreLoadExecutor-818-thread-1) [    ] o.a.s.c.SolrResourceLoader new SolrResourceLoader for directory: 'C:\Users\jenkins\workspace\Lucene-Solr-master-Windows\solr\build\solr-core\test\J0\temp\solr.handler.TestReplicationHandler_1DE0945A78842956-001\solr-instance-001\collection1'
   [junit4]   2> 268179 INFO  (coreLoadExecutor-818-thread-1) [    ] o.a.s.c.SolrResourceLoader JNDI not configured for solr (NoInitialContextEx)
   [junit4]   2> 268179 INFO  (coreLoadExecutor-818-thread-1) [    ] o.a.s.c.SolrResourceLoader solr home defaulted to 'solr/' (could not find system property or JNDI)
   [junit4]   2> 268200 INFO  (coreLoadExecutor-818-thread-1) [    ] o.a.s.c.SolrConfig current version of requestparams : -1
   [junit4]   2> 268206 WARN  (coreLoadExecutor-818-thread-1) [    ] o.a.s.c.Config Beginning with Solr 5.5, <mergePolicy> is deprecated, use <mergePolicyFactory> instead.
   [junit4]   2> 268206 INFO  (coreLoadExecutor-818-thread-1) [    ] o.a.s.c.SolrConfig Using Lucene MatchVersion: 7.0.0
   [junit4]   2> 268215 INFO  (coreLoadExecutor-818-thread-1) [    ] o.a.s.c.SolrConfig Loaded SolrConfig: solrconfig.xml
   [junit4]   2> 268218 INFO  (coreLoadExecutor-818-thread-1) [    ] o.a.s.s.IndexSchema [collection1] Schema name=test
   [junit4]   2> 268226 INFO  (coreLoadExecutor-818-thread-1) [    ] o.a.s.s.IndexSchema unique key field: id
   [junit4]   2> 268234 INFO  (coreLoadExecutor-818-thread-1) [    ] o.a.s.c.ConfigSetProperties Did not find ConfigSet properties, assuming default properties: Can't find resource 'configsetprops.json' in classpath or 'C:\Users\jenkins\workspace\Lucene-Solr-master-Windows\solr\build\solr-core\test\J0\temp\solr.handler.TestReplicationHandler_1DE0945A78842956-001\solr-instance-001\collection1'
   [junit4]   2> 268234 INFO  (coreLoadExecutor-818-thread-1) [    ] o.a.s.c.CoreContainer Creating SolrCore 'collection1' using configuration from instancedir C:\Users\jenkins\workspace\Lucene-Solr-master-Windows\solr\build\solr-core\test\J0\temp\solr.handler.TestReplicationHandler_1DE0945A78842956-001\solr-instance-001\.\collection1
   [junit4]   2> 268234 INFO  (coreLoadExecutor-818-thread-1) [    x:collection1] o.a.s.c.SolrCore org.apache.solr.core.MockDirectoryFactory
   [junit4]   2> 268234 INFO  (coreLoadExecutor-818-thread-1) [    x:collection1] o.a.s.c.SolrCore [[collection1] ] Opening new SolrCore at [C:\Users\jenkins\workspace\Lucene-Solr-master-Windows\solr\build\solr-core\test\J0\temp\solr.handler.TestReplicationHandler_1DE0945A78842956-001\solr-instance-001\collection1], dataDir=[C:\Users\jenkins\workspace\Lucene-Solr-master-Windows\solr\build\solr-core\test\J0\temp\solr.handler.TestReplicationHandler_1DE0945A78842956-001\solr-instance-001\.\collection1\data\]
   [junit4]   2> 268234 INFO  (coreLoadExecutor-818-thread-1) [    x:collection1] o.a.s.c.SolrCore JMX monitoring not detected for core: collection1
   [junit4]   2> 268235 INFO  (coreLoadExecutor-818-thread-1) [    x:collection1] o.a.s.c.CachingDirectoryFactory return new directory for C:\Users\jenkins\workspace\Lucene-Solr-master-Windows\solr\build\solr-core\test\J0\temp\solr.handler.TestReplicationHandler_1DE0945A78842956-001\solr-instance-001\.\collection1\data\
   [junit4]   2> 268235 INFO  (coreLoadExecutor-818-thread-1) [    x:collection1] o.a.s.c.SolrCore New index directory detected: old=null new=C:\Users\jenkins\workspace\Lucene-Solr-master-Windows\solr\build\solr-core\test\J0\temp\solr.handler.TestReplicationHandler_1DE0945A78842956-001\solr-instance-001\.\collection1\data\index/
   [junit4]   2> 268235 WARN  (coreLoadExecutor-818-thread-1) [    x:collection1] o.a.s.c.SolrCore [collection1] Solr index directory 'C:\Users\jenkins\workspace\Lucene-Solr-master-Windows\solr\build\solr-core\test\J0\temp\solr.handler.TestReplicationHandler_1DE0945A78842956-001\solr-instance-001\.\collection1\data\index' doesn't exist. Creating new index...
   [junit4]   2> 268235 INFO  (coreLoadExecutor-818-thread-1) [    x:collection1] o.a.s.c.CachingDirectoryFactory return new directory for C:\Users\jenkins\workspace\Lucene-Solr-master-Windows\solr\build\solr-core\test\J0\temp\solr.handler.TestReplicationHandler_1DE0945A78842956-001\solr-instance-001\.\collection1\data\index
   [junit4]   2> 268235 INFO  (coreLoadExecutor-818-thread-1) [    x:collection1] o.a.s.u.RandomMergePolicy RandomMergePolicy wrapping class org.apache.lucene.index.AlcoholicMergePolicy: [AlcoholicMergePolicy: minMergeSize=0, mergeFactor=10, maxMergeSize=2147240494, maxMergeSizeForForcedMerge=9223372036854775807, calibrateSizeByDeletes=true, maxMergeDocs=2147483647, maxCFSSegmentSizeMB=8.796093022207999E12, noCFSRatio=0.1]
   [junit4]   2> 268236 INFO  (coreLoadExecutor-818-thread-1) [    x:collection1] o.a.s.c.SolrDeletionPolicy SolrDeletionPolicy.onCommit: commits: num=1
   [junit4]   2> 	commit{dir=MockDirectoryWrapper(RAMDirectory@1b3b85ce lockFactory=org.apache.lucene.store.SingleInstanceLockFactory@924b2c4),segFN=segments_1,generation=1}
   [junit4]   2> 268236 INFO  (coreLoadExecutor-818-thread-1) [    x:collection1] o.a.s.c.SolrDeletionPolicy newest commit generation = 1
   [junit4]   2> 268237 INFO  (coreLoadExecutor-818-thread-1) [    x:collection1] o.a.s.c.SolrCore no updateRequestProcessorChain defined as default, creating implicit default
   [junit4]   2> 268238 INFO  (OldIndexDirectoryCleanupThreadForCore-collection1) [    x:collection1] o.a.s.c.SolrCore Looking for old index directories to cleanup for core collection1 in C:\Users\jenkins\workspace\Lucene-Solr-master-Windows\solr\build\solr-core\test\J0\temp\solr.handler.TestReplicationHandler_1DE0945A78842956-001\solr-instance-001\.\collection1\data\
   [junit4]   2> 268243 INFO  (coreLoadExecutor-818-thread-1) [    x:collection1] o.a.s.h.l.XMLLoader xsltCacheLifetimeSeconds=60
   [junit4]   2> 268244 INFO  (coreLoadExecutor-818-thread-1) [    x:collection1] o.a.s.h.l.XMLLoader xsltCacheLifetimeSeconds=60
   [junit4]   2> 268245 INFO  (coreLoadExecutor-818-thread-1) [    x:collection1] o.a.s.h.l.XMLLoader xsltCacheLifetimeSeconds=60
   [junit4]   2> 268246 INFO  (coreLoadExecutor-818-thread-1) [    x:collection1] o.a.s.h.l.XMLLoader xsltCacheLifetimeSeconds=60
   [junit4]   2> 268247 INFO  (coreLoadExecutor-818-thread-1) [    x:collection1] o.a.s.c.PluginBag requestHandler : 'lazy' created with startup=lazy 
   [junit4]   2> 268247 INFO  (coreLoadExecutor-818-thread-1) [    x:collection1] o.a.s.c.RequestHandlers Registered paths: /admin/mbeans,standard,lazy,/update/json/docs,/admin/luke,/export,/get,/admin/properties,/update/json,/admin/threads,/update/csv,/sql,/admin/segments,/admin/system,/replication,defaults,/config,/stream,/schema,/admin/plugins,/admin/logging,/admin/ping,/update,/admin/file
   [junit4]   2> 268247 INFO  (coreLoadExecutor-818-thread-1) [    x:collection1] o.a.s.c.SolrCore Using default statsCache cache: org.apache.solr.search.stats.LocalStatsCache
   [junit4]   2> 268248 INFO  (coreLoadExecutor-818-thread-1) [    x:collection1] o.a.s.u.CommitTracker Hard AutoCommit: disabled
   [junit4]   2> 268248 INFO  (coreLoadExecutor-818-thread-1) [    x:collection1] o.a.s.u.CommitTracker Soft AutoCommit: disabled
   [junit4]   2> 268248 INFO  (coreLoadExecutor-818-thread-1) [    x:collection1] o.a.s.u.RandomMergePolicy RandomMergePolicy wrapping class org.apache.lucene.index.TieredMergePolicy: [TieredMergePolicy: maxMergeAtOnce=41, maxMergeAtOnceExplicit=33, maxMergedSegmentMB=76.0087890625, floorSegmentMB=1.703125, forceMergeDeletesPctAllowed=13.96537289015696, segmentsPerTier=19.0, maxCFSSegmentSizeMB=8.796093022207999E12, noCFSRatio=0.3582743427778934
   [junit4]   2> 268249 INFO  (coreLoadExecutor-818-thread-1) [    x:collection1] o.a.s.c.SolrDeletionPolicy SolrDeletionPolicy.onInit: commits: num=1
   [junit4]   2> 	commit{dir=MockDirectoryWrapper(RAMDirectory@1b3b85ce lockFactory=org.apache.lucene.store.SingleInstanceLockFactory@924b2c4),segFN=segments_1,generation=1}
   [junit4]   2> 268249 INFO  (coreLoadExecutor-818-thread-1) [    x:collection1] o.a.s.c.SolrDeletionPolicy newest commit generation = 1
   [junit4]   2> 268249 INFO  (coreLoadExecutor-818-thread-1) [    x:collection1] o.a.s.s.SolrIndexSearcher Opening [Searcher@29ae9117[collection1] main]
   [junit4]   2> 268249 INFO  (coreLoadExecutor-818-thread-1) [    x:collection1] o.a.s.r.ManagedResourceStorage File-based storage initialized to use dir: C:\Users\jenkins\workspace\Lucene-Solr-master-Windows\solr\build\solr-core\test\J0\temp\solr.handler.TestReplicationHandler_1DE0945A78842956-001\solr-instance-001\collection1\conf
   [junit4]   2> 268249 INFO  (coreLoadExecutor-818-thread-1) [    x:collection1] o.a.s.r.RestManager Initializing RestManager with initArgs: {storageDir=C:\Users\jenkins\workspace\Lucene-Solr-master-Windows\solr\build\solr-core\test\J0\temp\solr.handler.TestReplicationHandler_1DE0945A78842956-001\solr-instance-001\collection1\conf}
   [junit4]   2> 268249 INFO  (coreLoadExecutor-818-thread-1) [    x:collection1] o.a.s.r.ManagedResourceStorage Reading _rest_managed.json using file:dir=C:\Users\jenkins\workspace\Lucene-Solr-master-Windows\solr\build\solr-core\test\J0\temp\solr.handler.TestReplicationHandler_1DE0945A78842956-001\solr-instance-001\collection1\conf
   [junit4]   2> 268250 INFO  (coreLoadExecutor-818-thread-1) [    x:collection1] o.a.s.r.RestManager Initializing 0 registered ManagedResources
   [junit4]   2> 268250 INFO  (coreLoadExecutor-818-thread-1) [    x:collection1] o.a.s.h.ReplicationHandler Replication enabled for following config files: schema.xml,xslt/dummy.xsl
   [junit4]   2> 268250 INFO  (coreLoadExecutor-818-thread-1) [    x:collection1] o.a.s.h.ReplicationHandler Commits will be reserved for  10000
   [junit4]   2> 268250 INFO  (searcherExecutor-819-thread-1-processing-x:collection1) [    x:collection1] o.a.s.c.SolrCore [collection1] Registered new searcher Searcher@29ae9117[collection1] main{ExitableDirectoryReader(UninvertingDirectoryReader())}
   [junit4]   2> 268250 INFO  (coreLoadExecutor-818-thread-1) [    x:collection1] o.a.s.c.CoreContainer registering core: collection1
   [junit4]   2> 268688 INFO  (TEST-TestReplicationHandler.doTestStressReplication-seed#[1DE0945A78842956]) [    ] o.a.s.SolrTestCaseJ4 Writing core.properties file to C:\Users\jenkins\workspace\Lucene-Solr-master-Windows\solr\build\solr-core\test\J0\temp\solr.handler.TestReplicationHandler_1DE0945A78842956-001\solr-instance-002\collection1
   [junit4]   2> 268698 INFO  (TEST-TestReplicationHandler.doTestStressReplication-seed#[1DE0945A78842956]) [    ] o.e.j.s.Server jetty-9.3.6.v20151106
   [junit4]   2> 268700 INFO  (TEST-TestReplicationHandler.doTestStressReplication-seed#[1DE0945A78842956]) [    ] o.e.j.s.h.ContextHandler Started o.e.j.s.ServletContextHandler@1f89ed15{/solr,null,AVAILABLE}
   [junit4]   2> 268701 INFO  (TEST-TestReplicationHandler.doTestStressReplication-seed#[1DE0945A78842956]) [    ] o.e.j.s.ServerConnector Started ServerConnector@2f89d8ef{HTTP/1.1,[http/1.1]}{127.0.0.1:49484}
   [junit4]   2> 268701 INFO  (TEST-TestReplicationHandler.doTestStressReplication-seed#[1DE0945A78842956]) [    ] o.e.j.s.Server Started @273626ms
   [junit4]   2> 268702 INFO  (TEST-TestReplicationHandler.doTestStressReplication-seed#[1DE0945A78842956]) [    ] o.a.s.c.s.e.JettySolrRunner Jetty properties: {solr.data.dir=C:\Users\jenkins\workspace\Lucene-Solr-master-Windows\solr\build\solr-core\test\J0\temp\solr.handler.TestReplicationHandler_1DE0945A78842956-001\solr-instance-002\collection1\data, hostContext=/solr, hostPort=49484}
   [junit4]   2> 268702 INFO  (TEST-TestReplicationHandler.doTestStressReplication-seed#[1DE0945A78842956]) [    ] o.a.s.s.SolrDispatchFilter SolrDispatchFilter.init(): sun.misc.Launcher$AppClassLoader@73d16e93
   [junit4]   2> 268702 INFO  (TEST-TestReplicationHandler.doTestStressReplication-seed#[1DE0945A78842956]) [    ] o.a.s.c.SolrResourceLoader new SolrResourceLoader for directory: 'C:\Users\jenkins\workspace\Lucene-Solr-master-Windows\solr\build\solr-core\test\J0\temp\solr.handler.TestReplicationHandler_1DE0945A78842956-001\solr-instance-002'
   [junit4]   2> 268702 INFO  (TEST-TestReplicationHandler.doTestStressReplication-seed#[1DE0945A78842956]) [    ] o.a.s.c.SolrResourceLoader JNDI not configured for solr (NoInitialContextEx)
   [junit4]   2> 268702 INFO  (TEST-TestReplicationHandler.doTestStressReplication-seed#[1DE0945A78842956]) [    ] o.a.s.c.SolrResourceLoader solr home defaulted to 'solr/' (could not find system property or JNDI)
   [junit4]   2> 268703 INFO  (TEST-TestReplicationHandler.doTestStressReplication-seed#[1DE0945A78842956]) [    ] o.a.s.c.SolrXmlConfig Loading container configuration from C:\Users\jenkins\workspace\Lucene-Solr-master-Windows\solr\build\solr-core\test\J0\temp\solr.handler.TestReplicationHandler_1DE0945A78842956-001\solr-instance-002\solr.xml
   [junit4]   2> 268723 INFO  (TEST-TestReplicationHandler.doTestStressReplication-seed#[1DE0945A78842956]) [    ] o.a.s.c.CorePropertiesLocator Config-defined core root directory: C:\Users\jenkins\workspace\Lucene-Solr-master-Windows\solr\build\solr-core\test\J0\temp\solr.handler.TestReplicationHandler_1DE0945A78842956-001\solr-instance-002\.
   [junit4]   2> 268723 INFO  (TEST-TestReplicationHandler.doTestStressReplication-seed#[1DE0945A78842956]) [    ] o.a.s.c.CoreContainer New CoreContainer 1728112576
   [junit4]   2> 268723 INFO  (TEST-TestReplicationHandler.doTestStressReplication-seed#[1DE0945A78842956]) [    ] o.a.s.c.CoreContainer Loading cores into CoreContainer [instanceDir=C:\Users\jenkins\workspace\Lucene-Solr-master-Windows\solr\build\solr-core\test\J0\temp\solr.handler.TestReplicationHandler_1DE0945A78842956-001\solr-instance-002]
   [junit4]   2> 268723 WARN  (TEST-TestReplicationHandler.doTestStressReplication-seed#[1DE0945A78842956]) [    ] o.a.s.c.CoreContainer Couldn't add files from C:\Users\jenkins\workspace\Lucene-Solr-master-Windows\solr\build\solr-core\test\J0\temp\solr.handler.TestReplicationHandler_1DE0945A78842956-001\solr-instance-002\lib to classpath: C:\Users\jenkins\workspace\Lucene-Solr-master-Windows\solr\build\solr-core\test\J0\temp\solr.handler.TestReplicationHandler_1DE0945A78842956-001\solr-instance-002\lib
   [junit4]   2> 268729 INFO  (TEST-TestReplicationHandler.doTestStressReplication-seed#[1DE0945A78842956]) [    ] o.a.s.h.c.HttpShardHandlerFactory created with socketTimeout : 90000,urlScheme : ,connTimeout : 15000,maxConnectionsPerHost : 20,maxConnections : 10000,corePoolSize : 0,maximumPoolSize : 2147483647,maxThreadIdleTime : 5,sizeOfQueue : -1,fairnessPolicy : false,useRetries : false,
   [junit4]   2> 268730 INFO  (TEST-TestReplicationHandler.doTestStressReplication-seed#[1DE0945A78842956]) [    ] o.a.s.u.UpdateShardHandler Creating UpdateShardHandler HTTP client with params: socketTimeout=340000&connTimeout=45000&retry=true
   [junit4]   2> 268731 INFO  (TEST-TestReplicationHandler.doTestStressReplication-seed#[1DE0945A78842956]) [    ] o.a.s.l.LogWatcher SLF4J impl is org.slf4j.impl.Log4jLoggerFactory
   [junit4]   2> 268731 INFO  (TEST-TestReplicationHandler.doTestStressReplication-seed#[1DE0945A78842956]) [    ] o.a.s.l.LogWatcher Registering Log Listener [Log4j (org.slf4j.impl.Log4jLoggerFactory)]
   [junit4]   2> 268731 INFO  (TEST-TestReplicationHandler.doTestStressReplication-seed#[1DE0945A78842956]) [    ] o.a.s.c.CoreContainer Security conf doesn't exist. Skipping setup for authorization module.
   [junit4]   2> 268731 INFO  (TEST-TestReplicationHandler.doTestStressReplication-seed#[1DE0945A78842956]) [    ] o.a.s.c.CoreContainer No authentication plugin used.
   [junit4]   2> 268732 INFO  (TEST-TestReplicationHandler.doTestStressReplication-seed#[1DE0945A78842956]) [    ] o.a.s.c.CorePropertiesLocator Looking for core definitions underneath C:\Users\jenkins\workspace\Lucene-Solr-master-Windows\solr\build\solr-core\test\J0\temp\solr.handler.TestReplicationHandler_1DE0945A78842956-001\solr-instance-002\.
   [junit4]   2> 268735 INFO  (TEST-TestReplicationHandler.doTestStressReplication-seed#[1DE0945A78842956]) [    ] o.a.s.c.CoreDescriptor Created CoreDescriptor: {name=collection1, config=solrconfig.xml, loadOnStartup=true, schema=schema.xml, configSetProperties=configsetprops.json, transient=false, dataDir=data\}
   [junit4]   2> 268735 INFO  (TEST-TestReplicationHandler.doTestStressReplication-seed#[1DE0945A78842956]) [    ] o.a.s.c.CorePropertiesLocator Found core collection1 in C:\Users\jenkins\workspace\Lucene-Solr-master-Windows\solr\build\solr-core\test\J0\temp\solr.handler.TestReplicationHandler_1DE0945A78842956-001\solr-instance-002\.\collection1
   [junit4]   2> 268736 INFO  (TEST-TestReplicationHandler.doTestStressReplication-seed#[1DE0945A78842956]) [    ] o.a.s.c.CorePropertiesLocator Found 1 core definitions
   [junit4]   2> 268736 INFO  (TEST-TestReplicationHandler.doTestStressReplication-seed#[1DE0945A78842956]) [    ] o.a.s.s.SolrDispatchFilter user.dir=C:\Users\jenkins\workspace\Lucene-Solr-master-Windows\solr\build\solr-core\test\J0
   [junit4]   2> 268736 INFO  (TEST-TestReplicationHandler.doTestStressReplication-seed#[1DE0945A78842956]) [    ] o.a.s.s.SolrDispatchFilter SolrDispatchFilter.init() done
   [junit4]   2> 268736 INFO  (coreLoadExecutor-828-thread-1) [    ] o.a.s.c.SolrResourceLoader new SolrResourceLoader for directory: 'C:\Users\jenkins\workspace\Lucene-Solr-master-Windows\solr\build\solr-core\test\J0\temp\solr.handler.TestReplicationHandler_1DE0945A78842956-001\solr-instance-002\collection1'
   [junit4]   2> 268737 INFO  (coreLoadExecutor-828-thread-1) [    ] o.a.s.c.SolrResourceLoader JNDI not configured for solr (NoInitialContextEx)
   [junit4]   2> 268737 INFO  (coreLoadExecutor-828-thread-1) [    ] o.a.s.c.SolrResourceLoader solr home defaulted to 'solr/' (could not find system property or JNDI)
   [junit4]   2> 268750 INFO  (coreLoadExecutor-828-thread-1) [    ] o.a.s.c.SolrConfig current version of requestparams : -1
   [junit4]   2> 268752 WARN  (coreLoadExecutor-828-thread-1) [    ] o.a.s.c.Config Beginning with Solr 5.5, <mergePolicy> is deprecated, use <mergePolicyFactory> instead.
   [junit4]   2> 268754 INFO  (coreLoadExecutor-828-thread-1) [    ] o.a.s.c.SolrConfig Using Lucene MatchVersion: 7.0.0
   [junit4]   2> 268767 INFO  (coreLoadExecutor-828-thread-1) [    ] o.a.s.c.SolrConfig Loaded SolrConfig: solrconfig.xml
   [junit4]   2> 268770 INFO  (coreLoadExecutor-828-thread-1) [    ] o.a.s.s.IndexSchema [collection1] Schema name=test
   [junit4]   2> 268772 INFO  (coreLoadExecutor-828-thread-1) [    ] o.a.s.s.IndexSchema unique key field: id
   [junit4]   2> 268774 INFO  (coreLoadExecutor-828-thread-1) [    ] o.a.s.c.ConfigSetProperties Did not find ConfigSet properties, assuming default properties: Can't find resource 'configsetprops.json' in classpath or 'C:\Users\jenkins\workspace\Lucene-Solr-master-Windows\solr\build\solr-core\test\J0\temp\solr.handler.TestReplicationHandler_1DE0945A78842956-001\solr-instance-002\collection1'
   [junit4]   2> 268774 INFO  (coreLoadExecutor-828-thread-1) [    ] o.a.s.c.CoreContainer Creating SolrCore 'collection1' using configuration from instancedir C:\Users\jenkins\workspace\Lucene-Solr-master-Windows\solr\build\solr-core\test\J0\temp\solr.handler.TestReplicationHandler_1DE0945A78842956-001\solr-instance-002\.\collection1
   [junit4]   2> 268775 INFO  (coreLoadExecutor-828-thread-1) [    x:collection1] o.a.s.c.SolrCore org.apache.solr.core.MockDirectoryFactory
   [junit4]   2> 268775 INFO  (coreLoadExecutor-828-thread-1) [    x:collection1] o.a.s.c.SolrCore [[collection1] ] Opening new SolrCore at [C:\Users\jenkins\workspace\Lucene-Solr-master-Windows\solr\build\solr-core\test\J0\temp\solr.handler.TestReplicationHandler_1DE0945A78842956-001\solr-instance-002\collection1], dataDir=[C:\Users\jenkins\workspace\Lucene-Solr-master-Windows\solr\build\solr-core\test\J0\temp\solr.handler.TestReplicationHandler_1DE0945A78842956-001\solr-instance-002\.\collection1\data\]
   [junit4]   2> 268775 INFO  (coreLoadExecutor-828-thread-1) [    x:collection1] o.a.s.c.SolrCore JMX monitoring not detected for core: collection1
   [junit4]   2> 268775 INFO  (coreLoadExecutor-828-thread-1) [    x:collection1] o.a.s.c.CachingDirectoryFactory return new directory for C:\Users\jenkins\workspace\Lucene-Solr-master-Windows\solr\build\solr-core\test\J0\temp\solr.handler.TestReplicationHandler_1DE0945A78842956-001\solr-instance-002\.\collection1\data\
   [junit4]   2> 268775 INFO  (coreLoadExecutor-828-thread-1) [    x:collection1] o.a.s.c.SolrCore New index directory detected: old=null new=C:\Users\jenkins\workspace\Lucene-Solr-master-Windows\solr\build\solr-core\test\J0\temp\solr.handler.TestReplicationHandler_1DE0945A78842956-001\solr-instance-002\.\collection1\data\index/
   [junit4]   2> 268775 WARN  (coreLoadExecutor-828-thread-1) [    x:collection1] o.a.s.c.SolrCore [collection1] Solr index directory 'C:\Users\jenkins\workspace\Lucene-Solr-master-Windows\solr\build\solr-core\test\J0\temp\solr.handler.TestReplicationHandler_1DE0945A78842956-001\solr-instance-002\.\collection1\data\index' doesn't exist. Creating new index...
   [junit4]   2> 268775 INFO  (coreLoadExecutor-828-thread-1) [    x:collection1] o.a.s.c.CachingDirectoryFactory return new directory for C:\Users\jenkins\workspace\Lucene-Solr-master-Windows\solr\build\solr-core\test\J0\temp\solr.handler.TestReplicationHandler_1DE0945A78842956-001\solr-instance-002\.\collection1\data\index
   [junit4]   2> 268776 INFO  (coreLoadExecutor-828-thread-1) [    x:collection1] o.a.s.u.RandomMergePolicy RandomMergePolicy wrapping class org.apache.lucene.index.AlcoholicMergePolicy: [AlcoholicMergePolicy: minMergeSize=0, mergeFactor=10, maxMergeSize=2147240494, maxMergeSizeForForcedMerge=9223372036854775807, calibrateSizeByDeletes=true, maxMergeDocs=2147483647, maxCFSSegmentSizeMB=8.796093022207999E12, noCFSRatio=0.1]
   [junit4]   2> 268777 INFO  (coreLoadExecutor-828-thread-1) [    x:collection1] o.a.s.c.SolrDeletionPolicy SolrDeletionPolicy.onCommit: commits: num=1
   [junit4]   2> 	commit{dir=MockDirectoryWrapper(RAMDirectory@20ac28a8 lockFactory=org.apache.lucene.store.SingleInstanceLockFactory@589f26c8),segFN=segments_1,generation=1}
   [junit4]   2> 268777 INFO  (coreLoadExecutor-828-thread-1) [    x:collection1] o.a.s.c.SolrDeletionPolicy newest commit generation = 1
   [junit4]   2> 268777 INFO  (OldIndexDirectoryCleanupThreadForCore-collection1) [    x:collection1] o.a.s.c.SolrCore Looking for old index directories to cleanup for core collection1 in C:\Users\jenkins\workspace\Lucene-Solr-master-Windows\solr\build\solr-core\test\J0\temp\solr.handler.TestReplicationHandler_1DE0945A78842956-001\solr-instance-002\.\collection1\data\
   [junit4]   2> 268779 INFO  (coreLoadExecutor-828-thread-1) [    x:collection1] o.a.s.c.SolrCore no updateRequestProcessorChain defined as default, creating implicit default
   [junit4]   2> 268781 INFO  (coreLoadExecutor-828-thread-1) [    x:collection1] o.a.s.h.l.XMLLoader xsltCacheLifetimeSeconds=60
   [junit4]   2> 268782 INFO  (coreLoadExecutor-828-thread-1) [    x:collection1] o.a.s.h.l.XMLLoader xsltCacheLifetimeSeconds=60
   [junit4]   2> 268783 INFO  (coreLoadExecutor-828-thread-1) [    x:collection1] o.a.s.h.l.XMLLoader xsltCacheLifetimeSeconds=60
   [junit4]   2> 268784 INFO  (coreLoadExecutor-828-thread-1) [    x:collection1] o.a.s.h.l.XMLLoader xsltCacheLifetimeSeconds=60
   [junit4]   2> 268785 INFO  (coreLoadExecutor-828-thread-1) [    x:collection1] o.a.s.c.PluginBag requestHandler : 'lazy' created with startup=lazy 
   [junit4]   2> 268785 INFO  (coreLoadExecutor-828-thread-1) [    x:collection1] o.a.s.c.RequestHandlers Registered paths: /admin/mbeans,standard,lazy,/update/json/docs,/admin/luke,/export,/get,/admin/properties,/update/json,/admin/threads,/update/csv,/sql,/admin/segments,/admin/system,/replication,defaults,/config,/stream,/schema,/admin/plugins,/admin/logging,/admin/ping,/update,/admin/file
   [junit4]   2> 268785 INFO  (coreLoadExecutor-828-thread-1) [    x:collection1] o.a.s.c.SolrCore Using default statsCache cache: org.apache.solr.search.stats.LocalStatsCache
   [junit4]   2> 268786 INFO  (coreLoadExecutor-828-thread-1) [    x:collection1] o.a.s.u.CommitTracker Hard AutoCommit: disabled
   [junit4]   2> 268786 INFO  (coreLoadExecutor-828-thread-1) [    x:collection1] o.a.s.u.CommitTracker Soft AutoCommit: disabled
   [junit4]   2> 268786 INFO  (coreLoadExecutor-828-thread-1) [    x:collection1] o.a.s.u.RandomMergePolicy RandomMergePolicy wrapping class org.apache.lucene.index.TieredMergePolicy: [TieredMergePolicy: maxMergeAtOnce=41, maxMergeAtOnceExplicit=33, maxMergedSegmentMB=76.0087890625, floorSegmentMB=1.703125, forceMergeDeletesPctAllowed=13.96537289015696, segmentsPerTier=19.0, maxCFSSegmentSizeMB=8.796093022207999E12, noCFSRatio=0.3582743427778934
   [junit4]   2> 268786 INFO  (coreLoadExecutor-828-thread-1) [    x:collection1] o.a.s.c.SolrDeletionPolicy SolrDeletionPolicy.onInit: commits: num=1
   [junit4]   2> 	commit{dir=MockDirectoryWrapper(RAMDirectory@20ac28a8 lockFactory=org.apache.lucene.store.SingleInstanceLockFactory@589f26c8),segFN=segments_1,generation=1}
   [junit4]   2> 268786 INFO  (coreLoadExecutor-828-thread-1) [    x:collection1] o.a.s.c.SolrDeletionPolicy newest commit generation = 1
   [junit4]   2> 268786 INFO  (coreLoadExecutor-828-thread-1) [    x:collection1] o.a.s.s.SolrIndexSearcher Opening [Searcher@4ec23ae2[collection1] main]
   [junit4]   2> 268787 INFO  (coreLoadExecutor-828-thread-1) [    x:collection1] o.a.s.r.ManagedResourceStorage File-based storage initialized to use dir: C:\Users\jenkins\workspace\Lucene-Solr-master-Windows\solr\build\solr-core\test\J0\temp\solr.handler.TestReplicationHandler_1DE0945A78842956-001\solr-instance-002\collection1\conf
   [junit4]   2> 268787 INFO  (coreLoadExecutor-828-thread-1) [    x:collection1] o.a.s.r.RestManager Initializing RestManager with initArgs: {storageDir=C:\Users\jenkins\workspace\Lucene-Solr-master-Windows\solr\build\solr-core\test\J0\temp\solr.handler.TestReplicationHandler_1DE0945A78842956-001\solr-instance-002\collection1\conf}
   [junit4]   2> 268787 INFO  (coreLoadExecutor-828-thread-1) [    x:collection1] o.a.s.r.ManagedResourceStorage Reading _rest_managed.json using file:dir=C:\Users\jenkins\workspace\Lucene-Solr-master-Windows\solr\build\solr-core\test\J0\temp\solr.handler.TestReplicationHandler_1DE0945A78842956-001\solr-instance-002\collection1\conf
   [junit4]   2> 268787 INFO  (coreLoadExecutor-828-thread-1) [    x:collection1] o.a.s.r.RestManager Initializing 0 registered ManagedResources
   [junit4]   2> 268789 INFO  (coreLoadExecutor-828-thread-1) [    x:collection1] o.a.s.h.ReplicationHandler Poll scheduled at an interval of 1000ms
   [junit4]   2> 268789 INFO  (searcherExecutor-829-thread-1-processing-x:collection1) [    x:collection1] o.a.s.c.SolrCore [collection1] Registered new searcher Searcher@4ec23ae2[collection1] main{ExitableDirectoryReader(UninvertingDirectoryReader())}
   [junit4]   2> 268789 INFO  (coreLoadExecutor-828-thread-1) [    x:collection1] o.a.s.c.CoreContainer registering core: collection1
   [junit4]   2> 268797 INFO  (qtp205973491-1444) [    x:collection1] o.a.s.c.S.Request [collection1]  webapp=/solr path=/replication params={qt=/replication&wt=javabin&version=2&command=indexversion} status=0 QTime=0
   [junit4]   2> 269241 INFO  (TEST-TestReplicationHandler.doTestStressReplication-seed#[1DE0945A78842956]) [    ] o.e.j.s.ServerConnector Stopped ServerConnector@2f89d8ef{HTTP/1.1,[http/1.1]}{127.0.0.1:0}
   [junit4]   2> 269241 INFO  (TEST-TestReplicationHandler.doTestStressReplication-seed#[1DE0945A78842956]) [    ] o.a.s.c.CoreContainer Shutting down CoreContainer instance=1728112576
   [junit4]   2> 269243 INFO  (coreCloseExecutor-834-thread-1) [    x:collection1] o.a.s.c.SolrCore [collection1]  CLOSING SolrCore org.apache.solr.core.SolrCore@6d9c1008
   [junit4]   2> 269244 INFO  (coreCloseExecutor-834-thread-1) [    x:collection1] o.a.s.u.DirectUpdateHandler2 closing DirectUpdateHandler2{commits=0,autocommits=0,soft autocommits=0,optimizes=0,rollbacks=0,expungeDeletes=0,docsPending=0,adds=0,deletesById=0,deletesByQuery=0,errors=0,cumulative_adds=0,cumulative_deletesById=0,cumulative_deletesByQuery=0,cumulative_errors=0}
   [junit4]   2> 269245 INFO  (coreCloseExecutor-834-thread-1) [    x:collection1] o.a.s.u.SolrCoreState Closing SolrCoreState
   [junit4]   2> 269245 INFO  (coreCloseExecutor-834-thread-1) [    x:collection1] o.a.s.u.DefaultSolrCoreState SolrCoreState ref count has reached 0 - closing IndexWriter
   [junit4]   2> 269245 INFO  (coreCloseExecutor-834-thread-1) [    x:collection1] o.a.s.u.DefaultSolrCoreState closing IndexWriter with IndexWriterCloser
   [junit4]   2> 269248 INFO  (coreCloseExecutor-834-thread-1) [    x:collection1] o.a.s.c.SolrCore [collection1] Closing main searcher on request.
   [junit4]   2> 269248 INFO  (coreCloseExecutor-834-thread-1) [    x:collection1] o.a.s.c.CachingDirectoryFactory Closing MockDirectoryFactory - 2 directories currently being tracked
   [junit4]   2> 269248 INFO  (coreCloseExecutor-834-thread-1) [    x:collection1] o.a.s.c.CachingDirectoryFactory looking to close C:\Users\jenkins\workspace\Lucene-Solr-master-Windows\solr\build\solr-core\test\J0\temp\solr.handler.TestReplicationHandler_1DE0945A78842956-001\solr-instance-002\.\collection1\data\index [CachedDir<<refCount=0;path=C:\Users\jenkins\workspace\Lucene-Solr-master-Windows\solr\build\solr-core\test\J0\temp\solr.handler.TestReplicationHandler_1DE0945A78842956-001\solr-instance-002\.\collection1\data\index;done=false>>]
   [junit4]   2> 269248 INFO  (coreCloseExecutor-834-thread-1) [    x:collection1] o.a.s.c.CachingDirectoryFactory Closing directory: C:\Users\jenkins\workspace\Lucene-Solr-master-Windows\solr\build\solr-core\test\J0\temp\solr.handler.TestReplicationHandler_1DE0945A78842956-001\solr-instance-002\.\collection1\data\index
   [junit4]   2> 269248 INFO  (coreCloseExecutor-834-thread-1) [    x:collection1] o.a.s.c.CachingDirectoryFactory looking to close C:\Users\jenkins\workspace\Lucene-Solr-master-Windows\solr\build\solr-core\test\J0\temp\solr.handler.TestReplicationHandler_1DE0945A78842956-001\solr-instance-002\.\collection1\data\ [CachedDir<<refCount=0;path=C:\Users\jenkins\workspace\Lucene-Solr-master-Windows\solr\build\solr-core\test\J0\temp\solr.handler.TestReplicationHandler_1DE0945A78842956-001\solr-instance-002\.\collection1\data\;done=false>>]
   [junit4]   2> 269249 INFO  (coreCloseExecutor-834-thread-1) [    x:collection1] o.a.s.c.CachingDirectoryFactory Closing directory: C:\Users\jenkins\workspace\Lucene-Solr-master-Windows\solr\build\solr-core\test\J0\temp\solr.handler.TestReplicationHandler_1DE0945A78842956-001\solr-instance-002\.\collection1\data\
   [junit4]   2> 269252 INFO  (TEST-TestReplicationHandler.doTestStressReplication-seed#[1DE0945A78842956]) [    ] o.e.j.s.h.ContextHandler Stopped o.e.j.s.ServletContextHandler@1f89ed15{/solr,null,UNAVAILABLE}
   [junit4]   2> 269282 INFO  (TEST-TestReplicationHandler.doTestStressReplication-seed#[1DE0945A78842956]) [    ] o.e.j.s.Server jetty-9.3.6.v20151106
   [junit4]   2> 269283 INFO  (TEST-TestReplicationHandler.doTestStressReplication-seed#[1DE0945A78842956]) [    ] o.e.j.s.h.ContextHandler Started o.e.j.s.ServletContextHandler@746337fe{/solr,null,AVAILABLE}
   [junit4]   2> 269284 INFO  (TEST-TestReplicationHandler.doTestStressReplication-seed#[1DE0945A78842956]) [    ] o.e.j.s.ServerConnector Started ServerConnector@9e4d108{HTTP/1.1,[http/1.1]}{127.0.0.1:49488}
   [junit4]   2> 269285 INFO  (TEST-TestReplicationHandler.doTestStressReplication-seed#[1DE0945A78842956]) [    ] o.e.j.s.Server Started @274210ms
   [junit4]   2> 269285 INFO  (TEST-TestReplicationHandler.doTestStressReplication-seed#[1DE0945A78842956]) [    ] o.a.s.c.s.e.JettySolrRunner Jetty properties: {solr.data.dir=C:\Users\jenkins\workspace\Lucene-Solr-master-Windows\solr\build\solr-core\test\J0\temp\solr.handler.TestReplicationHandler_1DE0945A78842956-001\solr-instance-002\collection1\data, hostContext=/solr, hostPort=49488}
   [junit4]   2> 269285 INFO  (TEST-TestReplicationHandler.doTestStressReplication-seed#[1DE0945A78842956]) [    ] o.a.s.s.SolrDispatchFilter SolrDispatchFilter.init(): sun.misc.Launcher$AppClassLoader@73d16e93
   [junit4]   2> 269285 INFO  (TEST-TestReplicationHandler.doTestStressReplication-seed#[1DE0945A78842956]) [    ] o.a.s.c.SolrResourceLoader new SolrResourceLoader for directory: 'C:\Users\jenkins\workspace\Lucene-Solr-master-Windows\solr\build\solr-core\test\J0\temp\solr.handler.TestReplicationHandler_1DE0945A78842956-001\solr-instance-002'
   [junit4]   2> 269285 INFO  (TEST-TestReplicationHandler.doTestStressReplication-seed#[1DE0945A78842956]) [    ] o.a.s.c.SolrResourceLoader JNDI not configured for solr (NoInitialContextEx)
   [junit4]   2> 269286 INFO  (TEST-TestReplicationHandler.doTestStressReplication-seed#[1DE0945A78842956]) [    ] o.a.s.c.SolrResourceLoader solr home defaulted to 'solr/' (could not find system property or JNDI)
   [junit4]   2> 269288 INFO  (TEST-TestReplicationHandler.doTestStressReplication-seed#[1DE0945A78842956]) [    ] o.a.s.c.SolrXmlConfig Loading container configuration from C:\Users\jenkins\workspace\Lucene-Solr-master-Windows\solr\build\solr-core\test\J0\temp\solr.handler.TestReplicationHandler_1DE0945A78842956-001\solr-instance-002\solr.xml
   [junit4]   2> 269293 INFO  (TEST-TestReplicationHandler.doTestStressReplication-seed#[1DE0945A78842956]) [    ] o.a.s.c.CorePropertiesLocator Config-defined core root directory: C:\Users\jenkins\workspace\Lucene-Solr-master-Windows\solr\build\solr-core\test\J0\temp\solr.handler.TestReplicationHandler_1DE0945A78842956-001\solr-instance-002\.
   [junit4]   2> 269293 INFO  (TEST-TestReplicationHandler.doTestStressReplication-seed#[1DE0945A78842956]) [    ] o.a.s.c.CoreContainer New CoreContainer 1111862815
   [junit4]   2> 269293 INFO  (TEST-TestReplicationHandler.doTestStressReplication-seed#[1DE0945A78842956]) [    ] o.a.s.c.CoreContainer Loading cores into CoreContainer [instanceDir=C:\Users\jenkins\workspace\Lucene-Solr-master-Windows\solr\build\solr-core\test\J0\temp\solr.handler.TestReplicationHandler_1DE0945A78842956-001\solr-instance-002]
   [junit4]   2> 269293 WARN  (TEST-TestReplicationHandler.doTestStressReplication-seed#[1DE0945A78842956]) [    ] o.a.s.c.CoreContainer Couldn't add files from C:\Users\jenkins\workspace\Lucene-Solr-master-Windows\solr\build\solr-core\test\J0\temp\solr.handler.TestReplicationHandler_1DE0945A78842956-001\solr-instance-002\lib to classpath: C:\Users\jenkins\workspace\Lucene-Solr-master-Windows\solr\build\solr-core\test\J0\temp\solr.handler.TestReplicationHandler_1DE0945A78842956-001\solr-instance-002\lib
   [junit4]   2> 269294 INFO  (TEST-TestReplicationHandler.doTestStressReplication-seed#[1DE0945A78842956]) [    ] o.a.s.h.c.HttpShardHandlerFactory created with socketTimeout : 90000,urlScheme : ,connTimeout : 15000,maxConnectionsPerHost : 20,maxConnections : 10000,corePoolSize : 0,maximumPoolSize : 2147483647,maxThreadIdleTime : 5,sizeOfQueue : -1,fairnessPolicy : false,useRetries : false,
   [junit4]   2> 269295 INFO  (TEST-TestReplicationHandler.doTestStressReplication-seed#[1DE0945A78842956]) [    ] o.a.s.u.UpdateShardHandler Creating UpdateShardHandler HTTP client with params: socketTimeout=340000&connTimeout=45000&retry=true
   [junit4]   2> 269296 INFO  (TEST-TestReplicationHandler.doTestStressReplication-seed#[1DE0945A78842956]) [    ] o.a.s.l.LogWatcher SLF4J impl is org.slf4j.impl.Log4jLoggerFactory
   [junit4]   2> 269296 INFO  (TEST-TestReplicationHandler.doTestStressReplication-seed#[1DE0945A78842956]) [    ] o.a.s.l.LogWatcher Registering Log Listener [Log4j (org.slf4j.impl.Log4jLoggerFactory)]
   [junit4]   2> 269296 INFO  (TEST-TestReplicationHandler.doTestStressReplication-seed#[1DE0945A78842956]) [    ] o.a.s.c.CoreContainer Security conf doesn't exist. Skipping setup for authorization module.
   [junit4]   2> 269296 INFO  (TEST-TestReplicationHandler.doTestStressReplication-seed#[1DE0945A78842956]) [    ] o.a.s.c.CoreContainer No authentication plugin used.
   [junit4]   2> 269297 INFO  (TEST-TestReplicationHandler.doTestStressReplication-seed#[1DE0945A78842956]) [    ] o.a.s.c.CorePropertiesLocator Looking for core definitions underneath C:\Users\jenkins\workspace\Lucene-Solr-master-Windows\solr\build\solr-core\test\J0\temp\solr.handler.TestReplicationHandler_1DE0945A78842956-001\solr-instance-002\.
   [junit4]   2> 269298 INFO  (TEST-TestReplicationHandler.doTestStressReplication-seed#[1DE0945A78842956]) [    ] o.a.s.c.CoreDescriptor Created CoreDescriptor: {name=collection1, config=solrconfig.xml, loadOnStartup=true, schema=schema.xml, configSetProperties=configsetprops.json, transient=false, dataDir=data\}
   [junit4]   2> 269298 INFO  (TEST-TestReplicationHandler.doTestStressReplication-seed#[1DE0945A78842956]) [    ] o.a.s.c.CorePropertiesLocator Found core collection1 in C:\Users\jenkins\workspace\Lucene-Solr-master-Windows\solr\build\solr-core\test\J0\temp\solr.handler.TestReplicationHandler_1DE0945A78842956-001\solr-instance-002\.\collection1
   [junit4]   2> 269299 INFO  (TEST-TestReplicationHandler.doTestStressReplication-seed#[1DE0945A78842956]) [    ] o.a.s.c.CorePropertiesLocator Found 1 core definitions
   [junit4]   2> 269299 INFO  (TEST-TestReplicationHandler.doTestStressReplication-seed#[1DE0945A78842956]) [    ] o.a.s.s.SolrDispatchFilter user.dir=C:\Users\jenkins\workspace\Lucene-Solr-master-Windows\solr\build\solr-core\test\J0
   [junit4]   2> 269299 INFO  (TEST-TestReplicationHandler.doTestStressReplication-seed#[1DE0945A78842956]) [    ] o.a.s.s.SolrDispatchFilter SolrDispatchFilter.init() done
   [junit4]   2> 269299 INFO  (coreLoadExecutor-841-thread-1) [    ] o.a.s.c.SolrResourceLoader new SolrResourceLoader for directory: 'C:\Users\jenkins\workspace\Lucene-Solr-master-Windows\solr\build\solr-core\test\J0\temp\solr.handler.TestReplicationHandler_1DE0945A78842956-001\solr-instance-002\collection1'
   [junit4]   2> 269300 INFO  (coreLoadExecutor-841-thread-1) [    ] o.a.s.c.SolrResourceLoader JNDI not configured for solr (NoInitialContextEx)
   [junit4]   2> 269300 INFO  (coreLoadExecutor-841-thread-1) [    ] o.a.s.c.SolrResourceLoader solr home defaulted to 'solr/' (could not find system property or JNDI)
   [junit4]   2> 269307 INFO  (coreLoadExecutor-841-thread-1) [    ] o.a.s.c.SolrConfig current version of requestparams : -1
   [junit4]   2> 269313 WARN  (coreLoadExecutor-841-thread-1) [    ] o.a.s.c.Config Beginning with Solr 5.5, <mergePolicy> is deprecated, use <mergePolicyFactory> instead.
   [junit4]   2> 269313 INFO  (coreLoadExecutor-841-thread-1) [    ] o.a.s.c.SolrConfig Using Lucene MatchVersion: 7.0.0
   [junit4]   2> 269321 INFO  (coreLoadExecutor-841-thread-1) [    ] o.a.s.c.SolrConfig Loaded SolrConfig: solrconfig.xml
   [junit4]   2> 269327 INFO  (coreLoadExecutor-841-thread-1) [    ] o.a.s.s.IndexSchema [collection1] Schema name=test
   [junit4]   2> 269329 INFO  (coreLoadExecutor-841-thread-1) [    ] o.a.s.s.IndexSchema unique key field: id
   [junit4]   2> 269331 INFO  (coreLoadExecutor-841-thread-1) [    ] o.a.s.c.ConfigSetProperties Did not find ConfigSet properties, assuming default properties: Can't find resource 'configsetprops.json' in classpath or 'C:\Users\jenkins\workspace\Lucene-Solr-master-Windows\solr\build\solr-core\test\J0\temp\solr.handler.TestReplicationHandler_1DE0945A78842956-001\solr-instance-002\collection1'
   [junit4]   2> 269331 INFO  (coreLoadExecutor-841-thread-1) [    ] o.a.s.c.CoreContainer Creating SolrCore 'collection1' using configuration from instancedir C:\Users\jenkins\workspace\Lucene-Solr-master-Windows\solr\build\solr-core\test\J0\temp\solr.handler.TestReplicationHandler_1DE0945A78842956-001\solr-instance-002\.\collection1
   [junit4]   2> 269331 INFO  (coreLoadExecutor-841-thread-1) [    x:collection1] o.a.s.c.SolrCore solr.NRTCachingDirectoryFactory
   [junit4]   2> 269331 INFO  (coreLoadExecutor-841-thread-1) [    x:collection1] o.a.s.c.SolrCore [[collection1] ] Opening new SolrCore at [C:\Users\jenkins\workspace\Lucene-Solr-master-Windows\solr\build\solr-core\test\J0\temp\solr.handler.TestReplicationHandler_1DE0945A78842956-001\solr-instance-002\collection1], dataDir=[C:\Users\jenkins\workspace\Lucene-Solr-master-Windows\solr\build\solr-core\test\J0\temp\solr.handler.TestReplicationHandler_1DE0945A78842956-001\solr-instance-002\.\collection1\data\]
   [junit4]   2> 269331 INFO  (coreLoadExecutor-841-thread-1) [    x:collection1] o.a.s.c.SolrCore JMX monitoring not detected for core: collection1
   [junit4]   2> 269332 INFO  (coreLoadExecutor-841-thread-1) [    x:collection1] o.a.s.c.CachingDirectoryFactory return new directory for C:\Users\jenkins\workspace\Lucene-Solr-master-Windows\solr\build\solr-core\test\J0\temp\solr.handler.TestReplicationHandler_1DE0945A78842956-001\solr-instance-002\collection1\data
   [junit4]   2> 269333 INFO  (coreLoadExecutor-841-thread-1) [    x:collection1] o.a.s.c.SolrCore New index directory detected: old=null new=C:\Users\jenkins\workspace\Lucene-Solr-master-Windows\solr\build\solr-core\test\J0\temp\solr.handler.TestReplicationHandler_1DE0945A78842956-001\solr-instance-002\.\collection1\data\index/
   [junit4]   2> 269333 WARN  (coreLoadExecutor-841-thread-1) [    x:collection1] o.a.s.c.SolrCore [collection1] Solr index directory 'C:\Users\jenkins\workspace\Lucene-Solr-master-Windows\solr\build\solr-core\test\J0\temp\solr.handler.TestReplicationHandler_1DE0945A78842956-001\solr-instance-002\.\collection1\data\index' doesn't exist. Creating new index...
   [junit4]   2> 269334 INFO  (coreLoadExecutor-841-thread-1) [    x:collection1] o.a.s.c.CachingDirectoryFactory return new directory for C:\Users\jenkins\workspace\Lucene-Solr-master-Windows\solr\build\solr-core\test\J0\temp\solr.handler.TestReplicationHandler_1DE0945A78842956-001\solr-instance-002\collection1\data\index
   [junit4]   2> 269336 INFO  (coreLoadExecutor-841-thread-1) [    x:collection1] o.a.s.u.RandomMergePolicy RandomMergePolicy wrapping class org.apache.lucene.index.LogByteSizeMergePolicy: [LogByteSizeMergePolicy: minMergeSize=1677721, mergeFactor=29, maxMergeSize=2147483648, maxMergeSizeForForcedMerge=9223372036854775807, calibrateSizeByDeletes=true, maxMergeDocs=2147483647, maxCFSSegmentSizeMB=8.796093022207999E12, noCFSRatio=0.30031828237297786]
   [junit4]   2> 269398 INFO  (coreLoadExecutor-841-thread-1) [    x:collection1] o.a.s.c.SolrDeletionPolicy SolrDeletionPolicy.onCommit: commits: num=1
   [junit4]   2> 	commit{dir=NRTCachingDirectory(MMapDirectory@C:\Users\jenkins\workspace\Lucene-Solr-master-Windows\solr\build\solr-core\test\J0\temp\solr.handler.TestReplicationHandler_1DE0945A78842956-001\solr-instance-002\collection1\data\index lockFactory=org.apache.lucene.store.SingleInstanceLockFactory@8099f81; maxCacheMB=48.0 maxMergeSizeMB=4.0),segFN=segments_1,generation=1}
   [junit4]   2> 269398 INFO  (coreLoadExecutor-841-thread-1) [    x:collection1] o.a.s.c.SolrDeletionPolicy newest commit generation = 1
   [junit4]   2> 269400 INFO  (coreLoadExecutor-841-thread-1) [    x:collection1] o.a.s.c.SolrCore no updateRequestProcessorChain defined as default, creating implicit default
   [junit4]   2> 269401 INFO  (coreLoadExecutor-841-thread-1) [    x:collection1] o.a.s.h.l.XMLLoader xsltCacheLifetimeSeconds=60
   [junit4]   2> 269402 INFO  (coreLoadExecutor-841-thread-1) [    x:collection1] o.a.s.h.l.XMLLoader xsltCacheLifetimeSeconds=60
   [junit4]   2> 269405 INFO  (OldIndexDirectoryCleanupThreadForCore-collection1) [    x:collection1] o.a.s.c.SolrCore Looking for old index directories to cleanup for core collection1 in C:\Users\jenkins\workspace\Lucene-Solr-master-Windows\solr\build\solr-core\test\J0\temp\solr.handler.TestReplicationHandler_1DE0945A78842956-001\solr-instance-002\.\collection1\data\
   [junit4]   2> 269406 INFO  (coreLoadExecutor-841-thread-1) [    x:collection1] o.a.s.h.l.XMLLoader xsltCacheLifetimeSeconds=60
   [junit4]   2> 269407 INFO  (coreLoadExecutor-841-thread-1) [    x:collection1] o.a.s.h.l.XMLLoader xsltCacheLifetimeSeconds=60
   [junit4]   2> 269408 INFO  (coreLoadExecutor-841-thread-1) [    x:collection1] o.a.s.c.PluginBag requestHandler : 'lazy' created with startup=lazy 
   [junit4]   2> 269408 INFO  (coreLoadExecutor-841-thread-1) [    x:collection1] o.a.s.c.RequestHandlers Registered paths: /admin/mbeans,standard,lazy,/update/json/docs,/admin/luke,/export,/get,/admin/properties,/update/json,/admin/threads,/update/csv,/sql,/admin/segments,/admin/system,/replication,defaults,/config,/stream,/schema,/admin/plugins,/admin/logging,/admin/ping,/update,/admin/file
   [junit4]   2> 269408 INFO  (coreLoadExecutor-841-thread-1) [    x:collection1] o.a.s.c.SolrCore Using default statsCache cache: org.apache.solr.search.stats.LocalStatsCache
   [junit4]   2> 269409 INFO  (coreLoadExecutor-841-thread-1) [    x:collection1] o.a.s.u.CommitTracker Hard AutoCommit: disabled
   [junit4]   2> 269409 INFO  (coreLoadExecutor-841-thread-1) [    x:collection1] o.a.s.u.CommitTracker Soft AutoCommit: disabled
   [junit4]   2> 269409 INFO  (coreLoadExecutor-841-thread-1) [    x:collection1] o.a.s.u.RandomMergePolicy RandomMergePolicy wrapping class org.apache.lucene.index.TieredMergePolicy: [TieredMergePolicy: maxMergeAtOnce=35, maxMergeAtOnceExplicit=26, maxMergedSegmentMB=37.765625, floorSegmentMB=1.7197265625, forceMergeDeletesPctAllowed=22.55136343605307, segmentsPerTier=48.0, maxCFSSegmentSizeMB=8.796093022207999E12, noCFSRatio=0.0
   [junit4]   2> 269412 INFO  (coreLoadExecutor-841-thread-1) [    x:collection1] o.a.s.c.SolrDeletionPolicy SolrDeletionPolicy.onInit: commits: num=1
   [junit4]   2> 	commit{dir=NRTCachingDirectory(MMapDirectory@C:\Users\jenkins\workspace\Lucene-Solr-master-Windows\solr\build\solr-core\test\J0\temp\solr.handler.TestReplicationHandler_1DE0945A78842956-001\solr-instance-002\collection1\data\index lockFactory=org.apache.lucene.store.SingleInstanceLockFactory@8099f81; maxCacheMB=48.0 maxMergeSizeMB=4.0),segFN=segments_1,generation=1}
   [junit4]   2> 269412 INFO  (coreLoadExecutor-841-thread-1) [    x:collection1] o.a.s.c.SolrDeletionPolicy newest commit generation = 1
   [junit4]   2> 269412 INFO  (coreLoadExecutor-841-thread-1) [    x:collection1] o.a.s.s.SolrIndexSearcher Opening [Searcher@cfdc781[collection1] main]
   [junit4]   2> 269412 INFO  (coreLoadExecutor-841-thread-1) [    x:collection1] o.a.s.r.ManagedResourceStorage File-based storage initialized to use dir: C:\Users\jenkins\workspace\Lucene-Solr-master-Windows\solr\build\solr-core\test\J0\temp\solr.handler.TestReplicationHandler_1DE0945A78842956-001\solr-instance-002\collection1\conf
   [junit4]   2> 269412 INFO  (coreLoadExecutor-841-thread-1) [    x:collection1] o.a.s.r.RestManager Initializing RestManager with initArgs: {storageDir=C:\Users\jenkins\workspace\Lucene-Solr-master-Windows\solr\build\solr-core\test\J0\temp\solr.handler.TestReplicationHandler_1DE0945A78842956-001\solr-instance-002\collection1\conf}
   [junit4]   2> 269412 INFO  (coreLoadExecutor-841-thread-1) [    x:collection1] o.a.s.r.ManagedResourceStorage Reading _rest_managed.json using file:dir=C:\Users\jenkins\workspace\Lucene-Solr-master-Windows\solr\build\solr-core\test\J0\temp\solr.handler.TestReplicationHandler_1DE0945A78842956-001\solr-instance-002\collection1\conf
   [junit4]   2> 269413 INFO  (coreLoadExecutor-841-thread-1) [    x:collection1] o.a.s.r.RestManager Initializing 0 registered ManagedResources
   [junit4]   2> 269413 INFO  (coreLoadExecutor-841-thread-1) [    x:collection1] o.a.s.h.ReplicationHandler Commits will be reserved for  10000
   [junit4]   2> 269413 INFO  (searcherExecutor-842-thread-1-processing-x:collection1) [    x:collection1] o.a.s.c.SolrCore [collection1] Registered new searcher Searcher@cfdc781[collection1] main{ExitableDirectoryReader(UninvertingDirectoryReader())}
   [junit4]   2> 269413 INFO  (coreLoadExecutor-841-thread-1) [    x:collection1] o.a.s.c.CoreContainer registering core: collection1
   [junit4]   2> 269806 INFO  (TEST-TestReplicationHandler.doTestStressReplication-seed#[1DE0945A78842956]) [    ] o.e.j.s.ServerConnector Stopped ServerConnector@2202b2fe{HTTP/1.1,[http/1.1]}{127.0.0.1:0}
   [junit4]   2> 269809 INFO  (TEST-TestReplicationHandler.doTestStressReplication-seed#[1DE0945A78842956]) [    ] o.a.s.c.CoreContainer Shutting down CoreContainer instance=660970731
   [junit4]   2> 269811 INFO  (coreCloseExecutor-846-thread-1) [    x:collection1] o.a.s.c.SolrCore [collection1]  CLOSING SolrCore org.apache.solr.core.SolrCore@604d4773
   [junit4]   2> 269811 INFO  (coreCloseExecutor-846-thread-1) [    x:collection1] o.a.s.u.DirectUpdateHandler2 closing DirectUpdateHandler2{commits=0,autocommits=0,soft autocommits=0,optimizes=0,rollbacks=0,expungeDeletes=0,docsPending=0,adds=0,deletesById=0,deletesByQuery=0,errors=0,cumulative_adds=0,cumulative_deletesById=0,cumulative_deletesByQuery=0,cumulative_errors=0}
   [junit4]   2> 269812 INFO  (coreCloseExecutor-846-thread-1) [    x:collection1] o.a.s.u.SolrCoreState Closing SolrCoreState
   [junit4]   2> 269812 INFO  (coreCloseExecutor-846-thread-1) [    x:collection1] o.a.s.u.DefaultSolrCoreState SolrCoreState ref count has reached 0 - closing IndexWriter
   [junit4]   2> 269812 INFO  (coreCloseExecutor-846-thread-1) [    x:collection1] o.a.s.u.DefaultSolrCoreState closing IndexWriter with IndexWriterCloser
   [junit4]   2> 269812 INFO  (coreCloseExecutor-846-thread-1) [    x:collection1] o.a.s.c.SolrCore [collection1] Closing main searcher on request.
   [junit4]   2> 269812 INFO  (coreCloseExecutor-846-thread-1) [    x:collection1] o.a.s.c.CachingDirectoryFactory Closing MockDirectoryFactory - 2 directories currently being tracked
   [junit4]   2> 269812 INFO  (coreCloseExecutor-846-thread-1) [    x:collection1] o.a.s.c.CachingDirectoryFactory looking to close C:\Users\jenkins\workspace\Lucene-Solr-master-Windows\solr\build\solr-core\test\J0\temp\solr.handler.TestReplicationHandler_1DE0945A78842956-001\solr-instance-001\.\collection1\data\ [CachedDir<<refCount=0;path=C:\Users\jenkins\workspace\Lucene-Solr-master-Windows\solr\build\solr-core\test\J0\temp\solr.handler.TestReplicationHandler_1DE0945A78842956-001\solr-instance-001\.\collection1\data\;done=false>>]
   [junit4]   2> 269812 INFO  (coreCloseExecutor-846-thread-1) [    x:collection1] o.a.s.c.CachingDirectoryFactory Closing directory: C:\Users\jenkins\workspace\Lucene-Solr-master-Windows\solr\build\solr-core\test\J0\temp\solr.handler.TestReplicationHandler_1DE0945A78842956-001\solr-instance-001\.\collection1\data\
   [junit4]   2> 269812 INFO  (coreCloseExecutor-846-thread-1) [    x:collection1] o.a.s.c.CachingDirectoryFactory looking to close C:\Users\jenkins\workspace\Lucene-Solr-master-Windows\solr\build\solr-core\test\J0\temp\solr.handler.TestReplicationHandler_1DE0945A78842956-001\solr-instance-001\.\collection1\data\index [CachedDir<<refCount=0;path=C:\Users\jenkins\workspace\Lucene-Solr-master-Windows\solr\build\solr-core\test\J0\temp\solr.handler.TestReplicationHandler_1DE0945A78842956-001\solr-instance-001\.\collection1\data\index;done=false>>]
   [junit4]   2> 269812 INFO  (coreCloseExecutor-846-thread-1) [    x:collection1] o.a.s.c.CachingDirectoryFactory Closing directory: C:\Users\jenkins\workspace\Lucene-Solr-master-Windows\solr\build\solr-core\test\J0\temp\solr.handler.TestReplicationHandler_1DE0945A78842956-001\solr-instance-001\.\collection1\data\index
   [junit4]   2> 269814 INFO  (TEST-TestReplicationHandler.doTestStressReplication-seed#[1DE0945A78842956]) [    ] o.e.j.s.h.ContextHandler Stopped o.e.j.s.ServletContextHandler@4e020153{/solr,null,UNAVAILABLE}
   [junit4]   2> 269818 INFO  (TEST-TestReplicationHandler.doTestStressReplication-seed#[1DE0945A78842956]) [    ] o.e.j.s.Server jetty-9.3.6.v20151106
   [junit4]   2> 269819 INFO  (TEST-TestReplicationHandler.doTestStressReplication-seed#[1DE0945A78842956]) [    ] o.e.j.s.h.ContextHandler Started o.e.j.s.ServletContextHandler@46822678{/solr,null,AVAILABLE}
   [junit4]   2> 269822 INFO  (TEST-TestReplicationHandler.doTestStressReplication-seed#[1DE0945A78842956]) [    ] o.e.j.s.ServerConnector Started ServerConnector@7b5a8d85{HTTP/1.1,[http/1.1]}{127.0.0.1:49491}
   [junit4]   2> 269822 INFO  (TEST-TestReplicationHandler.doTestStressReplication-seed#[1DE0945A78842956]) [    ] o.e.j.s.Server Started @274747ms
   [junit4]   2> 269822 INFO  (TEST-TestReplicationHandler.doTestStressReplication-seed#[1DE0945A78842956]) [    ] o.a.s.c.s.e.JettySolrRunner Jetty properties: {solr.data.dir=C:\Users\jenkins\workspace\Lucene-Solr-master-Windows\solr\build\solr-core\test\J0\temp\solr.handler.TestReplicationHandler_1DE0945A78842956-001\solr-instance-001\collection1\data, hostContext=/solr, hostPort=49491}
   [junit4]   2> 269822 INFO  (TEST-TestReplicationHandler.doTestStressReplication-seed#[1DE0945A78842956]) [    ] o.a.s.s.SolrDispatchFilter SolrDispatchFilter.init(): sun.misc.Launcher$AppClassLoader@73d16e93
   [junit4]   2> 269823 INFO  (TEST-TestReplicationHandler.doTestStressReplication-seed#[1DE0945A78842956]) [    ] o.a.s.c.SolrResourceLoader new SolrResourceLoader for directory: 'C:\Users\jenkins\workspace\Lucene-Solr-master-Windows\solr\build\solr-core\test\J0\temp\solr.handler.TestReplicationHandler_1DE0945A78842956-001\solr-instance-001'
   [junit4]   2> 269823 INFO  (TEST-TestReplicationHandler.doTestStressReplication-seed#[1DE0945A78842956]) [    ] o.a.s.c.SolrResourceLoader JNDI not configured for solr (NoInitialContextEx)
   [junit4]   2> 269823 INFO  (TEST-TestReplicationHandler.doTestStressReplication-seed#[1DE0945A78842956]) [    ] o.a.s.c.SolrResourceLoader solr home defaulted to 'solr/' (could not find system property or JNDI)
   [junit4]   2> 269823 INFO  (TEST-TestReplicationHandler.doTestStressReplication-seed#[1DE0945A78842956]) [    ] o.a.s.c.SolrXmlConfig Loading container configuration from C:\Users\jenkins\workspace\Lucene-Solr-master-Windows\solr\build\solr-core\test\J0\temp\solr.handler.TestReplicationHandler_1DE0945A78842956-001\solr-instance-001\solr.xml
   [junit4]   2> 269835 INFO  (TEST-TestReplicationHandler.doTestStressReplication-seed#[1DE0945A78842956]) [    ] o.a.s.c.CorePropertiesLocator Config-defined core root directory: C:\Users\jenkins\workspace\Lucene-Solr-master-Windows\solr\build\solr-core\test\J0\temp\solr.handler.TestReplicationHandler_1DE0945A78842956-001\solr-instance-001\.
   [junit4]   2> 269835 INFO  (TEST-TestReplicationHandler.doTestStressReplication-seed#[1DE0945A78842956]) [    ] o.a.s.c.CoreContainer New CoreContainer 548224670
   [junit4]   2> 269835 INFO  (TEST-TestReplicationHandler.doTestStressReplication-seed#[1DE0945A78842956]) [    ] o.a.s.c.CoreContainer Loading cores into CoreContainer [instanceDir=C:\Users\jenkins\workspace\Lucene-Solr-master-Windows\solr\build\solr-core\test\J0\temp\solr.handler.TestReplicationHandler_1DE0945A78842956-001\solr-instance-001]
   [junit4]   2> 269835 WARN  (TEST-TestReplicationHandler.doTestStressReplication-seed#[1DE0945A78842956]) [    ] o.a.s.c.CoreContainer Couldn't add files from C:\Users\jenkins\workspace\Lucene-Solr-master-Windows\solr\build\solr-core\test\J0\temp\solr.handler.TestReplicationHandler_1DE0945A78842956-001\solr-instance-001\lib to classpath: C:\Users\jenkins\workspace\Lucene-Solr-master-Windows\solr\build\solr-core\test\J0\temp\solr.handler.TestReplicationHandler_1DE0945A78842956-001\solr-instance-001\lib
   [junit4]   2> 269842 INFO  (TEST-TestReplicationHandler.doTestStressReplication-seed#[1DE0945A78842956]) [    ] o.a.s.h.c.HttpShardHandlerFactory created with socketTimeout : 90000,urlScheme : ,connTimeout : 15000,maxConnectionsPerHost : 20,maxConnections : 10000,corePoolSize : 0,maximumPoolSize : 2147483647,maxThreadIdleTime : 5,sizeOfQueue : -1,fairnessPolicy : false,useRetries : false,
   [junit4]   2> 269844 INFO  (TEST-TestReplicationHandler.doTestStressReplication-seed#[1DE0945A78842956]) [    ] o.a.s.u.UpdateShardHandler Creating UpdateShardHandler HTTP client with params: socketTimeout=340000&connTimeout=45000&retry=true
   [junit4]   2> 269844 INFO  (TEST-TestReplicationHandler.doTestStressReplication-seed#[1DE0945A78842956]) [    ] o.a.s.l.LogWatcher SLF4J impl is org.slf4j.impl.Log4jLoggerFactory
   [junit4]   2> 269844 INFO  (TEST-TestReplicationHandler.doTestStressReplication-seed#[1DE0945A78842956]) [    ] o.a.s.l.LogWatcher Registering Log Listener [Log4j (org.slf4j.impl.Log4jLoggerFactory)]
   [junit4]   2> 269846 INFO  (TEST-TestReplicationHandler.doTestStressReplication-seed#[1DE0945A78842956]) [    ] o.a.s.c.CoreContainer Security conf doesn't exist. Skipping setup for authorization module.
   [junit4]   2> 269846 INFO  (TEST-TestReplicationHandler.doTestStressReplication-seed#[1DE0945A78842956]) [    ] o.a.s.c.CoreContainer No authentication plugin used.
   [junit4]   2> 269847 INFO  (TEST-TestReplicationHandler.doTestStressReplication-seed#[1DE0945A78842956]) [    ] o.a.s.c.CorePropertiesLocator Looking for core definitions underneath C:\Users\jenkins\workspace\Lucene-Solr-master-Windows\solr\build\solr-core\test\J0\temp\solr.handler.TestReplicationHandler_1DE0945A78842956-001\solr-instance-001\.
   [junit4]   2> 269848 INFO  (TEST-TestReplicationHandler.doTestStressReplication-seed#[1DE0945A78842956]) [    ] o.a.s.c.CoreDescriptor Created CoreDescriptor: {name=collection1, config=solrconfig.xml, loadOnStartup=true, schema=schema.xml, configSetProperties=configsetprops.json, transient=false, dataDir=data\}
   [junit4]   2> 269848 INFO  (TEST-TestReplicationHandler.doTestStressReplication-seed#[1DE0945A78842956]) [    ] o.a.s.c.CorePropertiesLocator Found core collection1 in C:\Users\jenkins\workspace\Lucene-Solr-master-Windows\solr\build\solr-core\test\J0\temp\solr.handler.TestReplicationHandler_1DE0945A78842956-001\solr-instance-001\.\collection1
   [junit4]   2> 269848 INFO  (TEST-TestReplicationHandler.doTestStressReplication-seed#[1DE0945A78842956]) [    ] o.a.s.c.CorePropertiesLocator Found 1 core definitions
   [junit4]   2> 269849 INFO  (TEST-TestReplicationHandler.doTestStressReplication-seed#[1DE0945A78842956]) [    ] o.a.s.s.SolrDispatchFilter user.dir=C:\Users\jenkins\workspace\Lucene-Solr-master-Windows\solr\build\solr-core\test\J0
   [junit4]   2> 269849 INFO  (TEST-TestReplicationHandler.doTestStressReplication-seed#[1DE0945A78842956]) [    ] o.a.s.s.SolrDispatchFilter SolrDispatchFilter.init() done
   [junit4]   2> 269849 INFO  (coreLoadExecutor-853-thread-1) [    ] o.a.s.c.SolrResourceLoader new SolrResourceLoader for directory: 'C:\Users\jenkins\workspace\Lucene-Solr-master-Windows\solr\build\solr-core\test\J0\temp\solr.handler.TestReplicationHandler_1DE0945A78842956-001\solr-instance-001\collection1'
   [junit4]   2> 269850 INFO  (coreLoadExecutor-853-thread-1) [    ] o.a.s.c.SolrResourceLoader JNDI not configured for solr (NoInitialContextEx)
   [junit4]   2> 269850 INFO  (coreLoadExecutor-853-thread-1) [    ] o.a.s.c.SolrResourceLoader solr home defaulted to 'solr/' (could not find system property or JNDI)
   [junit4]   2> 269857 INFO  (coreLoadExecutor-853-thread-1) [    ] o.a.s.c.SolrConfig current version of requestparams : -1
   [junit4]   2> 269863 WARN  (coreLoadExecutor-853-thread-1) [    ] o.a.s.c.Config Beginning with Solr 5.5, <mergePolicy> is deprecated, use <mergePolicyFactory> instead.
   [junit4]   2> 269867 INFO  (coreLoadExecutor-853-thread-1) [    ] o.a.s.c.SolrConfig Using Lucene MatchVersion: 7.0.0
   [junit4]   2> 269878 INFO  (coreLoadExecutor-853-thread-1) [    ] o.a.s.c.SolrConfig Loaded SolrConfig: solrconfig.xml
   [junit4]   2> 269881 INFO  (coreLoadExecutor-853-thread-1) [    ] o.a.s.s.IndexSchema [collection1] Schema name=test
   [junit4]   2> 269890 INFO  (coreLoadExecutor-853-thread-1) [    ] o.a.s.s.IndexSchema unique key field: id
   [junit4]   2> 269892 INFO  (coreLoadExecutor-853-thread-1) [    ] o.a.s.c.ConfigSetProperties Did not find ConfigSet properties, assuming default properties: Can't find resource 'configsetprops.json' in classpath or 'C:\Users\jenkins\workspace\Lucene-Solr-master-Windows\solr\build\solr-core\test\J0\temp\solr.handler.TestReplicationHandler_1DE0945A78842956-001\solr-instance-001\collection1'
   [junit4]   2> 269892 INFO  (coreLoadExecutor-853-thread-1) [    ] o.a.s.c.CoreContainer Creating SolrCore 'collection1' using configuration from instancedir C:\Users\jenkins\workspace\Lucene-Solr-master-Windows\solr\build\solr-core\test\J0\temp\solr.handler.TestReplicationHandler_1DE0945A78842956-001\solr-instance-001\.\collection1
   [junit4]   2> 269892 INFO  (coreLoadExecutor-853-thread-1) [    x:collection1] o.a.s.c.SolrCore solr.NRTCachingDirectoryFactory
   [junit4]   2> 269892 INFO  (coreLoadExecutor-853-thread-1) [    x:collection1] o.a.s.c.SolrCore [[collection1] ] Opening new SolrCore at [C:\Users\jenkins\workspace\Lucene-Solr-master-Windows\solr\build\solr-core\test\J0\temp\solr.handler.TestReplicationHandler_1DE0945A78842956-001\solr-instance-001\collection1], dataDir=[C:\Users\jenkins\workspace\Lucene-Solr-master-Windows\solr\build\solr-core\test\J0\temp\solr.handler.TestReplicationHandler_1DE0945A78842956-001\solr-instance-001\.\collection1\data\]
   [junit4]   2> 269892 INFO  (coreLoadExecutor-853-thread-1) [    x:collection1] o.a.s.c.SolrCore JMX monitoring not detected for core: collection1
   [junit4]   2> 269895 INFO  (coreLoadExecutor-853-thread-1) [    x:collection1] o.a.s.c.CachingDirectoryFactory return new directory for C:\Users\jenkins\workspace\Lucene-Solr-master-Windows\solr\build\solr-core\test\J0\temp\solr.handler.TestReplicationHandler_1DE0945A78842956-001\solr-instance-001\collection1\data
   [junit4]   2> 269895 INFO  (coreLoadExecutor-853-thread-1) [    x:collection1] o.a.s.c.SolrCore New index directory detected: old=null new=C:\Users\jenkins\workspace\Lucene-Solr-master-Windows\solr\build\solr-core\test\J0\temp\solr.handler.TestReplicationHandler_1DE0945A78842956-001\solr-instance-001\.\collection1\data\index/
   [junit4]   2> 269896 WARN  (coreLoadExecutor-853-thread-1) [    x:collection1] o.a.s.c.SolrCore [collection1] Solr index directory 'C:\Users\jenkins\workspace\Lucene-Solr-master-Windows\solr\build\solr-core\test\J0\temp\solr.handler.TestReplicationHandler_1DE0945A78842956-001\solr-instance-001\.\collection1\data\index' doesn't exist. Creating new index...
   [junit4]   2> 269897 INFO  (coreLoadExecutor-853-thread-1) [    x:collection1] o.a.s.c.CachingDirectoryFactory return new directory for C:\Users\jenkins\workspace\Lucene-Solr-master-Windows\solr\build\solr-core\test\J0\temp\solr.handler.TestReplicationHandler_1DE0945A78842956-001\solr-instance-001\collection1\data\index
   [junit4]   2> 269897 INFO  (coreLoadExecutor-853-thread-1) [    x:collection1] o.a.s.u.RandomMergePolicy RandomMergePolicy wrapping class org.apache.lucene.index.LogByteSizeMergePolicy: [LogByteSizeMergePolicy: minMergeSize=1677721, mergeFactor=29, maxMergeSize=2147483648, maxMergeSizeForForcedMerge=9223372036854775807, calibrateSizeByDeletes=true, maxMergeDocs=2147483647, maxCFSSegmentSizeMB=8.796093022207999E12, noCFSRatio=0.30031828237297786]
   [junit4]   2> 269960 INFO  (coreLoadExecutor-853-thread-1) [    x:collection1] o.a.s.c.SolrDeletionPolicy SolrDeletionPolicy.onCommit: commits: num=1
   [junit4]   2> 	commit{dir=NRTCachingDirectory(MMapDirectory@C:\Users\jenkins\workspace\Lucene-Solr-master-Windows\solr\build\solr-core\test\J0\temp\solr.handler.TestReplicationHandler_1DE0945A78842956-001\solr-instance-001\collection1\data\index lockFactory=org.apache.lucene.store.SingleInstanceLockFactory@36aba3b2; maxCacheMB=48.0 maxMergeSizeMB=4.0),segFN=segments_1,generation=1}
   [junit4]   2> 269961 INFO  (coreLoadExecutor-853-thread-1) [    x:collection1] o.a.s.c.SolrDeletionPolicy newest commit generation = 1
   [junit4]   2> 269962 INFO  (coreLoadExecutor-853-thread-1) [    x:collection1] o.a.s.c.SolrCore no updateRequestProcessorChain defined as default, creating implicit default
   [junit4]   2> 269963 INFO  (coreLoadExecutor-853-thread-1) [    x:collection1] o.a.s.h.l.XMLLoader xsltCacheLifetimeSeconds=60
   [junit4]   2> 269964 INFO  (coreLoadExecutor-853-thread-1) [    x:collection1] o.a.s.h.l.XMLLoader xsltCacheLifetimeSeconds=60
   [junit4]   2> 269965 INFO  (coreLoadExecutor-853-thread-1) [    x:collection1] o.a.s.h.l.XMLLoader xsltCacheLifetimeSeconds=60
   [junit4]   2> 269966 INFO  (coreLoadExecutor-853-thread-1) [    x:collection1] o.a.s.h.l.XMLLoader xsltCacheLifetimeSeconds=60
   [junit4]   2> 269967 INFO  (coreLoadExecutor-853-thread-1) [    x:collection1] o.a.s.c.PluginBag requestHandler : 'lazy' created with startup=lazy 
   [junit4]   2> 269967 INFO  (coreLoadExecutor-853-thread-1) [    x:collection1] o.a.s.c.RequestHandlers Registered paths: /admin/mbeans,standard,lazy,/update/json/docs,/admin/luke,/export,/get,/admin/properties,/update/json,/admin/threads,/update/csv,/sql,/admin/segments,/admin/system,/replication,defaults,/config,/stream,/schema,/admin/plugins,/admin/logging,/admin/ping,/update,/admin/file
   [junit4]   2> 269967 INFO  (coreLoadExecutor-853-thread-1) [    x:collection1] o.a.s.c.SolrCore Using default statsCache cache: org.apache.solr.search.stats.LocalStatsCache
   [junit4]   2> 269968 INFO  (coreLoadExecutor-853-thread-1) [    x:collection1] o.a.s.u.CommitTracker Hard AutoCommit: disabled
   [junit4]   2> 269968 INFO  (coreLoadExecutor-853-thread-1) [    x:collection1] o.a.s.u.CommitTracker Soft AutoCommit: disabled
   [junit4]   2> 269968 INFO  (coreLoadExecutor-853-thread-1) [    x:collection1] o.a.s.u.RandomMergePolicy RandomMergePolicy wrapping class org.apache.lucene.index.TieredMergePolicy: [TieredMergePolicy: maxMergeAtOnce=35, maxMergeAtOnceExplicit=26, maxMergedSegmentMB=37.765625, floorSegmentMB=1.7197265625, forceMergeDeletesPctAllowed=22.55136343605307, segmentsPerTier=48.0, maxCFSSegmentSizeMB=8.796093022207999E12, noCFSRatio=0.0
   [junit4]   2> 269969 INFO  (coreLoadExecutor-853-thread-1) [    x:collection1] o.a.s.c.SolrDeletionPolicy SolrDeletionPolicy.onInit: commits: num=1
   [junit4]   2> 	commit{dir=NRTCachingDirectory(MMapDirectory@C:\Users\jenkins\workspace\Lucene-Solr-master-Windows\solr\build\solr-core\test\J0\temp\solr.handler.TestReplicationHandler_1DE0945A78842956-001\solr-instance-001\collection1\data\index lockFactory=org.apache.lucene.store.SingleInstanceLockFactory@36aba3b2; maxCacheMB=48.0 maxMergeSizeMB=4.0),segFN=segments_1,generation=1}
   [junit4]   2> 269969 INFO  (coreLoadExecutor-853-thread-1) [    x:collection1] o.a.s.c.SolrDeletionPolicy newest commit generation = 1
   [junit4]   2> 269969 INFO  (coreLoadExecutor-853-thread-1) [    x:collection1] o.a.s.s.SolrIndexSearcher Opening [Searcher@4fbda5dc[collection1] main]
   [junit4]   2> 269970 INFO  (coreLoadExecutor-853-thread-1) [    x:collection1] o.a.s.r.ManagedResourceStorage File-based storage initialized to use dir: C:\Users\jenkins\workspace\Lucene-Solr-master-Windows\solr\build\solr-core\test\J0\temp\solr.handler.TestReplicationHandler_1DE0945A78842956-001\solr-instance-001\collection1\conf
   [junit4]   2> 269970 INFO  (coreLoadExecutor-853-thread-1) [    x:collection1] o.a.s.r.RestManager Initializing RestManager with initArgs: {storageDir=C:\Users\jenkins\workspace\Lucene-Solr-master-Windows\solr\build\solr-core\test\J0\temp\solr.handler.TestReplicationHandler_1DE0945A78842956-001\solr-instance-001\collection1\conf}
   [junit4]   2> 269970 INFO  (coreLoadExecutor-853-thread-1) [    x:collection1] o.a.s.r.ManagedResourceStorage Reading _rest_managed.json using file:dir=C:\Users\jenkins\workspace\Lucene-Solr-master-Windows\solr\build\solr-core\test\J0\temp\solr.handler.TestReplicationHandler_1DE0945A78842956-001\solr-instance-001\collection1\conf
   [junit4]   2> 269971 INFO  (coreLoadExecutor-853-thread-1) [    x:collection1] o.a.s.r.RestManager Initializing 0 registered ManagedResources
   [junit4]   2> 269971 INFO  (coreLoadExecutor-853-thread-1) [    x:collection1] o.a.s.h.ReplicationHandler Replication enabled for following config files: schema.xml
   [junit4]   2> 269971 INFO  (coreLoadExecutor-853-thread-1) [    x:collection1] o.a.s.h.ReplicationHandler Commits will be reserved for  10000
   [junit4]   2> 269971 INFO  (coreLoadExecutor-853-thread-1) [    x:collection1] o.a.s.c.CoreContainer registering core: collection1
   [junit4]   2> 269974 INFO  (OldIndexDirectoryCleanupThreadForCore-collection1) [    x:collection1] o.a.s.c.SolrCore Looking for old index directories to cleanup for core collection1 in C:\Users\jenkins\workspace\Lucene-Solr-master-Windows\solr\build\solr-core\test\J0\temp\solr.handler.TestReplicationHandler_1DE0945A78842956-001\solr-instance-001\.\collection1\data\
   [junit4]   2> 269975 INFO  (searcherExecutor-854-thread-1-processing-x:collection1) [    x:collection1] o.a.s.c.SolrCore [collection1] Registered new searcher Searcher@4fbda5dc[collection1] main{ExitableDirectoryReader(UninvertingDirectoryReader())}
   [junit4]   2> 270354 INFO  (qtp869180384-1510) [    x:collection1] o.a.s.u.DirectUpdateHandler2 [collection1] REMOVING ALL DOCUMENTS FROM INDEX
   [junit4]   2> 270354 INFO  (qtp869180384-1510) [    x:collection1] o.a.s.u.p.LogUpdateProcessorFactory [collection1]  webapp=/solr path=/update params={wt=javabin&version=2}{deleteByQuery=*:*} 0 0
   [junit4]   2> 270357 INFO  (qtp836053633-1487) [    x:collection1] o.a.s.u.DirectUpdateHandler2 [collection1] REMOVING ALL DOCUMENTS FROM INDEX
   [junit4]   2> 270357 INFO  (qtp836053633-1487) [    x:collection1] o.a.s.u.p.LogUpdateProcessorFactory [collection1]  webapp=/solr path=/update params={wt=javabin&version=2}{deleteByQuery=*:*} 0 0
   [junit4]   2> 270359 INFO  (qtp836053633-1488) [    x:collection1] o.a.s.u.DirectUpdateHandler2 start commit{,optimize=false,openSearcher=true,waitSearcher=true,expungeDeletes=false,softCommit=false,prepareCommit=false}
   [junit4]   2> 270401 INFO  (qtp836053633-1488) [    x:collection1] o.a.s.c.SolrDeletionPolicy SolrDeletionPolicy.onCommit: commits: num=2
   [junit4]   2> 	commit{dir=NRTCachingDirectory(MMapDirectory@C:\Users\jenkins\workspace\Lucene-Solr-master-Windows\solr\build\solr-core\test\J0\temp\solr.handler.TestReplicationHandler_1DE0945A78842956-001\solr-instance-002\collection1\data\index lockFactory=org.apache.lucene.store.SingleInstanceLockFactory@8099f81; maxCacheMB=48.0 maxMergeSizeMB=4.0),segFN=segments_1,generation=1}
   [junit4]   2> 	commit{dir=NRTCachingDirectory(MMapDirectory@C:\Users\jenkins\workspace\Lucene-Solr-master-Windows\solr\build\solr-core\test\J0\temp\solr.handler.TestReplicationHandler_1DE0945A78842956-001\solr-instance-002\collection1\data\index lockFactory=org.apache.lucene.store.SingleInstanceLockFactory@8099f81; maxCacheMB=48.0 maxMergeSizeMB=4.0),segFN=segments_2,generation=2}
   [junit4]   2> 270402 INFO  (qtp836053633-1488) [    x:collection1] o.a.s.c.SolrDeletionPolicy newest commit generation = 2
   [junit4]   2> 270403 INFO  (qtp836053633-1488) [    x:collection1] o.a.s.s.SolrIndexSearcher Opening [Searcher@5018a20e[collection1] main]
   [junit4]   2> 270403 INFO  (qtp836053633-1488) [    x:collection1] o.a.s.u.DirectUpdateHandler2 end_commit_flush
   [junit4]   2> 270403 INFO  (searcherExecutor-842-thread-1-processing-x:collection1) [    x:collection1] o.a.s.c.SolrCore [collection1] Registered new searcher Searcher@5018a20e[collection1] main{ExitableDirectoryReader(UninvertingDirectoryReader())}
   [junit4]   2> 270403 INFO  (qtp836053633-1488) [    x:collection1] o.a.s.u.p.LogUpdateProcessorFactory [collection1]  webapp=/solr path=/update params={waitSearcher=true&commit=true&softCommit=false&wt=javabin&version=2}{commit=} 0 44
   [junit4]   2> 270408 INFO  (qtp869180384-1509) [    x:collection1] o.a.s.u.p.LogUpdateProcessorFactory [collection1]  webapp=/solr path=/update params={wt=javabin&version=2}{add=[0]} 0 2
   [junit4]   2> 270411 INFO  (qtp869180384-1508) [    x:collection1] o.a.s.u.p.LogUpdateProcessorFactory [collection1]  webapp=/solr path=/update params={wt=javabin&version=2}{add=[1]} 0 0
   [junit4]   2> 270413 INFO  (qtp869180384-1507) [    x:collection1] o.a.s.u.p.LogUpdateProcessorFactory [collection1]  webapp=/solr path=/update params={wt=javabin&version=2}{add=[2]} 0 0
   [junit4]   2> 270415 INFO  (qtp869180384-1506) [    x:collection1] o.a.s.u.p.LogUpdateProcessorFactory [collection1]  webapp=/solr path=/update params={wt=javabin&version=2}{add=[3]} 0 0
   [junit4]   2> 270417 INFO  (qtp869180384-1505) [    x:collection1] o.a.s.u.p.LogUpdateProcessorFactory [collection1]  webapp=/solr path=/update params={wt=javabin&version=2}{add=[4]} 0 0
   [junit4]   2> 270418 INFO  (qtp869180384-1516) [    x:collection1] o.a.s.u.p.LogUpdateProcessorFactory [collection1]  webapp=/solr path=/update params={wt=javabin&version=2}{add=[5]} 0 0
   [junit4]   2> 270419 INFO  (qtp869180384-1515) [    x:collection1] o.a.s.u.p.LogUpdateProcessorFactory [collection1]  webapp=/solr path=/update params={wt=javabin&version=2}{add=[6]} 0 0
   [junit4]   2> 270420 INFO  (qtp869180384-1504) [    x:collection1] o.a.s.u.p.LogUpdateProcessorFactory [collection1]  webapp=/solr path=/update params={wt=javabin&version=2}{add=[7]} 0 0
   [junit4]   2> 270421 INFO  (qtp869180384-1510) [    x:collection1] o.a.s.u.p.LogUpdateProcessorFactory [collection1]  webapp=/solr path=/update params={wt=javabin&version=2}{add=[8]} 0 0
   [junit4]   2> 270423 INFO  (qtp869180384-1509) [    x:collection1] o.a.s.u.p.LogUpdateProcessorFactory [collection1]  webapp=/solr path=/update params={wt=javabin&version=2}{add=[9]} 0 0
   [junit4]   2> 270425 INFO  (qtp869180384-1508) [    x:collection1] o.a.s.u.p.LogUpdateProcessorFactory [collection1]  webapp=/solr path=/update params={wt=javabin&version=2}{add=[10]} 0 0
   [junit4]   2> 270427 INFO  (qtp869180384-1507) [    x:collection1] o.a.s.u.p.LogUpdateProcessorFactory [collection1]  webapp=/solr path=/update params={wt=javabin&version=2}{add=[11]} 0 0
   [junit4]   2> 270430 INFO  (qtp869180384-1506) [    x:collection1] o.a.s.u.p.LogUpdateProcessorFactory [collection1]  webapp=/solr path=/update params={wt=javabin&version=2}{add=[12]} 0 0
   [junit4]   2> 270433 INFO  (qtp869180384-1505) [    x:collection1] o.a.s.u.p.LogUpdateProcessorFactory [collection1]  webapp=/solr path=/update params={wt=javabin&version=2}{add=[13]} 0 0
   [junit4]   2> 270434 INFO  (qtp869180384-1516) [    x:collection1] o.a.s.u.p.LogUpdateProcessorFactory [collection1]  webapp=/solr path=/update params={wt=javabin&version=2}{add=[14]} 0 0
   [junit4]   2> 270437 INFO  (qtp869180384-1515) [    x:collection1] o.a.s.u.p.LogUpdateProcessorFactory [collection1]  webapp=/solr path=/update params={wt=javabin&version=2}{add=[15]} 0 0
   [junit4]   2> 270439 INFO  (qtp869180384-1504) [    x:collection1] o.a.s.u.p.LogUpdateProcessorFactory [collection1]  webapp=/solr path=/update params={wt=javabin&version=2}{add=[16]} 0 0
   [junit4]   2> 270440 INFO  (qtp869180384-1510) [    x:collection1] o.a.s.u.p.LogUpdateProcessorFactory [collection1]  webapp=/solr path=/update params={wt=javabin&version=2}{add=[17]} 0 0
   [junit4]   2> 270443 INFO  (qtp869180384-1509) [    x:collection1] o.a.s.u.p.LogUpdateProcessorFactory [collection1]  webapp=/solr path=/update params={wt=javabin&version=2}{add=[18]} 0 0
   [junit4]   2> 270445 INFO  (qtp869180384-1509) [    x:collection1] o.a.s.u.p.LogUpdateProcessorFactory [collection1]  webapp=/solr path=/update params={wt=javabin&version=2}{add=[19]} 0 0
   [junit4]   2> 270447 INFO  (qtp869180384-1509) [    x:collection1] o.a.s.u.p.LogUpdateProcessorFactory [collection1]  webapp=/solr path=/update params={wt=javabin&version=2}{add=[20]} 0 0
   [junit4]   2> 270449 INFO  (qtp869180384-1509) [    x:collection1] o.a.s.u.DirectUpdateHandler2 start commit{,optimize=false,openSearcher=true,waitSearcher=true,expungeDeletes=false,softCommit=false,prepareCommit=false}
   [junit4]   2> 270517 INFO  (qtp869180384-1509) [    x:collection1] o.a.s.c.SolrDeletionPolicy SolrDeletionPolicy.onCommit: commits: num=2
   [junit4]   2> 	commit{dir=NRTCachingDirectory(MMapDirectory@C:\Users\jenkins\workspace\Lucene-Solr-master-Windows\solr\build\solr-core\test\J0\temp\solr.handler.TestReplicationHandler_1DE0945A78842956-001\solr-instance-001\collection1\data\index lockFactory=org.apache.lucene.store.SingleInstanceLockFactory@36aba3b2; maxCacheMB=48.0 maxMergeSizeMB=4.0),segFN=segments_1,generation=1}
   [junit4]   2> 	commit{dir=NRTCachingDirectory(MMapDirectory@C:\Users\jenkins\workspace\Lucene-Solr-master-Windows\solr\build\solr-core\test\J0\temp\solr.handler.TestReplicationHandler_1DE0945A78842956-001\solr-instance-001\collection1\data\index lockFactory=org.apache.lucene.store.SingleInstanceLockFactory@36aba3b2; maxCacheMB=48.0 maxMergeSizeMB=4.0),segFN=segments_2,generation=2}
   [junit4]   2> 270517 INFO  (qtp869180384-1509) [    x:collection1] o.a.s.c.SolrDeletionPolicy newest commit generation = 2


[...truncated too long message...]

oseExecutor-1433-thread-1) [    x:collection1] o.a.s.u.DirectUpdateHandler2 closing DirectUpdateHandler2{commits=2,autocommits=0,soft autocommits=0,optimizes=0,rollbacks=0,expungeDeletes=0,docsPending=0,adds=0,deletesById=0,deletesByQuery=0,errors=0,cumulative_adds=497,cumulative_deletesById=0,cumulative_deletesByQuery=1,cumulative_errors=0}
   [junit4]   2> 347632 INFO  (coreCloseExecutor-1433-thread-1) [    x:collection1] o.a.s.u.SolrCoreState Closing SolrCoreState
   [junit4]   2> 347632 INFO  (coreCloseExecutor-1433-thread-1) [    x:collection1] o.a.s.u.DefaultSolrCoreState SolrCoreState ref count has reached 0 - closing IndexWriter
   [junit4]   2> 347632 INFO  (coreCloseExecutor-1433-thread-1) [    x:collection1] o.a.s.u.DefaultSolrCoreState closing IndexWriter with IndexWriterCloser
   [junit4]   2> 347633 INFO  (coreCloseExecutor-1433-thread-1) [    x:collection1] o.a.s.c.SolrCore [collection1] Closing main searcher on request.
   [junit4]   2> 347633 INFO  (coreCloseExecutor-1433-thread-1) [    x:collection1] o.a.s.c.CachingDirectoryFactory Closing MockDirectoryFactory - 2 directories currently being tracked
   [junit4]   2> 347633 INFO  (coreCloseExecutor-1433-thread-1) [    x:collection1] o.a.s.c.CachingDirectoryFactory looking to close C:\Users\jenkins\workspace\Lucene-Solr-master-Windows\solr\build\solr-core\test\J0\temp\solr.handler.TestReplicationHandler_1DE0945A78842956-001\solr-instance-027\.\collection1\data\ [CachedDir<<refCount=0;path=C:\Users\jenkins\workspace\Lucene-Solr-master-Windows\solr\build\solr-core\test\J0\temp\solr.handler.TestReplicationHandler_1DE0945A78842956-001\solr-instance-027\.\collection1\data\;done=false>>]
   [junit4]   2> 347633 INFO  (coreCloseExecutor-1433-thread-1) [    x:collection1] o.a.s.c.CachingDirectoryFactory Closing directory: C:\Users\jenkins\workspace\Lucene-Solr-master-Windows\solr\build\solr-core\test\J0\temp\solr.handler.TestReplicationHandler_1DE0945A78842956-001\solr-instance-027\.\collection1\data\
   [junit4]   2> 347633 INFO  (coreCloseExecutor-1433-thread-1) [    x:collection1] o.a.s.c.CachingDirectoryFactory looking to close C:\Users\jenkins\workspace\Lucene-Solr-master-Windows\solr\build\solr-core\test\J0\temp\solr.handler.TestReplicationHandler_1DE0945A78842956-001\solr-instance-027\.\collection1\data\index.20160317003817645 [CachedDir<<refCount=0;path=C:\Users\jenkins\workspace\Lucene-Solr-master-Windows\solr\build\solr-core\test\J0\temp\solr.handler.TestReplicationHandler_1DE0945A78842956-001\solr-instance-027\.\collection1\data\index.20160317003817645;done=false>>]
   [junit4]   2> 347634 INFO  (coreCloseExecutor-1433-thread-1) [    x:collection1] o.a.s.c.CachingDirectoryFactory Closing directory: C:\Users\jenkins\workspace\Lucene-Solr-master-Windows\solr\build\solr-core\test\J0\temp\solr.handler.TestReplicationHandler_1DE0945A78842956-001\solr-instance-027\.\collection1\data\index.20160317003817645
   [junit4]   2> 347634 INFO  (TEST-TestReplicationHandler.doTestIndexFetchWithMasterUrl-seed#[1DE0945A78842956]) [    ] o.e.j.s.h.ContextHandler Stopped o.e.j.s.ServletContextHandler@4903ad82{/solr,null,UNAVAILABLE}
   [junit4]   2> 347640 INFO  (TEST-TestReplicationHandler.doTestIndexFetchWithMasterUrl-seed#[1DE0945A78842956]) [    ] o.e.j.s.ServerConnector Stopped ServerConnector@36e9b600{HTTP/1.1,[http/1.1]}{127.0.0.1:0}
   [junit4]   2> 347640 INFO  (TEST-TestReplicationHandler.doTestIndexFetchWithMasterUrl-seed#[1DE0945A78842956]) [    ] o.a.s.c.CoreContainer Shutting down CoreContainer instance=1997093467
   [junit4]   2> 347641 INFO  (coreCloseExecutor-1435-thread-1) [    x:collection1] o.a.s.c.SolrCore [collection1]  CLOSING SolrCore org.apache.solr.core.SolrCore@134ac549
   [junit4]   2> 347641 INFO  (coreCloseExecutor-1435-thread-1) [    x:collection1] o.a.s.u.DirectUpdateHandler2 closing DirectUpdateHandler2{commits=2,autocommits=0,soft autocommits=0,optimizes=0,rollbacks=0,expungeDeletes=0,docsPending=0,adds=0,deletesById=0,deletesByQuery=0,errors=0,cumulative_adds=3,cumulative_deletesById=0,cumulative_deletesByQuery=1,cumulative_errors=0}
   [junit4]   2> 347641 INFO  (coreCloseExecutor-1435-thread-1) [    x:collection1] o.a.s.u.SolrCoreState Closing SolrCoreState
   [junit4]   2> 347641 INFO  (coreCloseExecutor-1435-thread-1) [    x:collection1] o.a.s.u.DefaultSolrCoreState SolrCoreState ref count has reached 0 - closing IndexWriter
   [junit4]   2> 347641 INFO  (coreCloseExecutor-1435-thread-1) [    x:collection1] o.a.s.u.DefaultSolrCoreState closing IndexWriter with IndexWriterCloser
   [junit4]   2> 347642 INFO  (coreCloseExecutor-1435-thread-1) [    x:collection1] o.a.s.c.SolrCore [collection1] Closing main searcher on request.
   [junit4]   2> 347642 INFO  (coreCloseExecutor-1435-thread-1) [    x:collection1] o.a.s.c.CachingDirectoryFactory Closing MockDirectoryFactory - 2 directories currently being tracked
   [junit4]   2> 347642 INFO  (coreCloseExecutor-1435-thread-1) [    x:collection1] o.a.s.c.CachingDirectoryFactory looking to close C:\Users\jenkins\workspace\Lucene-Solr-master-Windows\solr\build\solr-core\test\J0\temp\solr.handler.TestReplicationHandler_1DE0945A78842956-001\solr-instance-028\.\collection1\data\index.20160317003817440 [CachedDir<<refCount=0;path=C:\Users\jenkins\workspace\Lucene-Solr-master-Windows\solr\build\solr-core\test\J0\temp\solr.handler.TestReplicationHandler_1DE0945A78842956-001\solr-instance-028\.\collection1\data\index.20160317003817440;done=false>>]
   [junit4]   2> 347642 INFO  (coreCloseExecutor-1435-thread-1) [    x:collection1] o.a.s.c.CachingDirectoryFactory Closing directory: C:\Users\jenkins\workspace\Lucene-Solr-master-Windows\solr\build\solr-core\test\J0\temp\solr.handler.TestReplicationHandler_1DE0945A78842956-001\solr-instance-028\.\collection1\data\index.20160317003817440
   [junit4]   2> 347642 INFO  (coreCloseExecutor-1435-thread-1) [    x:collection1] o.a.s.c.CachingDirectoryFactory looking to close C:\Users\jenkins\workspace\Lucene-Solr-master-Windows\solr\build\solr-core\test\J0\temp\solr.handler.TestReplicationHandler_1DE0945A78842956-001\solr-instance-028\.\collection1\data\ [CachedDir<<refCount=0;path=C:\Users\jenkins\workspace\Lucene-Solr-master-Windows\solr\build\solr-core\test\J0\temp\solr.handler.TestReplicationHandler_1DE0945A78842956-001\solr-instance-028\.\collection1\data\;done=false>>]
   [junit4]   2> 347642 INFO  (coreCloseExecutor-1435-thread-1) [    x:collection1] o.a.s.c.CachingDirectoryFactory Closing directory: C:\Users\jenkins\workspace\Lucene-Solr-master-Windows\solr\build\solr-core\test\J0\temp\solr.handler.TestReplicationHandler_1DE0945A78842956-001\solr-instance-028\.\collection1\data\
   [junit4]   2> 347645 INFO  (TEST-TestReplicationHandler.doTestIndexFetchWithMasterUrl-seed#[1DE0945A78842956]) [    ] o.e.j.s.h.ContextHandler Stopped o.e.j.s.ServletContextHandler@79e7fa21{/solr,null,UNAVAILABLE}
   [junit4]   2> 347650 INFO  (SUITE-TestReplicationHandler-seed#[1DE0945A78842956]-worker) [    ] o.a.s.SolrTestCaseJ4 ###deleteCore
   [junit4]   2> NOTE: leaving temporary files on disk at: C:\Users\jenkins\workspace\Lucene-Solr-master-Windows\solr\build\solr-core\test\J0\temp\solr.handler.TestReplicationHandler_1DE0945A78842956-001
   [junit4]   2> NOTE: test params are: codec=Asserting(Lucene60): {name=PostingsFormat(name=LuceneVarGapFixedInterval), id=PostingsFormat(name=LuceneVarGapFixedInterval), newname=PostingsFormat(name=LuceneVarGapFixedInterval)}, docValues:{}, maxPointsInLeafNode=110, maxMBSortInHeap=6.435263636644734, sim=ClassicSimilarity, locale=es-UY, timezone=America/Moncton
   [junit4]   2> NOTE: Windows 10 10.0 amd64/Oracle Corporation 1.8.0_72 (64-bit)/cpus=3,threads=1,free=100026776,total=193662976
   [junit4]   2> NOTE: All tests run in this JVM: [CollectionsAPIAsyncDistributedZkTest, AddSchemaFieldsUpdateProcessorFactoryTest, TimeZoneUtilsTest, ParsingFieldUpdateProcessorsTest, ChaosMonkeyNothingIsSafeTest, DistributedQueryElevationComponentTest, HdfsTlogReplayBufferedWhileIndexingTest, BadCopyFieldTest, TestIntervalFaceting, IndexBasedSpellCheckerTest, TestCollationFieldDocValues, CloudMLTQParserTest, FastVectorHighlighterTest, TestWordDelimiterFilterFactory, TestRuleBasedAuthorizationPlugin, TestXIncludeConfig, DistributedSpellCheckComponentTest, TestDistributedStatsComponentCardinality, TestSchemaManager, SSLMigrationTest, PreAnalyzedFieldTest, QueryElevationComponentTest, JSONWriterTest, TestFieldSortValues, TestCursorMarkWithoutUniqueKey, SystemInfoHandlerTest, DistributedFacetPivotSmallAdvancedTest, TestReplicationHandler]
   [junit4] Completed [68/580 (1!)] on J0 in 79.53s, 13 tests, 1 failure <<< FAILURES!

[...truncated 1673 lines...]
BUILD FAILED
C:\Users\jenkins\workspace\Lucene-Solr-master-Windows\build.xml:740: The following error occurred while executing this line:
C:\Users\jenkins\workspace\Lucene-Solr-master-Windows\build.xml:684: The following error occurred while executing this line:
C:\Users\jenkins\workspace\Lucene-Solr-master-Windows\build.xml:59: The following error occurred while executing this line:
C:\Users\jenkins\workspace\Lucene-Solr-master-Windows\solr\build.xml:233: The following error occurred while executing this line:
C:\Users\jenkins\workspace\Lucene-Solr-master-Windows\solr\common-build.xml:526: The following error occurred while executing this line:
C:\Users\jenkins\workspace\Lucene-Solr-master-Windows\lucene\common-build.xml:1457: The following error occurred while executing this line:
C:\Users\jenkins\workspace\Lucene-Solr-master-Windows\lucene\common-build.xml:1014: There were test failures: 580 suites (10 ignored), 2318 tests, 1 failure, 124 ignored (79 assumptions) [seed: 1DE0945A78842956]

Total time: 72 minutes 8 seconds
Build step 'Invoke Ant' marked build as failure
Archiving artifacts
[WARNINGS] Skipping publisher since build result is FAILURE
Recording test results
Email was triggered for: Failure - Any
Sending email for trigger: Failure - Any



Mime
View raw message