lucene-dev mailing list archives

Site index · List index
Message view « Date » · « Thread »
Top « Date » · « Thread »
From Policeman Jenkins Server <jenk...@thetaphi.de>
Subject [JENKINS-EA] Lucene-Solr-trunk-Linux (32bit/jdk-9-ea+107) - Build # 16059 - Failure!
Date Tue, 01 Mar 2016 12:04:18 GMT
Build: http://jenkins.thetaphi.de/job/Lucene-Solr-trunk-Linux/16059/
Java: 32bit/jdk-9-ea+107 -client -XX:+UseG1GC

1 tests failed.
FAILED:  org.apache.solr.cloud.UnloadDistributedZkTest.test

Error Message:
Captured an uncaught exception in thread: Thread[id=5601, name=testExecutor-2803-thread-5, state=RUNNABLE, group=TGRP-UnloadDistributedZkTest]

Stack Trace:
com.carrotsearch.randomizedtesting.UncaughtExceptionError: Captured an uncaught exception in thread: Thread[id=5601, name=testExecutor-2803-thread-5, state=RUNNABLE, group=TGRP-UnloadDistributedZkTest]
Caused by: java.lang.RuntimeException: org.apache.solr.client.solrj.SolrServerException: Timeout occured while waiting response from server at: http://127.0.0.1:48323
	at __randomizedtesting.SeedInfo.seed([AF65FD0E773D5D93]:0)
	at org.apache.solr.cloud.BasicDistributedZkTest$1.run(BasicDistributedZkTest.java:586)
	at org.apache.solr.common.util.ExecutorUtil$MDCAwareThreadPoolExecutor$1.run(ExecutorUtil.java:231)
	at java.util.concurrent.ThreadPoolExecutor.runWorker(ThreadPoolExecutor.java:1158)
	at java.util.concurrent.ThreadPoolExecutor$Worker.run(ThreadPoolExecutor.java:632)
	at java.lang.Thread.run(Thread.java:804)
Caused by: org.apache.solr.client.solrj.SolrServerException: Timeout occured while waiting response from server at: http://127.0.0.1:48323
	at org.apache.solr.client.solrj.impl.HttpSolrClient.executeMethod(HttpSolrClient.java:588)
	at org.apache.solr.client.solrj.impl.HttpSolrClient.request(HttpSolrClient.java:241)
	at org.apache.solr.client.solrj.impl.HttpSolrClient.request(HttpSolrClient.java:230)
	at org.apache.solr.client.solrj.SolrClient.request(SolrClient.java:1219)
	at org.apache.solr.cloud.BasicDistributedZkTest$1.run(BasicDistributedZkTest.java:584)
	... 4 more
Caused by: java.net.SocketTimeoutException: Read timed out
	at java.net.SocketInputStream.socketRead0(Native Method)
	at java.net.SocketInputStream.socketRead(SocketInputStream.java:116)
	at java.net.SocketInputStream.read(SocketInputStream.java:170)
	at java.net.SocketInputStream.read(SocketInputStream.java:141)
	at org.apache.http.impl.io.AbstractSessionInputBuffer.fillBuffer(AbstractSessionInputBuffer.java:160)
	at org.apache.http.impl.io.SocketInputBuffer.fillBuffer(SocketInputBuffer.java:84)
	at org.apache.http.impl.io.AbstractSessionInputBuffer.readLine(AbstractSessionInputBuffer.java:273)
	at org.apache.http.impl.conn.DefaultHttpResponseParser.parseHead(DefaultHttpResponseParser.java:140)
	at org.apache.http.impl.conn.DefaultHttpResponseParser.parseHead(DefaultHttpResponseParser.java:57)
	at org.apache.http.impl.io.AbstractMessageParser.parse(AbstractMessageParser.java:261)
	at org.apache.http.impl.AbstractHttpClientConnection.receiveResponseHeader(AbstractHttpClientConnection.java:283)
	at org.apache.http.impl.conn.DefaultClientConnection.receiveResponseHeader(DefaultClientConnection.java:251)
	at org.apache.http.impl.conn.ManagedClientConnectionImpl.receiveResponseHeader(ManagedClientConnectionImpl.java:197)
	at org.apache.http.protocol.HttpRequestExecutor.doReceiveResponse(HttpRequestExecutor.java:272)
	at org.apache.http.protocol.HttpRequestExecutor.execute(HttpRequestExecutor.java:124)
	at org.apache.http.impl.client.DefaultRequestDirector.tryExecute(DefaultRequestDirector.java:685)
	at org.apache.http.impl.client.DefaultRequestDirector.execute(DefaultRequestDirector.java:487)
	at org.apache.http.impl.client.AbstractHttpClient.doExecute(AbstractHttpClient.java:882)
	at org.apache.http.impl.client.CloseableHttpClient.execute(CloseableHttpClient.java:82)
	at org.apache.http.impl.client.CloseableHttpClient.execute(CloseableHttpClient.java:107)
	at org.apache.http.impl.client.CloseableHttpClient.execute(CloseableHttpClient.java:55)
	at org.apache.solr.client.solrj.impl.HttpSolrClient.executeMethod(HttpSolrClient.java:482)
	... 8 more




Build Log:
[...truncated 11276 lines...]
   [junit4] Suite: org.apache.solr.cloud.UnloadDistributedZkTest
   [junit4]   2> Creating dataDir: /home/jenkins/workspace/Lucene-Solr-trunk-Linux/solr/build/solr-core/test/J2/temp/solr.cloud.UnloadDistributedZkTest_AF65FD0E773D5D93-001/init-core-data-001
   [junit4]   2> 693520 INFO  (SUITE-UnloadDistributedZkTest-seed#[AF65FD0E773D5D93]-worker) [    ] o.a.s.BaseDistributedSearchTestCase Setting hostContext system property: /
   [junit4]   2> 693522 INFO  (TEST-UnloadDistributedZkTest.test-seed#[AF65FD0E773D5D93]) [    ] o.a.s.c.ZkTestServer STARTING ZK TEST SERVER
   [junit4]   2> 693522 INFO  (Thread-1896) [    ] o.a.s.c.ZkTestServer client port:0.0.0.0/0.0.0.0:0
   [junit4]   2> 693522 INFO  (Thread-1896) [    ] o.a.s.c.ZkTestServer Starting server
   [junit4]   2> 693622 INFO  (TEST-UnloadDistributedZkTest.test-seed#[AF65FD0E773D5D93]) [    ] o.a.s.c.ZkTestServer start zk server on port:45256
   [junit4]   2> 693622 INFO  (TEST-UnloadDistributedZkTest.test-seed#[AF65FD0E773D5D93]) [    ] o.a.s.c.c.SolrZkClient Using default ZkCredentialsProvider
   [junit4]   2> 693623 INFO  (TEST-UnloadDistributedZkTest.test-seed#[AF65FD0E773D5D93]) [    ] o.a.s.c.c.ConnectionManager Waiting for client to connect to ZooKeeper
   [junit4]   2> 693624 INFO  (zkCallback-912-thread-1) [    ] o.a.s.c.c.ConnectionManager Watcher org.apache.solr.common.cloud.ConnectionManager@8b2541 name:ZooKeeperConnection Watcher:127.0.0.1:45256 got event WatchedEvent state:SyncConnected type:None path:null path:null type:None
   [junit4]   2> 693624 INFO  (TEST-UnloadDistributedZkTest.test-seed#[AF65FD0E773D5D93]) [    ] o.a.s.c.c.ConnectionManager Client is connected to ZooKeeper
   [junit4]   2> 693625 INFO  (TEST-UnloadDistributedZkTest.test-seed#[AF65FD0E773D5D93]) [    ] o.a.s.c.c.SolrZkClient Using default ZkACLProvider
   [junit4]   2> 693625 INFO  (TEST-UnloadDistributedZkTest.test-seed#[AF65FD0E773D5D93]) [    ] o.a.s.c.c.SolrZkClient makePath: /solr
   [junit4]   2> 693627 INFO  (TEST-UnloadDistributedZkTest.test-seed#[AF65FD0E773D5D93]) [    ] o.a.s.c.c.SolrZkClient Using default ZkCredentialsProvider
   [junit4]   2> 693627 INFO  (TEST-UnloadDistributedZkTest.test-seed#[AF65FD0E773D5D93]) [    ] o.a.s.c.c.ConnectionManager Waiting for client to connect to ZooKeeper
   [junit4]   2> 693628 INFO  (zkCallback-913-thread-1) [    ] o.a.s.c.c.ConnectionManager Watcher org.apache.solr.common.cloud.ConnectionManager@11d22a1 name:ZooKeeperConnection Watcher:127.0.0.1:45256/solr got event WatchedEvent state:SyncConnected type:None path:null path:null type:None
   [junit4]   2> 693628 INFO  (TEST-UnloadDistributedZkTest.test-seed#[AF65FD0E773D5D93]) [    ] o.a.s.c.c.ConnectionManager Client is connected to ZooKeeper
   [junit4]   2> 693628 INFO  (TEST-UnloadDistributedZkTest.test-seed#[AF65FD0E773D5D93]) [    ] o.a.s.c.c.SolrZkClient Using default ZkACLProvider
   [junit4]   2> 693628 INFO  (TEST-UnloadDistributedZkTest.test-seed#[AF65FD0E773D5D93]) [    ] o.a.s.c.c.SolrZkClient makePath: /collections/collection1
   [junit4]   2> 693629 INFO  (TEST-UnloadDistributedZkTest.test-seed#[AF65FD0E773D5D93]) [    ] o.a.s.c.c.SolrZkClient makePath: /collections/collection1/shards
   [junit4]   2> 693630 INFO  (TEST-UnloadDistributedZkTest.test-seed#[AF65FD0E773D5D93]) [    ] o.a.s.c.c.SolrZkClient makePath: /collections/control_collection
   [junit4]   2> 693631 INFO  (TEST-UnloadDistributedZkTest.test-seed#[AF65FD0E773D5D93]) [    ] o.a.s.c.c.SolrZkClient makePath: /collections/control_collection/shards
   [junit4]   2> 693632 INFO  (TEST-UnloadDistributedZkTest.test-seed#[AF65FD0E773D5D93]) [    ] o.a.s.c.AbstractZkTestCase put /home/jenkins/workspace/Lucene-Solr-trunk-Linux/solr/core/src/test-files/solr/collection1/conf/solrconfig-tlog.xml to /configs/conf1/solrconfig.xml
   [junit4]   2> 693632 INFO  (TEST-UnloadDistributedZkTest.test-seed#[AF65FD0E773D5D93]) [    ] o.a.s.c.c.SolrZkClient makePath: /configs/conf1/solrconfig.xml
   [junit4]   2> 693635 INFO  (TEST-UnloadDistributedZkTest.test-seed#[AF65FD0E773D5D93]) [    ] o.a.s.c.AbstractZkTestCase put /home/jenkins/workspace/Lucene-Solr-trunk-Linux/solr/core/src/test-files/solr/collection1/conf/schema.xml to /configs/conf1/schema.xml
   [junit4]   2> 693635 INFO  (TEST-UnloadDistributedZkTest.test-seed#[AF65FD0E773D5D93]) [    ] o.a.s.c.c.SolrZkClient makePath: /configs/conf1/schema.xml
   [junit4]   2> 693637 INFO  (TEST-UnloadDistributedZkTest.test-seed#[AF65FD0E773D5D93]) [    ] o.a.s.c.AbstractZkTestCase put /home/jenkins/workspace/Lucene-Solr-trunk-Linux/solr/core/src/test-files/solr/collection1/conf/solrconfig.snippet.randomindexconfig.xml to /configs/conf1/solrconfig.snippet.randomindexconfig.xml
   [junit4]   2> 693637 INFO  (TEST-UnloadDistributedZkTest.test-seed#[AF65FD0E773D5D93]) [    ] o.a.s.c.c.SolrZkClient makePath: /configs/conf1/solrconfig.snippet.randomindexconfig.xml
   [junit4]   2> 693639 INFO  (TEST-UnloadDistributedZkTest.test-seed#[AF65FD0E773D5D93]) [    ] o.a.s.c.AbstractZkTestCase put /home/jenkins/workspace/Lucene-Solr-trunk-Linux/solr/core/src/test-files/solr/collection1/conf/stopwords.txt to /configs/conf1/stopwords.txt
   [junit4]   2> 693639 INFO  (TEST-UnloadDistributedZkTest.test-seed#[AF65FD0E773D5D93]) [    ] o.a.s.c.c.SolrZkClient makePath: /configs/conf1/stopwords.txt
   [junit4]   2> 693640 INFO  (TEST-UnloadDistributedZkTest.test-seed#[AF65FD0E773D5D93]) [    ] o.a.s.c.AbstractZkTestCase put /home/jenkins/workspace/Lucene-Solr-trunk-Linux/solr/core/src/test-files/solr/collection1/conf/protwords.txt to /configs/conf1/protwords.txt
   [junit4]   2> 693640 INFO  (TEST-UnloadDistributedZkTest.test-seed#[AF65FD0E773D5D93]) [    ] o.a.s.c.c.SolrZkClient makePath: /configs/conf1/protwords.txt
   [junit4]   2> 693641 INFO  (TEST-UnloadDistributedZkTest.test-seed#[AF65FD0E773D5D93]) [    ] o.a.s.c.AbstractZkTestCase put /home/jenkins/workspace/Lucene-Solr-trunk-Linux/solr/core/src/test-files/solr/collection1/conf/currency.xml to /configs/conf1/currency.xml
   [junit4]   2> 693641 INFO  (TEST-UnloadDistributedZkTest.test-seed#[AF65FD0E773D5D93]) [    ] o.a.s.c.c.SolrZkClient makePath: /configs/conf1/currency.xml
   [junit4]   2> 693642 INFO  (TEST-UnloadDistributedZkTest.test-seed#[AF65FD0E773D5D93]) [    ] o.a.s.c.AbstractZkTestCase put /home/jenkins/workspace/Lucene-Solr-trunk-Linux/solr/core/src/test-files/solr/collection1/conf/enumsConfig.xml to /configs/conf1/enumsConfig.xml
   [junit4]   2> 693642 INFO  (TEST-UnloadDistributedZkTest.test-seed#[AF65FD0E773D5D93]) [    ] o.a.s.c.c.SolrZkClient makePath: /configs/conf1/enumsConfig.xml
   [junit4]   2> 693643 INFO  (TEST-UnloadDistributedZkTest.test-seed#[AF65FD0E773D5D93]) [    ] o.a.s.c.AbstractZkTestCase put /home/jenkins/workspace/Lucene-Solr-trunk-Linux/solr/core/src/test-files/solr/collection1/conf/open-exchange-rates.json to /configs/conf1/open-exchange-rates.json
   [junit4]   2> 693644 INFO  (TEST-UnloadDistributedZkTest.test-seed#[AF65FD0E773D5D93]) [    ] o.a.s.c.c.SolrZkClient makePath: /configs/conf1/open-exchange-rates.json
   [junit4]   2> 693644 INFO  (TEST-UnloadDistributedZkTest.test-seed#[AF65FD0E773D5D93]) [    ] o.a.s.c.AbstractZkTestCase put /home/jenkins/workspace/Lucene-Solr-trunk-Linux/solr/core/src/test-files/solr/collection1/conf/mapping-ISOLatin1Accent.txt to /configs/conf1/mapping-ISOLatin1Accent.txt
   [junit4]   2> 693645 INFO  (TEST-UnloadDistributedZkTest.test-seed#[AF65FD0E773D5D93]) [    ] o.a.s.c.c.SolrZkClient makePath: /configs/conf1/mapping-ISOLatin1Accent.txt
   [junit4]   2> 693645 INFO  (TEST-UnloadDistributedZkTest.test-seed#[AF65FD0E773D5D93]) [    ] o.a.s.c.AbstractZkTestCase put /home/jenkins/workspace/Lucene-Solr-trunk-Linux/solr/core/src/test-files/solr/collection1/conf/old_synonyms.txt to /configs/conf1/old_synonyms.txt
   [junit4]   2> 693645 INFO  (TEST-UnloadDistributedZkTest.test-seed#[AF65FD0E773D5D93]) [    ] o.a.s.c.c.SolrZkClient makePath: /configs/conf1/old_synonyms.txt
   [junit4]   2> 693646 INFO  (TEST-UnloadDistributedZkTest.test-seed#[AF65FD0E773D5D93]) [    ] o.a.s.c.AbstractZkTestCase put /home/jenkins/workspace/Lucene-Solr-trunk-Linux/solr/core/src/test-files/solr/collection1/conf/synonyms.txt to /configs/conf1/synonyms.txt
   [junit4]   2> 693646 INFO  (TEST-UnloadDistributedZkTest.test-seed#[AF65FD0E773D5D93]) [    ] o.a.s.c.c.SolrZkClient makePath: /configs/conf1/synonyms.txt
   [junit4]   2> 693727 INFO  (TEST-UnloadDistributedZkTest.test-seed#[AF65FD0E773D5D93]) [    ] o.a.s.SolrTestCaseJ4 Writing core.properties file to /home/jenkins/workspace/Lucene-Solr-trunk-Linux/solr/build/solr-core/test/J2/temp/solr.cloud.UnloadDistributedZkTest_AF65FD0E773D5D93-001/control-001/cores/collection1
   [junit4]   2> 693729 INFO  (TEST-UnloadDistributedZkTest.test-seed#[AF65FD0E773D5D93]) [    ] o.e.j.s.Server jetty-9.3.6.v20151106
   [junit4]   2> 693730 INFO  (TEST-UnloadDistributedZkTest.test-seed#[AF65FD0E773D5D93]) [    ] o.e.j.s.h.ContextHandler Started o.e.j.s.ServletContextHandler@59f0db{/,null,AVAILABLE}
   [junit4]   2> 693732 INFO  (TEST-UnloadDistributedZkTest.test-seed#[AF65FD0E773D5D93]) [    ] o.e.j.s.ServerConnector Started ServerConnector@127022d{HTTP/1.1,[http/1.1]}{127.0.0.1:32938}
   [junit4]   2> 693732 INFO  (TEST-UnloadDistributedZkTest.test-seed#[AF65FD0E773D5D93]) [    ] o.e.j.s.Server Started @695354ms
   [junit4]   2> 693732 INFO  (TEST-UnloadDistributedZkTest.test-seed#[AF65FD0E773D5D93]) [    ] o.a.s.c.s.e.JettySolrRunner Jetty properties: {solr.data.dir=/home/jenkins/workspace/Lucene-Solr-trunk-Linux/solr/build/solr-core/test/J2/temp/solr.cloud.UnloadDistributedZkTest_AF65FD0E773D5D93-001/tempDir-001/control/data, hostContext=/, hostPort=32938, coreRootDirectory=/home/jenkins/workspace/Lucene-Solr-trunk-Linux/solr/build/solr-core/test/J2/../../../../../../../../../home/jenkins/workspace/Lucene-Solr-trunk-Linux/solr/build/solr-core/test/J2/temp/solr.cloud.UnloadDistributedZkTest_AF65FD0E773D5D93-001/control-001/cores}
   [junit4]   2> 693732 INFO  (TEST-UnloadDistributedZkTest.test-seed#[AF65FD0E773D5D93]) [    ] o.a.s.s.SolrDispatchFilter SolrDispatchFilter.init(): sun.misc.Launcher$AppClassLoader@163006a
   [junit4]   2> 693732 INFO  (TEST-UnloadDistributedZkTest.test-seed#[AF65FD0E773D5D93]) [    ] o.a.s.c.SolrResourceLoader new SolrResourceLoader for directory: '/home/jenkins/workspace/Lucene-Solr-trunk-Linux/solr/build/solr-core/test/J2/temp/solr.cloud.UnloadDistributedZkTest_AF65FD0E773D5D93-001/control-001'
   [junit4]   2> 693733 INFO  (TEST-UnloadDistributedZkTest.test-seed#[AF65FD0E773D5D93]) [    ] o.a.s.c.SolrResourceLoader JNDI not configured for solr (NoInitialContextEx)
   [junit4]   2> 693733 INFO  (TEST-UnloadDistributedZkTest.test-seed#[AF65FD0E773D5D93]) [    ] o.a.s.c.SolrResourceLoader solr home defaulted to 'solr/' (could not find system property or JNDI)
   [junit4]   2> 693733 INFO  (TEST-UnloadDistributedZkTest.test-seed#[AF65FD0E773D5D93]) [    ] o.a.s.c.c.SolrZkClient Using default ZkCredentialsProvider
   [junit4]   2> 693733 INFO  (TEST-UnloadDistributedZkTest.test-seed#[AF65FD0E773D5D93]) [    ] o.a.s.c.c.ConnectionManager Waiting for client to connect to ZooKeeper
   [junit4]   2> 693735 INFO  (zkCallback-914-thread-1) [    ] o.a.s.c.c.ConnectionManager Watcher org.apache.solr.common.cloud.ConnectionManager@1ab9fd6 name:ZooKeeperConnection Watcher:127.0.0.1:45256/solr got event WatchedEvent state:SyncConnected type:None path:null path:null type:None
   [junit4]   2> 693735 INFO  (TEST-UnloadDistributedZkTest.test-seed#[AF65FD0E773D5D93]) [    ] o.a.s.c.c.ConnectionManager Client is connected to ZooKeeper
   [junit4]   2> 693737 INFO  (TEST-UnloadDistributedZkTest.test-seed#[AF65FD0E773D5D93]) [    ] o.a.s.c.c.SolrZkClient Using default ZkACLProvider
   [junit4]   2> 693738 INFO  (TEST-UnloadDistributedZkTest.test-seed#[AF65FD0E773D5D93]) [    ] o.a.s.s.SolrDispatchFilter Loading solr.xml from SolrHome (not found in ZooKeeper)
   [junit4]   2> 693738 INFO  (TEST-UnloadDistributedZkTest.test-seed#[AF65FD0E773D5D93]) [    ] o.a.s.c.SolrXmlConfig Loading container configuration from /home/jenkins/workspace/Lucene-Solr-trunk-Linux/solr/build/solr-core/test/J2/temp/solr.cloud.UnloadDistributedZkTest_AF65FD0E773D5D93-001/control-001/solr.xml
   [junit4]   2> 693750 INFO  (TEST-UnloadDistributedZkTest.test-seed#[AF65FD0E773D5D93]) [    ] o.a.s.c.CorePropertiesLocator Config-defined core root directory: /home/jenkins/workspace/Lucene-Solr-trunk-Linux/solr/build/solr-core/test/J2/../../../../../../../../../home/jenkins/workspace/Lucene-Solr-trunk-Linux/solr/build/solr-core/test/J2/temp/solr.cloud.UnloadDistributedZkTest_AF65FD0E773D5D93-001/control-001/cores
   [junit4]   2> 693750 INFO  (TEST-UnloadDistributedZkTest.test-seed#[AF65FD0E773D5D93]) [    ] o.a.s.c.CoreContainer New CoreContainer 19471606
   [junit4]   2> 693750 INFO  (TEST-UnloadDistributedZkTest.test-seed#[AF65FD0E773D5D93]) [    ] o.a.s.c.CoreContainer Loading cores into CoreContainer [instanceDir=/home/jenkins/workspace/Lucene-Solr-trunk-Linux/solr/build/solr-core/test/J2/temp/solr.cloud.UnloadDistributedZkTest_AF65FD0E773D5D93-001/control-001]
   [junit4]   2> 693750 WARN  (TEST-UnloadDistributedZkTest.test-seed#[AF65FD0E773D5D93]) [    ] o.a.s.c.CoreContainer Couldn't add files from /home/jenkins/workspace/Lucene-Solr-trunk-Linux/solr/build/solr-core/test/J2/temp/solr.cloud.UnloadDistributedZkTest_AF65FD0E773D5D93-001/control-001/lib to classpath: /home/jenkins/workspace/Lucene-Solr-trunk-Linux/solr/build/solr-core/test/J2/temp/solr.cloud.UnloadDistributedZkTest_AF65FD0E773D5D93-001/control-001/lib
   [junit4]   2> 693750 INFO  (TEST-UnloadDistributedZkTest.test-seed#[AF65FD0E773D5D93]) [    ] o.a.s.h.c.HttpShardHandlerFactory created with socketTimeout : 90000,urlScheme : ,connTimeout : 15000,maxConnectionsPerHost : 20,maxConnections : 10000,corePoolSize : 0,maximumPoolSize : 2147483647,maxThreadIdleTime : 5,sizeOfQueue : -1,fairnessPolicy : false,useRetries : false,
   [junit4]   2> 693752 INFO  (TEST-UnloadDistributedZkTest.test-seed#[AF65FD0E773D5D93]) [    ] o.a.s.u.UpdateShardHandler Creating UpdateShardHandler HTTP client with params: socketTimeout=340000&connTimeout=45000&retry=true
   [junit4]   2> 693753 INFO  (TEST-UnloadDistributedZkTest.test-seed#[AF65FD0E773D5D93]) [    ] o.a.s.l.LogWatcher SLF4J impl is org.slf4j.impl.Log4jLoggerFactory
   [junit4]   2> 693753 INFO  (TEST-UnloadDistributedZkTest.test-seed#[AF65FD0E773D5D93]) [    ] o.a.s.l.LogWatcher Registering Log Listener [Log4j (org.slf4j.impl.Log4jLoggerFactory)]
   [junit4]   2> 693753 INFO  (TEST-UnloadDistributedZkTest.test-seed#[AF65FD0E773D5D93]) [    ] o.a.s.c.ZkContainer Zookeeper client=127.0.0.1:45256/solr
   [junit4]   2> 693753 INFO  (TEST-UnloadDistributedZkTest.test-seed#[AF65FD0E773D5D93]) [    ] o.a.s.c.ZkController zkHost includes chroot
   [junit4]   2> 693753 INFO  (TEST-UnloadDistributedZkTest.test-seed#[AF65FD0E773D5D93]) [    ] o.a.s.c.c.SolrZkClient Using default ZkCredentialsProvider
   [junit4]   2> 693754 INFO  (TEST-UnloadDistributedZkTest.test-seed#[AF65FD0E773D5D93]) [    ] o.a.s.c.c.ConnectionManager Waiting for client to connect to ZooKeeper
   [junit4]   2> 693755 INFO  (zkCallback-917-thread-1) [    ] o.a.s.c.c.ConnectionManager Watcher org.apache.solr.common.cloud.ConnectionManager@f25463 name:ZooKeeperConnection Watcher:127.0.0.1:45256 got event WatchedEvent state:SyncConnected type:None path:null path:null type:None
   [junit4]   2> 693755 INFO  (TEST-UnloadDistributedZkTest.test-seed#[AF65FD0E773D5D93]) [    ] o.a.s.c.c.ConnectionManager Client is connected to ZooKeeper
   [junit4]   2> 693755 INFO  (TEST-UnloadDistributedZkTest.test-seed#[AF65FD0E773D5D93]) [    ] o.a.s.c.c.SolrZkClient Using default ZkACLProvider
   [junit4]   2> 693756 INFO  (TEST-UnloadDistributedZkTest.test-seed#[AF65FD0E773D5D93]) [    ] o.a.s.c.c.ConnectionManager Waiting for client to connect to ZooKeeper
   [junit4]   2> 693757 INFO  (zkCallback-918-thread-1) [    ] o.a.s.c.c.ConnectionManager Watcher org.apache.solr.common.cloud.ConnectionManager@5a9acf name:ZooKeeperConnection Watcher:127.0.0.1:45256/solr got event WatchedEvent state:SyncConnected type:None path:null path:null type:None
   [junit4]   2> 693757 INFO  (TEST-UnloadDistributedZkTest.test-seed#[AF65FD0E773D5D93]) [    ] o.a.s.c.c.ConnectionManager Client is connected to ZooKeeper
   [junit4]   2> 693758 INFO  (TEST-UnloadDistributedZkTest.test-seed#[AF65FD0E773D5D93]) [    ] o.a.s.c.c.SolrZkClient makePath: /overseer/queue
   [junit4]   2> 693759 INFO  (TEST-UnloadDistributedZkTest.test-seed#[AF65FD0E773D5D93]) [    ] o.a.s.c.c.SolrZkClient makePath: /overseer/collection-queue-work
   [junit4]   2> 693761 INFO  (TEST-UnloadDistributedZkTest.test-seed#[AF65FD0E773D5D93]) [    ] o.a.s.c.c.SolrZkClient makePath: /overseer/collection-map-running
   [junit4]   2> 693763 INFO  (TEST-UnloadDistributedZkTest.test-seed#[AF65FD0E773D5D93]) [    ] o.a.s.c.c.SolrZkClient makePath: /overseer/collection-map-completed
   [junit4]   2> 693764 INFO  (TEST-UnloadDistributedZkTest.test-seed#[AF65FD0E773D5D93]) [    ] o.a.s.c.c.SolrZkClient makePath: /overseer/collection-map-failure
   [junit4]   2> 693765 INFO  (TEST-UnloadDistributedZkTest.test-seed#[AF65FD0E773D5D93]) [    ] o.a.s.c.c.SolrZkClient makePath: /live_nodes
   [junit4]   2> 693766 INFO  (TEST-UnloadDistributedZkTest.test-seed#[AF65FD0E773D5D93]) [    ] o.a.s.c.c.SolrZkClient makePath: /aliases.json
   [junit4]   2> 693767 INFO  (TEST-UnloadDistributedZkTest.test-seed#[AF65FD0E773D5D93]) [    ] o.a.s.c.c.SolrZkClient makePath: /clusterstate.json
   [junit4]   2> 693767 INFO  (TEST-UnloadDistributedZkTest.test-seed#[AF65FD0E773D5D93]) [    ] o.a.s.c.c.SolrZkClient makePath: /security.json
   [junit4]   2> 693768 INFO  (TEST-UnloadDistributedZkTest.test-seed#[AF65FD0E773D5D93]) [    ] o.a.s.c.c.ZkStateReader Updating cluster state from ZooKeeper... 
   [junit4]   2> 693769 INFO  (TEST-UnloadDistributedZkTest.test-seed#[AF65FD0E773D5D93]) [    ] o.a.s.c.c.ZkStateReader Updated live nodes from ZooKeeper... (0) -> (0)
   [junit4]   2> 693770 INFO  (TEST-UnloadDistributedZkTest.test-seed#[AF65FD0E773D5D93]) [    ] o.a.s.c.c.SolrZkClient makePath: /overseer_elect
   [junit4]   2> 693771 INFO  (TEST-UnloadDistributedZkTest.test-seed#[AF65FD0E773D5D93]) [    ] o.a.s.c.c.SolrZkClient makePath: /overseer_elect/election
   [junit4]   2> 693772 INFO  (TEST-UnloadDistributedZkTest.test-seed#[AF65FD0E773D5D93]) [    ] o.a.s.c.Overseer Overseer (id=null) closing
   [junit4]   2> 693772 INFO  (TEST-UnloadDistributedZkTest.test-seed#[AF65FD0E773D5D93]) [    ] o.a.s.c.LeaderElector Joined leadership election with path: /overseer_elect/election/95474972720037892-127.0.0.1:32938_-n_0000000000
   [junit4]   2> 693772 INFO  (TEST-UnloadDistributedZkTest.test-seed#[AF65FD0E773D5D93]) [    ] o.a.s.c.OverseerElectionContext I am going to be the leader 127.0.0.1:32938_
   [junit4]   2> 693773 INFO  (TEST-UnloadDistributedZkTest.test-seed#[AF65FD0E773D5D93]) [    ] o.a.s.c.c.SolrZkClient makePath: /overseer_elect/leader
   [junit4]   2> 693773 INFO  (TEST-UnloadDistributedZkTest.test-seed#[AF65FD0E773D5D93]) [    ] o.a.s.c.Overseer Overseer (id=95474972720037892-127.0.0.1:32938_-n_0000000000) starting
   [junit4]   2> 693774 INFO  (TEST-UnloadDistributedZkTest.test-seed#[AF65FD0E773D5D93]) [    ] o.a.s.c.c.SolrZkClient makePath: /overseer/queue-work
   [junit4]   2> 693777 INFO  (TEST-UnloadDistributedZkTest.test-seed#[AF65FD0E773D5D93]) [    ] o.a.s.c.OverseerAutoReplicaFailoverThread Starting OverseerAutoReplicaFailoverThread autoReplicaFailoverWorkLoopDelay=10000 autoReplicaFailoverWaitAfterExpiration=10000 autoReplicaFailoverBadNodeExpiration=60000
   [junit4]   2> 693777 INFO  (OverseerCollectionConfigSetProcessor-95474972720037892-127.0.0.1:32938_-n_0000000000) [    ] o.a.s.c.OverseerTaskProcessor Process current queue of overseer operations
   [junit4]   2> 693777 INFO  (TEST-UnloadDistributedZkTest.test-seed#[AF65FD0E773D5D93]) [    ] o.a.s.c.ZkController Register node as live in ZooKeeper:/live_nodes/127.0.0.1:32938_
   [junit4]   2> 693777 INFO  (OverseerStateUpdate-95474972720037892-127.0.0.1:32938_-n_0000000000) [    ] o.a.s.c.Overseer Starting to work on the main queue
   [junit4]   2> 693777 INFO  (TEST-UnloadDistributedZkTest.test-seed#[AF65FD0E773D5D93]) [    ] o.a.s.c.c.SolrZkClient makePath: /live_nodes/127.0.0.1:32938_
   [junit4]   2> 693778 INFO  (OverseerStateUpdate-95474972720037892-127.0.0.1:32938_-n_0000000000) [    ] o.a.s.c.c.ZkStateReader Updated live nodes from ZooKeeper... (0) -> (0)
   [junit4]   2> 693778 INFO  (zkCallback-918-thread-1) [    ] o.a.s.c.c.ZkStateReader A live node change: [WatchedEvent state:SyncConnected type:NodeChildrenChanged path:/live_nodes], has occurred - updating... (live nodes size: [0])
   [junit4]   2> 693779 INFO  (zkCallback-918-thread-1) [    ] o.a.s.c.c.ZkStateReader Updated live nodes from ZooKeeper... (0) -> (1)
   [junit4]   2> 693803 INFO  (TEST-UnloadDistributedZkTest.test-seed#[AF65FD0E773D5D93]) [    ] o.a.s.c.CoreContainer Security conf doesn't exist. Skipping setup for authorization module.
   [junit4]   2> 693803 INFO  (TEST-UnloadDistributedZkTest.test-seed#[AF65FD0E773D5D93]) [    ] o.a.s.c.CoreContainer No authentication plugin used.
   [junit4]   2> 693804 INFO  (TEST-UnloadDistributedZkTest.test-seed#[AF65FD0E773D5D93]) [    ] o.a.s.c.CorePropertiesLocator Looking for core definitions underneath /home/jenkins/workspace/Lucene-Solr-trunk-Linux/solr/build/solr-core/test/J2/../../../../../../../../../home/jenkins/workspace/Lucene-Solr-trunk-Linux/solr/build/solr-core/test/J2/temp/solr.cloud.UnloadDistributedZkTest_AF65FD0E773D5D93-001/control-001/cores
   [junit4]   2> 693805 INFO  (TEST-UnloadDistributedZkTest.test-seed#[AF65FD0E773D5D93]) [    ] o.a.s.c.CoreDescriptor Created CoreDescriptor: {name=collection1, config=solrconfig.xml, transient=false, schema=schema.xml, loadOnStartup=true, configSetProperties=configsetprops.json, collection=control_collection, coreNodeName=, dataDir=data/, shard=}
   [junit4]   2> 693805 INFO  (TEST-UnloadDistributedZkTest.test-seed#[AF65FD0E773D5D93]) [    ] o.a.s.c.CorePropertiesLocator Found core collection1 in /home/jenkins/workspace/Lucene-Solr-trunk-Linux/solr/build/solr-core/test/J2/../../../../../../../../../home/jenkins/workspace/Lucene-Solr-trunk-Linux/solr/build/solr-core/test/J2/temp/solr.cloud.UnloadDistributedZkTest_AF65FD0E773D5D93-001/control-001/cores/collection1
   [junit4]   2> 693805 INFO  (TEST-UnloadDistributedZkTest.test-seed#[AF65FD0E773D5D93]) [    ] o.a.s.c.CorePropertiesLocator Found 1 core definitions
   [junit4]   2> 693805 INFO  (TEST-UnloadDistributedZkTest.test-seed#[AF65FD0E773D5D93]) [    ] o.a.s.s.SolrDispatchFilter user.dir=/home/jenkins/workspace/Lucene-Solr-trunk-Linux/solr/build/solr-core/test/J2
   [junit4]   2> 693805 INFO  (TEST-UnloadDistributedZkTest.test-seed#[AF65FD0E773D5D93]) [    ] o.a.s.s.SolrDispatchFilter SolrDispatchFilter.init() done
   [junit4]   2> 693805 INFO  (coreLoadExecutor-2724-thread-1) [    ] o.a.s.c.ZkController publishing state=down
   [junit4]   2> 693805 INFO  (coreLoadExecutor-2724-thread-1) [    ] o.a.s.c.ZkController numShards not found on descriptor - reading it from system property
   [junit4]   2> 693807 INFO  (OverseerStateUpdate-95474972720037892-127.0.0.1:32938_-n_0000000000) [    ] o.a.s.c.Overseer processMessage: queueSize: 1, message = {
   [junit4]   2>   "core":"collection1",
   [junit4]   2>   "roles":null,
   [junit4]   2>   "base_url":"http://127.0.0.1:32938",
   [junit4]   2>   "node_name":"127.0.0.1:32938_",
   [junit4]   2>   "numShards":"1",
   [junit4]   2>   "state":"down",
   [junit4]   2>   "shard":null,
   [junit4]   2>   "collection":"control_collection",
   [junit4]   2>   "operation":"state"} current state version: 0
   [junit4]   2> 693807 INFO  (coreLoadExecutor-2724-thread-1) [    ] o.a.s.c.ZkController look for our core node name
   [junit4]   2> 693807 INFO  (OverseerStateUpdate-95474972720037892-127.0.0.1:32938_-n_0000000000) [    ] o.a.s.c.o.ReplicaMutator Update state numShards=1 message={
   [junit4]   2>   "core":"collection1",
   [junit4]   2>   "roles":null,
   [junit4]   2>   "base_url":"http://127.0.0.1:32938",
   [junit4]   2>   "node_name":"127.0.0.1:32938_",
   [junit4]   2>   "numShards":"1",
   [junit4]   2>   "state":"down",
   [junit4]   2>   "shard":null,
   [junit4]   2>   "collection":"control_collection",
   [junit4]   2>   "operation":"state"}
   [junit4]   2> 693807 INFO  (OverseerStateUpdate-95474972720037892-127.0.0.1:32938_-n_0000000000) [    ] o.a.s.c.o.ClusterStateMutator building a new cName: control_collection
   [junit4]   2> 693807 INFO  (OverseerStateUpdate-95474972720037892-127.0.0.1:32938_-n_0000000000) [    ] o.a.s.c.o.ReplicaMutator Assigning new node to shard shard=shard1
   [junit4]   2> 693808 INFO  (zkCallback-918-thread-1) [    ] o.a.s.c.c.ZkStateReader A cluster state change: [WatchedEvent state:SyncConnected type:NodeDataChanged path:/clusterstate.json], has occurred - updating... (live nodes size: [1])
   [junit4]   2> 694807 INFO  (coreLoadExecutor-2724-thread-1) [    ] o.a.s.c.ZkController waiting to find shard id in clusterstate for collection1
   [junit4]   2> 694807 INFO  (coreLoadExecutor-2724-thread-1) [    ] o.a.s.c.ZkController Check for collection zkNode:control_collection
   [junit4]   2> 694808 INFO  (coreLoadExecutor-2724-thread-1) [    ] o.a.s.c.ZkController Collection zkNode exists
   [junit4]   2> 694808 INFO  (coreLoadExecutor-2724-thread-1) [    ] o.a.s.c.c.ZkStateReader Load collection config from: [/collections/control_collection]
   [junit4]   2> 694808 INFO  (coreLoadExecutor-2724-thread-1) [    ] o.a.s.c.c.ZkStateReader path=[/collections/control_collection] [configName]=[conf1] specified config exists in ZooKeeper
   [junit4]   2> 694808 INFO  (coreLoadExecutor-2724-thread-1) [    ] o.a.s.c.SolrResourceLoader new SolrResourceLoader for directory: '/home/jenkins/workspace/Lucene-Solr-trunk-Linux/solr/build/solr-core/test/J2/temp/solr.cloud.UnloadDistributedZkTest_AF65FD0E773D5D93-001/control-001/cores/collection1'
   [junit4]   2> 694808 INFO  (coreLoadExecutor-2724-thread-1) [    ] o.a.s.c.SolrResourceLoader JNDI not configured for solr (NoInitialContextEx)
   [junit4]   2> 694808 INFO  (coreLoadExecutor-2724-thread-1) [    ] o.a.s.c.SolrResourceLoader solr home defaulted to 'solr/' (could not find system property or JNDI)
   [junit4]   2> 694809 INFO  (coreLoadExecutor-2724-thread-1) [    ] o.a.s.c.Config loaded config solrconfig.xml with version 0 
   [junit4]   2> 694829 INFO  (coreLoadExecutor-2724-thread-1) [    ] o.a.s.c.SolrConfig current version of requestparams : -1
   [junit4]   2> 694834 INFO  (coreLoadExecutor-2724-thread-1) [    ] o.a.s.c.SolrConfig Using Lucene MatchVersion: 6.0.0
   [junit4]   2> 694844 INFO  (coreLoadExecutor-2724-thread-1) [    ] o.a.s.c.SolrConfig Loaded SolrConfig: solrconfig.xml
   [junit4]   2> 694859 INFO  (coreLoadExecutor-2724-thread-1) [    ] o.a.s.s.IndexSchema [collection1] Schema name=test
   [junit4]   2> 694957 INFO  (coreLoadExecutor-2724-thread-1) [    ] o.a.s.s.OpenExchangeRatesOrgProvider Initialized with rates=open-exchange-rates.json, refreshInterval=1440.
   [junit4]   2> 694963 INFO  (coreLoadExecutor-2724-thread-1) [    ] o.a.s.s.IndexSchema default search field in schema is text
   [junit4]   2> 694965 INFO  (coreLoadExecutor-2724-thread-1) [    ] o.a.s.s.IndexSchema unique key field: id
   [junit4]   2> 694972 INFO  (coreLoadExecutor-2724-thread-1) [    ] o.a.s.s.FileExchangeRateProvider Reloading exchange rates from file currency.xml
   [junit4]   2> 694975 INFO  (coreLoadExecutor-2724-thread-1) [    ] o.a.s.s.FileExchangeRateProvider Reloading exchange rates from file currency.xml
   [junit4]   2> 694976 INFO  (coreLoadExecutor-2724-thread-1) [    ] o.a.s.s.OpenExchangeRatesOrgProvider Reloading exchange rates from open-exchange-rates.json
   [junit4]   2> 694977 INFO  (coreLoadExecutor-2724-thread-1) [    ] o.a.s.s.OpenExchangeRatesOrgProvider Reloading exchange rates from open-exchange-rates.json
   [junit4]   2> 694978 INFO  (coreLoadExecutor-2724-thread-1) [    ] o.a.s.c.ConfigSetProperties Did not find ConfigSet properties, assuming default properties: Can't find resource 'configsetprops.json' in classpath or '/configs/conf1', cwd=/home/jenkins/workspace/Lucene-Solr-trunk-Linux/solr/build/solr-core/test/J2
   [junit4]   2> 694978 INFO  (coreLoadExecutor-2724-thread-1) [    ] o.a.s.c.CoreContainer Creating SolrCore 'collection1' using configuration from collection control_collection
   [junit4]   2> 694978 INFO  (coreLoadExecutor-2724-thread-1) [    ] o.a.s.c.SolrCore org.apache.solr.core.MockDirectoryFactory
   [junit4]   2> 694978 INFO  (coreLoadExecutor-2724-thread-1) [    ] o.a.s.c.SolrCore [[collection1] ] Opening new SolrCore at [/home/jenkins/workspace/Lucene-Solr-trunk-Linux/solr/build/solr-core/test/J2/temp/solr.cloud.UnloadDistributedZkTest_AF65FD0E773D5D93-001/control-001/cores/collection1], dataDir=[/home/jenkins/workspace/Lucene-Solr-trunk-Linux/solr/build/solr-core/test/J2/../../../../../../../../../home/jenkins/workspace/Lucene-Solr-trunk-Linux/solr/build/solr-core/test/J2/temp/solr.cloud.UnloadDistributedZkTest_AF65FD0E773D5D93-001/control-001/cores/collection1/data/]
   [junit4]   2> 694979 INFO  (coreLoadExecutor-2724-thread-1) [    ] o.a.s.c.JmxMonitoredMap JMX monitoring is enabled. Adding Solr mbeans to JMX Server: com.sun.jmx.mbeanserver.JmxMBeanServer@424154
   [junit4]   2> 694979 INFO  (coreLoadExecutor-2724-thread-1) [    ] o.a.s.c.CachingDirectoryFactory return new directory for /home/jenkins/workspace/Lucene-Solr-trunk-Linux/solr/build/solr-core/test/J2/../../../../../../../../../home/jenkins/workspace/Lucene-Solr-trunk-Linux/solr/build/solr-core/test/J2/temp/solr.cloud.UnloadDistributedZkTest_AF65FD0E773D5D93-001/control-001/cores/collection1/data
   [junit4]   2> 694979 INFO  (coreLoadExecutor-2724-thread-1) [    ] o.a.s.c.SolrCore New index directory detected: old=null new=/home/jenkins/workspace/Lucene-Solr-trunk-Linux/solr/build/solr-core/test/J2/../../../../../../../../../home/jenkins/workspace/Lucene-Solr-trunk-Linux/solr/build/solr-core/test/J2/temp/solr.cloud.UnloadDistributedZkTest_AF65FD0E773D5D93-001/control-001/cores/collection1/data/index/
   [junit4]   2> 694980 WARN  (coreLoadExecutor-2724-thread-1) [    ] o.a.s.c.SolrCore [collection1] Solr index directory '/home/jenkins/workspace/Lucene-Solr-trunk-Linux/solr/build/solr-core/test/J2/../../../../../../../../../home/jenkins/workspace/Lucene-Solr-trunk-Linux/solr/build/solr-core/test/J2/temp/solr.cloud.UnloadDistributedZkTest_AF65FD0E773D5D93-001/control-001/cores/collection1/data/index' doesn't exist. Creating new index...
   [junit4]   2> 694980 INFO  (coreLoadExecutor-2724-thread-1) [    ] o.a.s.c.CachingDirectoryFactory return new directory for /home/jenkins/workspace/Lucene-Solr-trunk-Linux/solr/build/solr-core/test/J2/../../../../../../../../../home/jenkins/workspace/Lucene-Solr-trunk-Linux/solr/build/solr-core/test/J2/temp/solr.cloud.UnloadDistributedZkTest_AF65FD0E773D5D93-001/control-001/cores/collection1/data/index
   [junit4]   2> 694980 INFO  (coreLoadExecutor-2724-thread-1) [    ] o.a.s.u.RandomMergePolicy RandomMergePolicy wrapping class org.apache.lucene.index.LogDocMergePolicy: [LogDocMergePolicy: minMergeSize=1000, mergeFactor=39, maxMergeSize=9223372036854775807, maxMergeSizeForForcedMerge=9223372036854775807, calibrateSizeByDeletes=false, maxMergeDocs=2147483647, maxCFSSegmentSizeMB=8.796093022207999E12, noCFSRatio=0.266565562763617]
   [junit4]   2> 694980 INFO  (coreLoadExecutor-2724-thread-1) [    ] o.a.s.c.SolrDeletionPolicy SolrDeletionPolicy.onCommit: commits: num=1
   [junit4]   2> 	commit{dir=MockDirectoryWrapper(RAMDirectory@1384c00 lockFactory=org.apache.lucene.store.SingleInstanceLockFactory@5dd870),segFN=segments_1,generation=1}
   [junit4]   2> 694980 INFO  (coreLoadExecutor-2724-thread-1) [    ] o.a.s.c.SolrDeletionPolicy newest commit generation = 1
   [junit4]   2> 694981 INFO  (OldIndexDirectoryCleanupThreadForCore-collection1) [    ] o.a.s.c.SolrCore Looking for old index directories to cleanup for core collection1 in /home/jenkins/workspace/Lucene-Solr-trunk-Linux/solr/build/solr-core/test/J2/../../../../../../../../../home/jenkins/workspace/Lucene-Solr-trunk-Linux/solr/build/solr-core/test/J2/temp/solr.cloud.UnloadDistributedZkTest_AF65FD0E773D5D93-001/control-001/cores/collection1/data/
   [junit4]   2> 694981 WARN  (OldIndexDirectoryCleanupThreadForCore-collection1) [    ] o.a.s.c.DirectoryFactory /home/jenkins/workspace/Lucene-Solr-trunk-Linux/solr/build/solr-core/test/J2/../../../../../../../../../home/jenkins/workspace/Lucene-Solr-trunk-Linux/solr/build/solr-core/test/J2/temp/solr.cloud.UnloadDistributedZkTest_AF65FD0E773D5D93-001/control-001/cores/collection1/data/ does not point to a valid data directory; skipping clean-up of old index directories.
   [junit4]   2> 694984 INFO  (coreLoadExecutor-2724-thread-1) [    ] o.a.s.u.p.UpdateRequestProcessorChain creating updateRequestProcessorChain "nodistrib"
   [junit4]   2> 694984 INFO  (coreLoadExecutor-2724-thread-1) [    ] o.a.s.u.p.UpdateRequestProcessorChain creating updateRequestProcessorChain "dedupe"
   [junit4]   2> 694984 INFO  (coreLoadExecutor-2724-thread-1) [    ] o.a.s.u.p.UpdateRequestProcessorChain inserting DistributedUpdateProcessorFactory into updateRequestProcessorChain "dedupe"
   [junit4]   2> 694984 INFO  (coreLoadExecutor-2724-thread-1) [    ] o.a.s.u.p.UpdateRequestProcessorChain creating updateRequestProcessorChain "stored_sig"
   [junit4]   2> 694984 INFO  (coreLoadExecutor-2724-thread-1) [    ] o.a.s.u.p.UpdateRequestProcessorChain inserting DistributedUpdateProcessorFactory into updateRequestProcessorChain "stored_sig"
   [junit4]   2> 694984 INFO  (coreLoadExecutor-2724-thread-1) [    ] o.a.s.u.p.UpdateRequestProcessorChain creating updateRequestProcessorChain "distrib-dup-test-chain-explicit"
   [junit4]   2> 694984 INFO  (coreLoadExecutor-2724-thread-1) [    ] o.a.s.u.p.UpdateRequestProcessorChain creating updateRequestProcessorChain "distrib-dup-test-chain-implicit"
   [junit4]   2> 694984 INFO  (coreLoadExecutor-2724-thread-1) [    ] o.a.s.u.p.UpdateRequestProcessorChain inserting DistributedUpdateProcessorFactory into updateRequestProcessorChain "distrib-dup-test-chain-implicit"
   [junit4]   2> 694984 INFO  (coreLoadExecutor-2724-thread-1) [    ] o.a.s.c.SolrCore no updateRequestProcessorChain defined as default, creating implicit default
   [junit4]   2> 694985 WARN  (coreLoadExecutor-2724-thread-1) [    ] o.a.s.c.RequestHandlers INVALID paramSet a in requestHandler {type = requestHandler,name = /dump,class = DumpRequestHandler,args = {defaults={a=A,b=B}}}
   [junit4]   2> 694987 INFO  (coreLoadExecutor-2724-thread-1) [    ] o.a.s.h.l.XMLLoader xsltCacheLifetimeSeconds=60
   [junit4]   2> 694988 INFO  (coreLoadExecutor-2724-thread-1) [    ] o.a.s.h.l.XMLLoader xsltCacheLifetimeSeconds=60
   [junit4]   2> 694988 INFO  (coreLoadExecutor-2724-thread-1) [    ] o.a.s.h.l.XMLLoader xsltCacheLifetimeSeconds=60
   [junit4]   2> 694989 INFO  (coreLoadExecutor-2724-thread-1) [    ] o.a.s.h.l.XMLLoader xsltCacheLifetimeSeconds=60
   [junit4]   2> 694992 INFO  (coreLoadExecutor-2724-thread-1) [    ] o.a.s.c.RequestHandlers Registered paths: /admin/mbeans,standard,/dump,/update/csv,/sql,/update/json/docs,/admin/luke,/export,/admin/segments,/get,/admin/system,/replication,/admin/properties,/config,/stream,/schema,/admin/plugins,/admin/logging,/update/json,/admin/ping,/admin/threads,/update,/admin/file
   [junit4]   2> 694993 INFO  (coreLoadExecutor-2724-thread-1) [    ] o.a.s.c.SolrCore Using default statsCache cache: org.apache.solr.search.stats.LocalStatsCache
   [junit4]   2> 694993 INFO  (coreLoadExecutor-2724-thread-1) [    ] o.a.s.u.UpdateHandler Using UpdateLog implementation: org.apache.solr.update.UpdateLog
   [junit4]   2> 694993 INFO  (coreLoadExecutor-2724-thread-1) [    ] o.a.s.u.UpdateLog Initializing UpdateLog: dataDir= defaultSyncLevel=FLUSH numRecordsToKeep=100 maxNumLogsToKeep=10 numVersionBuckets=65536
   [junit4]   2> 694995 INFO  (coreLoadExecutor-2724-thread-1) [    ] o.a.s.u.CommitTracker Hard AutoCommit: disabled
   [junit4]   2> 694995 INFO  (coreLoadExecutor-2724-thread-1) [    ] o.a.s.u.CommitTracker Soft AutoCommit: disabled
   [junit4]   2> 694995 INFO  (coreLoadExecutor-2724-thread-1) [    ] o.a.s.u.RandomMergePolicy RandomMergePolicy wrapping class org.apache.lucene.index.LogDocMergePolicy: [LogDocMergePolicy: minMergeSize=1000, mergeFactor=14, maxMergeSize=9223372036854775807, maxMergeSizeForForcedMerge=9223372036854775807, calibrateSizeByDeletes=false, maxMergeDocs=2147483647, maxCFSSegmentSizeMB=8.796093022207999E12, noCFSRatio=0.0]
   [junit4]   2> 694995 INFO  (coreLoadExecutor-2724-thread-1) [    ] o.a.s.c.SolrDeletionPolicy SolrDeletionPolicy.onInit: commits: num=1
   [junit4]   2> 	commit{dir=MockDirectoryWrapper(RAMDirectory@1384c00 lockFactory=org.apache.lucene.store.SingleInstanceLockFactory@5dd870),segFN=segments_1,generation=1}
   [junit4]   2> 694995 INFO  (coreLoadExecutor-2724-thread-1) [    ] o.a.s.c.SolrDeletionPolicy newest commit generation = 1
   [junit4]   2> 694995 INFO  (coreLoadExecutor-2724-thread-1) [    ] o.a.s.s.SolrIndexSearcher Opening [Searcher@3a0a25[collection1] main]
   [junit4]   2> 694995 INFO  (coreLoadExecutor-2724-thread-1) [    ] o.a.s.c.c.ZkStateReader Load collection config from: [/collections/control_collection]
   [junit4]   2> 694996 INFO  (coreLoadExecutor-2724-thread-1) [    ] o.a.s.c.c.ZkStateReader path=[/collections/control_collection] [configName]=[conf1] specified config exists in ZooKeeper
   [junit4]   2> 694996 INFO  (coreLoadExecutor-2724-thread-1) [    ] o.a.s.r.ManagedResourceStorage Setting up ZooKeeper-based storage for the RestManager with znodeBase: /configs/conf1
   [junit4]   2> 694996 INFO  (coreLoadExecutor-2724-thread-1) [    ] o.a.s.r.ManagedResourceStorage Configured ZooKeeperStorageIO with znodeBase: /configs/conf1
   [junit4]   2> 694996 INFO  (coreLoadExecutor-2724-thread-1) [    ] o.a.s.r.RestManager Initializing RestManager with initArgs: {}
   [junit4]   2> 694996 INFO  (coreLoadExecutor-2724-thread-1) [    ] o.a.s.r.ManagedResourceStorage Reading _rest_managed.json using ZooKeeperStorageIO:path=/configs/conf1
   [junit4]   2> 694996 INFO  (coreLoadExecutor-2724-thread-1) [    ] o.a.s.r.ManagedResourceStorage No data found for znode /configs/conf1/_rest_managed.json
   [junit4]   2> 694997 INFO  (coreLoadExecutor-2724-thread-1) [    ] o.a.s.r.ManagedResourceStorage Loaded null at path _rest_managed.json using ZooKeeperStorageIO:path=/configs/conf1
   [junit4]   2> 694997 INFO  (coreLoadExecutor-2724-thread-1) [    ] o.a.s.r.RestManager Initializing 0 registered ManagedResources
   [junit4]   2> 694997 INFO  (coreLoadExecutor-2724-thread-1) [    ] o.a.s.h.ReplicationHandler Commits will be reserved for  10000
   [junit4]   2> 694998 INFO  (searcherExecutor-2725-thread-1) [    ] o.a.s.c.SolrCore [collection1] Registered new searcher Searcher@3a0a25[collection1] main{ExitableDirectoryReader(UninvertingDirectoryReader())}
   [junit4]   2> 694998 INFO  (coreLoadExecutor-2724-thread-1) [    ] o.a.s.u.UpdateLog Looking up max value of version field to seed version buckets
   [junit4]   2> 694998 INFO  (coreLoadExecutor-2724-thread-1) [    ] o.a.s.u.VersionInfo Refreshing highest value of _version_ for 65536 version buckets from index
   [junit4]   2> 694998 INFO  (coreLoadExecutor-2724-thread-1) [    ] o.a.s.u.VersionInfo No terms found for _version_, cannot seed version bucket highest value from index
   [junit4]   2> 694998 INFO  (coreLoadExecutor-2724-thread-1) [    ] o.a.s.u.UpdateLog Could not find max version in index or recent updates, using new clock 1527599565067255808
   [junit4]   2> 695000 INFO  (coreLoadExecutor-2724-thread-1) [    ] o.a.s.u.UpdateLog Took 1.0ms to seed version buckets with highest version 1527599565067255808
   [junit4]   2> 695000 INFO  (coreLoadExecutor-2724-thread-1) [    ] o.a.s.c.ZkController watch zkdir /configs/conf1
   [junit4]   2> 695000 INFO  (coreLoadExecutor-2724-thread-1) [    ] o.a.s.c.CoreContainer registering core: collection1
   [junit4]   2> 695001 INFO  (coreZkRegister-2718-thread-1) [    ] o.a.s.c.ZkController Register replica - core:collection1 address:http://127.0.0.1:32938 collection:control_collection shard:shard1
   [junit4]   2> 695001 INFO  (coreZkRegister-2718-thread-1) [    ] o.a.s.c.c.SolrZkClient makePath: /collections/control_collection/leader_elect/shard1/election
   [junit4]   2> 695002 INFO  (coreZkRegister-2718-thread-1) [    ] o.a.s.c.LeaderElector Joined leadership election with path: /collections/control_collection/leader_elect/shard1/election/95474972720037892-core_node1-n_0000000000
   [junit4]   2> 695003 INFO  (coreZkRegister-2718-thread-1) [    ] o.a.s.c.ShardLeaderElectionContext Running the leader process for shard=shard1 and weAreReplacement=false and leaderVoteWait=180000
   [junit4]   2> 695003 INFO  (coreZkRegister-2718-thread-1) [    ] o.a.s.c.ShardLeaderElectionContext Enough replicas found to continue.
   [junit4]   2> 695004 INFO  (coreZkRegister-2718-thread-1) [    ] o.a.s.c.ShardLeaderElectionContext I may be the new leader - try and sync
   [junit4]   2> 695004 INFO  (coreZkRegister-2718-thread-1) [    ] o.a.s.c.SyncStrategy Sync replicas to http://127.0.0.1:32938/collection1/
   [junit4]   2> 695004 INFO  (OverseerStateUpdate-95474972720037892-127.0.0.1:32938_-n_0000000000) [    ] o.a.s.c.Overseer processMessage: queueSize: 1, message = {
   [junit4]   2>   "operation":"leader",
   [junit4]   2>   "shard":"shard1",
   [junit4]   2>   "collection":"control_collection"} current state version: 1
   [junit4]   2> 695004 INFO  (coreZkRegister-2718-thread-1) [    ] o.a.s.c.SyncStrategy Sync Success - now sync replicas to me
   [junit4]   2> 695004 INFO  (coreZkRegister-2718-thread-1) [    ] o.a.s.c.SyncStrategy http://127.0.0.1:32938/collection1/ has no replicas
   [junit4]   2> 695004 INFO  (coreZkRegister-2718-thread-1) [    ] o.a.s.c.c.SolrZkClient makePath: /collections/control_collection/leaders/shard1
   [junit4]   2> 695005 INFO  (coreZkRegister-2718-thread-1) [    ] o.a.s.c.ShardLeaderElectionContextBase Creating leader registration node /collections/control_collection/leaders/shard1/leader after winning as /collections/control_collection/leader_elect/shard1/election/95474972720037892-core_node1-n_0000000000
   [junit4]   2> 695007 INFO  (coreZkRegister-2718-thread-1) [    ] o.a.s.c.ShardLeaderElectionContext I am the new leader: http://127.0.0.1:32938/collection1/ shard1
   [junit4]   2> 695007 INFO  (OverseerStateUpdate-95474972720037892-127.0.0.1:32938_-n_0000000000) [    ] o.a.s.c.Overseer processMessage: queueSize: 1, message = {
   [junit4]   2>   "operation":"leader",
   [junit4]   2>   "shard":"shard1",
   [junit4]   2>   "collection":"control_collection",
   [junit4]   2>   "base_url":"http://127.0.0.1:32938",
   [junit4]   2>   "core":"collection1",
   [junit4]   2>   "state":"active"} current state version: 1
   [junit4]   2> 695109 INFO  (zkCallback-918-thread-1) [    ] o.a.s.c.c.ZkStateReader A cluster state change: [WatchedEvent state:SyncConnected type:NodeDataChanged path:/clusterstate.json], has occurred - updating... (live nodes size: [1])
   [junit4]   2> 695157 INFO  (coreZkRegister-2718-thread-1) [    ] o.a.s.c.ZkController We are http://127.0.0.1:32938/collection1/ and leader is http://127.0.0.1:32938/collection1/
   [junit4]   2> 695157 INFO  (coreZkRegister-2718-thread-1) [    ] o.a.s.c.ZkController No LogReplay needed for core=collection1 baseURL=http://127.0.0.1:32938
   [junit4]   2> 695157 INFO  (coreZkRegister-2718-thread-1) [    ] o.a.s.c.ZkController I am the leader, no recovery necessary
   [junit4]   2> 695158 INFO  (coreZkRegister-2718-thread-1) [    ] o.a.s.c.ZkController publishing state=active
   [junit4]   2> 695158 INFO  (coreZkRegister-2718-thread-1) [    ] o.a.s.c.ZkController numShards not found on descriptor - reading it from system property
   [junit4]   2> 695159 INFO  (OverseerStateUpdate-95474972720037892-127.0.0.1:32938_-n_0000000000) [    ] o.a.s.c.Overseer processMessage: queueSize: 1, message = {
   [junit4]   2>   "core":"collection1",
   [junit4]   2>   "core_node_name":"core_node1",
   [junit4]   2>   "roles":null,
   [junit4]   2>   "base_url":"http://127.0.0.1:32938",
   [junit4]   2>   "node_name":"127.0.0.1:32938_",
   [junit4]   2>   "numShards":"1",
   [junit4]   2>   "state":"active",
   [junit4]   2>   "shard":"shard1",
   [junit4]   2>   "collection":"control_collection",
   [junit4]   2>   "operation":"state"} current state version: 2
   [junit4]   2> 695159 INFO  (coreZkRegister-2718-thread-1) [    ] o.a.s.c.c.ZkStateReader Updated live nodes from ZooKeeper... (1) -> (1)
   [junit4]   2> 695159 INFO  (OverseerStateUpdate-95474972720037892-127.0.0.1:32938_-n_0000000000) [    ] o.a.s.c.o.ReplicaMutator Update state numShards=1 message={
   [junit4]   2>   "core":"collection1",
   [junit4]   2>   "core_node_name":"core_node1",
   [junit4]   2>   "roles":null,
   [junit4]   2>   "base_url":"http://127.0.0.1:32938",
   [junit4]   2>   "node_name":"127.0.0.1:32938_",
   [junit4]   2>   "numShards":"1",
   [junit4]   2>   "state":"active",
   [junit4]   2>   "shard":"shard1",
   [junit4]   2>   "collection":"control_collection",
   [junit4]   2>   "operation":"state"}
   [junit4]   2> 695261 INFO  (zkCallback-918-thread-1) [    ] o.a.s.c.c.ZkStateReader A cluster state change: [WatchedEvent state:SyncConnected type:NodeDataChanged path:/clusterstate.json], has occurred - updating... (live nodes size: [1])
   [junit4]   2> 695307 INFO  (TEST-UnloadDistributedZkTest.test-seed#[AF65FD0E773D5D93]) [    ] o.a.s.c.c.SolrZkClient Using default ZkCredentialsProvider
   [junit4]   2> 695307 INFO  (TEST-UnloadDistributedZkTest.test-seed#[AF65FD0E773D5D93]) [    ] o.a.s.c.c.ConnectionManager Waiting for client to connect to ZooKeeper
   [junit4]   2> 695309 INFO  (zkCallback-920-thread-1) [    ] o.a.s.c.c.ConnectionManager Watcher org.apache.solr.common.cloud.ConnectionManager@1aee3c4 name:ZooKeeperConnection Watcher:127.0.0.1:45256/solr got event WatchedEvent state:SyncConnected type:None path:null path:null type:None
   [junit4]   2> 695309 INFO  (TEST-UnloadDistributedZkTest.test-seed#[AF65FD0E773D5D93]) [    ] o.a.s.c.c.ConnectionManager Client is connected to ZooKeeper
   [junit4]   2> 695309 INFO  (TEST-UnloadDistributedZkTest.test-seed#[AF65FD0E773D5D93]) [    ] o.a.s.c.c.SolrZkClient Using default ZkACLProvider
   [junit4]   2> 695309 INFO  (TEST-UnloadDistributedZkTest.test-seed#[AF65FD0E773D5D93]) [    ] o.a.s.c.c.ZkStateReader Updating cluster state from ZooKeeper... 
   [junit4]   2> 695310 INFO  (TEST-UnloadDistributedZkTest.test-seed#[AF65FD0E773D5D93]) [    ] o.a.s.c.c.ZkStateReader Updated live nodes from ZooKeeper... (0) -> (1)
   [junit4]   2> 695310 INFO  (TEST-UnloadDistributedZkTest.test-seed#[AF65FD0E773D5D93]) [    ] o.a.s.c.ChaosMonkey monkey: init - expire sessions:false cause connection loss:false
   [junit4]   2> 695406 INFO  (TEST-UnloadDistributedZkTest.test-seed#[AF65FD0E773D5D93]) [    ] o.a.s.SolrTestCaseJ4 Writing core.properties file to /home/jenkins/workspace/Lucene-Solr-trunk-Linux/solr/build/solr-core/test/J2/temp/solr.cloud.UnloadDistributedZkTest_AF65FD0E773D5D93-001/shard-1-001/cores/collection1
   [junit4]   2> 695407 INFO  (TEST-UnloadDistributedZkTest.test-seed#[AF65FD0E773D5D93]) [    ] o.a.s.c.AbstractFullDistribZkTestBase create jetty 1 in directory /home/jenkins/workspace/Lucene-Solr-trunk-Linux/solr/build/solr-core/test/J2/temp/solr.cloud.UnloadDistributedZkTest_AF65FD0E773D5D93-001/shard-1-001
   [junit4]   2> 695408 INFO  (TEST-UnloadDistributedZkTest.test-seed#[AF65FD0E773D5D93]) [    ] o.e.j.s.Server jetty-9.3.6.v20151106
   [junit4]   2> 695408 INFO  (TEST-UnloadDistributedZkTest.test-seed#[AF65FD0E773D5D93]) [    ] o.e.j.s.h.ContextHandler Started o.e.j.s.ServletContextHandler@9096d4{/,null,AVAILABLE}
   [junit4]   2> 695409 INFO  (TEST-UnloadDistributedZkTest.test-seed#[AF65FD0E773D5D93]) [    ] o.e.j.s.ServerConnector Started ServerConnector@183e918{HTTP/1.1,[http/1.1]}{127.0.0.1:38443}
   [junit4]   2> 695409 INFO  (TEST-UnloadDistributedZkTest.test-seed#[AF65FD0E773D5D93]) [    ] o.e.j.s.Server Started @697032ms
   [junit4]   2> 695409 INFO  (TEST-UnloadDistributedZkTest.test-seed#[AF65FD0E773D5D93]) [    ] o.a.s.c.s.e.JettySolrRunner Jetty properties: {solr.data.dir=/home/jenkins/workspace/Lucene-Solr-trunk-Linux/solr/build/solr-core/test/J2/temp/solr.cloud.UnloadDistributedZkTest_AF65FD0E773D5D93-001/tempDir-001/jetty1, solrconfig=solrconfig.xml, hostContext=/, hostPort=38443, coreRootDirectory=/home/jenkins/workspace/Lucene-Solr-trunk-Linux/solr/build/solr-core/test/J2/temp/solr.cloud.UnloadDistributedZkTest_AF65FD0E773D5D93-001/shard-1-001/cores}
   [junit4]   2> 695410 INFO  (TEST-UnloadDistributedZkTest.test-seed#[AF65FD0E773D5D93]) [    ] o.a.s.s.SolrDispatchFilter SolrDispatchFilter.init(): sun.misc.Launcher$AppClassLoader@163006a
   [junit4]   2> 695410 INFO  (TEST-UnloadDistributedZkTest.test-seed#[AF65FD0E773D5D93]) [    ] o.a.s.c.SolrResourceLoader new SolrResourceLoader for directory: '/home/jenkins/workspace/Lucene-Solr-trunk-Linux/solr/build/solr-core/test/J2/temp/solr.cloud.UnloadDistributedZkTest_AF65FD0E773D5D93-001/shard-1-001'
   [junit4]   2> 695410 INFO  (TEST-UnloadDistributedZkTest.test-seed#[AF65FD0E773D5D93]) [    ] o.a.s.c.SolrResourceLoader JNDI not configured for solr (NoInitialContextEx)
   [junit4]   2> 695410 INFO  (TEST-UnloadDistributedZkTest.test-seed#[AF65FD0E773D5D93]) [    ] o.a.s.c.SolrResourceLoader solr home defaulted to 'solr/' (could not find system property or JNDI)
   [junit4]   2> 695410 INFO  (TEST-UnloadDistributedZkTest.test-seed#[AF65FD0E773D5D93]) [    ] o.a.s.c.c.SolrZkClient Using default ZkCredentialsProvider
   [junit4]   2> 695410 INFO  (TEST-UnloadDistributedZkTest.test-seed#[AF65FD0E773D5D93]) [    ] o.a.s.c.c.ConnectionManager Waiting for client to connect to ZooKeeper
   [junit4]   2> 695411 INFO  (zkCallback-921-thread-1) [    ] o.a.s.c.c.ConnectionManager Watcher org.apache.solr.common.cloud.ConnectionManager@1113d16 name:ZooKeeperConnection Watcher:127.0.0.1:45256/solr got event WatchedEvent state:SyncConnected type:None path:null path:null type:None
   [junit4]   2> 695411 INFO  (TEST-UnloadDistributedZkTest.test-seed#[AF65FD0E773D5D93]) [    ] o.a.s.c.c.ConnectionManager Client is connected to ZooKeeper
   [junit4]   2> 695412 INFO  (TEST-UnloadDistributedZkTest.test-seed#[AF65FD0E773D5D93]) [    ] o.a.s.c.c.SolrZkClient Using default ZkACLProvider
   [junit4]   2> 695412 INFO  (TEST-UnloadDistributedZkTest.test-seed#[AF65FD0E773D5D93]) [    ] o.a.s.s.SolrDispatchFilter Loading solr.xml from SolrHome (not found in ZooKeeper)
   [junit4]   2> 695412 INFO  (TEST-UnloadDistributedZkTest.test-seed#[AF65FD0E773D5D93]) [    ] o.a.s.c.SolrXmlConfig Loading container configuration from /home/jenkins/workspace/Lucene-Solr-trunk-Linux/solr/build/solr-core/test/J2/temp/solr.cloud.UnloadDistributedZkTest_AF65FD0E773D5D93-001/shard-1-001/solr.xml
   [junit4]   2> 695418 INFO  (TEST-UnloadDistributedZkTest.test-seed#[AF65FD0E773D5D93]) [    ] o.a.s.c.CorePropertiesLocator Config-defined core root directory: /home/jenkins/workspace/Lucene-Solr-trunk-Linux/solr/build/solr-core/test/J2/temp/solr.cloud.UnloadDistributedZkTest_AF65FD0E773D5D93-001/shard-1-001/cores
   [junit4]   2> 695418 INFO  (TEST-UnloadDistributedZkTest.test-seed#[AF65FD0E773D5D93]) [    ] o.a.s.c.CoreContainer New CoreContainer 708267
   [junit4]   2> 695418 INFO  (TEST-UnloadDistributedZkTest.test-seed#[AF65FD0E773D5D93]) [    ] o.a.s.c.CoreContainer Loading cores into CoreContainer [instanceDir=/home/jenkins/workspace/Lucene-Solr-trunk-Linux/solr/build/solr-core/test/J2/temp/solr.cloud.UnloadDistributedZkTest_AF65FD0E773D5D93-001/shard-1-001]
   [junit4]   2> 695419 WARN  (TEST-UnloadDistributedZkTest.test-seed#[AF65FD0E773D5D93]) [    ] o.a.s.c.CoreContainer Couldn't add files from /home/jenkins/workspace/Lucene-Solr-trunk-Linux/solr/build/solr-core/test/J2/temp/solr.cloud.UnloadDistributedZkTest_AF65FD0E773D5D93-001/shard-1-001/lib to classpath: /home/jenkins/workspace/Lucene-Solr-trunk-Linux/solr/build/solr-core/test/J2/temp/solr.cloud.UnloadDistributedZkTest_AF65FD0E773D5D93-001/shard-1-001/lib
   [junit4]   2> 695419 INFO  (TEST-UnloadDistributedZkTest.test-seed#[AF65FD0E773D5D93]) [    ] o.a.s.h.c.HttpShardHandlerFactory created with socketTimeout : 90000,urlScheme : ,connTimeout : 15000,maxConnectionsPerHost : 20,maxConnections : 10000,corePoolSize : 0,maximumPoolSize : 2147483647,maxThreadIdleTime : 5,sizeOfQueue : -1,fairnessPolicy : false,useRetries : false,
   [junit4]   2> 695420 INFO  (TEST-UnloadDistributedZkTest.test-seed#[AF65FD0E773D5D93]) [    ] o.a.s.u.UpdateShardHandler Creating UpdateShardHandler HTTP client with params: socketTimeout=340000&connTimeout=45000&retry=true
   [junit4]   2> 695420 INFO  (TEST-UnloadDistributedZkTest.test-seed#[AF65FD0E773D5D93]) [    ] o.a.s.l.LogWatcher SLF4J impl is org.slf4j.impl.Log4jLoggerFactory
   [junit4]   2> 695420 INFO  (TEST-UnloadDistributedZkTest.test-seed#[AF65FD0E773D5D93]) [    ] o.a.s.l.LogWatcher Registering Log Listener [Log4j (org.slf4j.impl.Log4jLoggerFactory)]
   [junit4]   2> 695421 INFO  (TEST-UnloadDistributedZkTest.test-seed#[AF65FD0E773D5D93]) [    ] o.a.s.c.ZkContainer Zookeeper client=127.0.0.1:45256/solr
   [junit4]   2> 695421 INFO  (TEST-UnloadDistributedZkTest.test-seed#[AF65FD0E773D5D93]) [    ] o.a.s.c.ZkController zkHost includes chroot
   [junit4]   2> 695421 INFO  (TEST-UnloadDistributedZkTest.test-seed#[AF65FD0E773D5D93]) [    ] o.a.s.c.c.SolrZkClient Using default ZkCredentialsProvider
   [junit4]   2> 695421 INFO  (TEST-UnloadDistributedZkTest.test-seed#[AF65FD0E773D5D93]) [    ] o.a.s.c.c.ConnectionManager Waiting for client to connect to ZooKeeper
   [junit4]   2> 695422 INFO  (zkCallback-924-thread-1) [    ] o.a.s.c.c.ConnectionManager Watcher org.apache.solr.common.cloud.ConnectionManager@1cebe21 name:ZooKeeperConnection Watcher:127.0.0.1:45256 got event WatchedEvent state:SyncConnected type:None path:null path:null type:None
   [junit4]   2> 695422 INFO  (TEST-UnloadDistributedZkTest.test-seed#[AF65FD0E773D5D93]) [    ] o.a.s.c.c.ConnectionManager Client is connected to ZooKeeper
   [junit4]   2> 695423 INFO  (TEST-UnloadDistributedZkTest.test-seed#[AF65FD0E773D5D93]) [    ] o.a.s.c.c.SolrZkClient Using default ZkACLProvider
   [junit4]   2> 695423 INFO  (TEST-UnloadDistributedZkTest.test-seed#[AF65FD0E773D5D93]) [    ] o.a.s.c.c.ConnectionManager Waiting for client to connect to ZooKeeper
   [junit4]   2> 695424 INFO  (zkCallback-925-thread-1) [    ] o.a.s.c.c.ConnectionManager Watcher org.apache.solr.common.cloud.ConnectionManager@569e32 name:ZooKeeperConnection Watcher:127.0.0.1:45256/solr got event WatchedEvent state:SyncConnected type:None path:null path:null type:None
   [junit4]   2> 695424 INFO  (TEST-UnloadDistributedZkTest.test-seed#[AF65FD0E773D5D93]) [    ] o.a.s.c.c.ConnectionManager Client is connected to ZooKeeper
   [junit4]   2> 695428 INFO  (TEST-UnloadDistributedZkTest.test-seed#[AF65FD0E773D5D93]) [    ] o.a.s.c.c.ZkStateReader Updating cluster state from ZooKeeper... 
   [junit4]   2> 695428 INFO  (TEST-UnloadDistributedZkTest.test-seed#[AF65FD0E773D5D93]) [    ] o.a.s.c.c.ZkStateReader Updated live nodes from ZooKeeper... (0) -> (1)
   [junit4]   2> 695429 INFO  (TEST-UnloadDistributedZkTest.test-seed#[AF65FD0E773D5D93]) [    ] o.a.s.c.Overseer Overseer (id=null) closing
   [junit4]   2> 695429 INFO  (TEST-UnloadDistributedZkTest.test-seed#[AF65FD0E773D5D93]) [    ] o.a.s.c.LeaderElector Joined leadership election with path: /overseer_elect/election/95474972720037896-127.0.0.1:38443_-n_0000000001
   [junit4]   2> 695430 INFO  (TEST-UnloadDistributedZkTest.test-seed#[AF65FD0E773D5D93]) [    ] o.a.s.c.LeaderElector Watching path /overseer_elect/election/95474972720037892-127.0.0.1:32938_-n_0000000000 to know if I could be the leader
   [junit4]   2> 695430 INFO  (TEST-UnloadDistributedZkTest.test-seed#[AF65FD0E773D5D93]) [    ] o.a.s.c.ZkController Publish node=127.0.0.1:38443_ as DOWN
   [junit4]   2> 695431 INFO  (OverseerStateUpdate-95474972720037892-127.0.0.1:32938_-n_0000000000) [    ] o.a.s.c.Overseer processMessage: queueSize: 1, message = {
   [junit4]   2>   "operation":"downnode",
   [junit4]   2>   "node_name":"127.0.0.1:38443_"} current state version: 3
   [junit4]   2> 695431 INFO  (OverseerStateUpdate-95474972720037892-127.0.0.1:32938_-n_0000000000) [    ] o.a.s.c.o.NodeMutator DownNode state invoked for node: 127.0.0.1:38443_
   [junit4]   2> 695533 INFO  (zkCallback-918-thread-1) [    ] o.a.s.c.c.ZkStateReader A cluster state change: [WatchedEvent state:SyncConnected type:NodeDataChanged path:/clusterstate.json], has occurred - updating... (live nodes size: [1])
   [junit4]   2> 695533 INFO  (zkCallback-925-thread-1) [    ] o.a.s.c.c.ZkStateReader A cluster state change: [WatchedEvent state:SyncConnected type:NodeDataChanged path:/clusterstate.json], has occurred - updating... (live nodes size: [1])
   [junit4]   2> 695533 INFO  (zkCallback-920-thread-1) [    ] o.a.s.c.c.ZkStateReader A cluster state change: [WatchedEvent state:SyncConnected type:NodeDataChanged path:/clusterstate.json], has occurred - updating... (live nodes size: [1])
   [junit4]   2> 696431 INFO  (TEST-UnloadDistributedZkTest.test-seed#[AF65FD0E773D5D93]) [    ] o.a.s.c.ZkController Register node as live in ZooKeeper:/live_nodes/127.0.0.1:38443_
   [junit4]   2> 696432 INFO  (TEST-UnloadDistributedZkTest.test-seed#[AF65FD0E773D5D93]) [    ] o.a.s.c.c.SolrZkClient makePath: /live_nodes/127.0.0.1:38443_
   [junit4]   2> 696432 INFO  (zkCallback-920-thread-1) [    ] o.a.s.c.c.ZkStateReader A live node change: [WatchedEvent state:SyncConnected type:NodeChildrenChanged path:/live_nodes], has occurred - updating... (live nodes size: [1])
   [junit4]   2> 696433 INFO  (zkCallback-925-thread-1) [    ] o.a.s.c.c.ZkStateReader A live node change: [WatchedEvent state:SyncConnected type:NodeChildrenChanged path:/live_nodes], has occurred - updating... (live nodes size: [1])
   [junit4]   2> 696432 INFO  (zkCallback-918-thread-1) [    ] o.a.s.c.c.ZkStateReader A live node change: [WatchedEvent state:SyncConnected type:NodeChildrenChanged path:/live_nodes], has occurred - updating... (live nodes size: [1])
   [junit4]   2> 696433 INFO  (zkCallback-920-thread-1) [    ] o.a.s.c.c.ZkStateReader Updated live nodes from ZooKeeper... (1) -> (2)
   [junit4]   2> 696433 INFO  (zkCallback-925-thread-1) [    ] o.a.s.c.c.ZkStateReader Updated live nodes from ZooKeeper... (1) -> (2)
   [junit4]   2> 696433 INFO  (zkCallback-918-thread-1) [    ] o.a.s.c.c.ZkStateReader Updated live nodes from ZooKeeper... (1) -> (2)
   [junit4]   2> 696458 INFO  (TEST-UnloadDistributedZkTest.test-seed#[AF65FD0E773D5D93]) [    ] o.a.s.c.CoreContainer Security conf doesn't exist. Skipping setup for authorization module.
   [junit4]   2> 696458 INFO  (TEST-UnloadDistributedZkTest.test-seed#[AF65FD0E773D5D93]) [    ] o.a.s.c.CoreContainer No authentication plugin used.
   [junit4]   2> 696458 INFO  (TEST-UnloadDistributedZkTest.test-seed#[AF65FD0E773D5D93]) [    ] o.a.s.c.CorePropertiesLocator Looking for core definitions underneath /home/jenkins/workspace/Lucene-Solr-trunk-Linux/solr/build/solr-core/test/J2/temp/solr.cloud.UnloadDistributedZkTest_AF65FD0E773D5D93-001/shard-1-001/cores
   [junit4]   2> 696459 INFO  (TEST-UnloadDistributedZkTest.test-seed#[AF65FD0E773D5D93]) [    ] o.a.s.c.CoreDescriptor Created CoreDescriptor: {name=collection1, config=solrconfig.xml, transient=false, schema=schema.xml, loadOnStartup=true, configSetProperties=configsetprops.json, collection=collection1, coreNodeName=, dataDir=data/, shard=}
   [junit4]   2> 696459 INFO  (TEST-UnloadDistributedZkTest.test-seed#[AF65FD0E773D5D93]) [    ] o.a.s.c.CorePropertiesLocator Found core collection1 in /home/jenkins/workspace/Lucene-Solr-trunk-Linux/solr/build/solr-core/test/J2/temp/solr.cloud.UnloadDistributedZkTest_AF65FD0E773D5D93-001/shard-1-001/cores/collection1
   [junit4]   2> 696459 INFO  (TEST-UnloadDistributedZkTest.test-seed#[AF65FD0E773D5D93]) [    ] o.a.s.c.CorePropertiesLocator Found 1 core definitions
   [junit4]   2> 696460 INFO  (TEST-UnloadDistributedZkTest.test-seed#[AF65FD0E773D5D93]) [    ] o.a.s.s.SolrDispatchFilter user.dir=/home/jenkins/workspace/Lucene-Solr-trunk-Linux/solr/build/solr-core/test/J2
   [junit4]   2> 696460 INFO  (TEST-UnloadDistributedZkTest.test-seed#[AF65FD0E773D5D93]) [    ] o.a.s.s.SolrDispatchFilter SolrDispatchFilter.init() done
   [junit4]   2> 696460 INFO  (coreLoadExecutor-2735-thread-1) [    ] o.a.s.c.ZkController publishing state=down
   [junit4]   2> 696460 INFO  (coreLoadExecutor-2735-thread-1) [    ] o.a.s.c.ZkController numShards not found on descriptor - reading it from system property
   [junit4]   2> 696460 INFO  (coreLoadExecutor-2735-thread-1) [    ] o.a.s.c.ZkController look for our core node name
   [junit4]   2> 696461 INFO  (OverseerStateUpdate-95474972720037892-127.0.0.1:32938_-n_0000000000) [    ] o.a.s.c.Overseer processMessage: queueSize: 1, message = {
   [junit4]   2>   "core":"collection1",
   [junit4]   2>   "roles":null,
   [junit4]   2>   "base_url":"http://127.0.0.1:38443",
   [junit4]   2>   "node_name":"127.0.0.1:38443_",
   [junit4]   2>   "numShards":"2",
   [junit4]   2>   "state":"down",
   [junit4]   2>   "shard":null,
   [junit4]   2>   "collection":"collection1",
   [junit4]   2>   "operation":"state"} current state version: 4
   [junit4]   2> 696461 INFO  (OverseerStateUpdate-95474972720037892-127.0.0.1:32938_-n_0000000000) [    ] o.a.s.c.o.ReplicaMutator Update state numShards=2 message={
   [junit4]   2>   "core":"collection1",
   [junit4]   2>   "roles":null,
   [junit4]   2>   "base_url":"http://127.0.0.1:38443",
   [junit4]   2>   "node_name":"127.0.0.1:38443_",
   [junit4]   2>   "numShards":"2",
   [junit4]   2>   "state":"down",
   [junit4]   2>   "shard":null,
   [junit4]   2>   "collection":"collection1",
   [junit4]   2>   "operation":"state"}
   [junit4]   2> 696461 INFO  (OverseerStateUpdate-95474972720037892-127.0.0.1:32938_-n_0000000000) [    ] o.a.s.c.o.ClusterStateMutator building a new cName: collection1
   [junit4]   2> 696461 INFO  (OverseerStateUpdate-95474972720037892-127.0.0.1:32938_-n_0000000000) [    ] o.a.s.c.o.ReplicaMutator Assigning new node to shard shard=shard2
   [junit4]   2> 696563 INFO  (zkCallback-918-thread-1) [    ] o.a.s.c.c.ZkStateReader A cluster state change: [WatchedEvent state:SyncConnected type:NodeDataChanged path:/clusterstate.json], has occurred - updating... (live nodes size: [2])
   [junit4]   2> 696563 INFO  (zkCallback-920-thread-1) [    ] o.a.s.c.c.ZkStateReader A cluster state change: [WatchedEvent state:SyncConnected type:NodeDataChanged path:/clusterstate.json], has occurred - updating... (live nodes size: [2])
   [junit4]   2> 696563 INFO  (zkCallback-925-thread-1) [    ] o.a.s.c.c.ZkStateReader A cluster state change: [WatchedEvent state:SyncConnected type:NodeDataChanged path:/clusterstate.json], has occurred - updating... (live nodes size: [2])
   [junit4]   2> 697461 INFO  (coreLoadExecutor-2735-thread-1) [    ] o.a.s.c.ZkController waiting to find shard id in clusterstate for collection1
   [junit4]   2> 697461 INFO  (coreLoadExecutor-2735-thread-1) [    ] o.a.s.c.ZkController Check for collection zkNode:collection1
   [junit4]   2> 697461 INFO  (coreLoadExecutor-2735-thread-1) [    ] o.a.s.c.ZkController Collection zkNode exists
   [junit4]   2> 697461 INFO  (coreLoadExecutor-2735-thread-1) [    ] o.a.s.c.c.ZkStateReader Load collection config from: [/collections/collection1]
   [junit4]   2> 697462 INFO  (coreLoadExecutor-2735-thread-1) [    ] o.a.s.c.c.ZkStateReader path=[/collections/collection1] [configName]=[conf1] specified config exists in ZooKeeper
   [junit4]   2> 697462 INFO  (coreLoadExecutor-2735-thread-1) [    ] o.a.s.c.SolrResourceLoader new SolrResourceLoader for directory: '/home/jenkins/workspace/Lucene-Solr-trunk-Linux/solr/build/solr-core/test/J2/temp/solr.cloud.UnloadDistributedZkTest_AF65FD0E773D5D93-001/shard-1-001/cores/collection1'
   [junit4]   2> 697462 INFO  (coreLoadExecutor-2735-thread-1) [    ] o.a.s.c.SolrResourceLoader JNDI not configured for solr (NoInitialContextEx)
   [junit4]   2> 697462 INFO  (coreLoadExecutor-2735-thread-1) [    ] o.a.s.c.SolrResourceLoader solr home defaulted to 'solr/' (could not find system property or JNDI)
   [junit4]   2> 697463 INFO  (coreLoadExecutor-2735-thread-1) [    ] o.a.s.c.Config loaded config solrconfig.xml with version 0 
   [junit4]   2> 697468 INFO  (coreLoadExecutor-2735-thread-1) [    ] o.a.s.c.SolrConfig current version of requestparams : -1
   [junit4]   2> 697472 INFO  (coreLoadExecutor-2735-thread-1) [    ] o.a.s.c.SolrConfig Using Lucene MatchVersion: 6.0.0
   [junit4]   2> 697481 INFO  (coreLoadExecutor-2735-thread-1) [    ] o.a.s.c.SolrConfig Loaded SolrConfig: solrconfig.xml
   [junit4]   2> 697488 INFO  (coreLoadExecutor-2735-thread-1) [    ] o.a.s.s.IndexSchema [collection1] Schema name=test
   [junit4]   2> 697585 INFO  (coreLoadExecutor-2735-thread-1) [    ] o.a.s.s.OpenExchangeRatesOrgProvider Initialized with rates=open-exchange-rates.json, refreshInterval=1440.
   [junit4]   2> 697591 INFO  (coreLoadExecutor-2735-thread-1) [    ] o.a.s.s.IndexSchema default search field in schema is text
   [junit4]   2> 697592 INFO  (coreLoadExecutor-2735-thread-1) [    ] o.a.s.s.IndexSchema unique key field: id
   [junit4]   2> 697599 INFO  (coreLoadExecutor-2735-thread-1) [    ] o.a.s.s.FileExchangeRateProvider Reloading exchange rates from file currency.xml
   [junit4]   2> 697601 INFO  (coreLoadExecutor-2735-thread-1) [    ] o.a.s.s.FileExchangeRateProvider Reloading exchange rates from file currency.xml
   [junit4]   2> 697603 INFO  (coreLoadExecutor-2735-thread-1) [    ] o.a.s.s.OpenExchangeRatesOrgProvider Reloading exchange rates from open-exchange-rates.json
   [junit4]   2> 697603 INFO  (coreLoadExecutor-2735-thread-1) [    ] o.a.s.s.OpenExchangeRatesOrgProvider Reloading exchange rates from open-exchange-rates.json
   [junit4]   2> 697604 INFO  (coreLoadExecutor-2735-thread-1) [    ] o.a.s.c.ConfigSetProperties Did not find ConfigSet properties, assuming default properties: Can't find resource 'configsetprops.json' in classpath or '/configs/conf1', cwd=/home/jenkins/workspace/Lucene-Solr-trunk-Linux/solr/build/solr-core/test/J2
   [junit4]   2> 697604 INFO  (coreLoadExecutor-2735-thread-1) [    ] o.a.s.c.CoreContainer Creating SolrCore 'collection1' using configuration from collection collection1
   [junit4]   2> 697605 INFO  (coreLoadExecutor-2735-thread-1) [    ] o.a.s.c.SolrCore org.apache.solr.core.MockDirectoryFactory
   [junit4]   2> 697605 INFO  (coreLoadExecutor-2735-thread-1) [    ] o.a.s.c.SolrCore [[collection1] ] Opening new SolrCore at [/home/jenkins/workspace/Lucene-Solr-trunk-Linux/solr/build/solr-core/test/J2/temp/solr.cloud.UnloadDistributedZkTest_AF65FD0E773D5D93-001/shard-1-001/cores/collection1], dataDir=[/home/jenkins/workspace/Lucene-Solr-trunk-Linux/solr/build/solr-core/test/J2/temp/solr.cloud.UnloadDistributedZkTest_AF65FD0E773D5D93-001/shard-1-001/cores/collection1/data/]
   [junit4]   2> 697605 INFO  (coreLoadExecutor-2735-thread-1) [    ] o.a.s.c.JmxMonitoredMap JMX monitoring is enabled. Adding Solr mbeans to JMX Server: com.sun.jmx.mbeanserver.JmxMBeanServer@424154
   [junit4]   2> 697606 INFO  (coreLoadExecutor-2735-thread-1) [    ] o.a.s.c.CachingDirectoryFactory return new directory for /home/jenkins/workspace/Lucene-Solr-trunk-Linux/solr/build/solr-core/test/J2/temp/solr.cloud.UnloadDistributedZkTest_AF65FD0E773D5D93-001/shard-1-001/cores/collection1/data
   [junit4]   2> 697606 INFO  (coreLoadExecutor-2735-thread-1) [    ] o.a.s.c.SolrCore New index directory detected: old=null new=/home/jenkins/workspace/Lucene-Solr-trunk-Linux/solr/build/solr-core/test/J2/temp/solr.cloud.UnloadDistributedZkTest_AF65FD0E773D5D93-001/shard-1-001/cores/collection1/data/index/
   [junit4]   2> 697606 WARN  (coreLoadExecutor-2735-thread-1) [    ] o.a.s.c.SolrCore [collection1] Solr index directory '/home/jenkins/workspace/Lucene-Solr-trunk-Linux/solr/build/solr-core/test/J2/temp/solr.cloud.UnloadDistributedZkTest_AF65FD0E773D5D93-001/shard-1-001/cores/collection1/data/index' doesn't exist. Creating new index...
   [junit4]   2> 697607 INFO  (coreLoadExecutor-2735-thread-1) [    ] o.a.s.c.CachingDirectoryFactory return new directory for /home/jenkins/workspace/Lucene-Solr-trunk-Linux/solr/build/solr-core/test/J2/temp/solr.cloud.UnloadDistributedZkTest_AF65FD0E773D5D93-001/shard-1-001/cores/collection1/data/index
   [junit4]   2> 697607 INFO  (coreLoadExecutor-2735-thread-1) [    ] o.a.s.u.RandomMergePolicy RandomMergePolicy wrapping class org.apache.lucene.index.LogDocMergePolicy: [LogDocMergePolicy: minMergeSize=1000, mergeFactor=39, maxMergeSize=9223372036854775807, maxMergeSizeForForcedMerge=9223372036854775807, calibrateSizeByDeletes=false, maxMergeDocs=2147483647, maxCFSSegmentSizeMB=8.796093022207999E12, noCFSRatio=0.266565562763617]
   [junit4]   2> 697607 INFO  (coreLoadExecutor-2735-thread-1) [    ] o.a.s.c.SolrDeletionPolicy SolrDeletionPolicy.onCommit: commits: num=1
   [junit4]   2> 	commit{dir=MockDirectoryWrapper(RAMDirectory@1a100c4 lockFactory=org.apache.lucene.store.SingleInstanceLockFactory@f0ce17),segFN=segments_1,generation=1}
   [junit4]   2> 697607 INFO  (coreLoadExecutor-2735-thread-1) [    ] o.a.s.c.SolrDeletionPolicy newest commit generation = 1
   [junit4]   2> 697607 INFO  (OldIndexDirectoryCleanupThreadForCore-collection1) [    ] o.a.s.c.SolrCore Looking for old index directories to cleanup for core collection1 in /home/jenkins/workspace/Lucene-Solr-trunk-Linux/solr/build/solr-core/test/J2/temp/solr.cloud.UnloadDistributedZkTest_AF65FD0E773D5D93-001/shard-1-001/cores/collection1/data/
   [junit4]   2> 697608 WARN  (OldIndexDirectoryCleanupThreadForCore-collection1) [    ] o.a.s.c.DirectoryFactory /home/jenkins/workspace/Lucene-Solr-trunk-Linux/solr/build/solr-core/test/J2/temp/solr.cloud.UnloadDistributedZkTest_AF65FD0E773D5D93-001/shard-1-001/cores/collection1/data/ does not point to a valid data directory; skipping clean-up of old index directories.
   [junit4]   2> 697610 INFO  (coreLoadExecutor-2735-thread-1) [    ] o.a.s.u.p.UpdateRequestProcessorChain creating updateRequestProcessorChain "nodistrib"
   [junit4]   2> 697611 INFO  (coreLoadExecutor-2735-thread-1) [    ] o.a.s.u.p.UpdateRequestProcessorChain creating updateRequestProcessorChain "dedupe"
   [junit4]   2> 697611 INFO  (coreLoadExecutor-2735-thread-1) [    ] o.a.s.u.p.UpdateRequestProcessorChain inserting DistributedUpdateProcessorFactory into updateRequestProcessorChain "dedupe"
   [junit4]   2> 697611 INFO  (coreLoadExecutor-2735-thread-1) [    ] o.a.s.u.p.UpdateRequestProcessorChain creating updateRequestProcessorChain "stored_sig"
   [junit4]   2> 697611 INFO  (coreLoadExecutor-2735-thread-1) [    ] o.a.s.u.p.UpdateRequestProcessorChain inserting DistributedUpdateProcessorFactory into updateRequestProcessorChain "stored_sig"
   [junit4]   2> 697611 INFO  (coreLoadExecutor-2735-thread-1) [    ] o.a.s.u.p.UpdateRequestProcessorChain creating updateRequestProcessorChain "distrib-dup-test-chain-explicit"
   [junit4]   2> 697611 INFO  (coreLoadExecutor-2735-thread-1) [    ] o.a.s.u.p.UpdateRequestProcessorChain creating updateRequestProcessorChain "distrib-dup-test-chain-implicit"
   [junit4]   2> 697611 INFO  (coreLoadExecutor-2735-thread-1) [    ] o.a.s.u.p.UpdateRequestProcessorChain inserting DistributedUpdateProcessorFactory into updateRequestProcessorChain "distrib-dup-test-chain-implicit"
   [junit4]   2> 697611 INFO  (coreLoadExecutor-2735-thread-1) [    ] o.a.s.c.SolrCore no updateRequestProcessorChain defined as default, creating implicit default
   [junit4]   2> 697611 WARN  (coreLoadExecutor-2735-thread-1) [    ] o.a.s.c.RequestHandlers INVALID paramSet a in requestHandler {type = requestHandler,name = /dump,class = DumpRequestHandler,args = {defaults={a=A,b=B}}}
   [junit4]   2> 697613 INFO  (coreLoadExecutor-2735-thread-1) [    ] o.a.s.h.l.XMLLoader xsltCacheLifetimeSeconds=60
   [junit4]   2> 697614 INFO  (coreLoadExecutor-2735-thread-1) [    ] o.a.s.h.l.XMLLoader xsltCacheLifetimeSeconds=60
   [junit4]   2> 697615 INFO  (coreLoadExecutor-2735-thread-1) [    ] o.a.s.h.l.XMLLoader xsltCacheLifetimeSeconds=60
   [junit4]   2> 697616 INFO  (coreLoadExecutor-2735-thread-1) [    ] o.a.s.h.l.XMLLoader xsltCacheLifetimeSeconds=60
   [junit4]   2> 697620 INFO  (coreLoadExecutor-2735-thread-1) [    ] o.a.s.c.RequestHandlers Registered paths: /admin/mbeans,standard,/dump,/update/csv,/sql,/update/json/docs,/admin/luke,/export,/admin/segments,/get,/admin/system,/replication,/admin/properties,/config,/stream,/schema,/admin/plugins,/admin/logging,/update/json,/admin/ping,/admin/threads,/update,/admin/file
   [junit4]   2> 697621 INFO  (coreLoadExecutor-2735-thread-1) [    ] o.a.s.c.SolrCore Using default statsCache cache: org.apache.solr.search.stats.LocalStatsCache
   [junit4]   2> 697621 INFO  (coreLoadExecutor-2735-thread-1) [    ] o.a.s.u.UpdateHandler Using UpdateLog implementation: org.apache.solr.update.UpdateLog
   [junit4]   2> 697621 INFO  (coreLoadExecutor-2735-thread-1) [    ] o.a.s.u.UpdateLog Initializing UpdateLog: dataDir= defaultSyncLevel=FLUSH numRecordsToKeep=100 maxNumLogsToKeep=10 numVersionBuckets=65536
   [junit4]   2> 697623 INFO  (coreLoadExecutor-2735-thread-1) [    ] o.a.s.u.CommitTracker Hard AutoCommit: disabled
   [junit4]   2> 697623 INFO  (coreLoadExecutor-2735-thread-1) [    ] o.a.s.u.CommitTracker Soft AutoCommit: disabled
   [junit4]   2> 697624 INFO  (coreLoadExecutor-2735-thread-1) [    ] o.a.s.u.RandomMergePolicy RandomMergePolicy wrapping class org.apache.lucene.index.LogDocMergePolicy: [LogDocMergePolicy: minMergeSize=1000, mergeFactor=14, maxMergeSize=9223372036854775807, maxMergeSizeForForcedMerge=9223372036854775807, calibrateSizeByDeletes=false, maxMergeDocs=2147483647, maxCFSSegmentSizeMB=8.796093022207999E12, noCFSRatio=0.0]
   [junit4]   2> 697624 INFO  (coreLoadExecutor-2735-thread-1) [    ] o.a.s.c.SolrDeletionPolicy SolrDeletionPolicy.onInit: commits: num=1
   [junit4]   2> 	commit{dir=MockDirectoryWrapper(RAMDirectory@1a100c4 lockFactory=org.apache.lucene.store.SingleInstanceLockFactory@f0ce17),segFN=segments_1,generation=1}
   [junit4]   2> 697624 INFO  (coreLoadExecutor-2735-thread-1) [    ] o.a.s.c.SolrDeletionPolicy newest commit generation = 1
   [junit4]   2> 697624 INFO  (coreLoadExecutor-2735-thread-1) [    ] o.a.s.s.SolrIndexSearcher Opening [Searcher@1a34895[collection1] main]
   [junit4]   2> 697624 INFO  (coreLoadExecutor-2735-thread-1) [    ] o.a.s.c.c.ZkStateReader Load collection config from: [/collections/collection1]
   [junit4]   2> 697625 INFO  (coreLoadExecutor-2735-thread-1) [    ] o.a.s.c.c.ZkStateReader path=[/collections/collection1] [configName]=[conf1] specified config exists in ZooKeeper
   [junit4]   2> 697625 INFO  (coreLoadExecutor-2735-thread-1) [    ] o.a.s.r.ManagedResourceStorage Setting up ZooKeeper-based storage for the RestManager with znodeBase: /configs/conf1
   [junit4]   2> 697625 INFO  (coreLoadExecutor-2735-thread-1) [    ] o.a.s.r.ManagedResourceStorage Configured ZooKeeperStorageIO with znodeBase: /configs/conf1
   [junit4]   2> 697625 INFO  (coreLoadExecutor-2735-thread-1) [    ] o.a.s.r.RestManager Initializing RestManager with initArgs: {}
   [junit4]   2> 697625 INFO  (coreLoadExecutor-2735-thread-1) [    ] o.a.s.r.ManagedResourceStorage Reading _rest_managed.json using ZooKeeperStorageIO:path=/configs/conf1
   [junit4]   2> 697625 INFO  (coreLoadExecutor-2735-thread-1) [    ] o.a.s.r.ManagedResourceStorage No data found for znode /configs/conf1/_rest_managed.json
   [junit4]   2> 697625 INFO  (coreLoadExecutor-2735-thread-1) [    ] o.a.s.r.ManagedResourceStorage Loaded null at path _rest_managed.json using ZooKeeperStorageIO:path=/configs/conf1
   [junit4]   2> 697625 INFO  (coreLoadExecutor-2735-thread-1) [    ] o.a.s.r.RestManager Initializing 0 registered ManagedResources
   [junit4]   2> 697625 INFO  (coreLoadExecutor-2735-thread-1) [    ] o.a.s.h.ReplicationHandler Commits will be reserved for  10000
   [junit4]   2> 697627 INFO  (searcherExecutor-2736-thread-1) [    ] o.a.s.c.SolrCore [collection1] Registered new searcher Searcher@1a34895[collection1] main{ExitableDirectoryReader(UninvertingDirectoryReader())}
   [junit4]   2> 697627 INFO  (coreLoadExecutor-2735-thread-1) [    ] o.a.s.u.UpdateLog Looking up max value of version field to seed version buckets
   [junit4]   2> 697627 INFO  (coreLoadExecutor-2735-thread-1) [    ] o.a.s.u.VersionInfo Refreshing highest value of _version_ for 65536 version buckets from index
   [junit4]   2> 697627 INFO  (coreLoadExecutor-2735-thread-1) [    ] o.a.s.u.VersionInfo No terms found for _version_, cannot seed version bucket highest value from index
   [junit4]   2> 697627 INFO  (coreLoadExecutor-2735-thread-1) [    ] o.a.s.u.UpdateLog Could not find max version in index or recent updates, using new clock 1527599567823962112
   [junit4]   2> 697629 INFO  (coreLoadExecutor-2735-thread-1) [    ] o.a.s.u.UpdateLog Took 1.0ms to seed version buckets with highest version 1527599567823962112
   [junit4]   2> 697629 INFO  (coreLoadExecutor-2735-thread-1) [    ] o.a.s.c.ZkController watch zkdir /configs/conf1
   [junit4]   2> 697629 INFO  (coreLoadExecutor-2735-thread-1) [    ] o.a.s.c.CoreContainer registering core: collection1
   [junit4]   2> 697630 INFO  (coreZkRegister-2730-thread-1) [    ] o.a.s.c.ZkController Register replica - core:collection1 address:http://127.0.0.1:38443 collection:collection1 shard:shard2
   [junit4]   2> 697630 INFO  (coreZkRegister-2730-thread-1) [    ] o.a.s.c.c.SolrZkClient makePath: /collections/collection1/leader_elect/shard2/election
   [junit4]   2> 697632 INFO  (coreZkRegister-2730-thread-1) [    ] o.a.s.c.LeaderElector Joined leadership election with path: /collections/collection1/leader_elect/shard2/election/95474972720037896-core_node1-n_0000000000
   [junit4]   2> 697632 INFO  (coreZkRegister-2730-thread-1) [    ] o.a.s.c.ShardLeaderElectionContext Running the leader process for shard=shard2 and weAreReplacement=false and leaderVoteWait=180000
   [junit4]   2> 697633 INFO  (coreZkRegister-2730-thread-1) [    ] o.a.s.c.ShardLeaderElectionContext Enough replicas found to continue.
   [junit4]   2> 697633 INFO  (coreZkRegister-2730-thread-1) [    ] o.a.s.c.ShardLeaderElectionContext I may be the new leader - try and sync
   [junit4]   2> 697633 INFO  (coreZkRegister-2730-thread-1) [    ] o.a.s.c.SyncStrategy Sync replicas to http://127.0.0.1:38443/collection1/
   [junit4]   2> 697633 INFO  (coreZkRegister-2730-thread-1) [    ] o.a.s.c.SyncStrategy Sync Success - now sync replicas to me
   [junit4]   2> 697633 INFO  (coreZkRegister-2730-thread-1) [    ] o.a.s.c.SyncStrategy http://127.0.0.1:38443/collection1/ has no replicas
   [junit4]   2> 697633 INFO  (OverseerStateUpdate-95474972720037892-127.0.0.1:32938_-n_0000000000) [    ] o.a.s.c.Overseer processMessage: queueSize: 1, message = {
   [junit4]   2>   "operation":"leader",
   [junit4]   2>   "shard":"shard2",
   [junit4]   2>   "collection":"collection1"} current state version: 5
   [junit4]   2> 697633 INFO  (coreZkRegister-2730-thread-1) [    ] o.a.s.c.c.SolrZkClient makePath: /collections/collection1/leaders/shard2
   [junit4]   2> 697635 INFO  (coreZkRegister-2730-thread-1) [    ] o.a.s.c.ShardLeaderElectionContextBase Creating leader registration node /collections/collection1/leaders/shard2/leader after winning as /collections/collection1/leader_elect/shard2/election/95474972720037896-core_node1-n_0000000000
   [junit4]   2> 697636 INFO  (coreZkRegister-2730-thread-1) [    ] o.a.s.c.ShardLeaderElectionContext I am the new leader: http://127.0.0.1:38443/collection1/ shard2
   [junit4]   2> 697636 INFO  (OverseerStateUpdate-95474972720037892-127.0.0.1:32938_-n_0000000000) [    ] o.a.s.c.Overseer processMessage: queueSize: 1, message = {
   [junit4]   2>   "operation":"leader",
   [junit4]   2>   "shard":"shard2",
   [junit4]   2>   "collection":"collection1",
   [junit4]   2>   "base_url":"http://127.0.0.1:38443",
   [junit4]   2>   "core":"collection1",
   [junit4]   2>   "state":"active"} current state version: 5
   [junit4]   2> 697738 INFO  (zkCallback-918-thread-1) [    ] o.a.s.c.c.ZkStateReader A cluster state change: [WatchedEvent state:SyncConnected type:NodeDataChanged path:/clusterstate.json], has occurred - updating... (live nodes size: [2])
   [junit4]   2> 697738 INFO  (zkCallback-925-thread-1) [    ] o.a.s.c.c.ZkStateReader A cluster state change: [WatchedEvent state:SyncConnected type:NodeDataChanged path:/clusterstate.json], has occurred - updating... (live nodes size: [2])
   [junit4]   2> 697738 INFO  (zkCallback-920-thread-1) [    ] o.a.s.c.c.ZkStateReader A cluster state change: [WatchedEvent state:SyncConnected type:NodeDataChanged path:/clusterstate.json], has occurred - updating... (live nodes size: [2])
   [junit4]   2> 697787 INFO  (coreZkRegister-2730-thread-1) [    ] o.a.s.c.ZkController We are http://127.0.0.1:38443/collection1/ and leader is http://127.0.0.1:38443/collection1/
   [junit4]   2> 697787 INFO  (coreZkRegister-2730-thread-1) [    ] o.a.s.c.ZkController No LogReplay needed for core=collection1 baseURL=http://127.0.0.1:38443
   [junit4]   2> 697787 INFO  (coreZkRegister-2730-thread-1) [    ] o.a.s.c.ZkController I am the leader, no recovery necessary
   [junit4]   2> 697787 INFO  (coreZkRegister-2730-thread-1) [    ] o.a.s.c.ZkController publishing state=active
   [junit4]   2> 697787 INFO  (coreZkRegister-2730-thread-1) [    ] o.a.s.c.ZkController numShards not found on descriptor - reading it from system property
   [junit4]   2> 697788 INFO  (OverseerStateUpdate-95474972720037892-127.0.0.1:32938_-n_0000000000) [    ] o.a.s.c.Overseer processMessage: queueSize: 1, message = {
   [junit4]   2>   "core":"collection1",
   [junit4]   2>   "core_node_name":"core_node1",
   [junit4]   2>   "roles":null,
   [junit4]   2>   "base_url":"http://127.0.0.1:38443",
   [junit4]   2>   "node_name":"127.0.0.1:38443_",
   [junit4]   2>   "numShards":"2",
   [junit4]   2>   "state":"active",
   [junit4]   2>   "shard":"shard2",
   [junit4]   2>   "collection":"collection1",
   [junit4]   2>   "operation":"state"} current state version: 6
   [junit4]   2> 697788 INFO  (coreZkRegister-2730-thread-1) [    ] o.a.s.c.c.ZkStateReader Updated live nodes from ZooKeeper... (2) -> (2)
   [junit4]   2> 697788 INFO  (OverseerStateUpdate-95474972720037892-127.0.0.1:32938_-n_0000000000) [    ] o.a.s.c.o.ReplicaMutator Update state numShards=2 message={
   [junit4]   2>   "core":"collection1",
   [junit4]   2>   "core_node_name":"core_node1",
   [junit4]   2>   "roles":null,
   [junit4]   2>   "base_url":"http://127.0.0.1:38443",
   [junit4]   2>   "node_name":"127.0.0.1:38443_",
   [junit4]   2>   "numShards":"2",
   [junit4]   2>   "state":"active",
   [junit4]   2>   "shard":"shard2",
   [junit4]   2>   "collection":"collection1",
   [junit4]   2>   "operation":"state"}
   [junit4]   2> 697890 INFO  (zkCallback-925-thread-1) [    ] o.a.s.c.c.ZkStateReader A cluster state change: [WatchedEvent state:SyncConnected type:NodeDataChanged path:/clusterstate.json], has occurred - updating... (live nodes size: [2])
   [junit4]   2> 697890 INFO  (zkCallback-920-thread-1) [    ] o.a.s.c.c.ZkStateReader A cluster state change: [WatchedEvent state:SyncConnected type:NodeDataChanged path:/clusterstate.json], has occurred - updating... (live nodes size: [2])
   [junit4]   2> 697890 INFO  (zkCallback-918-thread-1) [    ] o.a.s.c.c.ZkStateReader A cluster state change: [WatchedEvent state:SyncConnected type:NodeDataChanged path:/clusterstate.json], has occurred - updating... (live nodes size: [2])
   [junit4]   2> 698033 INFO  (TEST-UnloadDistributedZkTest.test-seed#[AF65FD0E773D5D93]) [    ] o.a.s.SolrTestCaseJ4 Writing core.properties file to /home/jenkins/workspace/Lucene-Solr-trunk-Linux/solr/build/solr-core/test/J2/temp/solr.cloud.UnloadDistributedZkTest_AF65FD0E773D5D93-001/shard-2-001/cores/collection1
   [junit4]   2> 698034 INFO  (TEST-UnloadDistributedZkTest.test-seed#[AF65FD0E773D5D93]) [    ] o.a.s.c.AbstractFullDistribZkTestBase create jetty 2 in directory /home/jenkins/workspace/Lucene-Solr-trunk-Linux/solr/build/solr-core/test/J2/temp/solr.cloud.UnloadDistributedZkTest_AF65FD0E773D5D93-001/shard-2-001
   [junit4]   2> 698034 INFO  (TEST-UnloadDistributedZkTest.test-seed#[AF65FD0E773D5D93]) [    ] o.e.j.s.Server jetty-9.3.6.v20151106
   [junit4]   2> 698035 INFO  (TEST-UnloadDistributedZkTest.test-seed#[AF65FD0E773D5D93]) [    ] o.e.j.s.h.ContextHandler Started o.e.j.s.ServletContextHandler@12fc412{/,null,AVAILABLE}
   [junit4]   2> 698036 INFO  (TEST-UnloadDistributedZkTest.test-seed#[AF65FD0E773D5D93]) [    ] o.e.j.s.ServerConnector Started ServerConnector@758f7{HTTP/1.1,[http/1.1]}{127.0.0.1:58736}
   [junit4]   2> 698036 INFO  (TEST-UnloadDistributedZkTest.test-seed#[AF65FD0E773D5D93]) [    ] o.e.j.s.Server Started @699659ms
   [junit4]   2> 698036 INFO  (TEST-UnloadDistributedZkTest.test-seed#[AF65FD0E773D5D93]) [    ] o.a.s.c.s.e.JettySolrRunner Jetty properties: {solr.data.dir=/home/jenkins/workspace/Lucene-Solr-trunk-Linux/solr/build/solr-core/test/J2/temp/solr.cloud.UnloadDistributedZkTest_AF65FD0E773D5D93-001/tempDir-001/je

[...truncated too long message...]

ocol.HttpRequestExecutor.doReceiveResponse(HttpRequestExecutor.java:272)
   [junit4]    > 	at org.apache.http.protocol.HttpRequestExecutor.execute(HttpRequestExecutor.java:124)
   [junit4]    > 	at org.apache.http.impl.client.DefaultRequestDirector.tryExecute(DefaultRequestDirector.java:685)
   [junit4]    > 	at org.apache.http.impl.client.DefaultRequestDirector.execute(DefaultRequestDirector.java:487)
   [junit4]    > 	at org.apache.http.impl.client.AbstractHttpClient.doExecute(AbstractHttpClient.java:882)
   [junit4]    > 	at org.apache.http.impl.client.CloseableHttpClient.execute(CloseableHttpClient.java:82)
   [junit4]    > 	at org.apache.http.impl.client.CloseableHttpClient.execute(CloseableHttpClient.java:107)
   [junit4]    > 	at org.apache.http.impl.client.CloseableHttpClient.execute(CloseableHttpClient.java:55)
   [junit4]    > 	at org.apache.solr.client.solrj.impl.HttpSolrClient.executeMethod(HttpSolrClient.java:482)
   [junit4]    > 	... 8 moreThrowable #7: com.carrotsearch.randomizedtesting.UncaughtExceptionError: Captured an uncaught exception in thread: Thread[id=5614, name=testExecutor-2803-thread-12, state=RUNNABLE, group=TGRP-UnloadDistributedZkTest]
   [junit4]    > Caused by: java.lang.RuntimeException: org.apache.solr.client.solrj.SolrServerException: Timeout occured while waiting response from server at: http://127.0.0.1:48323
   [junit4]    > 	at __randomizedtesting.SeedInfo.seed([AF65FD0E773D5D93]:0)
   [junit4]    > 	at org.apache.solr.cloud.BasicDistributedZkTest$1.run(BasicDistributedZkTest.java:586)
   [junit4]    > 	at org.apache.solr.common.util.ExecutorUtil$MDCAwareThreadPoolExecutor$1.run(ExecutorUtil.java:231)
   [junit4]    > 	at java.util.concurrent.ThreadPoolExecutor.runWorker(ThreadPoolExecutor.java:1158)
   [junit4]    > 	at java.util.concurrent.ThreadPoolExecutor$Worker.run(ThreadPoolExecutor.java:632)
   [junit4]    > 	at java.lang.Thread.run(Thread.java:804)
   [junit4]    > Caused by: org.apache.solr.client.solrj.SolrServerException: Timeout occured while waiting response from server at: http://127.0.0.1:48323
   [junit4]    > 	at org.apache.solr.client.solrj.impl.HttpSolrClient.executeMethod(HttpSolrClient.java:588)
   [junit4]    > 	at org.apache.solr.client.solrj.impl.HttpSolrClient.request(HttpSolrClient.java:241)
   [junit4]    > 	at org.apache.solr.client.solrj.impl.HttpSolrClient.request(HttpSolrClient.java:230)
   [junit4]    > 	at org.apache.solr.client.solrj.SolrClient.request(SolrClient.java:1219)
   [junit4]    > 	at org.apache.solr.cloud.BasicDistributedZkTest$1.run(BasicDistributedZkTest.java:584)
   [junit4]    > 	... 4 more
   [junit4]    > Caused by: java.net.SocketTimeoutException: Read timed out
   [junit4]    > 	at java.net.SocketInputStream.socketRead0(Native Method)
   [junit4]    > 	at java.net.SocketInputStream.socketRead(SocketInputStream.java:116)
   [junit4]    > 	at java.net.SocketInputStream.read(SocketInputStream.java:170)
   [junit4]    > 	at java.net.SocketInputStream.read(SocketInputStream.java:141)
   [junit4]    > 	at org.apache.http.impl.io.AbstractSessionInputBuffer.fillBuffer(AbstractSessionInputBuffer.java:160)
   [junit4]    > 	at org.apache.http.impl.io.SocketInputBuffer.fillBuffer(SocketInputBuffer.java:84)
   [junit4]    > 	at org.apache.http.impl.io.AbstractSessionInputBuffer.readLine(AbstractSessionInputBuffer.java:273)
   [junit4]    > 	at org.apache.http.impl.conn.DefaultHttpResponseParser.parseHead(DefaultHttpResponseParser.java:140)
   [junit4]    > 	at org.apache.http.impl.conn.DefaultHttpResponseParser.parseHead(DefaultHttpResponseParser.java:57)
   [junit4]    > 	at org.apache.http.impl.io.AbstractMessageParser.parse(AbstractMessageParser.java:261)
   [junit4]    > 	at org.apache.http.impl.AbstractHttpClientConnection.receiveResponseHeader(AbstractHttpClientConnection.java:283)
   [junit4]    > 	at org.apache.http.impl.conn.DefaultClientConnection.receiveResponseHeader(DefaultClientConnection.java:251)
   [junit4]    > 	at org.apache.http.impl.conn.ManagedClientConnectionImpl.receiveResponseHeader(ManagedClientConnectionImpl.java:197)
   [junit4]    > 	at org.apache.http.protocol.HttpRequestExecutor.doReceiveResponse(HttpRequestExecutor.java:272)
   [junit4]    > 	at org.apache.http.protocol.HttpRequestExecutor.execute(HttpRequestExecutor.java:124)
   [junit4]    > 	at org.apache.http.impl.client.DefaultRequestDirector.tryExecute(DefaultRequestDirector.java:685)
   [junit4]    > 	at org.apache.http.impl.client.DefaultRequestDirector.execute(DefaultRequestDirector.java:487)
   [junit4]    > 	at org.apache.http.impl.client.AbstractHttpClient.doExecute(AbstractHttpClient.java:882)
   [junit4]    > 	at org.apache.http.impl.client.CloseableHttpClient.execute(CloseableHttpClient.java:82)
   [junit4]    > 	at org.apache.http.impl.client.CloseableHttpClient.execute(CloseableHttpClient.java:107)
   [junit4]    > 	at org.apache.http.impl.client.CloseableHttpClient.execute(CloseableHttpClient.java:55)
   [junit4]    > 	at org.apache.solr.client.solrj.impl.HttpSolrClient.executeMethod(HttpSolrClient.java:482)
   [junit4]    > 	... 8 more
   [junit4]   2> 830224 INFO  (SUITE-UnloadDistributedZkTest-seed#[AF65FD0E773D5D93]-worker) [    ] o.a.s.SolrTestCaseJ4 ###deleteCore
   [junit4]   2> Mar 01, 2016 11:43:26 AM com.carrotsearch.randomizedtesting.ThreadLeakControl checkThreadLeaks
   [junit4]   2> WARNING: Will linger awaiting termination of 1 leaked thread(s).
   [junit4]   2> NOTE: test params are: codec=Asserting(Lucene60): {other_tl1=PostingsFormat(name=LuceneVarGapFixedInterval), range_facet_l_dv=Lucene50(blocksize=128), _version_=PostingsFormat(name=LuceneVarGapFixedInterval), multiDefault=FSTOrd50, a_t=FSTOrd50, intDefault=PostingsFormat(name=LuceneVarGapFixedInterval), a_i1=FSTOrd50, id=Lucene50(blocksize=128), range_facet_i_dv=FSTOrd50, text=Lucene50(blocksize=128), range_facet_l=FSTOrd50, timestamp=FSTOrd50}, docValues:{range_facet_l_dv=DocValuesFormat(name=Lucene54), range_facet_i_dv=DocValuesFormat(name=Memory), timestamp=DocValuesFormat(name=Memory)}, maxPointsInLeafNode=1580, maxMBSortInHeap=4.352238241660318, sim=ClassicSimilarity, locale=en-TK, timezone=Africa/Ouagadougou
   [junit4]   2> NOTE: Linux 3.19.0-51-generic i386/Oracle Corporation 9-ea (32-bit)/cpus=12,threads=1,free=141513704,total=456130560
   [junit4]   2> NOTE: All tests run in this JVM: [SolrTestCaseJ4Test, SaslZkACLProviderTest, RequestLoggingTest, TestManagedStopFilterFactory, HdfsRecoveryZkTest, TestElisionMultitermQuery, DocValuesMultiTest, TestNRTOpen, TestSearchPerf, TestMissingGroups, SearchHandlerTest, TestCollationField, TestMiniSolrCloudClusterBase, CurrencyFieldXmlFileTest, DeleteReplicaTest, IgnoreCommitOptimizeUpdateProcessorFactoryTest, UpdateParamsTest, DistributedFacetPivotWhiteBoxTest, TestDistribDocBasedVersion, BinaryUpdateRequestHandlerTest, DistributedFacetPivotLongTailTest, TestCoreDiscovery, TestHashQParserPlugin, TermVectorComponentDistributedTest, TestZkChroot, AssignTest, TestRecovery, TestSolrQueryParser, TestCustomDocTransformer, HdfsWriteToMultipleCollectionsTest, CollectionStateFormat2Test, XmlUpdateRequestHandlerTest, HdfsCollectionsAPIDistributedZkTest, DistributedDebugComponentTest, TestCloudPivotFacet, TestRemoveLastDynamicCopyField, SuggesterWFSTTest, TestDynamicFieldCollectionResource, BadComponentTest, TestSolrDeletionPolicy1, LeaderInitiatedRecoveryOnShardRestartTest, ChangedSchemaMergeTest, TestNonDefinedSimilarityFactory, QueryParsingTest, TestUtils, LukeRequestHandlerTest, TestTestInjection, TestUseDocValuesAsStored, TestCharFilters, TestGroupingSearch, TestImplicitCoreProperties, TestIntervalFaceting, TestReplicationHandlerBackup, TestReload, TestReRankQParserPlugin, DistributedQueueTest, TestLeaderElectionZkExpiry, EnumFieldTest, OverseerTest, TestCloudManagedSchema, ResponseHeaderTest, TestSweetSpotSimilarityFactory, TestExpandComponent, StatsComponentTest, DistribCursorPagingTest, SliceStateTest, TestFieldResource, TestIndexingPerformance, RankQueryTest, BlockJoinFacetSimpleTest, TestSearcherReuse, TestSizeLimitedDistributedMap, FullSolrCloudDistribCmdsTest, HdfsThreadLeakTest, InfoHandlerTest, TestExtendedDismaxParser, TriLevelCompositeIdRoutingTest, TestHighFrequencyDictionaryFactory, TestIndexSearcher, TestConfigSetsAPIExclusivity, AutoCommitTest, TestCollationFieldDocValues, TestSolrQueryResponse, SharedFSAutoReplicaFailoverUtilsTest, TestJmxIntegration, BitVectorTest, NoCacheHeaderTest, SimpleMLTQParserTest, TestCustomSort, AddBlockUpdateTest, TestWriterPerf, ClusterStateTest, SimpleFacetsTest, TestJettySolrRunner, JavabinLoaderTest, BasicDistributedZk2Test, UnloadDistributedZkTest]
   [junit4] Completed [248/581 (1!)] on J2 in 137.69s, 1 test, 1 error <<< FAILURES!

[...truncated 1132 lines...]
BUILD FAILED
/home/jenkins/workspace/Lucene-Solr-trunk-Linux/build.xml:740: The following error occurred while executing this line:
/home/jenkins/workspace/Lucene-Solr-trunk-Linux/build.xml:684: The following error occurred while executing this line:
/home/jenkins/workspace/Lucene-Solr-trunk-Linux/build.xml:59: The following error occurred while executing this line:
/home/jenkins/workspace/Lucene-Solr-trunk-Linux/solr/build.xml:233: The following error occurred while executing this line:
/home/jenkins/workspace/Lucene-Solr-trunk-Linux/solr/common-build.xml:524: The following error occurred while executing this line:
/home/jenkins/workspace/Lucene-Solr-trunk-Linux/lucene/common-build.xml:1457: The following error occurred while executing this line:
/home/jenkins/workspace/Lucene-Solr-trunk-Linux/lucene/common-build.xml:1014: There were test failures: 581 suites (8 ignored), 2349 tests, 1 error, 117 ignored (71 assumptions) [seed: AF65FD0E773D5D93]

Total time: 63 minutes 49 seconds
Build step 'Invoke Ant' marked build as failure
Archiving artifacts
[WARNINGS] Skipping publisher since build result is FAILURE
Recording test results
Email was triggered for: Failure - Any
Sending email for trigger: Failure - Any



Mime
View raw message