lucene-dev mailing list archives

Site index · List index
Message view « Date » · « Thread »
Top « Date » · « Thread »
From Policeman Jenkins Server <jenk...@thetaphi.de>
Subject [JENKINS] Lucene-Solr-master-Solaris (64bit/jdk1.8.0) - Build # 460 - Failure!
Date Fri, 18 Mar 2016 17:21:45 GMT
Build: http://jenkins.thetaphi.de/job/Lucene-Solr-master-Solaris/460/
Java: 64bit/jdk1.8.0 -XX:+UseCompressedOops -XX:+UseG1GC

1 tests failed.
FAILED:  org.apache.solr.cloud.DistribDocExpirationUpdateProcessorTest.test

Error Message:
There are still nodes recoverying - waited for 45 seconds

Stack Trace:
java.lang.AssertionError: There are still nodes recoverying - waited for 45 seconds
	at __randomizedtesting.SeedInfo.seed([1C3BD10017CBEAE7:946FEEDAB937871F]:0)
	at org.junit.Assert.fail(Assert.java:93)
	at org.apache.solr.cloud.AbstractDistribZkTestBase.waitForRecoveriesToFinish(AbstractDistribZkTestBase.java:173)
	at org.apache.solr.cloud.AbstractFullDistribZkTestBase.waitForRecoveriesToFinish(AbstractFullDistribZkTestBase.java:856)
	at org.apache.solr.cloud.DistribDocExpirationUpdateProcessorTest.test(DistribDocExpirationUpdateProcessorTest.java:73)
	at sun.reflect.NativeMethodAccessorImpl.invoke0(Native Method)
	at sun.reflect.NativeMethodAccessorImpl.invoke(NativeMethodAccessorImpl.java:62)
	at sun.reflect.DelegatingMethodAccessorImpl.invoke(DelegatingMethodAccessorImpl.java:43)
	at java.lang.reflect.Method.invoke(Method.java:498)
	at com.carrotsearch.randomizedtesting.RandomizedRunner.invoke(RandomizedRunner.java:1764)
	at com.carrotsearch.randomizedtesting.RandomizedRunner$8.evaluate(RandomizedRunner.java:871)
	at com.carrotsearch.randomizedtesting.RandomizedRunner$9.evaluate(RandomizedRunner.java:907)
	at com.carrotsearch.randomizedtesting.RandomizedRunner$10.evaluate(RandomizedRunner.java:921)
	at org.apache.solr.BaseDistributedSearchTestCase$ShardsRepeatRule$ShardsFixedStatement.callStatement(BaseDistributedSearchTestCase.java:996)
	at org.apache.solr.BaseDistributedSearchTestCase$ShardsRepeatRule$ShardsStatement.evaluate(BaseDistributedSearchTestCase.java:971)
	at com.carrotsearch.randomizedtesting.rules.SystemPropertiesRestoreRule$1.evaluate(SystemPropertiesRestoreRule.java:57)
	at org.apache.lucene.util.TestRuleSetupTeardownChained$1.evaluate(TestRuleSetupTeardownChained.java:49)
	at org.apache.lucene.util.AbstractBeforeAfterRule$1.evaluate(AbstractBeforeAfterRule.java:45)
	at org.apache.lucene.util.TestRuleThreadAndTestName$1.evaluate(TestRuleThreadAndTestName.java:48)
	at org.apache.lucene.util.TestRuleIgnoreAfterMaxFailures$1.evaluate(TestRuleIgnoreAfterMaxFailures.java:64)
	at org.apache.lucene.util.TestRuleMarkFailure$1.evaluate(TestRuleMarkFailure.java:47)
	at com.carrotsearch.randomizedtesting.rules.StatementAdapter.evaluate(StatementAdapter.java:36)
	at com.carrotsearch.randomizedtesting.ThreadLeakControl$StatementRunner.run(ThreadLeakControl.java:367)
	at com.carrotsearch.randomizedtesting.ThreadLeakControl.forkTimeoutingTask(ThreadLeakControl.java:809)
	at com.carrotsearch.randomizedtesting.ThreadLeakControl$3.evaluate(ThreadLeakControl.java:460)
	at com.carrotsearch.randomizedtesting.RandomizedRunner.runSingleTest(RandomizedRunner.java:880)
	at com.carrotsearch.randomizedtesting.RandomizedRunner$5.evaluate(RandomizedRunner.java:781)
	at com.carrotsearch.randomizedtesting.RandomizedRunner$6.evaluate(RandomizedRunner.java:816)
	at com.carrotsearch.randomizedtesting.RandomizedRunner$7.evaluate(RandomizedRunner.java:827)
	at com.carrotsearch.randomizedtesting.rules.StatementAdapter.evaluate(StatementAdapter.java:36)
	at com.carrotsearch.randomizedtesting.rules.SystemPropertiesRestoreRule$1.evaluate(SystemPropertiesRestoreRule.java:57)
	at org.apache.lucene.util.AbstractBeforeAfterRule$1.evaluate(AbstractBeforeAfterRule.java:45)
	at com.carrotsearch.randomizedtesting.rules.StatementAdapter.evaluate(StatementAdapter.java:36)
	at org.apache.lucene.util.TestRuleStoreClassName$1.evaluate(TestRuleStoreClassName.java:41)
	at com.carrotsearch.randomizedtesting.rules.NoShadowingOrOverridesOnMethodsRule$1.evaluate(NoShadowingOrOverridesOnMethodsRule.java:40)
	at com.carrotsearch.randomizedtesting.rules.NoShadowingOrOverridesOnMethodsRule$1.evaluate(NoShadowingOrOverridesOnMethodsRule.java:40)
	at com.carrotsearch.randomizedtesting.rules.StatementAdapter.evaluate(StatementAdapter.java:36)
	at com.carrotsearch.randomizedtesting.rules.StatementAdapter.evaluate(StatementAdapter.java:36)
	at com.carrotsearch.randomizedtesting.rules.StatementAdapter.evaluate(StatementAdapter.java:36)
	at org.apache.lucene.util.TestRuleAssertionsRequired$1.evaluate(TestRuleAssertionsRequired.java:53)
	at org.apache.lucene.util.TestRuleMarkFailure$1.evaluate(TestRuleMarkFailure.java:47)
	at org.apache.lucene.util.TestRuleIgnoreAfterMaxFailures$1.evaluate(TestRuleIgnoreAfterMaxFailures.java:64)
	at org.apache.lucene.util.TestRuleIgnoreTestSuites$1.evaluate(TestRuleIgnoreTestSuites.java:54)
	at com.carrotsearch.randomizedtesting.rules.StatementAdapter.evaluate(StatementAdapter.java:36)
	at com.carrotsearch.randomizedtesting.ThreadLeakControl$StatementRunner.run(ThreadLeakControl.java:367)
	at java.lang.Thread.run(Thread.java:745)




Build Log:
[...truncated 10582 lines...]
   [junit4] Suite: org.apache.solr.cloud.DistribDocExpirationUpdateProcessorTest
   [junit4]   2> Creating dataDir: /export/home/jenkins/workspace/Lucene-Solr-master-Solaris/solr/build/solr-core/test/J0/temp/solr.cloud.DistribDocExpirationUpdateProcessorTest_1C3BD10017CBEAE7-001/init-core-data-001
   [junit4]   2> 49231 INFO  (SUITE-DistribDocExpirationUpdateProcessorTest-seed#[1C3BD10017CBEAE7]-worker) [    ] o.a.s.SolrTestCaseJ4 Randomized ssl (false) and clientAuth (false)
   [junit4]   2> 49231 INFO  (SUITE-DistribDocExpirationUpdateProcessorTest-seed#[1C3BD10017CBEAE7]-worker) [    ] o.a.s.BaseDistributedSearchTestCase Setting hostContext system property: /bcab/qk
   [junit4]   2> 49285 INFO  (TEST-DistribDocExpirationUpdateProcessorTest.test-seed#[1C3BD10017CBEAE7]) [    ] o.a.s.c.ZkTestServer STARTING ZK TEST SERVER
   [junit4]   2> 49285 INFO  (Thread-80) [    ] o.a.s.c.ZkTestServer client port:0.0.0.0/0.0.0.0:0
   [junit4]   2> 49285 INFO  (Thread-80) [    ] o.a.s.c.ZkTestServer Starting server
   [junit4]   2> 49385 INFO  (TEST-DistribDocExpirationUpdateProcessorTest.test-seed#[1C3BD10017CBEAE7]) [    ] o.a.s.c.ZkTestServer start zk server on port:43203
   [junit4]   2> 49387 INFO  (TEST-DistribDocExpirationUpdateProcessorTest.test-seed#[1C3BD10017CBEAE7]) [    ] o.a.s.c.c.SolrZkClient Using default ZkCredentialsProvider
   [junit4]   2> 49387 INFO  (TEST-DistribDocExpirationUpdateProcessorTest.test-seed#[1C3BD10017CBEAE7]) [    ] o.a.s.c.c.ConnectionManager Waiting for client to connect to ZooKeeper
   [junit4]   2> 49391 INFO  (zkCallback-38-thread-1) [    ] o.a.s.c.c.ConnectionManager Watcher org.apache.solr.common.cloud.ConnectionManager@430a0868 name:ZooKeeperConnection Watcher:127.0.0.1:43203 got event WatchedEvent state:SyncConnected type:None path:null path:null type:None
   [junit4]   2> 49391 INFO  (TEST-DistribDocExpirationUpdateProcessorTest.test-seed#[1C3BD10017CBEAE7]) [    ] o.a.s.c.c.ConnectionManager Client is connected to ZooKeeper
   [junit4]   2> 49392 INFO  (TEST-DistribDocExpirationUpdateProcessorTest.test-seed#[1C3BD10017CBEAE7]) [    ] o.a.s.c.c.SolrZkClient Using default ZkACLProvider
   [junit4]   2> 49392 INFO  (TEST-DistribDocExpirationUpdateProcessorTest.test-seed#[1C3BD10017CBEAE7]) [    ] o.a.s.c.c.SolrZkClient makePath: /solr
   [junit4]   2> 49398 INFO  (TEST-DistribDocExpirationUpdateProcessorTest.test-seed#[1C3BD10017CBEAE7]) [    ] o.a.s.c.c.SolrZkClient Using default ZkCredentialsProvider
   [junit4]   2> 49399 INFO  (TEST-DistribDocExpirationUpdateProcessorTest.test-seed#[1C3BD10017CBEAE7]) [    ] o.a.s.c.c.ConnectionManager Waiting for client to connect to ZooKeeper
   [junit4]   2> 49401 INFO  (zkCallback-39-thread-1) [    ] o.a.s.c.c.ConnectionManager Watcher org.apache.solr.common.cloud.ConnectionManager@328eb16a name:ZooKeeperConnection Watcher:127.0.0.1:43203/solr got event WatchedEvent state:SyncConnected type:None path:null path:null type:None
   [junit4]   2> 49402 INFO  (TEST-DistribDocExpirationUpdateProcessorTest.test-seed#[1C3BD10017CBEAE7]) [    ] o.a.s.c.c.ConnectionManager Client is connected to ZooKeeper
   [junit4]   2> 49402 INFO  (TEST-DistribDocExpirationUpdateProcessorTest.test-seed#[1C3BD10017CBEAE7]) [    ] o.a.s.c.c.SolrZkClient Using default ZkACLProvider
   [junit4]   2> 49402 INFO  (TEST-DistribDocExpirationUpdateProcessorTest.test-seed#[1C3BD10017CBEAE7]) [    ] o.a.s.c.c.SolrZkClient makePath: /collections/collection1
   [junit4]   2> 49405 INFO  (TEST-DistribDocExpirationUpdateProcessorTest.test-seed#[1C3BD10017CBEAE7]) [    ] o.a.s.c.c.SolrZkClient makePath: /collections/collection1/shards
   [junit4]   2> 49408 INFO  (TEST-DistribDocExpirationUpdateProcessorTest.test-seed#[1C3BD10017CBEAE7]) [    ] o.a.s.c.c.SolrZkClient makePath: /collections/control_collection
   [junit4]   2> 49410 INFO  (TEST-DistribDocExpirationUpdateProcessorTest.test-seed#[1C3BD10017CBEAE7]) [    ] o.a.s.c.c.SolrZkClient makePath: /collections/control_collection/shards
   [junit4]   2> 49413 INFO  (TEST-DistribDocExpirationUpdateProcessorTest.test-seed#[1C3BD10017CBEAE7]) [    ] o.a.s.c.AbstractZkTestCase put /export/home/jenkins/workspace/Lucene-Solr-master-Solaris/solr/core/src/test-files/solr/collection1/conf/solrconfig-doc-expire-update-processor.xml to /configs/conf1/solrconfig.xml
   [junit4]   2> 49413 INFO  (TEST-DistribDocExpirationUpdateProcessorTest.test-seed#[1C3BD10017CBEAE7]) [    ] o.a.s.c.c.SolrZkClient makePath: /configs/conf1/solrconfig.xml
   [junit4]   2> 49418 INFO  (TEST-DistribDocExpirationUpdateProcessorTest.test-seed#[1C3BD10017CBEAE7]) [    ] o.a.s.c.AbstractZkTestCase put /export/home/jenkins/workspace/Lucene-Solr-master-Solaris/solr/core/src/test-files/solr/collection1/conf/schema15.xml to /configs/conf1/schema.xml
   [junit4]   2> 49419 INFO  (TEST-DistribDocExpirationUpdateProcessorTest.test-seed#[1C3BD10017CBEAE7]) [    ] o.a.s.c.c.SolrZkClient makePath: /configs/conf1/schema.xml
   [junit4]   2> 49422 INFO  (TEST-DistribDocExpirationUpdateProcessorTest.test-seed#[1C3BD10017CBEAE7]) [    ] o.a.s.c.AbstractZkTestCase put /export/home/jenkins/workspace/Lucene-Solr-master-Solaris/solr/core/src/test-files/solr/collection1/conf/solrconfig.snippet.randomindexconfig.xml to /configs/conf1/solrconfig.snippet.randomindexconfig.xml
   [junit4]   2> 49422 INFO  (TEST-DistribDocExpirationUpdateProcessorTest.test-seed#[1C3BD10017CBEAE7]) [    ] o.a.s.c.c.SolrZkClient makePath: /configs/conf1/solrconfig.snippet.randomindexconfig.xml
   [junit4]   2> 49425 INFO  (TEST-DistribDocExpirationUpdateProcessorTest.test-seed#[1C3BD10017CBEAE7]) [    ] o.a.s.c.AbstractZkTestCase put /export/home/jenkins/workspace/Lucene-Solr-master-Solaris/solr/core/src/test-files/solr/collection1/conf/stopwords.txt to /configs/conf1/stopwords.txt
   [junit4]   2> 49425 INFO  (TEST-DistribDocExpirationUpdateProcessorTest.test-seed#[1C3BD10017CBEAE7]) [    ] o.a.s.c.c.SolrZkClient makePath: /configs/conf1/stopwords.txt
   [junit4]   2> 49428 INFO  (TEST-DistribDocExpirationUpdateProcessorTest.test-seed#[1C3BD10017CBEAE7]) [    ] o.a.s.c.AbstractZkTestCase put /export/home/jenkins/workspace/Lucene-Solr-master-Solaris/solr/core/src/test-files/solr/collection1/conf/protwords.txt to /configs/conf1/protwords.txt
   [junit4]   2> 49429 INFO  (TEST-DistribDocExpirationUpdateProcessorTest.test-seed#[1C3BD10017CBEAE7]) [    ] o.a.s.c.c.SolrZkClient makePath: /configs/conf1/protwords.txt
   [junit4]   2> 49431 INFO  (TEST-DistribDocExpirationUpdateProcessorTest.test-seed#[1C3BD10017CBEAE7]) [    ] o.a.s.c.AbstractZkTestCase put /export/home/jenkins/workspace/Lucene-Solr-master-Solaris/solr/core/src/test-files/solr/collection1/conf/currency.xml to /configs/conf1/currency.xml
   [junit4]   2> 49431 INFO  (TEST-DistribDocExpirationUpdateProcessorTest.test-seed#[1C3BD10017CBEAE7]) [    ] o.a.s.c.c.SolrZkClient makePath: /configs/conf1/currency.xml
   [junit4]   2> 49434 INFO  (TEST-DistribDocExpirationUpdateProcessorTest.test-seed#[1C3BD10017CBEAE7]) [    ] o.a.s.c.AbstractZkTestCase put /export/home/jenkins/workspace/Lucene-Solr-master-Solaris/solr/core/src/test-files/solr/collection1/conf/enumsConfig.xml to /configs/conf1/enumsConfig.xml
   [junit4]   2> 49435 INFO  (TEST-DistribDocExpirationUpdateProcessorTest.test-seed#[1C3BD10017CBEAE7]) [    ] o.a.s.c.c.SolrZkClient makePath: /configs/conf1/enumsConfig.xml
   [junit4]   2> 49438 INFO  (TEST-DistribDocExpirationUpdateProcessorTest.test-seed#[1C3BD10017CBEAE7]) [    ] o.a.s.c.AbstractZkTestCase put /export/home/jenkins/workspace/Lucene-Solr-master-Solaris/solr/core/src/test-files/solr/collection1/conf/open-exchange-rates.json to /configs/conf1/open-exchange-rates.json
   [junit4]   2> 49438 INFO  (TEST-DistribDocExpirationUpdateProcessorTest.test-seed#[1C3BD10017CBEAE7]) [    ] o.a.s.c.c.SolrZkClient makePath: /configs/conf1/open-exchange-rates.json
   [junit4]   2> 49441 INFO  (TEST-DistribDocExpirationUpdateProcessorTest.test-seed#[1C3BD10017CBEAE7]) [    ] o.a.s.c.AbstractZkTestCase put /export/home/jenkins/workspace/Lucene-Solr-master-Solaris/solr/core/src/test-files/solr/collection1/conf/mapping-ISOLatin1Accent.txt to /configs/conf1/mapping-ISOLatin1Accent.txt
   [junit4]   2> 49442 INFO  (TEST-DistribDocExpirationUpdateProcessorTest.test-seed#[1C3BD10017CBEAE7]) [    ] o.a.s.c.c.SolrZkClient makePath: /configs/conf1/mapping-ISOLatin1Accent.txt
   [junit4]   2> 49444 INFO  (TEST-DistribDocExpirationUpdateProcessorTest.test-seed#[1C3BD10017CBEAE7]) [    ] o.a.s.c.AbstractZkTestCase put /export/home/jenkins/workspace/Lucene-Solr-master-Solaris/solr/core/src/test-files/solr/collection1/conf/old_synonyms.txt to /configs/conf1/old_synonyms.txt
   [junit4]   2> 49445 INFO  (TEST-DistribDocExpirationUpdateProcessorTest.test-seed#[1C3BD10017CBEAE7]) [    ] o.a.s.c.c.SolrZkClient makePath: /configs/conf1/old_synonyms.txt
   [junit4]   2> 49447 INFO  (TEST-DistribDocExpirationUpdateProcessorTest.test-seed#[1C3BD10017CBEAE7]) [    ] o.a.s.c.AbstractZkTestCase put /export/home/jenkins/workspace/Lucene-Solr-master-Solaris/solr/core/src/test-files/solr/collection1/conf/synonyms.txt to /configs/conf1/synonyms.txt
   [junit4]   2> 49447 INFO  (TEST-DistribDocExpirationUpdateProcessorTest.test-seed#[1C3BD10017CBEAE7]) [    ] o.a.s.c.c.SolrZkClient makePath: /configs/conf1/synonyms.txt
   [junit4]   2> 49641 INFO  (TEST-DistribDocExpirationUpdateProcessorTest.test-seed#[1C3BD10017CBEAE7]) [    ] o.a.s.SolrTestCaseJ4 Writing core.properties file to /export/home/jenkins/workspace/Lucene-Solr-master-Solaris/solr/build/solr-core/test/J0/temp/solr.cloud.DistribDocExpirationUpdateProcessorTest_1C3BD10017CBEAE7-001/control-001/cores/collection1
   [junit4]   2> 49653 INFO  (TEST-DistribDocExpirationUpdateProcessorTest.test-seed#[1C3BD10017CBEAE7]) [    ] o.e.j.s.Server jetty-9.3.8.v20160314
   [junit4]   2> 49660 INFO  (TEST-DistribDocExpirationUpdateProcessorTest.test-seed#[1C3BD10017CBEAE7]) [    ] o.e.j.s.h.ContextHandler Started o.e.j.s.ServletContextHandler@2b97d048{/bcab/qk,null,AVAILABLE}
   [junit4]   2> 49669 INFO  (TEST-DistribDocExpirationUpdateProcessorTest.test-seed#[1C3BD10017CBEAE7]) [    ] o.e.j.s.ServerConnector Started ServerConnector@39853a34{HTTP/1.1,[http/1.1]}{127.0.0.1:63098}
   [junit4]   2> 49669 INFO  (TEST-DistribDocExpirationUpdateProcessorTest.test-seed#[1C3BD10017CBEAE7]) [    ] o.e.j.s.Server Started @52559ms
   [junit4]   2> 49669 INFO  (TEST-DistribDocExpirationUpdateProcessorTest.test-seed#[1C3BD10017CBEAE7]) [    ] o.a.s.c.s.e.JettySolrRunner Jetty properties: {solr.data.dir=/export/home/jenkins/workspace/Lucene-Solr-master-Solaris/solr/build/solr-core/test/J0/temp/solr.cloud.DistribDocExpirationUpdateProcessorTest_1C3BD10017CBEAE7-001/tempDir-001/control/data, hostContext=/bcab/qk, hostPort=63098, coreRootDirectory=/export/home/jenkins/workspace/Lucene-Solr-master-Solaris/solr/build/solr-core/test/J0/temp/solr.cloud.DistribDocExpirationUpdateProcessorTest_1C3BD10017CBEAE7-001/control-001/cores}
   [junit4]   2> 49670 INFO  (TEST-DistribDocExpirationUpdateProcessorTest.test-seed#[1C3BD10017CBEAE7]) [    ] o.a.s.s.SolrDispatchFilter SolrDispatchFilter.init(): sun.misc.Launcher$AppClassLoader@6d06d69c
   [junit4]   2> 49670 INFO  (TEST-DistribDocExpirationUpdateProcessorTest.test-seed#[1C3BD10017CBEAE7]) [    ] o.a.s.c.SolrResourceLoader new SolrResourceLoader for directory: '/export/home/jenkins/workspace/Lucene-Solr-master-Solaris/solr/build/solr-core/test/J0/temp/solr.cloud.DistribDocExpirationUpdateProcessorTest_1C3BD10017CBEAE7-001/control-001'
   [junit4]   2> 49670 INFO  (TEST-DistribDocExpirationUpdateProcessorTest.test-seed#[1C3BD10017CBEAE7]) [    ] o.a.s.c.SolrResourceLoader JNDI not configured for solr (NoInitialContextEx)
   [junit4]   2> 49670 INFO  (TEST-DistribDocExpirationUpdateProcessorTest.test-seed#[1C3BD10017CBEAE7]) [    ] o.a.s.c.SolrResourceLoader solr home defaulted to 'solr/' (could not find system property or JNDI)
   [junit4]   2> 49670 INFO  (TEST-DistribDocExpirationUpdateProcessorTest.test-seed#[1C3BD10017CBEAE7]) [    ] o.a.s.c.c.SolrZkClient Using default ZkCredentialsProvider
   [junit4]   2> 49671 INFO  (TEST-DistribDocExpirationUpdateProcessorTest.test-seed#[1C3BD10017CBEAE7]) [    ] o.a.s.c.c.ConnectionManager Waiting for client to connect to ZooKeeper
   [junit4]   2> 49697 INFO  (zkCallback-40-thread-1) [    ] o.a.s.c.c.ConnectionManager Watcher org.apache.solr.common.cloud.ConnectionManager@490ff1bc name:ZooKeeperConnection Watcher:127.0.0.1:43203/solr got event WatchedEvent state:SyncConnected type:None path:null path:null type:None
   [junit4]   2> 49697 INFO  (TEST-DistribDocExpirationUpdateProcessorTest.test-seed#[1C3BD10017CBEAE7]) [    ] o.a.s.c.c.ConnectionManager Client is connected to ZooKeeper
   [junit4]   2> 49698 INFO  (TEST-DistribDocExpirationUpdateProcessorTest.test-seed#[1C3BD10017CBEAE7]) [    ] o.a.s.c.c.SolrZkClient Using default ZkACLProvider
   [junit4]   2> 49729 INFO  (TEST-DistribDocExpirationUpdateProcessorTest.test-seed#[1C3BD10017CBEAE7]) [    ] o.a.s.s.SolrDispatchFilter Loading solr.xml from SolrHome (not found in ZooKeeper)
   [junit4]   2> 49729 INFO  (TEST-DistribDocExpirationUpdateProcessorTest.test-seed#[1C3BD10017CBEAE7]) [    ] o.a.s.c.SolrXmlConfig Loading container configuration from /export/home/jenkins/workspace/Lucene-Solr-master-Solaris/solr/build/solr-core/test/J0/temp/solr.cloud.DistribDocExpirationUpdateProcessorTest_1C3BD10017CBEAE7-001/control-001/solr.xml
   [junit4]   2> 49735 INFO  (TEST-DistribDocExpirationUpdateProcessorTest.test-seed#[1C3BD10017CBEAE7]) [    ] o.a.s.c.CorePropertiesLocator Config-defined core root directory: /export/home/jenkins/workspace/Lucene-Solr-master-Solaris/solr/build/solr-core/test/J0/temp/solr.cloud.DistribDocExpirationUpdateProcessorTest_1C3BD10017CBEAE7-001/control-001/cores
   [junit4]   2> 49735 INFO  (TEST-DistribDocExpirationUpdateProcessorTest.test-seed#[1C3BD10017CBEAE7]) [    ] o.a.s.c.CoreContainer New CoreContainer 1339889968
   [junit4]   2> 49735 INFO  (TEST-DistribDocExpirationUpdateProcessorTest.test-seed#[1C3BD10017CBEAE7]) [    ] o.a.s.c.CoreContainer Loading cores into CoreContainer [instanceDir=/export/home/jenkins/workspace/Lucene-Solr-master-Solaris/solr/build/solr-core/test/J0/temp/solr.cloud.DistribDocExpirationUpdateProcessorTest_1C3BD10017CBEAE7-001/control-001]
   [junit4]   2> 49735 WARN  (TEST-DistribDocExpirationUpdateProcessorTest.test-seed#[1C3BD10017CBEAE7]) [    ] o.a.s.c.CoreContainer Couldn't add files from /export/home/jenkins/workspace/Lucene-Solr-master-Solaris/solr/build/solr-core/test/J0/temp/solr.cloud.DistribDocExpirationUpdateProcessorTest_1C3BD10017CBEAE7-001/control-001/lib to classpath: /export/home/jenkins/workspace/Lucene-Solr-master-Solaris/solr/build/solr-core/test/J0/temp/solr.cloud.DistribDocExpirationUpdateProcessorTest_1C3BD10017CBEAE7-001/control-001/lib
   [junit4]   2> 49751 INFO  (TEST-DistribDocExpirationUpdateProcessorTest.test-seed#[1C3BD10017CBEAE7]) [    ] o.a.s.h.c.HttpShardHandlerFactory created with socketTimeout : 90000,urlScheme : ,connTimeout : 15000,maxConnectionsPerHost : 20,maxConnections : 10000,corePoolSize : 0,maximumPoolSize : 2147483647,maxThreadIdleTime : 5,sizeOfQueue : -1,fairnessPolicy : false,useRetries : false,
   [junit4]   2> 49752 INFO  (TEST-DistribDocExpirationUpdateProcessorTest.test-seed#[1C3BD10017CBEAE7]) [    ] o.a.s.u.UpdateShardHandler Creating UpdateShardHandler HTTP client with params: socketTimeout=340000&connTimeout=45000&retry=true
   [junit4]   2> 49753 INFO  (TEST-DistribDocExpirationUpdateProcessorTest.test-seed#[1C3BD10017CBEAE7]) [    ] o.a.s.l.LogWatcher SLF4J impl is org.slf4j.impl.Log4jLoggerFactory
   [junit4]   2> 49753 INFO  (TEST-DistribDocExpirationUpdateProcessorTest.test-seed#[1C3BD10017CBEAE7]) [    ] o.a.s.l.LogWatcher Registering Log Listener [Log4j (org.slf4j.impl.Log4jLoggerFactory)]
   [junit4]   2> 49753 INFO  (TEST-DistribDocExpirationUpdateProcessorTest.test-seed#[1C3BD10017CBEAE7]) [    ] o.a.s.c.ZkContainer Zookeeper client=127.0.0.1:43203/solr
   [junit4]   2> 49753 INFO  (TEST-DistribDocExpirationUpdateProcessorTest.test-seed#[1C3BD10017CBEAE7]) [    ] o.a.s.c.ZkController zkHost includes chroot
   [junit4]   2> 49753 INFO  (TEST-DistribDocExpirationUpdateProcessorTest.test-seed#[1C3BD10017CBEAE7]) [    ] o.a.s.c.c.SolrZkClient Using default ZkCredentialsProvider
   [junit4]   2> 49754 INFO  (TEST-DistribDocExpirationUpdateProcessorTest.test-seed#[1C3BD10017CBEAE7]) [    ] o.a.s.c.c.ConnectionManager Waiting for client to connect to ZooKeeper
   [junit4]   2> 49775 INFO  (zkCallback-43-thread-1) [    ] o.a.s.c.c.ConnectionManager Watcher org.apache.solr.common.cloud.ConnectionManager@1843c2ab name:ZooKeeperConnection Watcher:127.0.0.1:43203 got event WatchedEvent state:SyncConnected type:None path:null path:null type:None
   [junit4]   2> 49776 INFO  (TEST-DistribDocExpirationUpdateProcessorTest.test-seed#[1C3BD10017CBEAE7]) [    ] o.a.s.c.c.ConnectionManager Client is connected to ZooKeeper
   [junit4]   2> 49777 INFO  (TEST-DistribDocExpirationUpdateProcessorTest.test-seed#[1C3BD10017CBEAE7]) [    ] o.a.s.c.c.SolrZkClient Using default ZkACLProvider
   [junit4]   2> 49787 INFO  (TEST-DistribDocExpirationUpdateProcessorTest.test-seed#[1C3BD10017CBEAE7]) [n:127.0.0.1:63098_bcab%2Fqk    ] o.a.s.c.c.ConnectionManager Waiting for client to connect to ZooKeeper
   [junit4]   2> 49794 INFO  (zkCallback-44-thread-1-processing-n:127.0.0.1:63098_bcab%2Fqk) [n:127.0.0.1:63098_bcab%2Fqk    ] o.a.s.c.c.ConnectionManager Watcher org.apache.solr.common.cloud.ConnectionManager@4741fd1d name:ZooKeeperConnection Watcher:127.0.0.1:43203/solr got event WatchedEvent state:SyncConnected type:None path:null path:null type:None
   [junit4]   2> 49795 INFO  (TEST-DistribDocExpirationUpdateProcessorTest.test-seed#[1C3BD10017CBEAE7]) [n:127.0.0.1:63098_bcab%2Fqk    ] o.a.s.c.c.ConnectionManager Client is connected to ZooKeeper
   [junit4]   2> 49810 INFO  (TEST-DistribDocExpirationUpdateProcessorTest.test-seed#[1C3BD10017CBEAE7]) [n:127.0.0.1:63098_bcab%2Fqk    ] o.a.s.c.c.SolrZkClient makePath: /overseer/queue
   [junit4]   2> 49820 INFO  (TEST-DistribDocExpirationUpdateProcessorTest.test-seed#[1C3BD10017CBEAE7]) [n:127.0.0.1:63098_bcab%2Fqk    ] o.a.s.c.c.SolrZkClient makePath: /overseer/collection-queue-work
   [junit4]   2> 49827 INFO  (TEST-DistribDocExpirationUpdateProcessorTest.test-seed#[1C3BD10017CBEAE7]) [n:127.0.0.1:63098_bcab%2Fqk    ] o.a.s.c.c.SolrZkClient makePath: /overseer/collection-map-running
   [junit4]   2> 49830 INFO  (TEST-DistribDocExpirationUpdateProcessorTest.test-seed#[1C3BD10017CBEAE7]) [n:127.0.0.1:63098_bcab%2Fqk    ] o.a.s.c.c.SolrZkClient makePath: /overseer/collection-map-completed
   [junit4]   2> 49834 INFO  (TEST-DistribDocExpirationUpdateProcessorTest.test-seed#[1C3BD10017CBEAE7]) [n:127.0.0.1:63098_bcab%2Fqk    ] o.a.s.c.c.SolrZkClient makePath: /overseer/collection-map-failure
   [junit4]   2> 49837 INFO  (TEST-DistribDocExpirationUpdateProcessorTest.test-seed#[1C3BD10017CBEAE7]) [n:127.0.0.1:63098_bcab%2Fqk    ] o.a.s.c.c.SolrZkClient makePath: /live_nodes
   [junit4]   2> 49840 INFO  (TEST-DistribDocExpirationUpdateProcessorTest.test-seed#[1C3BD10017CBEAE7]) [n:127.0.0.1:63098_bcab%2Fqk    ] o.a.s.c.c.SolrZkClient makePath: /aliases.json
   [junit4]   2> 49842 INFO  (TEST-DistribDocExpirationUpdateProcessorTest.test-seed#[1C3BD10017CBEAE7]) [n:127.0.0.1:63098_bcab%2Fqk    ] o.a.s.c.c.SolrZkClient makePath: /clusterstate.json
   [junit4]   2> 49845 INFO  (TEST-DistribDocExpirationUpdateProcessorTest.test-seed#[1C3BD10017CBEAE7]) [n:127.0.0.1:63098_bcab%2Fqk    ] o.a.s.c.c.SolrZkClient makePath: /security.json
   [junit4]   2> 49847 INFO  (TEST-DistribDocExpirationUpdateProcessorTest.test-seed#[1C3BD10017CBEAE7]) [n:127.0.0.1:63098_bcab%2Fqk    ] o.a.s.c.c.ZkStateReader Updating cluster state from ZooKeeper... 
   [junit4]   2> 49849 INFO  (TEST-DistribDocExpirationUpdateProcessorTest.test-seed#[1C3BD10017CBEAE7]) [n:127.0.0.1:63098_bcab%2Fqk    ] o.a.s.c.c.ZkStateReader Updated live nodes from ZooKeeper... (0) -> (0)
   [junit4]   2> 49852 INFO  (TEST-DistribDocExpirationUpdateProcessorTest.test-seed#[1C3BD10017CBEAE7]) [n:127.0.0.1:63098_bcab%2Fqk    ] o.a.s.c.c.SolrZkClient makePath: /overseer_elect
   [junit4]   2> 49855 INFO  (TEST-DistribDocExpirationUpdateProcessorTest.test-seed#[1C3BD10017CBEAE7]) [n:127.0.0.1:63098_bcab%2Fqk    ] o.a.s.c.c.SolrZkClient makePath: /overseer_elect/election
   [junit4]   2> 49857 INFO  (TEST-DistribDocExpirationUpdateProcessorTest.test-seed#[1C3BD10017CBEAE7]) [n:127.0.0.1:63098_bcab%2Fqk    ] o.a.s.c.Overseer Overseer (id=null) closing
   [junit4]   2> 49858 INFO  (TEST-DistribDocExpirationUpdateProcessorTest.test-seed#[1C3BD10017CBEAE7]) [n:127.0.0.1:63098_bcab%2Fqk    ] o.a.s.c.LeaderElector Joined leadership election with path: /overseer_elect/election/95572352196280324-127.0.0.1:63098_bcab%2Fqk-n_0000000000
   [junit4]   2> 49859 INFO  (TEST-DistribDocExpirationUpdateProcessorTest.test-seed#[1C3BD10017CBEAE7]) [n:127.0.0.1:63098_bcab%2Fqk    ] o.a.s.c.OverseerElectionContext I am going to be the leader 127.0.0.1:63098_bcab%2Fqk
   [junit4]   2> 49859 INFO  (TEST-DistribDocExpirationUpdateProcessorTest.test-seed#[1C3BD10017CBEAE7]) [n:127.0.0.1:63098_bcab%2Fqk    ] o.a.s.c.c.SolrZkClient makePath: /overseer_elect/leader
   [junit4]   2> 49862 INFO  (TEST-DistribDocExpirationUpdateProcessorTest.test-seed#[1C3BD10017CBEAE7]) [n:127.0.0.1:63098_bcab%2Fqk    ] o.a.s.c.Overseer Overseer (id=95572352196280324-127.0.0.1:63098_bcab%2Fqk-n_0000000000) starting
   [junit4]   2> 49865 INFO  (TEST-DistribDocExpirationUpdateProcessorTest.test-seed#[1C3BD10017CBEAE7]) [n:127.0.0.1:63098_bcab%2Fqk    ] o.a.s.c.c.SolrZkClient makePath: /overseer/queue-work
   [junit4]   2> 49876 INFO  (TEST-DistribDocExpirationUpdateProcessorTest.test-seed#[1C3BD10017CBEAE7]) [n:127.0.0.1:63098_bcab%2Fqk    ] o.a.s.c.OverseerAutoReplicaFailoverThread Starting OverseerAutoReplicaFailoverThread autoReplicaFailoverWorkLoopDelay=10000 autoReplicaFailoverWaitAfterExpiration=30000 autoReplicaFailoverBadNodeExpiration=60000
   [junit4]   2> 49878 INFO  (OverseerCollectionConfigSetProcessor-95572352196280324-127.0.0.1:63098_bcab%2Fqk-n_0000000000) [n:127.0.0.1:63098_bcab%2Fqk    ] o.a.s.c.OverseerTaskProcessor Process current queue of overseer operations
   [junit4]   2> 49878 INFO  (TEST-DistribDocExpirationUpdateProcessorTest.test-seed#[1C3BD10017CBEAE7]) [n:127.0.0.1:63098_bcab%2Fqk    ] o.a.s.c.ZkController Register node as live in ZooKeeper:/live_nodes/127.0.0.1:63098_bcab%2Fqk
   [junit4]   2> 49879 INFO  (OverseerStateUpdate-95572352196280324-127.0.0.1:63098_bcab%2Fqk-n_0000000000) [n:127.0.0.1:63098_bcab%2Fqk    ] o.a.s.c.Overseer Starting to work on the main queue
   [junit4]   2> 49880 INFO  (TEST-DistribDocExpirationUpdateProcessorTest.test-seed#[1C3BD10017CBEAE7]) [n:127.0.0.1:63098_bcab%2Fqk    ] o.a.s.c.c.SolrZkClient makePath: /live_nodes/127.0.0.1:63098_bcab%2Fqk
   [junit4]   2> 49882 INFO  (zkCallback-44-thread-1-processing-n:127.0.0.1:63098_bcab%2Fqk) [n:127.0.0.1:63098_bcab%2Fqk    ] o.a.s.c.c.ZkStateReader A live node change: [WatchedEvent state:SyncConnected type:NodeChildrenChanged path:/live_nodes], has occurred - updating... (live nodes size: [0])
   [junit4]   2> 49882 INFO  (OverseerStateUpdate-95572352196280324-127.0.0.1:63098_bcab%2Fqk-n_0000000000) [n:127.0.0.1:63098_bcab%2Fqk    ] o.a.s.c.c.ZkStateReader Updated live nodes from ZooKeeper... (0) -> (1)
   [junit4]   2> 49883 INFO  (zkCallback-44-thread-1-processing-n:127.0.0.1:63098_bcab%2Fqk) [n:127.0.0.1:63098_bcab%2Fqk    ] o.a.s.c.c.ZkStateReader Updated live nodes from ZooKeeper... (1) -> (1)
   [junit4]   2> 49916 INFO  (TEST-DistribDocExpirationUpdateProcessorTest.test-seed#[1C3BD10017CBEAE7]) [n:127.0.0.1:63098_bcab%2Fqk    ] o.a.s.c.CoreContainer Security conf doesn't exist. Skipping setup for authorization module.
   [junit4]   2> 49916 INFO  (TEST-DistribDocExpirationUpdateProcessorTest.test-seed#[1C3BD10017CBEAE7]) [n:127.0.0.1:63098_bcab%2Fqk    ] o.a.s.c.CoreContainer No authentication plugin used.
   [junit4]   2> 49917 INFO  (TEST-DistribDocExpirationUpdateProcessorTest.test-seed#[1C3BD10017CBEAE7]) [n:127.0.0.1:63098_bcab%2Fqk    ] o.a.s.c.CorePropertiesLocator Looking for core definitions underneath /export/home/jenkins/workspace/Lucene-Solr-master-Solaris/solr/build/solr-core/test/J0/temp/solr.cloud.DistribDocExpirationUpdateProcessorTest_1C3BD10017CBEAE7-001/control-001/cores
   [junit4]   2> 49919 INFO  (TEST-DistribDocExpirationUpdateProcessorTest.test-seed#[1C3BD10017CBEAE7]) [n:127.0.0.1:63098_bcab%2Fqk    ] o.a.s.c.CoreDescriptor Created CoreDescriptor: {name=collection1, config=solrconfig.xml, transient=false, schema=schema.xml, loadOnStartup=true, configSetProperties=configsetprops.json, collection=control_collection, coreNodeName=, dataDir=data/, shard=}
   [junit4]   2> 49920 INFO  (TEST-DistribDocExpirationUpdateProcessorTest.test-seed#[1C3BD10017CBEAE7]) [n:127.0.0.1:63098_bcab%2Fqk    ] o.a.s.c.CorePropertiesLocator Found core collection1 in /export/home/jenkins/workspace/Lucene-Solr-master-Solaris/solr/build/solr-core/test/J0/temp/solr.cloud.DistribDocExpirationUpdateProcessorTest_1C3BD10017CBEAE7-001/control-001/cores/collection1
   [junit4]   2> 49920 INFO  (TEST-DistribDocExpirationUpdateProcessorTest.test-seed#[1C3BD10017CBEAE7]) [n:127.0.0.1:63098_bcab%2Fqk    ] o.a.s.c.CorePropertiesLocator Found 1 core definitions
   [junit4]   2> 49923 INFO  (TEST-DistribDocExpirationUpdateProcessorTest.test-seed#[1C3BD10017CBEAE7]) [n:127.0.0.1:63098_bcab%2Fqk    ] o.a.s.s.SolrDispatchFilter user.dir=/export/home/jenkins/workspace/Lucene-Solr-master-Solaris/solr/build/solr-core/test/J0
   [junit4]   2> 49923 INFO  (TEST-DistribDocExpirationUpdateProcessorTest.test-seed#[1C3BD10017CBEAE7]) [n:127.0.0.1:63098_bcab%2Fqk    ] o.a.s.s.SolrDispatchFilter SolrDispatchFilter.init() done
   [junit4]   2> 49928 INFO  (coreLoadExecutor-157-thread-1-processing-n:127.0.0.1:63098_bcab%2Fqk) [n:127.0.0.1:63098_bcab%2Fqk c:control_collection   x:collection1] o.a.s.c.ZkController publishing state=down
   [junit4]   2> 49928 INFO  (coreLoadExecutor-157-thread-1-processing-n:127.0.0.1:63098_bcab%2Fqk) [n:127.0.0.1:63098_bcab%2Fqk c:control_collection   x:collection1] o.a.s.c.ZkController numShards not found on descriptor - reading it from system property
   [junit4]   2> 49934 INFO  (OverseerStateUpdate-95572352196280324-127.0.0.1:63098_bcab%2Fqk-n_0000000000) [n:127.0.0.1:63098_bcab%2Fqk    ] o.a.s.c.Overseer processMessage: queueSize: 1, message = {
   [junit4]   2>   "core":"collection1",
   [junit4]   2>   "roles":null,
   [junit4]   2>   "base_url":"http://127.0.0.1:63098/bcab/qk",
   [junit4]   2>   "node_name":"127.0.0.1:63098_bcab%2Fqk",
   [junit4]   2>   "numShards":"1",
   [junit4]   2>   "state":"down",
   [junit4]   2>   "shard":null,
   [junit4]   2>   "collection":"control_collection",
   [junit4]   2>   "operation":"state"} current state version: 0
   [junit4]   2> 49935 INFO  (OverseerStateUpdate-95572352196280324-127.0.0.1:63098_bcab%2Fqk-n_0000000000) [n:127.0.0.1:63098_bcab%2Fqk    ] o.a.s.c.o.ReplicaMutator Update state numShards=1 message={
   [junit4]   2>   "core":"collection1",
   [junit4]   2>   "roles":null,
   [junit4]   2>   "base_url":"http://127.0.0.1:63098/bcab/qk",
   [junit4]   2>   "node_name":"127.0.0.1:63098_bcab%2Fqk",
   [junit4]   2>   "numShards":"1",
   [junit4]   2>   "state":"down",
   [junit4]   2>   "shard":null,
   [junit4]   2>   "collection":"control_collection",
   [junit4]   2>   "operation":"state"}
   [junit4]   2> 49935 INFO  (coreLoadExecutor-157-thread-1-processing-n:127.0.0.1:63098_bcab%2Fqk) [n:127.0.0.1:63098_bcab%2Fqk c:control_collection   x:collection1] o.a.s.c.ZkController look for our core node name
   [junit4]   2> 49935 INFO  (OverseerStateUpdate-95572352196280324-127.0.0.1:63098_bcab%2Fqk-n_0000000000) [n:127.0.0.1:63098_bcab%2Fqk    ] o.a.s.c.o.ClusterStateMutator building a new cName: control_collection
   [junit4]   2> 49937 INFO  (OverseerStateUpdate-95572352196280324-127.0.0.1:63098_bcab%2Fqk-n_0000000000) [n:127.0.0.1:63098_bcab%2Fqk    ] o.a.s.c.o.ReplicaMutator Assigning new node to shard shard=shard1
   [junit4]   2> 49942 INFO  (zkCallback-44-thread-1-processing-n:127.0.0.1:63098_bcab%2Fqk) [n:127.0.0.1:63098_bcab%2Fqk    ] o.a.s.c.c.ZkStateReader A cluster state change: [WatchedEvent state:SyncConnected type:NodeDataChanged path:/clusterstate.json], has occurred - updating... (live nodes size: [1])
   [junit4]   2> 50937 INFO  (coreLoadExecutor-157-thread-1-processing-n:127.0.0.1:63098_bcab%2Fqk) [n:127.0.0.1:63098_bcab%2Fqk c:control_collection   x:collection1] o.a.s.c.ZkController waiting to find shard id in clusterstate for collection1
   [junit4]   2> 50937 INFO  (coreLoadExecutor-157-thread-1-processing-n:127.0.0.1:63098_bcab%2Fqk) [n:127.0.0.1:63098_bcab%2Fqk c:control_collection   x:collection1] o.a.s.c.ZkController Check for collection zkNode:control_collection
   [junit4]   2> 50938 INFO  (coreLoadExecutor-157-thread-1-processing-n:127.0.0.1:63098_bcab%2Fqk) [n:127.0.0.1:63098_bcab%2Fqk c:control_collection   x:collection1] o.a.s.c.ZkController Collection zkNode exists
   [junit4]   2> 50938 INFO  (coreLoadExecutor-157-thread-1-processing-n:127.0.0.1:63098_bcab%2Fqk) [n:127.0.0.1:63098_bcab%2Fqk c:control_collection   x:collection1] o.a.s.c.c.ZkStateReader Load collection config from: [/collections/control_collection]
   [junit4]   2> 50939 INFO  (coreLoadExecutor-157-thread-1-processing-n:127.0.0.1:63098_bcab%2Fqk) [n:127.0.0.1:63098_bcab%2Fqk c:control_collection   x:collection1] o.a.s.c.c.ZkStateReader path=[/collections/control_collection] [configName]=[conf1] specified config exists in ZooKeeper
   [junit4]   2> 50939 INFO  (coreLoadExecutor-157-thread-1-processing-n:127.0.0.1:63098_bcab%2Fqk) [n:127.0.0.1:63098_bcab%2Fqk c:control_collection   x:collection1] o.a.s.c.SolrResourceLoader new SolrResourceLoader for directory: '/export/home/jenkins/workspace/Lucene-Solr-master-Solaris/solr/build/solr-core/test/J0/temp/solr.cloud.DistribDocExpirationUpdateProcessorTest_1C3BD10017CBEAE7-001/control-001/cores/collection1'
   [junit4]   2> 50939 INFO  (coreLoadExecutor-157-thread-1-processing-n:127.0.0.1:63098_bcab%2Fqk) [n:127.0.0.1:63098_bcab%2Fqk c:control_collection   x:collection1] o.a.s.c.SolrResourceLoader JNDI not configured for solr (NoInitialContextEx)
   [junit4]   2> 50939 INFO  (coreLoadExecutor-157-thread-1-processing-n:127.0.0.1:63098_bcab%2Fqk) [n:127.0.0.1:63098_bcab%2Fqk c:control_collection   x:collection1] o.a.s.c.SolrResourceLoader solr home defaulted to 'solr/' (could not find system property or JNDI)
   [junit4]   2> 50941 INFO  (coreLoadExecutor-157-thread-1-processing-n:127.0.0.1:63098_bcab%2Fqk) [n:127.0.0.1:63098_bcab%2Fqk c:control_collection   x:collection1] o.a.s.c.Config loaded config solrconfig.xml with version 0 
   [junit4]   2> 50951 INFO  (coreLoadExecutor-157-thread-1-processing-n:127.0.0.1:63098_bcab%2Fqk) [n:127.0.0.1:63098_bcab%2Fqk c:control_collection   x:collection1] o.a.s.c.SolrConfig current version of requestparams : -1
   [junit4]   2> 50954 WARN  (coreLoadExecutor-157-thread-1-processing-n:127.0.0.1:63098_bcab%2Fqk) [n:127.0.0.1:63098_bcab%2Fqk c:control_collection   x:collection1] o.a.s.c.Config Beginning with Solr 5.5, <mergePolicy> is deprecated, use <mergePolicyFactory> instead.
   [junit4]   2> 50954 INFO  (coreLoadExecutor-157-thread-1-processing-n:127.0.0.1:63098_bcab%2Fqk) [n:127.0.0.1:63098_bcab%2Fqk c:control_collection   x:collection1] o.a.s.c.SolrConfig Using Lucene MatchVersion: 7.0.0
   [junit4]   2> 50961 INFO  (coreLoadExecutor-157-thread-1-processing-n:127.0.0.1:63098_bcab%2Fqk) [n:127.0.0.1:63098_bcab%2Fqk c:control_collection   x:collection1] o.a.s.c.SolrConfig Loaded SolrConfig: solrconfig.xml
   [junit4]   2> 50970 INFO  (coreLoadExecutor-157-thread-1-processing-n:127.0.0.1:63098_bcab%2Fqk) [n:127.0.0.1:63098_bcab%2Fqk c:control_collection   x:collection1] o.a.s.s.IndexSchema [collection1] Schema name=test
   [junit4]   2> 51060 INFO  (coreLoadExecutor-157-thread-1-processing-n:127.0.0.1:63098_bcab%2Fqk) [n:127.0.0.1:63098_bcab%2Fqk c:control_collection   x:collection1] o.a.s.s.IndexSchema default search field in schema is text
   [junit4]   2> 51061 INFO  (coreLoadExecutor-157-thread-1-processing-n:127.0.0.1:63098_bcab%2Fqk) [n:127.0.0.1:63098_bcab%2Fqk c:control_collection   x:collection1] o.a.s.s.IndexSchema unique key field: id
   [junit4]   2> 51062 INFO  (coreLoadExecutor-157-thread-1-processing-n:127.0.0.1:63098_bcab%2Fqk) [n:127.0.0.1:63098_bcab%2Fqk c:control_collection   x:collection1] o.a.s.s.FileExchangeRateProvider Reloading exchange rates from file currency.xml
   [junit4]   2> 51066 INFO  (coreLoadExecutor-157-thread-1-processing-n:127.0.0.1:63098_bcab%2Fqk) [n:127.0.0.1:63098_bcab%2Fqk c:control_collection   x:collection1] o.a.s.s.FileExchangeRateProvider Reloading exchange rates from file currency.xml
   [junit4]   2> 51095 INFO  (coreLoadExecutor-157-thread-1-processing-n:127.0.0.1:63098_bcab%2Fqk) [n:127.0.0.1:63098_bcab%2Fqk c:control_collection   x:collection1] o.a.s.c.ConfigSetProperties Did not find ConfigSet properties, assuming default properties: Can't find resource 'configsetprops.json' in classpath or '/configs/conf1', cwd=/export/home/jenkins/workspace/Lucene-Solr-master-Solaris/solr/build/solr-core/test/J0
   [junit4]   2> 51095 INFO  (coreLoadExecutor-157-thread-1-processing-n:127.0.0.1:63098_bcab%2Fqk) [n:127.0.0.1:63098_bcab%2Fqk c:control_collection   x:collection1] o.a.s.c.CoreContainer Creating SolrCore 'collection1' using configuration from collection control_collection
   [junit4]   2> 51096 INFO  (coreLoadExecutor-157-thread-1-processing-n:127.0.0.1:63098_bcab%2Fqk) [n:127.0.0.1:63098_bcab%2Fqk c:control_collection s:shard1 r:core_node1 x:collection1] o.a.s.c.SolrCore org.apache.solr.core.MockDirectoryFactory
   [junit4]   2> 51096 INFO  (coreLoadExecutor-157-thread-1-processing-n:127.0.0.1:63098_bcab%2Fqk) [n:127.0.0.1:63098_bcab%2Fqk c:control_collection s:shard1 r:core_node1 x:collection1] o.a.s.c.SolrCore [[collection1] ] Opening new SolrCore at [/export/home/jenkins/workspace/Lucene-Solr-master-Solaris/solr/build/solr-core/test/J0/temp/solr.cloud.DistribDocExpirationUpdateProcessorTest_1C3BD10017CBEAE7-001/control-001/cores/collection1], dataDir=[/export/home/jenkins/workspace/Lucene-Solr-master-Solaris/solr/build/solr-core/test/J0/temp/solr.cloud.DistribDocExpirationUpdateProcessorTest_1C3BD10017CBEAE7-001/control-001/cores/collection1/data/]
   [junit4]   2> 51096 INFO  (coreLoadExecutor-157-thread-1-processing-n:127.0.0.1:63098_bcab%2Fqk) [n:127.0.0.1:63098_bcab%2Fqk c:control_collection s:shard1 r:core_node1 x:collection1] o.a.s.c.SolrCore JMX monitoring not detected for core: collection1
   [junit4]   2> 51097 INFO  (coreLoadExecutor-157-thread-1-processing-n:127.0.0.1:63098_bcab%2Fqk) [n:127.0.0.1:63098_bcab%2Fqk c:control_collection s:shard1 r:core_node1 x:collection1] o.a.s.c.CachingDirectoryFactory return new directory for /export/home/jenkins/workspace/Lucene-Solr-master-Solaris/solr/build/solr-core/test/J0/temp/solr.cloud.DistribDocExpirationUpdateProcessorTest_1C3BD10017CBEAE7-001/control-001/cores/collection1/data
   [junit4]   2> 51097 INFO  (coreLoadExecutor-157-thread-1-processing-n:127.0.0.1:63098_bcab%2Fqk) [n:127.0.0.1:63098_bcab%2Fqk c:control_collection s:shard1 r:core_node1 x:collection1] o.a.s.c.SolrCore New index directory detected: old=null new=/export/home/jenkins/workspace/Lucene-Solr-master-Solaris/solr/build/solr-core/test/J0/temp/solr.cloud.DistribDocExpirationUpdateProcessorTest_1C3BD10017CBEAE7-001/control-001/cores/collection1/data/index/
   [junit4]   2> 51097 WARN  (coreLoadExecutor-157-thread-1-processing-n:127.0.0.1:63098_bcab%2Fqk) [n:127.0.0.1:63098_bcab%2Fqk c:control_collection s:shard1 r:core_node1 x:collection1] o.a.s.c.SolrCore [collection1] Solr index directory '/export/home/jenkins/workspace/Lucene-Solr-master-Solaris/solr/build/solr-core/test/J0/temp/solr.cloud.DistribDocExpirationUpdateProcessorTest_1C3BD10017CBEAE7-001/control-001/cores/collection1/data/index' doesn't exist. Creating new index...
   [junit4]   2> 51097 INFO  (coreLoadExecutor-157-thread-1-processing-n:127.0.0.1:63098_bcab%2Fqk) [n:127.0.0.1:63098_bcab%2Fqk c:control_collection s:shard1 r:core_node1 x:collection1] o.a.s.c.CachingDirectoryFactory return new directory for /export/home/jenkins/workspace/Lucene-Solr-master-Solaris/solr/build/solr-core/test/J0/temp/solr.cloud.DistribDocExpirationUpdateProcessorTest_1C3BD10017CBEAE7-001/control-001/cores/collection1/data/index
   [junit4]   2> 51097 INFO  (coreLoadExecutor-157-thread-1-processing-n:127.0.0.1:63098_bcab%2Fqk) [n:127.0.0.1:63098_bcab%2Fqk c:control_collection s:shard1 r:core_node1 x:collection1] o.a.s.u.RandomMergePolicy RandomMergePolicy wrapping class org.apache.lucene.index.TieredMergePolicy: [TieredMergePolicy: maxMergeAtOnce=39, maxMergeAtOnceExplicit=20, maxMergedSegmentMB=79.369140625, floorSegmentMB=0.22265625, forceMergeDeletesPctAllowed=18.280195644241356, segmentsPerTier=40.0, maxCFSSegmentSizeMB=8.796093022207999E12, noCFSRatio=0.0
   [junit4]   2> 51097 INFO  (coreLoadExecutor-157-thread-1-processing-n:127.0.0.1:63098_bcab%2Fqk) [n:127.0.0.1:63098_bcab%2Fqk c:control_collection s:shard1 r:core_node1 x:collection1] o.a.s.c.SolrDeletionPolicy SolrDeletionPolicy.onCommit: commits: num=1
   [junit4]   2> 	commit{dir=MockDirectoryWrapper(RAMDirectory@7d5c1df7 lockFactory=org.apache.lucene.store.SingleInstanceLockFactory@203bbdf0),segFN=segments_1,generation=1}
   [junit4]   2> 51098 INFO  (coreLoadExecutor-157-thread-1-processing-n:127.0.0.1:63098_bcab%2Fqk) [n:127.0.0.1:63098_bcab%2Fqk c:control_collection s:shard1 r:core_node1 x:collection1] o.a.s.c.SolrDeletionPolicy newest commit generation = 1
   [junit4]   2> 51098 INFO  (OldIndexDirectoryCleanupThreadForCore-collection1) [n:127.0.0.1:63098_bcab%2Fqk c:control_collection s:shard1 r:core_node1 x:collection1] o.a.s.c.SolrCore Looking for old index directories to cleanup for core collection1 in /export/home/jenkins/workspace/Lucene-Solr-master-Solaris/solr/build/solr-core/test/J0/temp/solr.cloud.DistribDocExpirationUpdateProcessorTest_1C3BD10017CBEAE7-001/control-001/cores/collection1/data/
   [junit4]   2> 51099 WARN  (OldIndexDirectoryCleanupThreadForCore-collection1) [n:127.0.0.1:63098_bcab%2Fqk c:control_collection s:shard1 r:core_node1 x:collection1] o.a.s.c.DirectoryFactory /export/home/jenkins/workspace/Lucene-Solr-master-Solaris/solr/build/solr-core/test/J0/temp/solr.cloud.DistribDocExpirationUpdateProcessorTest_1C3BD10017CBEAE7-001/control-001/cores/collection1/data/ does not point to a valid data directory; skipping clean-up of old index directories.
   [junit4]   2> 51101 INFO  (coreLoadExecutor-157-thread-1-processing-n:127.0.0.1:63098_bcab%2Fqk) [n:127.0.0.1:63098_bcab%2Fqk c:control_collection s:shard1 r:core_node1 x:collection1] o.a.s.u.p.UpdateRequestProcessorChain creating updateRequestProcessorChain "convert-ttl-defaults"
   [junit4]   2> 51111 INFO  (coreLoadExecutor-157-thread-1-processing-n:127.0.0.1:63098_bcab%2Fqk) [n:127.0.0.1:63098_bcab%2Fqk c:control_collection s:shard1 r:core_node1 x:collection1] o.a.s.u.p.UpdateRequestProcessorChain creating updateRequestProcessorChain "convert-ttl-field"
   [junit4]   2> 51122 INFO  (coreLoadExecutor-157-thread-1-processing-n:127.0.0.1:63098_bcab%2Fqk) [n:127.0.0.1:63098_bcab%2Fqk c:control_collection s:shard1 r:core_node1 x:collection1] o.a.s.u.p.UpdateRequestProcessorChain creating updateRequestProcessorChain "convert-ttl-param"
   [junit4]   2> 51122 INFO  (coreLoadExecutor-157-thread-1-processing-n:127.0.0.1:63098_bcab%2Fqk) [n:127.0.0.1:63098_bcab%2Fqk c:control_collection s:shard1 r:core_node1 x:collection1] o.a.s.u.p.UpdateRequestProcessorChain creating updateRequestProcessorChain "convert-ttl-field-with-param-default"
   [junit4]   2> 51122 INFO  (coreLoadExecutor-157-thread-1-processing-n:127.0.0.1:63098_bcab%2Fqk) [n:127.0.0.1:63098_bcab%2Fqk c:control_collection s:shard1 r:core_node1 x:collection1] o.a.s.u.p.UpdateRequestProcessorChain creating updateRequestProcessorChain "scheduled-delete" (default)
   [junit4]   2> 51139 INFO  (coreLoadExecutor-157-thread-1-processing-n:127.0.0.1:63098_bcab%2Fqk) [n:127.0.0.1:63098_bcab%2Fqk c:control_collection s:shard1 r:core_node1 x:collection1] o.a.s.u.p.UpdateRequestProcessorChain inserting DistributedUpdateProcessorFactory into updateRequestProcessorChain "scheduled-delete" (default)
   [junit4]   2> 51142 INFO  (coreLoadExecutor-157-thread-1-processing-n:127.0.0.1:63098_bcab%2Fqk) [n:127.0.0.1:63098_bcab%2Fqk c:control_collection s:shard1 r:core_node1 x:collection1] o.a.s.h.l.XMLLoader xsltCacheLifetimeSeconds=60
   [junit4]   2> 51143 INFO  (coreLoadExecutor-157-thread-1-processing-n:127.0.0.1:63098_bcab%2Fqk) [n:127.0.0.1:63098_bcab%2Fqk c:control_collection s:shard1 r:core_node1 x:collection1] o.a.s.h.l.XMLLoader xsltCacheLifetimeSeconds=60
   [junit4]   2> 51144 INFO  (coreLoadExecutor-157-thread-1-processing-n:127.0.0.1:63098_bcab%2Fqk) [n:127.0.0.1:63098_bcab%2Fqk c:control_collection s:shard1 r:core_node1 x:collection1] o.a.s.h.l.XMLLoader xsltCacheLifetimeSeconds=60
   [junit4]   2> 51145 INFO  (coreLoadExecutor-157-thread-1-processing-n:127.0.0.1:63098_bcab%2Fqk) [n:127.0.0.1:63098_bcab%2Fqk c:control_collection s:shard1 r:core_node1 x:collection1] o.a.s.h.l.XMLLoader xsltCacheLifetimeSeconds=60
   [junit4]   2> 51147 INFO  (coreLoadExecutor-157-thread-1-processing-n:127.0.0.1:63098_bcab%2Fqk) [n:127.0.0.1:63098_bcab%2Fqk c:control_collection s:shard1 r:core_node1 x:collection1] o.a.s.c.RequestHandlers Registered paths: /admin/mbeans,,/update/csv,/sql,/update/json/docs,/admin/luke,/export,/select,/admin/segments,/get,/admin/system,/replication,/admin/properties,/config,/stream,/schema,/admin/plugins,/admin/logging,/update/json,/admin/ping,/admin/threads,/update,/admin/file
   [junit4]   2> 51147 INFO  (coreLoadExecutor-157-thread-1-processing-n:127.0.0.1:63098_bcab%2Fqk) [n:127.0.0.1:63098_bcab%2Fqk c:control_collection s:shard1 r:core_node1 x:collection1] o.a.s.c.SolrCore Using default statsCache cache: org.apache.solr.search.stats.LocalStatsCache
   [junit4]   2> 51147 INFO  (coreLoadExecutor-157-thread-1-processing-n:127.0.0.1:63098_bcab%2Fqk) [n:127.0.0.1:63098_bcab%2Fqk c:control_collection s:shard1 r:core_node1 x:collection1] o.a.s.u.UpdateHandler Using UpdateLog implementation: org.apache.solr.update.UpdateLog
   [junit4]   2> 51147 INFO  (coreLoadExecutor-157-thread-1-processing-n:127.0.0.1:63098_bcab%2Fqk) [n:127.0.0.1:63098_bcab%2Fqk c:control_collection s:shard1 r:core_node1 x:collection1] o.a.s.u.UpdateLog Initializing UpdateLog: dataDir= defaultSyncLevel=FLUSH numRecordsToKeep=100 maxNumLogsToKeep=10 numVersionBuckets=65536
   [junit4]   2> 51148 INFO  (coreLoadExecutor-157-thread-1-processing-n:127.0.0.1:63098_bcab%2Fqk) [n:127.0.0.1:63098_bcab%2Fqk c:control_collection s:shard1 r:core_node1 x:collection1] o.a.s.u.CommitTracker Hard AutoCommit: disabled
   [junit4]   2> 51148 INFO  (coreLoadExecutor-157-thread-1-processing-n:127.0.0.1:63098_bcab%2Fqk) [n:127.0.0.1:63098_bcab%2Fqk c:control_collection s:shard1 r:core_node1 x:collection1] o.a.s.u.CommitTracker Soft AutoCommit: disabled
   [junit4]   2> 51148 INFO  (coreLoadExecutor-157-thread-1-processing-n:127.0.0.1:63098_bcab%2Fqk) [n:127.0.0.1:63098_bcab%2Fqk c:control_collection s:shard1 r:core_node1 x:collection1] o.a.s.u.RandomMergePolicy RandomMergePolicy wrapping class org.apache.lucene.index.LogDocMergePolicy: [LogDocMergePolicy: minMergeSize=1000, mergeFactor=31, maxMergeSize=9223372036854775807, maxMergeSizeForForcedMerge=9223372036854775807, calibrateSizeByDeletes=false, maxMergeDocs=2147483647, maxCFSSegmentSizeMB=8.796093022207999E12, noCFSRatio=0.3539247470756085]
   [junit4]   2> 51149 INFO  (coreLoadExecutor-157-thread-1-processing-n:127.0.0.1:63098_bcab%2Fqk) [n:127.0.0.1:63098_bcab%2Fqk c:control_collection s:shard1 r:core_node1 x:collection1] o.a.s.c.SolrDeletionPolicy SolrDeletionPolicy.onInit: commits: num=1
   [junit4]   2> 	commit{dir=MockDirectoryWrapper(RAMDirectory@7d5c1df7 lockFactory=org.apache.lucene.store.SingleInstanceLockFactory@203bbdf0),segFN=segments_1,generation=1}
   [junit4]   2> 51149 INFO  (coreLoadExecutor-157-thread-1-processing-n:127.0.0.1:63098_bcab%2Fqk) [n:127.0.0.1:63098_bcab%2Fqk c:control_collection s:shard1 r:core_node1 x:collection1] o.a.s.c.SolrDeletionPolicy newest commit generation = 1
   [junit4]   2> 51149 INFO  (coreLoadExecutor-157-thread-1-processing-n:127.0.0.1:63098_bcab%2Fqk) [n:127.0.0.1:63098_bcab%2Fqk c:control_collection s:shard1 r:core_node1 x:collection1] o.a.s.s.SolrIndexSearcher Opening [Searcher@2441fe62[collection1] main]
   [junit4]   2> 51149 INFO  (coreLoadExecutor-157-thread-1-processing-n:127.0.0.1:63098_bcab%2Fqk) [n:127.0.0.1:63098_bcab%2Fqk c:control_collection s:shard1 r:core_node1 x:collection1] o.a.s.c.c.ZkStateReader Load collection config from: [/collections/control_collection]
   [junit4]   2> 51150 INFO  (coreLoadExecutor-157-thread-1-processing-n:127.0.0.1:63098_bcab%2Fqk) [n:127.0.0.1:63098_bcab%2Fqk c:control_collection s:shard1 r:core_node1 x:collection1] o.a.s.c.c.ZkStateReader path=[/collections/control_collection] [configName]=[conf1] specified config exists in ZooKeeper
   [junit4]   2> 51150 INFO  (coreLoadExecutor-157-thread-1-processing-n:127.0.0.1:63098_bcab%2Fqk) [n:127.0.0.1:63098_bcab%2Fqk c:control_collection s:shard1 r:core_node1 x:collection1] o.a.s.r.ManagedResourceStorage Setting up ZooKeeper-based storage for the RestManager with znodeBase: /configs/conf1
   [junit4]   2> 51151 INFO  (coreLoadExecutor-157-thread-1-processing-n:127.0.0.1:63098_bcab%2Fqk) [n:127.0.0.1:63098_bcab%2Fqk c:control_collection s:shard1 r:core_node1 x:collection1] o.a.s.r.ManagedResourceStorage Configured ZooKeeperStorageIO with znodeBase: /configs/conf1
   [junit4]   2> 51151 INFO  (coreLoadExecutor-157-thread-1-processing-n:127.0.0.1:63098_bcab%2Fqk) [n:127.0.0.1:63098_bcab%2Fqk c:control_collection s:shard1 r:core_node1 x:collection1] o.a.s.r.RestManager Initializing RestManager with initArgs: {}
   [junit4]   2> 51151 INFO  (coreLoadExecutor-157-thread-1-processing-n:127.0.0.1:63098_bcab%2Fqk) [n:127.0.0.1:63098_bcab%2Fqk c:control_collection s:shard1 r:core_node1 x:collection1] o.a.s.r.ManagedResourceStorage Reading _rest_managed.json using ZooKeeperStorageIO:path=/configs/conf1
   [junit4]   2> 51151 INFO  (coreLoadExecutor-157-thread-1-processing-n:127.0.0.1:63098_bcab%2Fqk) [n:127.0.0.1:63098_bcab%2Fqk c:control_collection s:shard1 r:core_node1 x:collection1] o.a.s.r.ManagedResourceStorage No data found for znode /configs/conf1/_rest_managed.json
   [junit4]   2> 51152 INFO  (coreLoadExecutor-157-thread-1-processing-n:127.0.0.1:63098_bcab%2Fqk) [n:127.0.0.1:63098_bcab%2Fqk c:control_collection s:shard1 r:core_node1 x:collection1] o.a.s.r.ManagedResourceStorage Loaded null at path _rest_managed.json using ZooKeeperStorageIO:path=/configs/conf1
   [junit4]   2> 51152 INFO  (coreLoadExecutor-157-thread-1-processing-n:127.0.0.1:63098_bcab%2Fqk) [n:127.0.0.1:63098_bcab%2Fqk c:control_collection s:shard1 r:core_node1 x:collection1] o.a.s.r.RestManager Initializing 0 registered ManagedResources
   [junit4]   2> 51159 INFO  (coreLoadExecutor-157-thread-1-processing-n:127.0.0.1:63098_bcab%2Fqk) [n:127.0.0.1:63098_bcab%2Fqk c:control_collection s:shard1 r:core_node1 x:collection1] o.a.s.h.ReplicationHandler Commits will be reserved for  10000
   [junit4]   2> 51160 INFO  (coreLoadExecutor-157-thread-1-processing-n:127.0.0.1:63098_bcab%2Fqk) [n:127.0.0.1:63098_bcab%2Fqk c:control_collection s:shard1 r:core_node1 x:collection1] o.a.s.u.UpdateLog Looking up max value of version field to seed version buckets
   [junit4]   2> 51160 INFO  (coreLoadExecutor-157-thread-1-processing-n:127.0.0.1:63098_bcab%2Fqk) [n:127.0.0.1:63098_bcab%2Fqk c:control_collection s:shard1 r:core_node1 x:collection1] o.a.s.u.VersionInfo Refreshing highest value of _version_ for 65536 version buckets from index
   [junit4]   2> 51160 INFO  (coreLoadExecutor-157-thread-1-processing-n:127.0.0.1:63098_bcab%2Fqk) [n:127.0.0.1:63098_bcab%2Fqk c:control_collection s:shard1 r:core_node1 x:collection1] o.a.s.u.VersionInfo No terms found for _version_, cannot seed version bucket highest value from index
   [junit4]   2> 51160 INFO  (coreLoadExecutor-157-thread-1-processing-n:127.0.0.1:63098_bcab%2Fqk) [n:127.0.0.1:63098_bcab%2Fqk c:control_collection s:shard1 r:core_node1 x:collection1] o.a.s.u.UpdateLog Could not find max version in index or recent updates, using new clock 1529157637105516544
   [junit4]   2> 51161 INFO  (coreLoadExecutor-157-thread-1-processing-n:127.0.0.1:63098_bcab%2Fqk) [n:127.0.0.1:63098_bcab%2Fqk c:control_collection s:shard1 r:core_node1 x:collection1] o.a.s.u.UpdateLog Took 1.0ms to seed version buckets with highest version 1529157637105516544
   [junit4]   2> 51161 INFO  (searcherExecutor-158-thread-1-processing-n:127.0.0.1:63098_bcab%2Fqk x:collection1 s:shard1 c:control_collection r:core_node1) [n:127.0.0.1:63098_bcab%2Fqk c:control_collection s:shard1 r:core_node1 x:collection1] o.a.s.c.SolrCore [collection1] Registered new searcher Searcher@2441fe62[collection1] main{ExitableDirectoryReader(UninvertingDirectoryReader())}
   [junit4]   2> 51161 INFO  (coreLoadExecutor-157-thread-1-processing-n:127.0.0.1:63098_bcab%2Fqk) [n:127.0.0.1:63098_bcab%2Fqk c:control_collection s:shard1 r:core_node1 x:collection1] o.a.s.c.ZkController watch zkdir /configs/conf1
   [junit4]   2> 51162 INFO  (coreLoadExecutor-157-thread-1-processing-n:127.0.0.1:63098_bcab%2Fqk) [n:127.0.0.1:63098_bcab%2Fqk c:control_collection s:shard1 r:core_node1 x:collection1] o.a.s.c.CoreContainer registering core: collection1
   [junit4]   2> 51164 INFO  (coreZkRegister-151-thread-1-processing-n:127.0.0.1:63098_bcab%2Fqk x:collection1 s:shard1 c:control_collection r:core_node1) [n:127.0.0.1:63098_bcab%2Fqk c:control_collection s:shard1 r:core_node1 x:collection1] o.a.s.c.ZkController Register replica - core:collection1 address:http://127.0.0.1:63098/bcab/qk collection:control_collection shard:shard1
   [junit4]   2> 51166 INFO  (coreZkRegister-151-thread-1-processing-n:127.0.0.1:63098_bcab%2Fqk x:collection1 s:shard1 c:control_collection r:core_node1) [n:127.0.0.1:63098_bcab%2Fqk c:control_collection s:shard1 r:core_node1 x:collection1] o.a.s.c.c.SolrZkClient makePath: /collections/control_collection/leader_elect/shard1/election
   [junit4]   2> 51171 INFO  (coreZkRegister-151-thread-1-processing-n:127.0.0.1:63098_bcab%2Fqk x:collection1 s:shard1 c:control_collection r:core_node1) [n:127.0.0.1:63098_bcab%2Fqk c:control_collection s:shard1 r:core_node1 x:collection1] o.a.s.c.LeaderElector Joined leadership election with path: /collections/control_collection/leader_elect/shard1/election/95572352196280324-core_node1-n_0000000000
   [junit4]   2> 51172 INFO  (coreZkRegister-151-thread-1-processing-n:127.0.0.1:63098_bcab%2Fqk x:collection1 s:shard1 c:control_collection r:core_node1) [n:127.0.0.1:63098_bcab%2Fqk c:control_collection s:shard1 r:core_node1 x:collection1] o.a.s.c.ShardLeaderElectionContext Running the leader process for shard=shard1 and weAreReplacement=false and leaderVoteWait=10000
   [junit4]   2> 51174 INFO  (coreZkRegister-151-thread-1-processing-n:127.0.0.1:63098_bcab%2Fqk x:collection1 s:shard1 c:control_collection r:core_node1) [n:127.0.0.1:63098_bcab%2Fqk c:control_collection s:shard1 r:core_node1 x:collection1] o.a.s.c.ShardLeaderElectionContext Enough replicas found to continue.
   [junit4]   2> 51175 INFO  (coreZkRegister-151-thread-1-processing-n:127.0.0.1:63098_bcab%2Fqk x:collection1 s:shard1 c:control_collection r:core_node1) [n:127.0.0.1:63098_bcab%2Fqk c:control_collection s:shard1 r:core_node1 x:collection1] o.a.s.c.ShardLeaderElectionContext I may be the new leader - try and sync
   [junit4]   2> 51175 INFO  (coreZkRegister-151-thread-1-processing-n:127.0.0.1:63098_bcab%2Fqk x:collection1 s:shard1 c:control_collection r:core_node1) [n:127.0.0.1:63098_bcab%2Fqk c:control_collection s:shard1 r:core_node1 x:collection1] o.a.s.c.SyncStrategy Sync replicas to http://127.0.0.1:63098/bcab/qk/collection1/
   [junit4]   2> 51175 INFO  (OverseerStateUpdate-95572352196280324-127.0.0.1:63098_bcab%2Fqk-n_0000000000) [n:127.0.0.1:63098_bcab%2Fqk    ] o.a.s.c.Overseer processMessage: queueSize: 1, message = {
   [junit4]   2>   "operation":"leader",
   [junit4]   2>   "shard":"shard1",
   [junit4]   2>   "collection":"control_collection"} current state version: 1
   [junit4]   2> 51175 INFO  (coreZkRegister-151-thread-1-processing-n:127.0.0.1:63098_bcab%2Fqk x:collection1 s:shard1 c:control_collection r:core_node1) [n:127.0.0.1:63098_bcab%2Fqk c:control_collection s:shard1 r:core_node1 x:collection1] o.a.s.c.SyncStrategy Sync Success - now sync replicas to me
   [junit4]   2> 51175 INFO  (coreZkRegister-151-thread-1-processing-n:127.0.0.1:63098_bcab%2Fqk x:collection1 s:shard1 c:control_collection r:core_node1) [n:127.0.0.1:63098_bcab%2Fqk c:control_collection s:shard1 r:core_node1 x:collection1] o.a.s.c.SyncStrategy http://127.0.0.1:63098/bcab/qk/collection1/ has no replicas
   [junit4]   2> 51177 INFO  (coreZkRegister-151-thread-1-processing-n:127.0.0.1:63098_bcab%2Fqk x:collection1 s:shard1 c:control_collection r:core_node1) [n:127.0.0.1:63098_bcab%2Fqk c:control_collection s:shard1 r:core_node1 x:collection1] o.a.s.c.c.SolrZkClient makePath: /collections/control_collection/leaders/shard1
   [junit4]   2> 51181 INFO  (coreZkRegister-151-thread-1-processing-n:127.0.0.1:63098_bcab%2Fqk x:collection1 s:shard1 c:control_collection r:core_node1) [n:127.0.0.1:63098_bcab%2Fqk c:control_collection s:shard1 r:core_node1 x:collection1] o.a.s.c.ShardLeaderElectionContextBase Creating leader registration node /collections/control_collection/leaders/shard1/leader after winning as /collections/control_collection/leader_elect/shard1/election/95572352196280324-core_node1-n_0000000000
   [junit4]   2> 51184 INFO  (coreZkRegister-151-thread-1-processing-n:127.0.0.1:63098_bcab%2Fqk x:collection1 s:shard1 c:control_collection r:core_node1) [n:127.0.0.1:63098_bcab%2Fqk c:control_collection s:shard1 r:core_node1 x:collection1] o.a.s.c.ShardLeaderElectionContext I am the new leader: http://127.0.0.1:63098/bcab/qk/collection1/ shard1
   [junit4]   2> 51186 INFO  (OverseerStateUpdate-95572352196280324-127.0.0.1:63098_bcab%2Fqk-n_0000000000) [n:127.0.0.1:63098_bcab%2Fqk    ] o.a.s.c.Overseer processMessage: queueSize: 1, message = {
   [junit4]   2>   "operation":"leader",
   [junit4]   2>   "shard":"shard1",
   [junit4]   2>   "collection":"control_collection",
   [junit4]   2>   "base_url":"http://127.0.0.1:63098/bcab/qk",
   [junit4]   2>   "core":"collection1",
   [junit4]   2>   "state":"active"} current state version: 1
   [junit4]   2> 51293 INFO  (zkCallback-44-thread-2-processing-n:127.0.0.1:63098_bcab%2Fqk) [n:127.0.0.1:63098_bcab%2Fqk    ] o.a.s.c.c.ZkStateReader A cluster state change: [WatchedEvent state:SyncConnected type:NodeDataChanged path:/clusterstate.json], has occurred - updating... (live nodes size: [1])
   [junit4]   2> 51337 INFO  (coreZkRegister-151-thread-1-processing-n:127.0.0.1:63098_bcab%2Fqk x:collection1 s:shard1 c:control_collection r:core_node1) [n:127.0.0.1:63098_bcab%2Fqk c:control_collection s:shard1 r:core_node1 x:collection1] o.a.s.c.ZkController We are http://127.0.0.1:63098/bcab/qk/collection1/ and leader is http://127.0.0.1:63098/bcab/qk/collection1/
   [junit4]   2> 51337 INFO  (coreZkRegister-151-thread-1-processing-n:127.0.0.1:63098_bcab%2Fqk x:collection1 s:shard1 c:control_collection r:core_node1) [n:127.0.0.1:63098_bcab%2Fqk c:control_collection s:shard1 r:core_node1 x:collection1] o.a.s.c.ZkController No LogReplay needed for core=collection1 baseURL=http://127.0.0.1:63098/bcab/qk
   [junit4]   2> 51337 INFO  (coreZkRegister-151-thread-1-processing-n:127.0.0.1:63098_bcab%2Fqk x:collection1 s:shard1 c:control_collection r:core_node1) [n:127.0.0.1:63098_bcab%2Fqk c:control_collection s:shard1 r:core_node1 x:collection1] o.a.s.c.ZkController I am the leader, no recovery necessary
   [junit4]   2> 51337 INFO  (coreZkRegister-151-thread-1-processing-n:127.0.0.1:63098_bcab%2Fqk x:collection1 s:shard1 c:control_collection r:core_node1) [n:127.0.0.1:63098_bcab%2Fqk c:control_collection s:shard1 r:core_node1 x:collection1] o.a.s.c.ZkController publishing state=active
   [junit4]   2> 51337 INFO  (coreZkRegister-151-thread-1-processing-n:127.0.0.1:63098_bcab%2Fqk x:collection1 s:shard1 c:control_collection r:core_node1) [n:127.0.0.1:63098_bcab%2Fqk c:control_collection s:shard1 r:core_node1 x:collection1] o.a.s.c.ZkController numShards not found on descriptor - reading it from system property
   [junit4]   2> 51343 INFO  (OverseerStateUpdate-95572352196280324-127.0.0.1:63098_bcab%2Fqk-n_0000000000) [n:127.0.0.1:63098_bcab%2Fqk    ] o.a.s.c.Overseer processMessage: queueSize: 1, message = {
   [junit4]   2>   "core":"collection1",
   [junit4]   2>   "core_node_name":"core_node1",
   [junit4]   2>   "roles":null,
   [junit4]   2>   "base_url":"http://127.0.0.1:63098/bcab/qk",
   [junit4]   2>   "node_name":"127.0.0.1:63098_bcab%2Fqk",
   [junit4]   2>   "numShards":"1",
   [junit4]   2>   "state":"active",
   [junit4]   2>   "shard":"shard1",
   [junit4]   2>   "collection":"control_collection",
   [junit4]   2>   "operation":"state"} current state version: 2
   [junit4]   2> 51344 INFO  (OverseerStateUpdate-95572352196280324-127.0.0.1:63098_bcab%2Fqk-n_0000000000) [n:127.0.0.1:63098_bcab%2Fqk    ] o.a.s.c.o.ReplicaMutator Update state numShards=1 message={
   [junit4]   2>   "core":"collection1",
   [junit4]   2>   "core_node_name":"core_node1",
   [junit4]   2>   "roles":null,
   [junit4]   2>   "base_url":"http://127.0.0.1:63098/bcab/qk",
   [junit4]   2>   "node_name":"127.0.0.1:63098_bcab%2Fqk",
   [junit4]   2>   "numShards":"1",
   [junit4]   2>   "state":"active",
   [junit4]   2>   "shard":"shard1",
   [junit4]   2>   "collection":"control_collection",
   [junit4]   2>   "operation":"state"}
   [junit4]   2> 51435 INFO  (TEST-DistribDocExpirationUpdateProcessorTest.test-seed#[1C3BD10017CBEAE7]) [    ] o.a.s.c.c.SolrZkClient Using default ZkCredentialsProvider
   [junit4]   2> 51436 INFO  (TEST-DistribDocExpirationUpdateProcessorTest.test-seed#[1C3BD10017CBEAE7]) [    ] o.a.s.c.c.ConnectionManager Waiting for client to connect to ZooKeeper
   [junit4]   2> 51439 INFO  (zkCallback-46-thread-1) [    ] o.a.s.c.c.ConnectionManager Watcher org.apache.solr.common.cloud.ConnectionManager@650e3bd1 name:ZooKeeperConnection Watcher:127.0.0.1:43203/solr got event WatchedEvent state:SyncConnected type:None path:null path:null type:None
   [junit4]   2> 51439 INFO  (TEST-DistribDocExpirationUpdateProcessorTest.test-seed#[1C3BD10017CBEAE7]) [    ] o.a.s.c.c.ConnectionManager Client is connected to ZooKeeper
   [junit4]   2> 51440 INFO  (TEST-DistribDocExpirationUpdateProcessorTest.test-seed#[1C3BD10017CBEAE7]) [    ] o.a.s.c.c.SolrZkClient Using default ZkACLProvider
   [junit4]   2> 51440 INFO  (TEST-DistribDocExpirationUpdateProcessorTest.test-seed#[1C3BD10017CBEAE7]) [    ] o.a.s.c.c.ZkStateReader Updating cluster state from ZooKeeper... 
   [junit4]   2> 51443 INFO  (TEST-DistribDocExpirationUpdateProcessorTest.test-seed#[1C3BD10017CBEAE7]) [    ] o.a.s.c.c.ZkStateReader Updated live nodes from ZooKeeper... (0) -> (1)
   [junit4]   2> 51446 INFO  (TEST-DistribDocExpirationUpdateProcessorTest.test-seed#[1C3BD10017CBEAE7]) [    ] o.a.s.c.ChaosMonkey monkey: init - expire sessions:false cause connection loss:false
   [junit4]   2> 51455 INFO  (zkCallback-46-thread-1) [    ] o.a.s.c.c.ZkStateReader A cluster state change: [WatchedEvent state:SyncConnected type:NodeDataChanged path:/clusterstate.json], has occurred - updating... (live nodes size: [1])
   [junit4]   2> 51455 INFO  (zkCallback-44-thread-2-processing-n:127.0.0.1:63098_bcab%2Fqk) [n:127.0.0.1:63098_bcab%2Fqk    ] o.a.s.c.c.ZkStateReader A cluster state change: [WatchedEvent state:SyncConnected type:NodeDataChanged path:/clusterstate.json], has occurred - updating... (live nodes size: [1])
   [junit4]   2> 51592 INFO  (TEST-DistribDocExpirationUpdateProcessorTest.test-seed#[1C3BD10017CBEAE7]) [    ] o.a.s.SolrTestCaseJ4 Writing core.properties file to /export/home/jenkins/workspace/Lucene-Solr-master-Solaris/solr/build/solr-core/test/J0/temp/solr.cloud.DistribDocExpirationUpdateProcessorTest_1C3BD10017CBEAE7-001/shard-1-001/cores/collection1
   [junit4]   2> 51593 INFO  (TEST-DistribDocExpirationUpdateProcessorTest.test-seed#[1C3BD10017CBEAE7]) [    ] o.a.s.c.AbstractFullDistribZkTestBase create jetty 1 in directory /export/home/jenkins/workspace/Lucene-Solr-master-Solaris/solr/build/solr-core/test/J0/temp/solr.cloud.DistribDocExpirationUpdateProcessorTest_1C3BD10017CBEAE7-001/shard-1-001
   [junit4]   2> 51593 INFO  (TEST-DistribDocExpirationUpdateProcessorTest.test-seed#[1C3BD10017CBEAE7]) [    ] o.e.j.s.Server jetty-9.3.8.v20160314
   [junit4]   2> 51597 INFO  (TEST-DistribDocExpirationUpdateProcessorTest.test-seed#[1C3BD10017CBEAE7]) [    ] o.e.j.s.h.ContextHandler Started o.e.j.s.ServletContextHandler@6b7dea6{/bcab/qk,null,AVAILABLE}
   [junit4]   2> 51597 INFO  (TEST-DistribDocExpirationUpdateProcessorTest.test-seed#[1C3BD10017CBEAE7]) [    ] o.e.j.s.ServerConnector Started ServerConnector@4c8a4282{HTTP/1.1,[http/1.1]}{127.0.0.1:54578}
   [junit4]   2> 51598 INFO  (TEST-DistribDocExpirationUpdateProcessorTest.test-seed#[1C3BD10017CBEAE7]) [    ] o.e.j.s.Server Started @54487ms
   [junit4]   2> 51598 INFO  (TEST-DistribDocExpirationUpdateProcessorTest.test-seed#[1C3BD10017CBEAE7]) [    ] o.a.s.c.s.e.JettySolrRunner Jetty properties: {solr.data.dir=/export/home/jenkins/workspace/Lucene-Solr-master-Solaris/solr/build/solr-core/test/J0/temp/solr.cloud.DistribDocExpirationUpdateProcessorTest_1C3BD10017CBEAE7-001/tempDir-001/jetty1, solrconfig=solrconfig.xml, hostContext=/bcab/qk, hostPort=54578, coreRootDirectory=/export/home/jenkins/workspace/Lucene-Solr-master-Solaris/solr/build/solr-core/test/J0/../../../../../../../../../../export/home/jenkins/workspace/Lucene-Solr-master-Solaris/solr/build/solr-core/test/J0/temp/solr.cloud.DistribDocExpirationUpdateProcessorTest_1C3BD10017CBEAE7-001/shard-1-001/cores}
   [junit4]   2> 51598 INFO  (TEST-DistribDocExpirationUpdateProcessorTest.test-seed#[1C3BD10017CBEAE7]) [    ] o.a.s.s.SolrDispatchFilter SolrDispatchFilter.init(): sun.misc.Launcher$AppClassLoader@6d06d69c
   [junit4]   2> 51598 INFO  (TEST-DistribDocExpirationUpdateProcessorTest.test-seed#[1C3BD10017CBEAE7]) [    ] o.a.s.c.SolrResourceLoader new SolrResourceLoader for directory: '/export/home/jenkins/workspace/Lucene-Solr-master-Solaris/solr/build/solr-core/test/J0/temp/solr.cloud.DistribDocExpirationUpdateProcessorTest_1C3BD10017CBEAE7-001/shard-1-001'
   [junit4]   2> 51599 INFO  (TEST-DistribDocExpirationUpdateProcessorTest.test-seed#[1C3BD10017CBEAE7]) [    ] o.a.s.c.SolrResourceLoader JNDI not configured for solr (NoInitialContextEx)
   [junit4]   2> 51599 INFO  (TEST-DistribDocExpirationUpdateProcessorTest.test-seed#[1C3BD10017CBEAE7]) [    ] o.a.s.c.SolrResourceLoader solr home defaulted to 'solr/' (could not find system property or JNDI)
   [junit4]   2> 51599 INFO  (TEST-DistribDocExpirationUpdateProcessorTest.test-seed#[1C3BD10017CBEAE7]) [    ] o.a.s.c.c.SolrZkClient Using default ZkCredentialsProvider
   [junit4]   2> 51600 INFO  (TEST-DistribDocExpirationUpdateProcessorTest.test-seed#[1C3BD10017CBEAE7]) [    ] o.a.s.c.c.ConnectionManager Waiting for client to connect to ZooKeeper
   [junit4]   2> 51603 INFO  (zkCallback-47-thread-1) [    ] o.a.s.c.c.ConnectionManager Watcher org.apache.solr.common.cloud.ConnectionManager@5ebdecec name:ZooKeeperConnection Watcher:127.0.0.1:43203/solr got event WatchedEvent state:SyncConnected type:None path:null path:null type:None
   [junit4]   2> 51604 INFO  (TEST-DistribDocExpirationUpdateProcessorTest.test-seed#[1C3BD10017CBEAE7]) [    ] o.a.s.c.c.ConnectionManager Client is connected to ZooKeeper
   [junit4]   2> 51604 INFO  (TEST-DistribDocExpirationUpdateProcessorTest.test-seed#[1C3BD10017CBEAE7]) [    ] o.a.s.c.c.SolrZkClient Using default ZkACLProvider
   [junit4]   2> 51609 INFO  (TEST-DistribDocExpirationUpdateProcessorTest.test-seed#[1C3BD10017CBEAE7]) [    ] o.a.s.s.SolrDispatchFilter Loading solr.xml from SolrHome (not found in ZooKeeper)
   [junit4]   2> 51609 INFO  (TEST-DistribDocExpirationUpdateProcessorTest.test-seed#[1C3BD10017CBEAE7]) [    ] o.a.s.c.SolrXmlConfig Loading container configuration from /export/home/jenkins/workspace/Lucene-Solr-master-Solaris/solr/build/solr-core/test/J0/temp/solr.cloud.DistribDocExpirationUpdateProcessorTest_1C3BD10017CBEAE7-001/shard-1-001/solr.xml
   [junit4]   2> 51617 INFO  (TEST-DistribDocExpirationUpdateProcessorTest.test-seed#[1C3BD10017CBEAE7]) [    ] o.a.s.c.CorePropertiesLocator Config-defined core root directory: /export/home/jenkins/workspace/Lucene-Solr-master-Solaris/solr/build/solr-core/test/J0/../../../../../../../../../../export/home/jenkins/workspace/Lucene-Solr-master-Solaris/solr/build/solr-core/test/J0/temp/solr.cloud.DistribDocExpirationUpdateProcessorTest_1C3BD10017CBEAE7-001/shard-1-001/cores
   [junit4]   2> 51617 INFO  (TEST-DistribDocExpirationUpdateProcessorTest.test-seed#[1C3BD10017CBEAE7]) [    ] o.a.s.c.CoreContainer New CoreContainer 1046238055
   [junit4]   2> 51617 INFO  (TEST-DistribDocExpirationUpdateProcessorTest.test-seed#[1C3BD10017CBEAE7]) [    ] o.a.s.c.CoreContainer Loading cores into CoreContainer [instanceDir=/export/home/jenkins/workspace/Lucene-Solr-master-Solaris/solr/build/solr-core/test/J0/temp/solr.cloud.DistribDocExpirationUpdateProcessorTest_1C3BD10017CBEAE7-001/shard-1-001]
   [junit4]   2> 51617 WARN  (TEST-DistribDocExpirationUpdateProcessorTest.test-seed#[1C3BD10017CBEAE7]) [    ] o.a.s.c.CoreContainer Couldn't add files from /export/home/jenkins/workspace/Lucene-Solr-master-Solaris/solr/build/solr-core/test/J0/temp/solr.cloud.DistribDocExpirationUpdateProcessorTest_1C3BD10017CBEAE7-001/shard-1-001/lib to classpath: /export/home/jenkins/workspace/Lucene-Solr-master-Solaris/solr/build/solr-core/test/J0/temp/solr.cloud.DistribDocExpirationUpdateProcessorTest_1C3BD10017CBEAE7-001/shard-1-001/lib
   [junit4]   2> 51617 INFO  (TEST-DistribDocExpirationUpdateProcessorTest.test-seed#[1C3BD10017CBEAE7]) [    ] o.a.s.h.c.HttpShardHandlerFactory created with socketTimeout : 90000,urlScheme : ,connTimeout : 15000,maxConnectionsPerHost : 20,maxConnections : 10000,corePoolSize : 0,maximumPoolSize : 2147483647,maxThreadIdleTime : 5,sizeOfQueue : -1,fairnessPolicy : false,useRetries : false,
   [junit4]   2> 51619 INFO  (TEST-DistribDocExpirationUpdateProcessorTest.test-seed#[1C3BD10017CBEAE7]) [    ] o.a.s.u.UpdateShardHandler Creating UpdateShardHandler HTTP client with params: socketTimeout=340000&connTimeout=45000&retry=true
   [junit4]   2> 51619 INFO  (TEST-DistribDocExpirationUpdateProcessorTest.test-seed#[1C3BD10017CBEAE7]) [    ] o.a.s.l.LogWatcher SLF4J impl is org.slf4j.impl.Log4jLoggerFactory
   [junit4]   2> 51619 INFO  (TEST-DistribDocExpirationUpdateProcessorTest.test-seed#[1C3BD10017CBEAE7]) [    ] o.a.s.l.LogWatcher Registering Log Listener [Log4j (org.slf4j.impl.Log4jLoggerFactory)]
   [junit4]   2> 51619 INFO  (TEST-DistribDocExpirationUpdateProcessorTest.test-seed#[1C3BD10017CBEAE7]) [    ] o.a.s.c.ZkContainer Zookeeper client=127.0.0.1:43203/solr
   [junit4]   2> 51619 INFO  (TEST-DistribDocExpirationUpdateProcessorTest.test-seed#[1C3BD10017CBEAE7]) [    ] o.a.s.c.ZkController zkHost includes chroot
   [junit4]   2> 51619 INFO  (TEST-DistribDocExpirationUpdateProcessorTest.test-seed#[1C3BD10017CBEAE7]) [    ] o.a.s.c.c.SolrZkClient Using default ZkCredentialsProvider
   [junit4]   2> 51620 INFO  (TEST-DistribDocExpirationUpdateProcessorTest.test-seed#[1C3BD10017CBEAE7]) [    ] o.a.s.c.c.ConnectionManager Waiting for client to connect to ZooKeeper
   [junit4]   2> 51623 INFO  (zkCallback-50-thread-1) [    ] o.a.s.c.c.ConnectionManager Watcher org.apache.solr.common.cloud.ConnectionManager@53daddbb name:ZooKeeperConnection Watcher:127.0.0.1:43203 got event WatchedEvent state:SyncConnected type:None path:null path:null type:None
   [junit4]   2> 51623 INFO  (TEST-DistribDocExpirationUpdateProcessorTest.test-seed#[1C3BD10017CBEAE7]) [    ] o.a.s.c.c.ConnectionManager Client is connected to ZooKeeper
   [junit4]   2> 51624 INFO  (TEST-DistribDocExpirationUpdateProcessorTest.test-seed#[1C3BD10017CBEAE7]) [    ] o.a.s.c.c.SolrZkClient Using default ZkACLProvider
   [junit4]   2> 51629 INFO  (TEST-DistribDocExpirationUpdateProcessorTest.test-seed#[1C3BD10017CBEAE7]) [n:127.0.0.1:54578_bcab%2Fqk    ] o.a.s.c.c.ConnectionManager Waiting for client to connect to ZooKeeper
   [junit4]   2> 51632 INFO  (zkCallback-51-thread-1-processing-n:127.0.0.1:54578_bcab%2Fqk) [n:127.0.0.1:54578_bcab%2Fqk    ] o.a.s.c.c.ConnectionManager Watcher org.apache.solr.common.cloud.ConnectionManager@60a9451f name:ZooKeeperConnection Watcher:127.0.0.1:43203/solr got event WatchedEvent state:SyncConnected type:None path:null path:null type:None
   [junit4]   2> 51632 INFO  (TEST-DistribDocExpirationUpdateProcessorTest.test-seed#[1C3BD10017CBEAE7]) [n:127.0.0.1:54578_bcab%2Fqk    ] o.a.s.c.c.ConnectionManager Client is connected to ZooKeeper
   [junit4]   2> 51643 INFO  (TEST-DistribDocExpirationUpdateProcessorTest.test-seed#[1C3BD10017CBEAE7]) [n:127.0.0.1:54578_bcab%2Fqk    ] o.a.s.c.c.ZkStateReader Updating cluster state from ZooKeeper... 
   [junit4]   2> 51646 INFO  (TEST-DistribDocExpirationUpdateProcessorTest.test-seed#[1C3BD10017CBEAE7]) [n:127.0.0.1:54578_bcab%2Fqk    ] o.a.s.c.c.ZkStateReader Updated live nodes from ZooKeeper... (0) -> (1)
   [junit4]   2> 51649 INFO  (TEST-DistribDocExpirationUpdateProcessorTest.test-seed#[1C3BD10017CBEAE7]) [n:127.0.0.1:54578_bcab%2Fqk    ] o.a.s.c.Overseer Overseer (id=null) closing
   [junit4]   2> 51650 INFO  (TEST-DistribDocExpirationUpdateProcessorTest.test-seed#[1C3BD10017CBEAE7]) [n:127.0.0.1:54578_bcab%2Fqk    ] o.a.s.c.LeaderElector Joined leadership election with path: /overseer_elect/election/95572352196280328-127.0.0.1:54578_bcab%2Fqk-n_0000000001
   [junit4]   2> 51651 INFO  (TEST-DistribDocExpirationUpdateProcessorTest.test-seed#[1C3BD10017CBEAE7]) [n:127.0.0.1:54578_bcab%2Fqk    ] o.a.s.c.LeaderElector Watching path /overseer_elect/election/95572352196280324-127.0.0.1:63098_bcab%2Fqk-n_0000000000 to know if I could be the leader
   [junit4]   2> 51651 INFO  (TEST-DistribDocExpirationUpdateProcessorTest.test-seed#[1C3BD10017CBEAE7]) [n:127.0.0.1:54578_bcab%2Fqk    ] o.a.s.c.ZkController Publish node=127.0.0.1:54578_bcab%2Fqk as DOWN
   [junit4]   2> 51655 INFO  (OverseerStateUpdate-95572352196280324-127.0.0.1:63098_bcab%2Fqk-n_0000000000) [n:127.0.0.1:63098_bcab%2Fqk    ] o.a.s.c.Overseer processMessage: queueSize: 1, message = {
   [junit4]   2>   "operation":"downnode",
   [junit4]   2>   "node_name":"127.0.0.1:54578_bcab%2Fqk"} current state version: 3
   [junit4]   2> 51655 INFO  (OverseerStateUpdate-95572352196280324-127.0.0.1:63098_bcab%2Fqk-n_0000000000) [n:127.0.0.1:63098_bcab%2Fqk    ] o.a.s.c.o.NodeMutator DownNode state invoked for node: 127.0.0.1:54578_bcab%2Fqk
   [junit4]   2> 51759 INFO  (zkCallback-44-thread-2-processing-n:127.0.0.1:63098_bcab%2Fqk) [n:127.0.0.1:63098_bcab%2Fqk    ] o.a.s.c.c.ZkStateReader A cluster state change: [WatchedEvent state:SyncConnected type:NodeDataChanged path:/clusterstate.json], has occurred - updating... (live nodes size: [1])
   [junit4]   2> 51759 INFO  (zkCallback-46-thread-1) [    ] o.a.s.c.c.ZkStateReader A cluster state change: [WatchedEvent state:SyncConnected type:NodeDataChanged path:/clusterstate.json], has occurred - updating... (live nodes size: [1])
   [junit4]   2> 51759 INFO  (zkCallback-51-thread-1-processing-n:127.0.0.1:54578_bcab%2Fqk) [n:127.0.0.1:54578_bcab%2Fqk    ] o.a.s.c.c.ZkStateReader A cluster state change: [WatchedEvent state:SyncConnected type:NodeDataChanged path:/clusterstate.json], has occurred - updating... (live nodes size: [1])
   [junit4]   2> 52655 INFO  (TEST-DistribDocExpirationUpdateProcessorTest.test-seed#[1C3BD10017CBEAE7]) [n:127.0.0.1:54578_bcab%2Fqk    ] o.a.s.c.ZkController Register node as live in ZooKeeper:/live_nodes/127.0.0.1:54578_bcab%2Fqk
   [junit4]   2> 52656 INFO  (TEST-DistribDocExpirationUpdateProcessorTest.test-seed#[1C3BD10017CBEAE7]) [n:127.0.0.1:54578_bcab%2Fqk    ] o.a.s.c.c.SolrZkClient makePath: /live_nodes/127.0.0.1:54578_bcab%2Fqk
   [junit4]   2> 52658 INFO  (zkCallback-46-thread-1) [    ] o.a.s.c.c.ZkStateReader A live node change: [WatchedEvent state:SyncConnected type:NodeChildrenChanged path:/live_nodes], has occurred - updating... (live nodes size: [1])
   [junit4]   2> 52658 INFO  (zkCallback-44-thread-2-processing-n:127.0.0.1:63098_bcab%2Fqk) [n:127.0.0.1:63098_bcab%2Fqk    ] o.a.s.c.c.ZkStateReader A live node change: [WatchedEvent state:SyncConnected type:NodeChildrenChanged path:/live_nodes], has occurred - updating... (live nodes size: [1])
   [junit4]   2> 52658 INFO  (zkCallback-51-thread-1-processing-n:127.0.0.1:54578_bcab%2Fqk) [n:127.0.0.1:54578_bcab%2Fqk    ] o.a.s.c.c.ZkStateReader A live node change: [WatchedEvent state:SyncConnected type:NodeChildrenChanged path:/live_nodes], has occurred - updating... (live nodes size: [1])
   [junit4]   2> 52659 INFO  (zkCallback-46-thread-1) [    ] o.a.s.c.c.ZkStateReader Updated live nodes from ZooKeeper... (1) -> (2)
   [junit4]   2> 52659 INFO  (zkCallback-44-thread-2-processing-n:127.0.0.1:63098_bcab%2Fqk) [n:127.0.0.1:63098_bcab%2Fqk    ] o.a.s.c.c.ZkStateReader Updated live nodes from ZooKeeper... (1) -> (2)
   [junit4]   2> 52659 INFO  (zkCallback-51-thread-1-processing-n:127.0.0.1:54578_bcab%2Fqk) [n:127.0.0.1:54578_bcab%2Fqk    ] o.a.s.c.c.ZkStateReader Updated live nodes from ZooKeeper... (1) -> (2)
   [junit4]   2> 52686 INFO  (TEST-DistribDocExpirationUpdateProcessorTest.test-seed#[1C3BD10017CBEAE7]) [n:127.0.0.1:54578_bcab%2Fqk    ] o.a.s.c.CoreContainer Security conf doesn't exist. Skipping setup for authorization module.
   [junit4]   2> 52686 INFO  (TEST-DistribDocExpirationUpdateProcessorTest.test-seed#[1C3BD10017CBEAE7]) [n:127.0.0.1:54578_bcab%2Fqk    ] o.a.s.c.CoreContainer No authentication plugin used.
   [junit4]   2> 52688 INFO  (TEST-DistribDocExpirationUpdateProcessorTest.test-seed#[1C3BD10017CBEAE7]) [n:127.0.0.1:54578_bcab%2Fqk    ] o.a.s.c.CorePropertiesLocator Looking for core definitions underneath /export/home/jenkins/workspace/Lucene-Solr-master-Solaris/solr/build/solr-core/test/J0/../../../../../../../../../../export/home/jenkins/workspace/Lucene-Solr-master-Solaris/solr/build/solr-core/test/J0/temp/solr.cloud.DistribDocExpirationUpdateProcessorTest_1C3BD10017CBEAE7-001/shard-1-001/cores
   [junit4]   2> 52690 INFO  (TEST-DistribDocExpirationUpdateProcessorTest.test-seed#[1C3BD10017CBEAE7]) [n:127.0.0.1:54578_bcab%2Fqk    ] o.a.s.c.CoreDescriptor Created CoreDescriptor: {name=collection1, config=solrconfig.xml, transient=false, schema=schema.xml, loadOnStartup=true, configSetProperties=configsetprops.json, collection=collection1, coreNodeName=, dataDir=data/, shard=}
   [junit4]   2> 52690 INFO  (TEST-DistribDocExpirationUpdateProcessorTest.test-seed#[1C3BD10017CBEAE7]) [n:127.0.0.1:54578_bcab%2Fqk    ] o.a.s.c.CorePropertiesLocator Found core collection1 in /export/home/jenkins/workspace/Lucene-Solr-master-Solaris/solr/build/solr-core/test/J0/../../../../../../../../../../export/home/jenkins/workspace/Lucene-Solr-master-Solaris/solr/build/solr-core/test/J0/temp/solr.cloud.DistribDocExpirationUpdateProcessorTest_1C3BD10017CBEAE7-001/shard-1-001/cores/collection1
   [junit4]   2> 52690 INFO  (TEST-DistribDocExpirationUpdateProcessorTest.test-seed#[1C3BD10017CBEAE7]) [n:127.0.0.1:54578_bcab%2Fqk    ] o.a.s.c.CorePropertiesLocator Found 1 core definitions
   [junit4]   2> 52693 INFO  (TEST-DistribDocExpirationUpdateProcessorTest.test-seed#[1C3BD10017CBEAE7]) [n:127.0.0.1:54578_bcab%2Fqk    ] o.a.s.s.SolrDispatchFilter user.dir=/export/home/jenkins/workspace/Lucene-Solr-master-Solaris/solr/build/solr-core/test/J0
   [junit4]   2> 52693 INFO  (TEST-DistribDocExpirationUpdateProcessorTest.test-seed#[1C3BD10017CBEAE7]) [n:127.0.0.1:54578_bcab%2Fqk    ] o.a.s.s.SolrDispatchFilter SolrDispatchFilter.init() done
   [junit4]   2> 52694 INFO  (coreLoadExecutor-169-thread-1-processing-n:127.0.0.1:54578_bcab%2Fqk) [n:127.0.0.1:54578_bcab%2Fqk c:collection1   x:collection1] o.a.s.c.ZkController publishing state=down
   [junit4]   2> 52694 INFO  (coreLoadExecutor-169-thread-1-processing-n:127.0.0.1:54578_bcab%2Fqk) [n:127.0.0.1:54578_bcab%2Fqk c:collection1   x:collection1] o.a.s.c.ZkController numShards not found on descriptor - reading it from system property
   [junit4]   2> 52697 INFO  (OverseerStateUpdate-95572352196280324-127.0.0.1:63098_bcab%2Fqk-n_0000000000) [n:127.0.0.1:63098_bcab%2Fqk    ] o.a.s.c.Overseer processMessage: queueSize: 1, message = {
   [junit4]   2>   "core":"collection1",
   [junit4]   2>   "roles":null,
   [junit4]   2>   "base_url":"http://127.0.0.1:54578/bcab/qk",
   [junit4]   2>   "node_name":"127.0.0.1:54578_bcab%2Fqk",
   [junit4]   2>   "numShards":"2",
   [junit4]   2>   "state":"down",
   [junit4]   2>   "shard":null,
   [junit4]   2>   "collection":"collection1",
   [junit4]   2>   "operation":"state"} current state version: 4
   [junit4]   2> 52697 INFO  (coreLoadExecutor-169-thread-1-processing-n:127.0.0.1:54578_bcab%2Fqk) [n:127.0.0.1:54578_bcab%2Fqk c:collection1   x:collection1] o.a.s.c.ZkController look for our core node name
   [junit4]   2> 52698 INFO  (OverseerStateUpdate-95572352196280324-127.0.0.1:63098_bcab%2Fqk-n_0000000000) [n:127.0.0.1:63098_bcab%2Fqk    ] o.a.s.c.o.ReplicaMutator Update state numShards=2 message={
   [junit4]   2>   "core":"collection1",
   [junit4]   2>   "roles":null,
   [junit4]   2>   "base_url":"http://127.0.0.1:54578/bcab/qk",
   [junit4]   2>   "node_name":"127.0.0.1:54578_bcab%2Fqk",
   [junit4]   2>   "numShards":"2",
   [junit4]   2>   "state":"down",
   [junit4]   2>   "shard":null,
   [junit4]   2>   "collection":"collection1",
   [junit4]   2>   "operation":"state"}
   [junit4]   2> 52698 INFO  (OverseerStateUpdate-95572352196280324-127.0.0.1:63098_bcab%2Fqk-n_0000000000) [n:127.0.0.1:63098_bcab%2Fqk    ] o.a.s.c.o.ClusterStateMutator building a new cName: collection1
   [junit4]   2> 52698 INFO  (OverseerStateUpdate-95572352196280324-127.0.0.1:63098_bcab%2Fqk-n_0000000000) [n:127.0.0.1:63098_bcab%2Fqk    ] o.a.s.c.o.ReplicaMutator Assigning new node to shard shard=shard2
   [junit4]   2> 52806 INFO  (zkCallback-46-thread-1) [    ] o.a.s.c.c.ZkStateReader A cluster state change: [WatchedEvent state:SyncConnected type:NodeDataChanged path:/clusterstate.json], has occurred - updating... (live nodes size: [2])
   [junit4]   2> 52806 INFO  (zkCallback-51-thread-1-processing-n:127.0.0.1:54578_bcab%2Fqk) [n:127.0.0.1:54578_bcab%2Fqk    ] o.a.s.c.c.ZkStateReader A cluster state change: [WatchedEvent state:SyncConnected type:NodeDataChanged path:/clusterstate.json], has occurred - updating... (live nodes size: [2])
   [junit4]   2> 52806 INFO  (zkCallback-44-thread-2-processing-n:127.0.0.1:63098_bcab%2Fqk) [n:127.0.0.1:63098_bcab%2Fqk    ] o.a.s.c.c.ZkStateReader A cluster state change: [WatchedEvent state:SyncConnected type:NodeDataChanged path:/clusterstate.json], has occurred - updating... (live nodes size: [2])
   [junit4]   2> 53701 INFO  (coreLoadExecutor-169-thread-1-processing-n:127.0.0.1:54578_bcab%2Fqk) [n:127.0.0.1:54578_bcab%2Fqk c:collection1   x:collection1] o.a.s.c.ZkController waiting to find shard id in clusterstate for collection1
   [junit4]   2> 53701 INFO  (coreLoadExecutor-169-thread-1-processing-n:127.0.0.1:54578_bcab%2Fqk) [n:127.0.0.1:54578_bcab%2Fqk c:collection1   x:collection1] o.a.s.c.ZkController Check for collection zkNode:collection1
   [junit4]   2> 53702 INFO  (coreLoadExecutor-169-thread-1-processing-n:127.0.0.1:54578_bcab%2Fqk) [n:127.0.0.1:54578_bcab%2Fqk c:collection1   x:collection1] o.a.s.c.ZkController Collection zkNode exists
   [junit4]   2> 53702 INFO  (coreLoadExecutor-169-thread-1-processing-n:127.0.0.1:54578_bcab%2Fqk) [n:127.0.0.1:54578_bcab%2Fqk c:collection1   x:collection1] o.a.s.c.c.ZkStateReader Load collection config from: [/collections/collection1]
   [junit4]   2> 53703 INFO  (coreLoadExecutor-169-thread-1-processing-n:127.0.0.1:54578_bcab%2Fqk) [n:127.0.0.1:54578_bcab%2Fqk c:collection1   x:collection1] o.a.s.c.c.ZkStateReader path=[/collections/collection1] [configName]=[conf1] specified config exists in ZooKeeper
   [junit4]   2> 53703 INFO  (coreLoadExecutor-169-thread-1-processing-n:127.0.0.1:54578_bcab%2Fqk) [n:127.0.0.1:54578_bcab%2Fqk c:collection1   x:collection1] o.a.s.c.SolrResourceLoader new SolrResourceLoader for directory: '/export/home/jenkins/workspace/Lucene-Solr-master-Solaris/solr/build/solr-core/test/J0/temp/solr.cloud.DistribDocExpirationUpdateProcessorTest_1C3BD10017CBEAE7-001/shard-1-001/cores/collection1'
   [junit4]   2> 53703 INFO  (coreLoadExecutor-169-thread-1-processing-n:127.0.0.1:54578_bcab%2Fqk) [n:127.0.0.1:54578_bcab%2Fqk c:collection1   x:collection1] o.a.s.c.SolrResourceLoader JNDI not configured for solr (NoInitialContextEx)
   [junit4]   2> 53703 INFO  (coreLoadExecutor-169-thread-1-processing-n:127.0.0.1:54578_bcab%2Fqk) [n:127.0.0.1:54578_bcab%2Fqk c:collection1   x:collection1] o.a.s.c.SolrResourceLoader solr home defaulted to 'solr/' (could not find system property or JNDI)
   [junit4]   2> 53706 INFO  (coreLoadExecutor-169-thread-1-processing-n:127.0.0.1:54578_bcab%2Fqk) [n:127.0.0.1:54578_bcab%2Fqk c:collection1   x:collection1] o.a.s.c.Config loaded config solrconfig.xml with version 0 
   [junit4]   2> 53714 INFO  (coreLoadExecutor-169-thread-1-processing-n:127.0.0.1:54578_bcab%2Fqk) [n:127.0.0.1:54578_bcab%2Fqk c:collection1   x:collection1] o.a.s.c.SolrConfig current version of requestparams : -1
   [junit4]   2> 53716 WARN  (coreLoadExecutor-169-thread-1-processing-n:127.0.0.1:54578_bcab%2Fqk) [n:127.0.0.1:54578_bcab%2Fqk c:collection1   x:collection1] o.a.s.c.Config Beginning with Solr 5.5, <mergePolicy> is deprecated, use <mergePolicyFactory> instead.
   [junit4]   2> 53716 INFO  (coreLoadExecutor-169-thread-1-processing-n:127.0.0.1:54578_bcab%2Fqk) [n:127.0.0.1:54578_bcab%2Fqk c:collection1   x:collection1] o.a.s.c.SolrConfig Using Lucene MatchVersion: 7.0.0
   [junit4]   2> 53721 INFO  (coreLoadExecutor-169-thread-1-processing-n:127.0.0.1:54578_bcab%2Fqk) [n:127.0.0.1:54578_bcab%2Fqk c:collection1   x:collection1] o.a.s.c.SolrConfig Loaded SolrConfig: solrconfig.xml
   [junit4]   2> 53729 INFO  (coreLoadExecutor-169-thread-1-processing-n:127.0.0.1:54578_bcab%2Fqk) [n:127.0.0.1:54578_bcab%2Fqk c:collection1   x:collection1] o.a.s.s.IndexSchema [collection1] Schema name=test
   [junit4]   2> 53798 INFO  (coreLoadExecutor-169-thread-1-processing-n:127.0.0.1:54578_bcab%2Fqk) [n:127.0.0.1:54578_bcab%2Fqk c:collection1   x:collection1] o.a.s.s.IndexSchema default search field in schema is text
   [junit4]   2> 53799 INFO  (coreLoadExecutor-169-thread-1-processing-n:127.0.0.1:54578_bcab%2Fqk) [n:127.0.0.1:54578_bcab%2Fqk c:collection1   x:collection1] o.a.s.s.IndexSchema unique key field: id
   [junit4]   2> 53800 INFO  (coreLoadExecutor-169-thread-1-processing-n:127.0.0.1:54578_bcab%2Fqk) [n:127.0.0.1:54578_bcab%2Fqk c:collection1   x:collection1] o.a.s.s.FileExchangeRateProvider Reloading exchange rates from file currency.xml
   [junit4]   2> 53803 INFO  (coreLoadExecutor-169-thread-1-processing-n:127.0.0.1:54578_bcab%2Fqk) [n:127.0.0.1:54578_bcab%2Fqk c:collection1   x:collection1] o.a.s.s.FileExchangeRateProvider Reloading exchange rates from file currency.xml
   [junit4]   2> 53829 INFO  (coreLoadExecutor-169-thread-1-processing-n:127.0.0.1:54578_bcab%2Fqk) [n:127.0.0.1:54578_bcab%2Fqk c:collection1   x:collection1] o.a.s.c.ConfigSetProperties Did not find ConfigSet properties, assuming default properties: Can't find resource 'configsetprops.json' in classpath or '/configs/conf1', cwd=/export/home/jenkins/workspace/Lucene-Solr-master-Solaris/solr/build/solr-core/test/J0
   [junit4]   2> 53829 INFO  (coreLoadExecutor-169-thread-1-processing-n:127.0.0.1:54578_bcab%2Fqk) [n:127.0.0.1:54578_bcab%2Fqk c:collection1   x:collection1] o.a.s.c.CoreContainer Creating SolrCore 'collection1' using configuration from collection collection1
   [junit4]   2> 53830 INFO  (coreLoa

[...truncated too long message...]

erCloser
   [junit4]   2> 117179 INFO  (zkCallback-67-thread-2-processing-n:127.0.0.1:45767_bcab%2Fqk) [n:127.0.0.1:45767_bcab%2Fqk c:collection1 s:shard1 r:core_node4 x:collection1] o.a.s.u.DirectUpdateHandler2 Committing on IndexWriter close.
   [junit4]   2> 117179 INFO  (zkCallback-67-thread-2-processing-n:127.0.0.1:45767_bcab%2Fqk) [n:127.0.0.1:45767_bcab%2Fqk c:collection1 s:shard1 r:core_node4 x:collection1] o.a.s.c.SolrDeletionPolicy SolrDeletionPolicy.onCommit: commits: num=2
   [junit4]   2> 	commit{dir=MockDirectoryWrapper(RAMDirectory@7284f446 lockFactory=org.apache.lucene.store.SingleInstanceLockFactory@5408cd93),segFN=segments_3,generation=3}
   [junit4]   2> 	commit{dir=MockDirectoryWrapper(RAMDirectory@7284f446 lockFactory=org.apache.lucene.store.SingleInstanceLockFactory@5408cd93),segFN=segments_4,generation=4}
   [junit4]   2> 117179 INFO  (zkCallback-67-thread-2-processing-n:127.0.0.1:45767_bcab%2Fqk) [n:127.0.0.1:45767_bcab%2Fqk c:collection1 s:shard1 r:core_node4 x:collection1] o.a.s.c.SolrDeletionPolicy newest commit generation = 4
   [junit4]   2> 117182 INFO  (zkCallback-67-thread-2-processing-n:127.0.0.1:45767_bcab%2Fqk) [n:127.0.0.1:45767_bcab%2Fqk c:collection1 s:shard1 r:core_node4 x:collection1] o.a.s.c.SolrCore [collection1] Closing main searcher on request.
   [junit4]   2> 117182 INFO  (zkCallback-67-thread-2-processing-n:127.0.0.1:45767_bcab%2Fqk) [n:127.0.0.1:45767_bcab%2Fqk c:collection1 s:shard1 r:core_node4 x:collection1] o.a.s.c.CachingDirectoryFactory Closing MockDirectoryFactory - 2 directories currently being tracked
   [junit4]   2> 117182 INFO  (zkCallback-67-thread-2-processing-n:127.0.0.1:45767_bcab%2Fqk) [n:127.0.0.1:45767_bcab%2Fqk c:collection1 s:shard1 r:core_node4 x:collection1] o.a.s.c.CachingDirectoryFactory looking to close /export/home/jenkins/workspace/Lucene-Solr-master-Solaris/solr/build/solr-core/test/J0/temp/solr.cloud.DistribDocExpirationUpdateProcessorTest_1C3BD10017CBEAE7-001/shard-4-001/cores/collection1/data [CachedDir<<refCount=0;path=/export/home/jenkins/workspace/Lucene-Solr-master-Solaris/solr/build/solr-core/test/J0/temp/solr.cloud.DistribDocExpirationUpdateProcessorTest_1C3BD10017CBEAE7-001/shard-4-001/cores/collection1/data;done=false>>]
   [junit4]   2> 117182 INFO  (zkCallback-67-thread-2-processing-n:127.0.0.1:45767_bcab%2Fqk) [n:127.0.0.1:45767_bcab%2Fqk c:collection1 s:shard1 r:core_node4 x:collection1] o.a.s.c.CachingDirectoryFactory Closing directory: /export/home/jenkins/workspace/Lucene-Solr-master-Solaris/solr/build/solr-core/test/J0/temp/solr.cloud.DistribDocExpirationUpdateProcessorTest_1C3BD10017CBEAE7-001/shard-4-001/cores/collection1/data
   [junit4]   2> 117182 INFO  (zkCallback-67-thread-2-processing-n:127.0.0.1:45767_bcab%2Fqk) [n:127.0.0.1:45767_bcab%2Fqk c:collection1 s:shard1 r:core_node4 x:collection1] o.a.s.c.CachingDirectoryFactory looking to close /export/home/jenkins/workspace/Lucene-Solr-master-Solaris/solr/build/solr-core/test/J0/temp/solr.cloud.DistribDocExpirationUpdateProcessorTest_1C3BD10017CBEAE7-001/shard-4-001/cores/collection1/data/index [CachedDir<<refCount=0;path=/export/home/jenkins/workspace/Lucene-Solr-master-Solaris/solr/build/solr-core/test/J0/temp/solr.cloud.DistribDocExpirationUpdateProcessorTest_1C3BD10017CBEAE7-001/shard-4-001/cores/collection1/data/index;done=false>>]
   [junit4]   2> 117182 INFO  (zkCallback-67-thread-2-processing-n:127.0.0.1:45767_bcab%2Fqk) [n:127.0.0.1:45767_bcab%2Fqk c:collection1 s:shard1 r:core_node4 x:collection1] o.a.s.c.CachingDirectoryFactory Closing directory: /export/home/jenkins/workspace/Lucene-Solr-master-Solaris/solr/build/solr-core/test/J0/temp/solr.cloud.DistribDocExpirationUpdateProcessorTest_1C3BD10017CBEAE7-001/shard-4-001/cores/collection1/data/index
   [junit4]   2> 117186 INFO  (TEST-DistribDocExpirationUpdateProcessorTest.test-seed#[1C3BD10017CBEAE7]) [    ] o.e.j.s.ServerConnector Stopped ServerConnector@1cfe7d8b{HTTP/1.1,[http/1.1]}{127.0.0.1:0}
   [junit4]   2> 117186 INFO  (TEST-DistribDocExpirationUpdateProcessorTest.test-seed#[1C3BD10017CBEAE7]) [    ] o.e.j.s.h.ContextHandler Stopped o.e.j.s.ServletContextHandler@7db713ba{/bcab/qk,null,UNAVAILABLE}
   [junit4]   2> 117191 INFO  (TEST-DistribDocExpirationUpdateProcessorTest.test-seed#[1C3BD10017CBEAE7]) [    ] o.a.s.c.ZkTestServer connecting to 127.0.0.1:43203 43203
   [junit4]   2> 117316 WARN  (NIOServerCxn.Factory:0.0.0.0/0.0.0.0:0) [    ] o.a.z.s.NIOServerCnxnFactory Ignoring unexpected runtime exception
   [junit4]   2> java.nio.channels.CancelledKeyException
   [junit4]   2> 	at sun.nio.ch.SelectionKeyImpl.ensureValid(SelectionKeyImpl.java:73)
   [junit4]   2> 	at sun.nio.ch.SelectionKeyImpl.readyOps(SelectionKeyImpl.java:87)
   [junit4]   2> 	at org.apache.zookeeper.server.NIOServerCnxnFactory.run(NIOServerCnxnFactory.java:187)
   [junit4]   2> 	at java.lang.Thread.run(Thread.java:745)
   [junit4]   2> 117317 INFO  (Thread-80) [    ] o.a.s.c.ZkTestServer connecting to 127.0.0.1:43203 43203
   [junit4]   2> 117318 WARN  (Thread-80) [    ] o.a.s.c.ZkTestServer Watch limit violations: 
   [junit4]   2> Maximum concurrent create/delete watches above limit:
   [junit4]   2> 
   [junit4]   2> 	6	/solr/aliases.json
   [junit4]   2> 	5	/solr/security.json
   [junit4]   2> 	5	/solr/configs/conf1
   [junit4]   2> 
   [junit4]   2> Maximum concurrent data watches above limit:
   [junit4]   2> 
   [junit4]   2> 	6	/solr/clusterstate.json
   [junit4]   2> 
   [junit4]   2> Maximum concurrent children watches above limit:
   [junit4]   2> 
   [junit4]   2> 	6	/solr/live_nodes
   [junit4]   2> 	6	/solr/collections
   [junit4]   2> 	4	/solr/overseer/queue
   [junit4]   2> 	4	/solr/overseer/collection-queue-work
   [junit4]   2> 	3	/solr/overseer/queue-work
   [junit4]   2> 
   [junit4]   2> NOTE: reproduce with: ant test  -Dtestcase=DistribDocExpirationUpdateProcessorTest -Dtests.method=test -Dtests.seed=1C3BD10017CBEAE7 -Dtests.slow=true -Dtests.locale=en-NZ -Dtests.timezone=SystemV/AST4ADT -Dtests.asserts=true -Dtests.file.encoding=US-ASCII
   [junit4] FAILURE 68.1s J0 | DistribDocExpirationUpdateProcessorTest.test <<<
   [junit4]    > Throwable #1: java.lang.AssertionError: There are still nodes recoverying - waited for 45 seconds
   [junit4]    > 	at __randomizedtesting.SeedInfo.seed([1C3BD10017CBEAE7:946FEEDAB937871F]:0)
   [junit4]    > 	at org.apache.solr.cloud.AbstractDistribZkTestBase.waitForRecoveriesToFinish(AbstractDistribZkTestBase.java:173)
   [junit4]    > 	at org.apache.solr.cloud.AbstractFullDistribZkTestBase.waitForRecoveriesToFinish(AbstractFullDistribZkTestBase.java:856)
   [junit4]    > 	at org.apache.solr.cloud.DistribDocExpirationUpdateProcessorTest.test(DistribDocExpirationUpdateProcessorTest.java:73)
   [junit4]    > 	at org.apache.solr.BaseDistributedSearchTestCase$ShardsRepeatRule$ShardsFixedStatement.callStatement(BaseDistributedSearchTestCase.java:996)
   [junit4]    > 	at org.apache.solr.BaseDistributedSearchTestCase$ShardsRepeatRule$ShardsStatement.evaluate(BaseDistributedSearchTestCase.java:971)
   [junit4]    > 	at java.lang.Thread.run(Thread.java:745)
   [junit4]   2> 117322 INFO  (SUITE-DistribDocExpirationUpdateProcessorTest-seed#[1C3BD10017CBEAE7]-worker) [    ] o.a.s.SolrTestCaseJ4 ###deleteCore
   [junit4]   2> NOTE: leaving temporary files on disk at: /export/home/jenkins/workspace/Lucene-Solr-master-Solaris/solr/build/solr-core/test/J0/temp/solr.cloud.DistribDocExpirationUpdateProcessorTest_1C3BD10017CBEAE7-001
   [junit4]   2> Mar 18, 2016 4:27:10 PM com.carrotsearch.randomizedtesting.ThreadLeakControl checkThreadLeaks
   [junit4]   2> WARNING: Will linger awaiting termination of 1 leaked thread(s).
   [junit4]   2> NOTE: test params are: codec=Asserting(Lucene60): {_version_=PostingsFormat(name=MockRandom), id=TestBloomFilteredLucenePostings(BloomFilteringPostingsFormat(Lucene50(blocksize=128)))}, docValues:{}, maxPointsInLeafNode=760, maxMBSortInHeap=5.753151392654731, sim=RandomSimilarity(queryNorm=true,coord=no): {}, locale=en-NZ, timezone=SystemV/AST4ADT
   [junit4]   2> NOTE: SunOS 5.11 amd64/Oracle Corporation 1.8.0_72 (64-bit)/cpus=3,threads=1,free=59091320,total=214958080
   [junit4]   2> NOTE: All tests run in this JVM: [TestFastLRUCache, SimpleFacetsTest, DistributedQueueTest, TestSolrQueryParserResource, SuggesterFSTTest, TestCollationFieldDocValues, DeleteStatusTest, TestSchemaSimilarityResource, ParsingFieldUpdateProcessorsTest, TestHashQParserPlugin, TestSolrXml, HdfsChaosMonkeySafeLeaderTest, TestSortingResponseWriter, DistribDocExpirationUpdateProcessorTest]
   [junit4] Completed [20/580 (1!)] on J0 in 68.88s, 1 test, 1 failure <<< FAILURES!

[...truncated 1817 lines...]
BUILD FAILED
/export/home/jenkins/workspace/Lucene-Solr-master-Solaris/build.xml:740: The following error occurred while executing this line:
/export/home/jenkins/workspace/Lucene-Solr-master-Solaris/build.xml:684: The following error occurred while executing this line:
/export/home/jenkins/workspace/Lucene-Solr-master-Solaris/build.xml:59: The following error occurred while executing this line:
/export/home/jenkins/workspace/Lucene-Solr-master-Solaris/solr/build.xml:233: The following error occurred while executing this line:
/export/home/jenkins/workspace/Lucene-Solr-master-Solaris/solr/common-build.xml:526: The following error occurred while executing this line:
/export/home/jenkins/workspace/Lucene-Solr-master-Solaris/lucene/common-build.xml:1457: The following error occurred while executing this line:
/export/home/jenkins/workspace/Lucene-Solr-master-Solaris/lucene/common-build.xml:1014: There were test failures: 580 suites (10 ignored), 2320 tests, 1 failure, 86 ignored (70 assumptions) [seed: 1C3BD10017CBEAE7]

Total time: 75 minutes 3 seconds
Build step 'Invoke Ant' marked build as failure
Archiving artifacts
[WARNINGS] Skipping publisher since build result is FAILURE
Recording test results
Email was triggered for: Failure - Any
Sending email for trigger: Failure - Any



Mime
View raw message