lucene-dev mailing list archives

Site index · List index
Message view « Date » · « Thread »
Top « Date » · « Thread »
From Policeman Jenkins Server <jenk...@thetaphi.de>
Subject [JENKINS-EA] Lucene-Solr-5.5-Linux (32bit/jdk-9-ea+107) - Build # 195 - Failure!
Date Wed, 02 Mar 2016 20:33:32 GMT
Build: http://jenkins.thetaphi.de/job/Lucene-Solr-5.5-Linux/195/
Java: 32bit/jdk-9-ea+107 -server -XX:+UseConcMarkSweepGC

1 tests failed.
FAILED:  org.apache.solr.cloud.CollectionsAPIDistributedZkTest.test

Error Message:
Error from server at http://127.0.0.1:54385/z_sl/awholynewcollection_0: non ok status: 500, message:Server Error

Stack Trace:
org.apache.solr.client.solrj.impl.HttpSolrClient$RemoteSolrException: Error from server at http://127.0.0.1:54385/z_sl/awholynewcollection_0: non ok status: 500, message:Server Error
	at __randomizedtesting.SeedInfo.seed([C387C3BEE221F6:8897B819101E4C0E]:0)
	at org.apache.solr.client.solrj.impl.HttpSolrClient.executeMethod(HttpSolrClient.java:511)
	at org.apache.solr.client.solrj.impl.HttpSolrClient.request(HttpSolrClient.java:240)
	at org.apache.solr.client.solrj.impl.HttpSolrClient.request(HttpSolrClient.java:229)
	at org.apache.solr.client.solrj.SolrRequest.process(SolrRequest.java:149)
	at org.apache.solr.client.solrj.SolrClient.query(SolrClient.java:942)
	at org.apache.solr.client.solrj.SolrClient.query(SolrClient.java:957)
	at org.apache.solr.cloud.AbstractFullDistribZkTestBase.waitForNon403or404or503(AbstractFullDistribZkTestBase.java:1753)
	at org.apache.solr.cloud.CollectionsAPIDistributedZkTest.testCollectionsAPI(CollectionsAPIDistributedZkTest.java:717)
	at org.apache.solr.cloud.CollectionsAPIDistributedZkTest.test(CollectionsAPIDistributedZkTest.java:160)
	at sun.reflect.NativeMethodAccessorImpl.invoke0(Native Method)
	at sun.reflect.NativeMethodAccessorImpl.invoke(NativeMethodAccessorImpl.java:62)
	at sun.reflect.DelegatingMethodAccessorImpl.invoke(DelegatingMethodAccessorImpl.java:43)
	at java.lang.reflect.Method.invoke(Method.java:520)
	at com.carrotsearch.randomizedtesting.RandomizedRunner.invoke(RandomizedRunner.java:1764)
	at com.carrotsearch.randomizedtesting.RandomizedRunner$8.evaluate(RandomizedRunner.java:871)
	at com.carrotsearch.randomizedtesting.RandomizedRunner$9.evaluate(RandomizedRunner.java:907)
	at com.carrotsearch.randomizedtesting.RandomizedRunner$10.evaluate(RandomizedRunner.java:921)
	at org.apache.solr.BaseDistributedSearchTestCase$ShardsRepeatRule$ShardsFixedStatement.callStatement(BaseDistributedSearchTestCase.java:964)
	at org.apache.solr.BaseDistributedSearchTestCase$ShardsRepeatRule$ShardsStatement.evaluate(BaseDistributedSearchTestCase.java:939)
	at com.carrotsearch.randomizedtesting.rules.SystemPropertiesRestoreRule$1.evaluate(SystemPropertiesRestoreRule.java:57)
	at org.apache.lucene.util.TestRuleSetupTeardownChained$1.evaluate(TestRuleSetupTeardownChained.java:49)
	at org.apache.lucene.util.AbstractBeforeAfterRule$1.evaluate(AbstractBeforeAfterRule.java:45)
	at org.apache.lucene.util.TestRuleThreadAndTestName$1.evaluate(TestRuleThreadAndTestName.java:48)
	at org.apache.lucene.util.TestRuleIgnoreAfterMaxFailures$1.evaluate(TestRuleIgnoreAfterMaxFailures.java:64)
	at org.apache.lucene.util.TestRuleMarkFailure$1.evaluate(TestRuleMarkFailure.java:47)
	at com.carrotsearch.randomizedtesting.rules.StatementAdapter.evaluate(StatementAdapter.java:36)
	at com.carrotsearch.randomizedtesting.ThreadLeakControl$StatementRunner.run(ThreadLeakControl.java:367)
	at com.carrotsearch.randomizedtesting.ThreadLeakControl.forkTimeoutingTask(ThreadLeakControl.java:809)
	at com.carrotsearch.randomizedtesting.ThreadLeakControl$3.evaluate(ThreadLeakControl.java:460)
	at com.carrotsearch.randomizedtesting.RandomizedRunner.runSingleTest(RandomizedRunner.java:880)
	at com.carrotsearch.randomizedtesting.RandomizedRunner$5.evaluate(RandomizedRunner.java:781)
	at com.carrotsearch.randomizedtesting.RandomizedRunner$6.evaluate(RandomizedRunner.java:816)
	at com.carrotsearch.randomizedtesting.RandomizedRunner$7.evaluate(RandomizedRunner.java:827)
	at com.carrotsearch.randomizedtesting.rules.StatementAdapter.evaluate(StatementAdapter.java:36)
	at com.carrotsearch.randomizedtesting.rules.SystemPropertiesRestoreRule$1.evaluate(SystemPropertiesRestoreRule.java:57)
	at org.apache.lucene.util.AbstractBeforeAfterRule$1.evaluate(AbstractBeforeAfterRule.java:45)
	at com.carrotsearch.randomizedtesting.rules.StatementAdapter.evaluate(StatementAdapter.java:36)
	at org.apache.lucene.util.TestRuleStoreClassName$1.evaluate(TestRuleStoreClassName.java:41)
	at com.carrotsearch.randomizedtesting.rules.NoShadowingOrOverridesOnMethodsRule$1.evaluate(NoShadowingOrOverridesOnMethodsRule.java:40)
	at com.carrotsearch.randomizedtesting.rules.NoShadowingOrOverridesOnMethodsRule$1.evaluate(NoShadowingOrOverridesOnMethodsRule.java:40)
	at com.carrotsearch.randomizedtesting.rules.StatementAdapter.evaluate(StatementAdapter.java:36)
	at com.carrotsearch.randomizedtesting.rules.StatementAdapter.evaluate(StatementAdapter.java:36)
	at com.carrotsearch.randomizedtesting.rules.StatementAdapter.evaluate(StatementAdapter.java:36)
	at org.apache.lucene.util.TestRuleAssertionsRequired$1.evaluate(TestRuleAssertionsRequired.java:53)
	at org.apache.lucene.util.TestRuleMarkFailure$1.evaluate(TestRuleMarkFailure.java:47)
	at org.apache.lucene.util.TestRuleIgnoreAfterMaxFailures$1.evaluate(TestRuleIgnoreAfterMaxFailures.java:64)
	at org.apache.lucene.util.TestRuleIgnoreTestSuites$1.evaluate(TestRuleIgnoreTestSuites.java:54)
	at com.carrotsearch.randomizedtesting.rules.StatementAdapter.evaluate(StatementAdapter.java:36)
	at com.carrotsearch.randomizedtesting.ThreadLeakControl$StatementRunner.run(ThreadLeakControl.java:367)
	at java.lang.Thread.run(Thread.java:804)




Build Log:
[...truncated 11716 lines...]
   [junit4] Suite: org.apache.solr.cloud.CollectionsAPIDistributedZkTest
   [junit4]   2> Creating dataDir: /home/jenkins/workspace/Lucene-Solr-5.5-Linux/solr/build/solr-core/test/J0/temp/solr.cloud.CollectionsAPIDistributedZkTest_C387C3BEE221F6-001/init-core-data-001
   [junit4]   2> 828673 INFO  (SUITE-CollectionsAPIDistributedZkTest-seed#[C387C3BEE221F6]-worker) [    ] o.a.s.SolrTestCaseJ4 Randomized ssl (false) and clientAuth (false)
   [junit4]   2> 828674 INFO  (SUITE-CollectionsAPIDistributedZkTest-seed#[C387C3BEE221F6]-worker) [    ] o.a.s.BaseDistributedSearchTestCase Setting hostContext system property: /z_sl/
   [junit4]   2> 828675 INFO  (TEST-CollectionsAPIDistributedZkTest.test-seed#[C387C3BEE221F6]) [    ] o.a.s.c.ZkTestServer STARTING ZK TEST SERVER
   [junit4]   2> 828675 INFO  (Thread-2632) [    ] o.a.s.c.ZkTestServer client port:0.0.0.0/0.0.0.0:0
   [junit4]   2> 828675 INFO  (Thread-2632) [    ] o.a.s.c.ZkTestServer Starting server
   [junit4]   2> 828775 INFO  (TEST-CollectionsAPIDistributedZkTest.test-seed#[C387C3BEE221F6]) [    ] o.a.s.c.ZkTestServer start zk server on port:35191
   [junit4]   2> 828776 INFO  (TEST-CollectionsAPIDistributedZkTest.test-seed#[C387C3BEE221F6]) [    ] o.a.s.c.c.SolrZkClient Using default ZkCredentialsProvider
   [junit4]   2> 828776 INFO  (TEST-CollectionsAPIDistributedZkTest.test-seed#[C387C3BEE221F6]) [    ] o.a.s.c.c.ConnectionManager Waiting for client to connect to ZooKeeper
   [junit4]   2> 828777 INFO  (zkCallback-864-thread-1) [    ] o.a.s.c.c.ConnectionManager Watcher org.apache.solr.common.cloud.ConnectionManager@1e0a348 name:ZooKeeperConnection Watcher:127.0.0.1:35191 got event WatchedEvent state:SyncConnected type:None path:null path:null type:None
   [junit4]   2> 828777 INFO  (TEST-CollectionsAPIDistributedZkTest.test-seed#[C387C3BEE221F6]) [    ] o.a.s.c.c.ConnectionManager Client is connected to ZooKeeper
   [junit4]   2> 828778 INFO  (TEST-CollectionsAPIDistributedZkTest.test-seed#[C387C3BEE221F6]) [    ] o.a.s.c.c.SolrZkClient Using default ZkACLProvider
   [junit4]   2> 828778 INFO  (TEST-CollectionsAPIDistributedZkTest.test-seed#[C387C3BEE221F6]) [    ] o.a.s.c.c.SolrZkClient makePath: /solr
   [junit4]   2> 828779 INFO  (TEST-CollectionsAPIDistributedZkTest.test-seed#[C387C3BEE221F6]) [    ] o.a.s.c.c.SolrZkClient Using default ZkCredentialsProvider
   [junit4]   2> 828779 INFO  (TEST-CollectionsAPIDistributedZkTest.test-seed#[C387C3BEE221F6]) [    ] o.a.s.c.c.ConnectionManager Waiting for client to connect to ZooKeeper
   [junit4]   2> 828779 INFO  (zkCallback-865-thread-1) [    ] o.a.s.c.c.ConnectionManager Watcher org.apache.solr.common.cloud.ConnectionManager@1d1be29 name:ZooKeeperConnection Watcher:127.0.0.1:35191/solr got event WatchedEvent state:SyncConnected type:None path:null path:null type:None
   [junit4]   2> 828780 INFO  (TEST-CollectionsAPIDistributedZkTest.test-seed#[C387C3BEE221F6]) [    ] o.a.s.c.c.ConnectionManager Client is connected to ZooKeeper
   [junit4]   2> 828780 INFO  (TEST-CollectionsAPIDistributedZkTest.test-seed#[C387C3BEE221F6]) [    ] o.a.s.c.c.SolrZkClient Using default ZkACLProvider
   [junit4]   2> 828780 INFO  (TEST-CollectionsAPIDistributedZkTest.test-seed#[C387C3BEE221F6]) [    ] o.a.s.c.c.SolrZkClient makePath: /collections/collection1
   [junit4]   2> 828781 INFO  (TEST-CollectionsAPIDistributedZkTest.test-seed#[C387C3BEE221F6]) [    ] o.a.s.c.c.SolrZkClient makePath: /collections/collection1/shards
   [junit4]   2> 828781 INFO  (TEST-CollectionsAPIDistributedZkTest.test-seed#[C387C3BEE221F6]) [    ] o.a.s.c.c.SolrZkClient makePath: /collections/control_collection
   [junit4]   2> 828781 INFO  (TEST-CollectionsAPIDistributedZkTest.test-seed#[C387C3BEE221F6]) [    ] o.a.s.c.c.SolrZkClient makePath: /collections/control_collection/shards
   [junit4]   2> 828782 INFO  (TEST-CollectionsAPIDistributedZkTest.test-seed#[C387C3BEE221F6]) [    ] o.a.s.c.AbstractZkTestCase put /home/jenkins/workspace/Lucene-Solr-5.5-Linux/solr/core/src/test-files/solr/collection1/conf/solrconfig-tlog.xml to /configs/conf1/solrconfig.xml
   [junit4]   2> 828782 INFO  (TEST-CollectionsAPIDistributedZkTest.test-seed#[C387C3BEE221F6]) [    ] o.a.s.c.c.SolrZkClient makePath: /configs/conf1/solrconfig.xml
   [junit4]   2> 828783 INFO  (TEST-CollectionsAPIDistributedZkTest.test-seed#[C387C3BEE221F6]) [    ] o.a.s.c.AbstractZkTestCase put /home/jenkins/workspace/Lucene-Solr-5.5-Linux/solr/core/src/test-files/solr/collection1/conf/schema.xml to /configs/conf1/schema.xml
   [junit4]   2> 828783 INFO  (TEST-CollectionsAPIDistributedZkTest.test-seed#[C387C3BEE221F6]) [    ] o.a.s.c.c.SolrZkClient makePath: /configs/conf1/schema.xml
   [junit4]   2> 828783 INFO  (TEST-CollectionsAPIDistributedZkTest.test-seed#[C387C3BEE221F6]) [    ] o.a.s.c.AbstractZkTestCase put /home/jenkins/workspace/Lucene-Solr-5.5-Linux/solr/core/src/test-files/solr/collection1/conf/solrconfig.snippet.randomindexconfig.xml to /configs/conf1/solrconfig.snippet.randomindexconfig.xml
   [junit4]   2> 828784 INFO  (TEST-CollectionsAPIDistributedZkTest.test-seed#[C387C3BEE221F6]) [    ] o.a.s.c.c.SolrZkClient makePath: /configs/conf1/solrconfig.snippet.randomindexconfig.xml
   [junit4]   2> 828784 INFO  (TEST-CollectionsAPIDistributedZkTest.test-seed#[C387C3BEE221F6]) [    ] o.a.s.c.AbstractZkTestCase put /home/jenkins/workspace/Lucene-Solr-5.5-Linux/solr/core/src/test-files/solr/collection1/conf/stopwords.txt to /configs/conf1/stopwords.txt
   [junit4]   2> 828784 INFO  (TEST-CollectionsAPIDistributedZkTest.test-seed#[C387C3BEE221F6]) [    ] o.a.s.c.c.SolrZkClient makePath: /configs/conf1/stopwords.txt
   [junit4]   2> 828785 INFO  (TEST-CollectionsAPIDistributedZkTest.test-seed#[C387C3BEE221F6]) [    ] o.a.s.c.AbstractZkTestCase put /home/jenkins/workspace/Lucene-Solr-5.5-Linux/solr/core/src/test-files/solr/collection1/conf/protwords.txt to /configs/conf1/protwords.txt
   [junit4]   2> 828785 INFO  (TEST-CollectionsAPIDistributedZkTest.test-seed#[C387C3BEE221F6]) [    ] o.a.s.c.c.SolrZkClient makePath: /configs/conf1/protwords.txt
   [junit4]   2> 828786 INFO  (TEST-CollectionsAPIDistributedZkTest.test-seed#[C387C3BEE221F6]) [    ] o.a.s.c.AbstractZkTestCase put /home/jenkins/workspace/Lucene-Solr-5.5-Linux/solr/core/src/test-files/solr/collection1/conf/currency.xml to /configs/conf1/currency.xml
   [junit4]   2> 828786 INFO  (TEST-CollectionsAPIDistributedZkTest.test-seed#[C387C3BEE221F6]) [    ] o.a.s.c.c.SolrZkClient makePath: /configs/conf1/currency.xml
   [junit4]   2> 828786 INFO  (TEST-CollectionsAPIDistributedZkTest.test-seed#[C387C3BEE221F6]) [    ] o.a.s.c.AbstractZkTestCase put /home/jenkins/workspace/Lucene-Solr-5.5-Linux/solr/core/src/test-files/solr/collection1/conf/enumsConfig.xml to /configs/conf1/enumsConfig.xml
   [junit4]   2> 828786 INFO  (TEST-CollectionsAPIDistributedZkTest.test-seed#[C387C3BEE221F6]) [    ] o.a.s.c.c.SolrZkClient makePath: /configs/conf1/enumsConfig.xml
   [junit4]   2> 828789 INFO  (TEST-CollectionsAPIDistributedZkTest.test-seed#[C387C3BEE221F6]) [    ] o.a.s.c.AbstractZkTestCase put /home/jenkins/workspace/Lucene-Solr-5.5-Linux/solr/core/src/test-files/solr/collection1/conf/open-exchange-rates.json to /configs/conf1/open-exchange-rates.json
   [junit4]   2> 828790 INFO  (TEST-CollectionsAPIDistributedZkTest.test-seed#[C387C3BEE221F6]) [    ] o.a.s.c.c.SolrZkClient makePath: /configs/conf1/open-exchange-rates.json
   [junit4]   2> 828790 INFO  (TEST-CollectionsAPIDistributedZkTest.test-seed#[C387C3BEE221F6]) [    ] o.a.s.c.AbstractZkTestCase put /home/jenkins/workspace/Lucene-Solr-5.5-Linux/solr/core/src/test-files/solr/collection1/conf/mapping-ISOLatin1Accent.txt to /configs/conf1/mapping-ISOLatin1Accent.txt
   [junit4]   2> 828790 INFO  (TEST-CollectionsAPIDistributedZkTest.test-seed#[C387C3BEE221F6]) [    ] o.a.s.c.c.SolrZkClient makePath: /configs/conf1/mapping-ISOLatin1Accent.txt
   [junit4]   2> 828791 INFO  (TEST-CollectionsAPIDistributedZkTest.test-seed#[C387C3BEE221F6]) [    ] o.a.s.c.AbstractZkTestCase put /home/jenkins/workspace/Lucene-Solr-5.5-Linux/solr/core/src/test-files/solr/collection1/conf/old_synonyms.txt to /configs/conf1/old_synonyms.txt
   [junit4]   2> 828791 INFO  (TEST-CollectionsAPIDistributedZkTest.test-seed#[C387C3BEE221F6]) [    ] o.a.s.c.c.SolrZkClient makePath: /configs/conf1/old_synonyms.txt
   [junit4]   2> 828792 INFO  (TEST-CollectionsAPIDistributedZkTest.test-seed#[C387C3BEE221F6]) [    ] o.a.s.c.AbstractZkTestCase put /home/jenkins/workspace/Lucene-Solr-5.5-Linux/solr/core/src/test-files/solr/collection1/conf/synonyms.txt to /configs/conf1/synonyms.txt
   [junit4]   2> 828792 INFO  (TEST-CollectionsAPIDistributedZkTest.test-seed#[C387C3BEE221F6]) [    ] o.a.s.c.c.SolrZkClient makePath: /configs/conf1/synonyms.txt
   [junit4]   2> 828793 INFO  (TEST-CollectionsAPIDistributedZkTest.test-seed#[C387C3BEE221F6]) [    ] o.a.s.c.c.SolrZkClient Using default ZkCredentialsProvider
   [junit4]   2> 828793 INFO  (TEST-CollectionsAPIDistributedZkTest.test-seed#[C387C3BEE221F6]) [    ] o.a.s.c.c.ConnectionManager Waiting for client to connect to ZooKeeper
   [junit4]   2> 828794 INFO  (zkCallback-866-thread-1) [    ] o.a.s.c.c.ConnectionManager Watcher org.apache.solr.common.cloud.ConnectionManager@c0a7cc name:ZooKeeperConnection Watcher:127.0.0.1:35191 got event WatchedEvent state:SyncConnected type:None path:null path:null type:None
   [junit4]   2> 828794 INFO  (TEST-CollectionsAPIDistributedZkTest.test-seed#[C387C3BEE221F6]) [    ] o.a.s.c.c.ConnectionManager Client is connected to ZooKeeper
   [junit4]   2> 828794 INFO  (TEST-CollectionsAPIDistributedZkTest.test-seed#[C387C3BEE221F6]) [    ] o.a.s.c.c.SolrZkClient Using default ZkACLProvider
   [junit4]   2> 828794 INFO  (TEST-CollectionsAPIDistributedZkTest.test-seed#[C387C3BEE221F6]) [    ] o.a.s.c.c.SolrZkClient makePath: /solr
   [junit4]   2> 828794 INFO  (TEST-CollectionsAPIDistributedZkTest.test-seed#[C387C3BEE221F6]) [    ] o.a.s.c.c.SolrZkClient Using default ZkCredentialsProvider
   [junit4]   2> 828795 INFO  (TEST-CollectionsAPIDistributedZkTest.test-seed#[C387C3BEE221F6]) [    ] o.a.s.c.c.ConnectionManager Waiting for client to connect to ZooKeeper
   [junit4]   2> 828795 INFO  (zkCallback-867-thread-1) [    ] o.a.s.c.c.ConnectionManager Watcher org.apache.solr.common.cloud.ConnectionManager@53a66f name:ZooKeeperConnection Watcher:127.0.0.1:35191/solr got event WatchedEvent state:SyncConnected type:None path:null path:null type:None
   [junit4]   2> 828795 INFO  (TEST-CollectionsAPIDistributedZkTest.test-seed#[C387C3BEE221F6]) [    ] o.a.s.c.c.ConnectionManager Client is connected to ZooKeeper
   [junit4]   2> 828795 INFO  (TEST-CollectionsAPIDistributedZkTest.test-seed#[C387C3BEE221F6]) [    ] o.a.s.c.c.SolrZkClient Using default ZkACLProvider
   [junit4]   2> 828796 INFO  (TEST-CollectionsAPIDistributedZkTest.test-seed#[C387C3BEE221F6]) [    ] o.a.s.c.AbstractZkTestCase put /home/jenkins/workspace/Lucene-Solr-5.5-Linux/solr/core/src/test-files/solr/collection1/conf/solrconfig-tlog.xml to /configs/conf2/solrconfig.xml
   [junit4]   2> 828796 INFO  (TEST-CollectionsAPIDistributedZkTest.test-seed#[C387C3BEE221F6]) [    ] o.a.s.c.c.SolrZkClient makePath: /configs/conf2/solrconfig.xml
   [junit4]   2> 828797 INFO  (TEST-CollectionsAPIDistributedZkTest.test-seed#[C387C3BEE221F6]) [    ] o.a.s.c.AbstractZkTestCase put /home/jenkins/workspace/Lucene-Solr-5.5-Linux/solr/core/src/test-files/solr/collection1/conf/schema.xml to /configs/conf2/schema.xml
   [junit4]   2> 828797 INFO  (TEST-CollectionsAPIDistributedZkTest.test-seed#[C387C3BEE221F6]) [    ] o.a.s.c.c.SolrZkClient makePath: /configs/conf2/schema.xml
   [junit4]   2> 828798 INFO  (TEST-CollectionsAPIDistributedZkTest.test-seed#[C387C3BEE221F6]) [    ] o.a.s.c.AbstractZkTestCase put /home/jenkins/workspace/Lucene-Solr-5.5-Linux/solr/core/src/test-files/solr/collection1/conf/enumsConfig.xml to /configs/conf2/enumsConfig.xml
   [junit4]   2> 828798 INFO  (TEST-CollectionsAPIDistributedZkTest.test-seed#[C387C3BEE221F6]) [    ] o.a.s.c.c.SolrZkClient makePath: /configs/conf2/enumsConfig.xml
   [junit4]   2> 828799 INFO  (TEST-CollectionsAPIDistributedZkTest.test-seed#[C387C3BEE221F6]) [    ] o.a.s.c.AbstractZkTestCase put /home/jenkins/workspace/Lucene-Solr-5.5-Linux/solr/core/src/test-files/solr/collection1/conf/solrconfig.snippet.randomindexconfig.xml to /configs/conf2/solrconfig.snippet.randomindexconfig.xml
   [junit4]   2> 828799 INFO  (TEST-CollectionsAPIDistributedZkTest.test-seed#[C387C3BEE221F6]) [    ] o.a.s.c.c.SolrZkClient makePath: /configs/conf2/solrconfig.snippet.randomindexconfig.xml
   [junit4]   2> 828800 INFO  (TEST-CollectionsAPIDistributedZkTest.test-seed#[C387C3BEE221F6]) [    ] o.a.s.c.AbstractZkTestCase put /home/jenkins/workspace/Lucene-Solr-5.5-Linux/solr/core/src/test-files/solr/collection1/conf/stopwords.txt to /configs/conf2/stopwords.txt
   [junit4]   2> 828800 INFO  (TEST-CollectionsAPIDistributedZkTest.test-seed#[C387C3BEE221F6]) [    ] o.a.s.c.c.SolrZkClient makePath: /configs/conf2/stopwords.txt
   [junit4]   2> 828800 INFO  (TEST-CollectionsAPIDistributedZkTest.test-seed#[C387C3BEE221F6]) [    ] o.a.s.c.AbstractZkTestCase put /home/jenkins/workspace/Lucene-Solr-5.5-Linux/solr/core/src/test-files/solr/collection1/conf/protwords.txt to /configs/conf2/protwords.txt
   [junit4]   2> 828800 INFO  (TEST-CollectionsAPIDistributedZkTest.test-seed#[C387C3BEE221F6]) [    ] o.a.s.c.c.SolrZkClient makePath: /configs/conf2/protwords.txt
   [junit4]   2> 828801 INFO  (TEST-CollectionsAPIDistributedZkTest.test-seed#[C387C3BEE221F6]) [    ] o.a.s.c.AbstractZkTestCase put /home/jenkins/workspace/Lucene-Solr-5.5-Linux/solr/core/src/test-files/solr/collection1/conf/currency.xml to /configs/conf2/currency.xml
   [junit4]   2> 828801 INFO  (TEST-CollectionsAPIDistributedZkTest.test-seed#[C387C3BEE221F6]) [    ] o.a.s.c.c.SolrZkClient makePath: /configs/conf2/currency.xml
   [junit4]   2> 828802 INFO  (TEST-CollectionsAPIDistributedZkTest.test-seed#[C387C3BEE221F6]) [    ] o.a.s.c.AbstractZkTestCase put /home/jenkins/workspace/Lucene-Solr-5.5-Linux/solr/core/src/test-files/solr/collection1/conf/open-exchange-rates.json to /configs/conf2/open-exchange-rates.json
   [junit4]   2> 828802 INFO  (TEST-CollectionsAPIDistributedZkTest.test-seed#[C387C3BEE221F6]) [    ] o.a.s.c.c.SolrZkClient makePath: /configs/conf2/open-exchange-rates.json
   [junit4]   2> 828803 INFO  (TEST-CollectionsAPIDistributedZkTest.test-seed#[C387C3BEE221F6]) [    ] o.a.s.c.AbstractZkTestCase put /home/jenkins/workspace/Lucene-Solr-5.5-Linux/solr/core/src/test-files/solr/collection1/conf/mapping-ISOLatin1Accent.txt to /configs/conf2/mapping-ISOLatin1Accent.txt
   [junit4]   2> 828803 INFO  (TEST-CollectionsAPIDistributedZkTest.test-seed#[C387C3BEE221F6]) [    ] o.a.s.c.c.SolrZkClient makePath: /configs/conf2/mapping-ISOLatin1Accent.txt
   [junit4]   2> 828803 INFO  (TEST-CollectionsAPIDistributedZkTest.test-seed#[C387C3BEE221F6]) [    ] o.a.s.c.AbstractZkTestCase put /home/jenkins/workspace/Lucene-Solr-5.5-Linux/solr/core/src/test-files/solr/collection1/conf/old_synonyms.txt to /configs/conf2/old_synonyms.txt
   [junit4]   2> 828803 INFO  (TEST-CollectionsAPIDistributedZkTest.test-seed#[C387C3BEE221F6]) [    ] o.a.s.c.c.SolrZkClient makePath: /configs/conf2/old_synonyms.txt
   [junit4]   2> 828804 INFO  (TEST-CollectionsAPIDistributedZkTest.test-seed#[C387C3BEE221F6]) [    ] o.a.s.c.AbstractZkTestCase put /home/jenkins/workspace/Lucene-Solr-5.5-Linux/solr/core/src/test-files/solr/collection1/conf/synonyms.txt to /configs/conf2/synonyms.txt
   [junit4]   2> 828804 INFO  (TEST-CollectionsAPIDistributedZkTest.test-seed#[C387C3BEE221F6]) [    ] o.a.s.c.c.SolrZkClient makePath: /configs/conf2/synonyms.txt
   [junit4]   2> 828805 INFO  (TEST-CollectionsAPIDistributedZkTest.test-seed#[C387C3BEE221F6]) [    ] o.a.s.c.AbstractZkTestCase put /home/jenkins/workspace/Lucene-Solr-5.5-Linux/solr/core/src/test-files/solr/collection1/conf/elevate.xml to /configs/conf2/elevate.xml
   [junit4]   2> 828805 INFO  (TEST-CollectionsAPIDistributedZkTest.test-seed#[C387C3BEE221F6]) [    ] o.a.s.c.c.SolrZkClient makePath: /configs/conf2/elevate.xml
   [junit4]   2> 828889 INFO  (TEST-CollectionsAPIDistributedZkTest.test-seed#[C387C3BEE221F6]) [    ] o.a.s.SolrTestCaseJ4 Writing core.properties file to /home/jenkins/workspace/Lucene-Solr-5.5-Linux/solr/build/solr-core/test/J0/temp/solr.cloud.CollectionsAPIDistributedZkTest_C387C3BEE221F6-001/control-001/cores/collection1
   [junit4]   2> 828891 INFO  (TEST-CollectionsAPIDistributedZkTest.test-seed#[C387C3BEE221F6]) [    ] o.e.j.s.Server jetty-9.2.13.v20150730
   [junit4]   2> 828892 INFO  (TEST-CollectionsAPIDistributedZkTest.test-seed#[C387C3BEE221F6]) [    ] o.e.j.s.h.ContextHandler Started o.e.j.s.ServletContextHandler@1ead0e5{/z_sl,null,AVAILABLE}
   [junit4]   2> 828895 INFO  (TEST-CollectionsAPIDistributedZkTest.test-seed#[C387C3BEE221F6]) [    ] o.e.j.s.ServerConnector Started ServerConnector@177a1c2{HTTP/1.1}{127.0.0.1:49251}
   [junit4]   2> 828895 INFO  (TEST-CollectionsAPIDistributedZkTest.test-seed#[C387C3BEE221F6]) [    ] o.e.j.s.Server Started @830822ms
   [junit4]   2> 828895 INFO  (TEST-CollectionsAPIDistributedZkTest.test-seed#[C387C3BEE221F6]) [    ] o.a.s.c.s.e.JettySolrRunner Jetty properties: {solr.data.dir=/home/jenkins/workspace/Lucene-Solr-5.5-Linux/solr/build/solr-core/test/J0/temp/solr.cloud.CollectionsAPIDistributedZkTest_C387C3BEE221F6-001/tempDir-001/control/data, hostContext=/z_sl, hostPort=49251, coreRootDirectory=/home/jenkins/workspace/Lucene-Solr-5.5-Linux/solr/build/solr-core/test/J0/temp/solr.cloud.CollectionsAPIDistributedZkTest_C387C3BEE221F6-001/control-001/cores}
   [junit4]   2> 828895 INFO  (TEST-CollectionsAPIDistributedZkTest.test-seed#[C387C3BEE221F6]) [    ] o.a.s.s.SolrDispatchFilter SolrDispatchFilter.init(): sun.misc.Launcher$AppClassLoader@163006a
   [junit4]   2> 828895 INFO  (TEST-CollectionsAPIDistributedZkTest.test-seed#[C387C3BEE221F6]) [    ] o.a.s.c.SolrResourceLoader new SolrResourceLoader for directory: '/home/jenkins/workspace/Lucene-Solr-5.5-Linux/solr/build/solr-core/test/J0/temp/solr.cloud.CollectionsAPIDistributedZkTest_C387C3BEE221F6-001/control-001'
   [junit4]   2> 828896 INFO  (TEST-CollectionsAPIDistributedZkTest.test-seed#[C387C3BEE221F6]) [    ] o.a.s.c.SolrResourceLoader JNDI not configured for solr (NoInitialContextEx)
   [junit4]   2> 828896 INFO  (TEST-CollectionsAPIDistributedZkTest.test-seed#[C387C3BEE221F6]) [    ] o.a.s.c.SolrResourceLoader solr home defaulted to 'solr/' (could not find system property or JNDI)
   [junit4]   2> 828896 INFO  (TEST-CollectionsAPIDistributedZkTest.test-seed#[C387C3BEE221F6]) [    ] o.a.s.c.c.SolrZkClient Using default ZkCredentialsProvider
   [junit4]   2> 828896 INFO  (TEST-CollectionsAPIDistributedZkTest.test-seed#[C387C3BEE221F6]) [    ] o.a.s.c.c.ConnectionManager Waiting for client to connect to ZooKeeper
   [junit4]   2> 828897 INFO  (zkCallback-868-thread-1) [    ] o.a.s.c.c.ConnectionManager Watcher org.apache.solr.common.cloud.ConnectionManager@1bc36c name:ZooKeeperConnection Watcher:127.0.0.1:35191/solr got event WatchedEvent state:SyncConnected type:None path:null path:null type:None
   [junit4]   2> 828897 INFO  (TEST-CollectionsAPIDistributedZkTest.test-seed#[C387C3BEE221F6]) [    ] o.a.s.c.c.ConnectionManager Client is connected to ZooKeeper
   [junit4]   2> 828898 INFO  (TEST-CollectionsAPIDistributedZkTest.test-seed#[C387C3BEE221F6]) [    ] o.a.s.c.c.SolrZkClient Using default ZkACLProvider
   [junit4]   2> 828898 INFO  (TEST-CollectionsAPIDistributedZkTest.test-seed#[C387C3BEE221F6]) [    ] o.a.s.s.SolrDispatchFilter Loading solr.xml from SolrHome (not found in ZooKeeper)
   [junit4]   2> 828899 INFO  (TEST-CollectionsAPIDistributedZkTest.test-seed#[C387C3BEE221F6]) [    ] o.a.s.c.SolrXmlConfig Loading container configuration from /home/jenkins/workspace/Lucene-Solr-5.5-Linux/solr/build/solr-core/test/J0/temp/solr.cloud.CollectionsAPIDistributedZkTest_C387C3BEE221F6-001/control-001/solr.xml
   [junit4]   2> 828903 INFO  (TEST-CollectionsAPIDistributedZkTest.test-seed#[C387C3BEE221F6]) [    ] o.a.s.c.CorePropertiesLocator Config-defined core root directory: /home/jenkins/workspace/Lucene-Solr-5.5-Linux/solr/build/solr-core/test/J0/temp/solr.cloud.CollectionsAPIDistributedZkTest_C387C3BEE221F6-001/control-001/cores
   [junit4]   2> 828903 INFO  (TEST-CollectionsAPIDistributedZkTest.test-seed#[C387C3BEE221F6]) [    ] o.a.s.c.CoreContainer New CoreContainer 20783655
   [junit4]   2> 828903 INFO  (TEST-CollectionsAPIDistributedZkTest.test-seed#[C387C3BEE221F6]) [    ] o.a.s.c.CoreContainer Loading cores into CoreContainer [instanceDir=/home/jenkins/workspace/Lucene-Solr-5.5-Linux/solr/build/solr-core/test/J0/temp/solr.cloud.CollectionsAPIDistributedZkTest_C387C3BEE221F6-001/control-001]
   [junit4]   2> 828904 WARN  (TEST-CollectionsAPIDistributedZkTest.test-seed#[C387C3BEE221F6]) [    ] o.a.s.c.CoreContainer Couldn't add files from /home/jenkins/workspace/Lucene-Solr-5.5-Linux/solr/build/solr-core/test/J0/temp/solr.cloud.CollectionsAPIDistributedZkTest_C387C3BEE221F6-001/control-001/lib to classpath: /home/jenkins/workspace/Lucene-Solr-5.5-Linux/solr/build/solr-core/test/J0/temp/solr.cloud.CollectionsAPIDistributedZkTest_C387C3BEE221F6-001/control-001/lib
   [junit4]   2> 828904 INFO  (TEST-CollectionsAPIDistributedZkTest.test-seed#[C387C3BEE221F6]) [    ] o.a.s.h.c.HttpShardHandlerFactory created with socketTimeout : 90000,urlScheme : ,connTimeout : 15000,maxConnectionsPerHost : 20,maxConnections : 10000,corePoolSize : 0,maximumPoolSize : 2147483647,maxThreadIdleTime : 5,sizeOfQueue : -1,fairnessPolicy : false,useRetries : false,
   [junit4]   2> 828905 INFO  (TEST-CollectionsAPIDistributedZkTest.test-seed#[C387C3BEE221F6]) [    ] o.a.s.u.UpdateShardHandler Creating UpdateShardHandler HTTP client with params: socketTimeout=340000&connTimeout=45000&retry=true
   [junit4]   2> 828906 INFO  (TEST-CollectionsAPIDistributedZkTest.test-seed#[C387C3BEE221F6]) [    ] o.a.s.l.LogWatcher SLF4J impl is org.slf4j.impl.Log4jLoggerFactory
   [junit4]   2> 828906 INFO  (TEST-CollectionsAPIDistributedZkTest.test-seed#[C387C3BEE221F6]) [    ] o.a.s.l.LogWatcher Registering Log Listener [Log4j (org.slf4j.impl.Log4jLoggerFactory)]
   [junit4]   2> 828906 INFO  (TEST-CollectionsAPIDistributedZkTest.test-seed#[C387C3BEE221F6]) [    ] o.a.s.c.ZkContainer Zookeeper client=127.0.0.1:35191/solr
   [junit4]   2> 828906 INFO  (TEST-CollectionsAPIDistributedZkTest.test-seed#[C387C3BEE221F6]) [    ] o.a.s.c.ZkController zkHost includes chroot
   [junit4]   2> 828906 INFO  (TEST-CollectionsAPIDistributedZkTest.test-seed#[C387C3BEE221F6]) [    ] o.a.s.c.c.SolrZkClient Using default ZkCredentialsProvider
   [junit4]   2> 828906 INFO  (TEST-CollectionsAPIDistributedZkTest.test-seed#[C387C3BEE221F6]) [    ] o.a.s.c.c.ConnectionManager Waiting for client to connect to ZooKeeper
   [junit4]   2> 828907 INFO  (zkCallback-871-thread-1) [    ] o.a.s.c.c.ConnectionManager Watcher org.apache.solr.common.cloud.ConnectionManager@112550c name:ZooKeeperConnection Watcher:127.0.0.1:35191 got event WatchedEvent state:SyncConnected type:None path:null path:null type:None
   [junit4]   2> 828907 INFO  (TEST-CollectionsAPIDistributedZkTest.test-seed#[C387C3BEE221F6]) [    ] o.a.s.c.c.ConnectionManager Client is connected to ZooKeeper
   [junit4]   2> 828907 INFO  (TEST-CollectionsAPIDistributedZkTest.test-seed#[C387C3BEE221F6]) [    ] o.a.s.c.c.SolrZkClient Using default ZkACLProvider
   [junit4]   2> 828908 INFO  (TEST-CollectionsAPIDistributedZkTest.test-seed#[C387C3BEE221F6]) [    ] o.a.s.c.c.ConnectionManager Waiting for client to connect to ZooKeeper
   [junit4]   2> 828909 INFO  (zkCallback-872-thread-1) [    ] o.a.s.c.c.ConnectionManager Watcher org.apache.solr.common.cloud.ConnectionManager@17717e0 name:ZooKeeperConnection Watcher:127.0.0.1:35191/solr got event WatchedEvent state:SyncConnected type:None path:null path:null type:None
   [junit4]   2> 828909 INFO  (TEST-CollectionsAPIDistributedZkTest.test-seed#[C387C3BEE221F6]) [    ] o.a.s.c.c.ConnectionManager Client is connected to ZooKeeper
   [junit4]   2> 828910 INFO  (TEST-CollectionsAPIDistributedZkTest.test-seed#[C387C3BEE221F6]) [    ] o.a.s.c.c.SolrZkClient makePath: /overseer/queue
   [junit4]   2> 828911 INFO  (TEST-CollectionsAPIDistributedZkTest.test-seed#[C387C3BEE221F6]) [    ] o.a.s.c.c.SolrZkClient makePath: /overseer/collection-queue-work
   [junit4]   2> 828912 INFO  (TEST-CollectionsAPIDistributedZkTest.test-seed#[C387C3BEE221F6]) [    ] o.a.s.c.c.SolrZkClient makePath: /overseer/collection-map-running
   [junit4]   2> 828912 INFO  (TEST-CollectionsAPIDistributedZkTest.test-seed#[C387C3BEE221F6]) [    ] o.a.s.c.c.SolrZkClient makePath: /overseer/collection-map-completed
   [junit4]   2> 828913 INFO  (TEST-CollectionsAPIDistributedZkTest.test-seed#[C387C3BEE221F6]) [    ] o.a.s.c.c.SolrZkClient makePath: /overseer/collection-map-failure
   [junit4]   2> 828914 INFO  (TEST-CollectionsAPIDistributedZkTest.test-seed#[C387C3BEE221F6]) [    ] o.a.s.c.c.SolrZkClient makePath: /live_nodes
   [junit4]   2> 828914 INFO  (TEST-CollectionsAPIDistributedZkTest.test-seed#[C387C3BEE221F6]) [    ] o.a.s.c.c.SolrZkClient makePath: /aliases.json
   [junit4]   2> 828914 INFO  (TEST-CollectionsAPIDistributedZkTest.test-seed#[C387C3BEE221F6]) [    ] o.a.s.c.c.SolrZkClient makePath: /clusterstate.json
   [junit4]   2> 828915 INFO  (TEST-CollectionsAPIDistributedZkTest.test-seed#[C387C3BEE221F6]) [    ] o.a.s.c.c.SolrZkClient makePath: /security.json
   [junit4]   2> 828915 INFO  (TEST-CollectionsAPIDistributedZkTest.test-seed#[C387C3BEE221F6]) [    ] o.a.s.c.ZkController Register node as live in ZooKeeper:/live_nodes/127.0.0.1:49251_z_sl
   [junit4]   2> 828915 INFO  (TEST-CollectionsAPIDistributedZkTest.test-seed#[C387C3BEE221F6]) [    ] o.a.s.c.c.SolrZkClient makePath: /live_nodes/127.0.0.1:49251_z_sl
   [junit4]   2> 828916 INFO  (TEST-CollectionsAPIDistributedZkTest.test-seed#[C387C3BEE221F6]) [    ] o.a.s.c.c.SolrZkClient makePath: /overseer_elect
   [junit4]   2> 828916 INFO  (TEST-CollectionsAPIDistributedZkTest.test-seed#[C387C3BEE221F6]) [    ] o.a.s.c.c.SolrZkClient makePath: /overseer_elect/election
   [junit4]   2> 828916 INFO  (TEST-CollectionsAPIDistributedZkTest.test-seed#[C387C3BEE221F6]) [    ] o.a.s.c.Overseer Overseer (id=null) closing
   [junit4]   2> 828917 INFO  (TEST-CollectionsAPIDistributedZkTest.test-seed#[C387C3BEE221F6]) [    ] o.a.s.c.LeaderElector Joined leadership election with path: /overseer_elect/election/95482670253146118-127.0.0.1:49251_z_sl-n_0000000000
   [junit4]   2> 828917 INFO  (TEST-CollectionsAPIDistributedZkTest.test-seed#[C387C3BEE221F6]) [    ] o.a.s.c.OverseerElectionContext I am going to be the leader 127.0.0.1:49251_z_sl
   [junit4]   2> 828917 INFO  (TEST-CollectionsAPIDistributedZkTest.test-seed#[C387C3BEE221F6]) [    ] o.a.s.c.c.SolrZkClient makePath: /overseer_elect/leader
   [junit4]   2> 828918 INFO  (TEST-CollectionsAPIDistributedZkTest.test-seed#[C387C3BEE221F6]) [    ] o.a.s.c.Overseer Overseer (id=95482670253146118-127.0.0.1:49251_z_sl-n_0000000000) starting
   [junit4]   2> 828918 INFO  (TEST-CollectionsAPIDistributedZkTest.test-seed#[C387C3BEE221F6]) [    ] o.a.s.c.c.SolrZkClient makePath: /overseer/queue-work
   [junit4]   2> 828920 INFO  (TEST-CollectionsAPIDistributedZkTest.test-seed#[C387C3BEE221F6]) [    ] o.a.s.c.OverseerAutoReplicaFailoverThread Starting OverseerAutoReplicaFailoverThread autoReplicaFailoverWorkLoopDelay=10000 autoReplicaFailoverWaitAfterExpiration=10000 autoReplicaFailoverBadNodeExpiration=60000
   [junit4]   2> 828921 INFO  (OverseerCollectionConfigSetProcessor-95482670253146118-127.0.0.1:49251_z_sl-n_0000000000) [    ] o.a.s.c.OverseerTaskProcessor Process current queue of overseer operations
   [junit4]   2> 828921 INFO  (TEST-CollectionsAPIDistributedZkTest.test-seed#[C387C3BEE221F6]) [    ] o.a.s.c.c.ZkStateReader Updating cluster state from ZooKeeper... 
   [junit4]   2> 828921 INFO  (OverseerStateUpdate-95482670253146118-127.0.0.1:49251_z_sl-n_0000000000) [    ] o.a.s.c.Overseer Starting to work on the main queue
   [junit4]   2> 828940 INFO  (TEST-CollectionsAPIDistributedZkTest.test-seed#[C387C3BEE221F6]) [    ] o.a.s.c.CoreContainer Security conf doesn't exist. Skipping setup for authorization module.
   [junit4]   2> 828940 INFO  (TEST-CollectionsAPIDistributedZkTest.test-seed#[C387C3BEE221F6]) [    ] o.a.s.c.CoreContainer No authentication plugin used.
   [junit4]   2> 828940 INFO  (TEST-CollectionsAPIDistributedZkTest.test-seed#[C387C3BEE221F6]) [    ] o.a.s.c.CorePropertiesLocator Looking for core definitions underneath /home/jenkins/workspace/Lucene-Solr-5.5-Linux/solr/build/solr-core/test/J0/temp/solr.cloud.CollectionsAPIDistributedZkTest_C387C3BEE221F6-001/control-001/cores
   [junit4]   2> 828941 INFO  (TEST-CollectionsAPIDistributedZkTest.test-seed#[C387C3BEE221F6]) [    ] o.a.s.c.CoreDescriptor Created CoreDescriptor: {name=collection1, config=solrconfig.xml, transient=false, schema=schema.xml, loadOnStartup=true, configSetProperties=configsetprops.json, collection=control_collection, coreNodeName=, dataDir=data/, shard=}
   [junit4]   2> 828941 INFO  (TEST-CollectionsAPIDistributedZkTest.test-seed#[C387C3BEE221F6]) [    ] o.a.s.c.CorePropertiesLocator Found core collection1 in /home/jenkins/workspace/Lucene-Solr-5.5-Linux/solr/build/solr-core/test/J0/temp/solr.cloud.CollectionsAPIDistributedZkTest_C387C3BEE221F6-001/control-001/cores/collection1
   [junit4]   2> 828941 INFO  (TEST-CollectionsAPIDistributedZkTest.test-seed#[C387C3BEE221F6]) [    ] o.a.s.c.CorePropertiesLocator Found 1 core definitions
   [junit4]   2> 828942 INFO  (TEST-CollectionsAPIDistributedZkTest.test-seed#[C387C3BEE221F6]) [    ] o.a.s.s.SolrDispatchFilter user.dir=/home/jenkins/workspace/Lucene-Solr-5.5-Linux/solr/build/solr-core/test/J0
   [junit4]   2> 828942 INFO  (TEST-CollectionsAPIDistributedZkTest.test-seed#[C387C3BEE221F6]) [    ] o.a.s.s.SolrDispatchFilter SolrDispatchFilter.init() done
   [junit4]   2> 828942 INFO  (coreLoadExecutor-2959-thread-1) [    ] o.a.s.c.ZkController publishing state=down
   [junit4]   2> 828942 INFO  (coreLoadExecutor-2959-thread-1) [    ] o.a.s.c.ZkController numShards not found on descriptor - reading it from system property
   [junit4]   2> 828943 INFO  (OverseerStateUpdate-95482670253146118-127.0.0.1:49251_z_sl-n_0000000000) [    ] o.a.s.c.Overseer processMessage: queueSize: 1, message = {
   [junit4]   2>   "core":"collection1",
   [junit4]   2>   "roles":null,
   [junit4]   2>   "base_url":"http://127.0.0.1:49251/z_sl",
   [junit4]   2>   "node_name":"127.0.0.1:49251_z_sl",
   [junit4]   2>   "numShards":"1",
   [junit4]   2>   "state":"down",
   [junit4]   2>   "shard":null,
   [junit4]   2>   "collection":"control_collection",
   [junit4]   2>   "operation":"state"} current state version: 0
   [junit4]   2> 828943 INFO  (coreLoadExecutor-2959-thread-1) [    ] o.a.s.c.ZkController look for our core node name
   [junit4]   2> 828943 INFO  (OverseerStateUpdate-95482670253146118-127.0.0.1:49251_z_sl-n_0000000000) [    ] o.a.s.c.o.ReplicaMutator Update state numShards=1 message={
   [junit4]   2>   "core":"collection1",
   [junit4]   2>   "roles":null,
   [junit4]   2>   "base_url":"http://127.0.0.1:49251/z_sl",
   [junit4]   2>   "node_name":"127.0.0.1:49251_z_sl",
   [junit4]   2>   "numShards":"1",
   [junit4]   2>   "state":"down",
   [junit4]   2>   "shard":null,
   [junit4]   2>   "collection":"control_collection",
   [junit4]   2>   "operation":"state"}
   [junit4]   2> 828943 INFO  (OverseerStateUpdate-95482670253146118-127.0.0.1:49251_z_sl-n_0000000000) [    ] o.a.s.c.o.ClusterStateMutator building a new cName: control_collection
   [junit4]   2> 828943 INFO  (OverseerStateUpdate-95482670253146118-127.0.0.1:49251_z_sl-n_0000000000) [    ] o.a.s.c.o.ReplicaMutator Assigning new node to shard shard=shard1
   [junit4]   2> 828944 INFO  (zkCallback-872-thread-1) [    ] o.a.s.c.c.ZkStateReader A cluster state change: [WatchedEvent state:SyncConnected type:NodeDataChanged path:/clusterstate.json], has occurred - updating... (live nodes size: [1])
   [junit4]   2> 829943 INFO  (coreLoadExecutor-2959-thread-1) [    ] o.a.s.c.ZkController waiting to find shard id in clusterstate for collection1
   [junit4]   2> 829943 INFO  (coreLoadExecutor-2959-thread-1) [    ] o.a.s.c.ZkController Check for collection zkNode:control_collection
   [junit4]   2> 829950 INFO  (coreLoadExecutor-2959-thread-1) [    ] o.a.s.c.ZkController Collection zkNode exists
   [junit4]   2> 829950 INFO  (coreLoadExecutor-2959-thread-1) [    ] o.a.s.c.c.ZkStateReader Load collection config from: [/collections/control_collection]
   [junit4]   2> 829950 INFO  (coreLoadExecutor-2959-thread-1) [    ] o.a.s.c.c.ZkStateReader path=[/collections/control_collection] [configName]=[conf1] specified config exists in ZooKeeper
   [junit4]   2> 829951 INFO  (coreLoadExecutor-2959-thread-1) [    ] o.a.s.c.SolrResourceLoader new SolrResourceLoader for directory: '/home/jenkins/workspace/Lucene-Solr-5.5-Linux/solr/build/solr-core/test/J0/temp/solr.cloud.CollectionsAPIDistributedZkTest_C387C3BEE221F6-001/control-001/cores/collection1'
   [junit4]   2> 829951 INFO  (coreLoadExecutor-2959-thread-1) [    ] o.a.s.c.SolrResourceLoader JNDI not configured for solr (NoInitialContextEx)
   [junit4]   2> 829951 INFO  (coreLoadExecutor-2959-thread-1) [    ] o.a.s.c.SolrResourceLoader solr home defaulted to 'solr/' (could not find system property or JNDI)
   [junit4]   2> 829951 INFO  (coreLoadExecutor-2959-thread-1) [    ] o.a.s.c.Config loaded config solrconfig.xml with version 0 
   [junit4]   2> 829955 INFO  (coreLoadExecutor-2959-thread-1) [    ] o.a.s.c.SolrConfig current version of requestparams : -1
   [junit4]   2> 829958 INFO  (coreLoadExecutor-2959-thread-1) [    ] o.a.s.c.SolrConfig Using Lucene MatchVersion: 5.5.0
   [junit4]   2> 829966 INFO  (coreLoadExecutor-2959-thread-1) [    ] o.a.s.c.SolrConfig Loaded SolrConfig: solrconfig.xml
   [junit4]   2> 829969 INFO  (coreLoadExecutor-2959-thread-1) [    ] o.a.s.s.IndexSchema [collection1] Schema name=test
   [junit4]   2> 830043 INFO  (coreLoadExecutor-2959-thread-1) [    ] o.a.s.s.OpenExchangeRatesOrgProvider Initialized with rates=open-exchange-rates.json, refreshInterval=1440.
   [junit4]   2> 830050 INFO  (coreLoadExecutor-2959-thread-1) [    ] o.a.s.s.IndexSchema default search field in schema is text
   [junit4]   2> 830051 INFO  (coreLoadExecutor-2959-thread-1) [    ] o.a.s.s.IndexSchema unique key field: id
   [junit4]   2> 830055 INFO  (coreLoadExecutor-2959-thread-1) [    ] o.a.s.s.FileExchangeRateProvider Reloading exchange rates from file currency.xml
   [junit4]   2> 830056 INFO  (coreLoadExecutor-2959-thread-1) [    ] o.a.s.s.FileExchangeRateProvider Reloading exchange rates from file currency.xml
   [junit4]   2> 830057 INFO  (coreLoadExecutor-2959-thread-1) [    ] o.a.s.s.OpenExchangeRatesOrgProvider Reloading exchange rates from open-exchange-rates.json
   [junit4]   2> 830058 INFO  (coreLoadExecutor-2959-thread-1) [    ] o.a.s.s.OpenExchangeRatesOrgProvider Reloading exchange rates from open-exchange-rates.json
   [junit4]   2> 830059 INFO  (coreLoadExecutor-2959-thread-1) [    ] o.a.s.c.ConfigSetProperties Did not find ConfigSet properties, assuming default properties: Can't find resource 'configsetprops.json' in classpath or '/configs/conf1', cwd=/home/jenkins/workspace/Lucene-Solr-5.5-Linux/solr/build/solr-core/test/J0
   [junit4]   2> 830059 INFO  (coreLoadExecutor-2959-thread-1) [    ] o.a.s.c.CoreContainer Creating SolrCore 'collection1' using configuration from collection control_collection
   [junit4]   2> 830059 INFO  (coreLoadExecutor-2959-thread-1) [    ] o.a.s.c.SolrCore org.apache.solr.core.MockDirectoryFactory
   [junit4]   2> 830059 INFO  (coreLoadExecutor-2959-thread-1) [    ] o.a.s.c.SolrCore [[collection1] ] Opening new SolrCore at [/home/jenkins/workspace/Lucene-Solr-5.5-Linux/solr/build/solr-core/test/J0/temp/solr.cloud.CollectionsAPIDistributedZkTest_C387C3BEE221F6-001/control-001/cores/collection1], dataDir=[/home/jenkins/workspace/Lucene-Solr-5.5-Linux/solr/build/solr-core/test/J0/temp/solr.cloud.CollectionsAPIDistributedZkTest_C387C3BEE221F6-001/control-001/cores/collection1/data/]
   [junit4]   2> 830059 INFO  (coreLoadExecutor-2959-thread-1) [    ] o.a.s.c.JmxMonitoredMap JMX monitoring is enabled. Adding Solr mbeans to JMX Server: com.sun.jmx.mbeanserver.JmxMBeanServer@14e0c66
   [junit4]   2> 830059 INFO  (coreLoadExecutor-2959-thread-1) [    ] o.a.s.c.CachingDirectoryFactory return new directory for /home/jenkins/workspace/Lucene-Solr-5.5-Linux/solr/build/solr-core/test/J0/temp/solr.cloud.CollectionsAPIDistributedZkTest_C387C3BEE221F6-001/control-001/cores/collection1/data
   [junit4]   2> 830060 INFO  (coreLoadExecutor-2959-thread-1) [    ] o.a.s.c.SolrCore New index directory detected: old=null new=/home/jenkins/workspace/Lucene-Solr-5.5-Linux/solr/build/solr-core/test/J0/temp/solr.cloud.CollectionsAPIDistributedZkTest_C387C3BEE221F6-001/control-001/cores/collection1/data/index/
   [junit4]   2> 830060 WARN  (coreLoadExecutor-2959-thread-1) [    ] o.a.s.c.SolrCore [collection1] Solr index directory '/home/jenkins/workspace/Lucene-Solr-5.5-Linux/solr/build/solr-core/test/J0/temp/solr.cloud.CollectionsAPIDistributedZkTest_C387C3BEE221F6-001/control-001/cores/collection1/data/index' doesn't exist. Creating new index...
   [junit4]   2> 830060 INFO  (coreLoadExecutor-2959-thread-1) [    ] o.a.s.c.CachingDirectoryFactory return new directory for /home/jenkins/workspace/Lucene-Solr-5.5-Linux/solr/build/solr-core/test/J0/temp/solr.cloud.CollectionsAPIDistributedZkTest_C387C3BEE221F6-001/control-001/cores/collection1/data/index
   [junit4]   2> 830060 INFO  (coreLoadExecutor-2959-thread-1) [    ] o.a.s.u.RandomMergePolicy RandomMergePolicy wrapping class org.apache.lucene.index.TieredMergePolicy: [TieredMergePolicy: maxMergeAtOnce=36, maxMergeAtOnceExplicit=22, maxMergedSegmentMB=75.7216796875, floorSegmentMB=0.6650390625, forceMergeDeletesPctAllowed=16.439724252570254, segmentsPerTier=31.0, maxCFSSegmentSizeMB=8.796093022207999E12, noCFSRatio=1.0
   [junit4]   2> 830060 INFO  (coreLoadExecutor-2959-thread-1) [    ] o.a.s.c.SolrDeletionPolicy SolrDeletionPolicy.onCommit: commits: num=1
   [junit4]   2> 	commit{dir=MockDirectoryWrapper(RAMDirectory@78715c lockFactory=org.apache.lucene.store.SingleInstanceLockFactory@494bf2),segFN=segments_1,generation=1}
   [junit4]   2> 830060 INFO  (coreLoadExecutor-2959-thread-1) [    ] o.a.s.c.SolrDeletionPolicy newest commit generation = 1
   [junit4]   2> 830061 INFO  (OldIndexDirectoryCleanupThreadForCore-collection1) [    ] o.a.s.c.SolrCore Looking for old index directories to cleanup for core collection1 in /home/jenkins/workspace/Lucene-Solr-5.5-Linux/solr/build/solr-core/test/J0/temp/solr.cloud.CollectionsAPIDistributedZkTest_C387C3BEE221F6-001/control-001/cores/collection1/data/
   [junit4]   2> 830061 WARN  (OldIndexDirectoryCleanupThreadForCore-collection1) [    ] o.a.s.c.DirectoryFactory /home/jenkins/workspace/Lucene-Solr-5.5-Linux/solr/build/solr-core/test/J0/temp/solr.cloud.CollectionsAPIDistributedZkTest_C387C3BEE221F6-001/control-001/cores/collection1/data/ does not point to a valid data directory; skipping clean-up of old index directories.
   [junit4]   2> 830062 INFO  (coreLoadExecutor-2959-thread-1) [    ] o.a.s.u.p.UpdateRequestProcessorChain creating updateRequestProcessorChain "nodistrib"
   [junit4]   2> 830062 INFO  (coreLoadExecutor-2959-thread-1) [    ] o.a.s.u.p.UpdateRequestProcessorChain creating updateRequestProcessorChain "dedupe"
   [junit4]   2> 830062 INFO  (coreLoadExecutor-2959-thread-1) [    ] o.a.s.u.p.UpdateRequestProcessorChain inserting DistributedUpdateProcessorFactory into updateRequestProcessorChain "dedupe"
   [junit4]   2> 830062 INFO  (coreLoadExecutor-2959-thread-1) [    ] o.a.s.u.p.UpdateRequestProcessorChain creating updateRequestProcessorChain "stored_sig"
   [junit4]   2> 830062 INFO  (coreLoadExecutor-2959-thread-1) [    ] o.a.s.u.p.UpdateRequestProcessorChain inserting DistributedUpdateProcessorFactory into updateRequestProcessorChain "stored_sig"
   [junit4]   2> 830063 INFO  (coreLoadExecutor-2959-thread-1) [    ] o.a.s.u.p.UpdateRequestProcessorChain creating updateRequestProcessorChain "distrib-dup-test-chain-explicit"
   [junit4]   2> 830063 INFO  (coreLoadExecutor-2959-thread-1) [    ] o.a.s.u.p.UpdateRequestProcessorChain creating updateRequestProcessorChain "distrib-dup-test-chain-implicit"
   [junit4]   2> 830063 INFO  (coreLoadExecutor-2959-thread-1) [    ] o.a.s.u.p.UpdateRequestProcessorChain inserting DistributedUpdateProcessorFactory into updateRequestProcessorChain "distrib-dup-test-chain-implicit"
   [junit4]   2> 830063 INFO  (coreLoadExecutor-2959-thread-1) [    ] o.a.s.c.SolrCore no updateRequestProcessorChain defined as default, creating implicit default
   [junit4]   2> 830063 WARN  (coreLoadExecutor-2959-thread-1) [    ] o.a.s.c.RequestHandlers INVALID paramSet a in requestHandler {type = requestHandler,name = /dump,class = DumpRequestHandler,args = {defaults={a=A,b=B}}}
   [junit4]   2> 830065 INFO  (coreLoadExecutor-2959-thread-1) [    ] o.a.s.h.l.XMLLoader xsltCacheLifetimeSeconds=60
   [junit4]   2> 830066 INFO  (coreLoadExecutor-2959-thread-1) [    ] o.a.s.h.l.XMLLoader xsltCacheLifetimeSeconds=60
   [junit4]   2> 830067 INFO  (coreLoadExecutor-2959-thread-1) [    ] o.a.s.h.l.XMLLoader xsltCacheLifetimeSeconds=60
   [junit4]   2> 830067 INFO  (coreLoadExecutor-2959-thread-1) [    ] o.a.s.h.l.XMLLoader xsltCacheLifetimeSeconds=60
   [junit4]   2> 830070 INFO  (coreLoadExecutor-2959-thread-1) [    ] o.a.s.c.RequestHandlers Registered paths: /admin/mbeans,standard,/dump,/update/csv,/update/json/docs,/admin/luke,/admin/segments,/get,/admin/system,/replication,/admin/properties,/config,/schema,/admin/plugins,/admin/logging,/update/json,/admin/threads,/admin/ping,/update,/admin/file
   [junit4]   2> 830071 INFO  (coreLoadExecutor-2959-thread-1) [    ] o.a.s.c.SolrCore Using default statsCache cache: org.apache.solr.search.stats.LocalStatsCache
   [junit4]   2> 830071 INFO  (coreLoadExecutor-2959-thread-1) [    ] o.a.s.u.UpdateHandler Using UpdateLog implementation: org.apache.solr.update.UpdateLog
   [junit4]   2> 830071 INFO  (coreLoadExecutor-2959-thread-1) [    ] o.a.s.u.UpdateLog Initializing UpdateLog: dataDir= defaultSyncLevel=FLUSH numRecordsToKeep=100 maxNumLogsToKeep=10 numVersionBuckets=65536
   [junit4]   2> 830072 INFO  (coreLoadExecutor-2959-thread-1) [    ] o.a.s.u.CommitTracker Hard AutoCommit: disabled
   [junit4]   2> 830072 INFO  (coreLoadExecutor-2959-thread-1) [    ] o.a.s.u.CommitTracker Soft AutoCommit: disabled
   [junit4]   2> 830072 INFO  (coreLoadExecutor-2959-thread-1) [    ] o.a.s.u.RandomMergePolicy RandomMergePolicy wrapping class org.apache.lucene.index.LogByteSizeMergePolicy: [LogByteSizeMergePolicy: minMergeSize=1677721, mergeFactor=41, maxMergeSize=2147483648, maxMergeSizeForForcedMerge=9223372036854775807, calibrateSizeByDeletes=true, maxMergeDocs=2147483647, maxCFSSegmentSizeMB=8.796093022207999E12, noCFSRatio=1.0]
   [junit4]   2> 830072 INFO  (coreLoadExecutor-2959-thread-1) [    ] o.a.s.c.SolrDeletionPolicy SolrDeletionPolicy.onInit: commits: num=1
   [junit4]   2> 	commit{dir=MockDirectoryWrapper(RAMDirectory@78715c lockFactory=org.apache.lucene.store.SingleInstanceLockFactory@494bf2),segFN=segments_1,generation=1}
   [junit4]   2> 830072 INFO  (coreLoadExecutor-2959-thread-1) [    ] o.a.s.c.SolrDeletionPolicy newest commit generation = 1
   [junit4]   2> 830073 INFO  (coreLoadExecutor-2959-thread-1) [    ] o.a.s.s.SolrIndexSearcher Opening Searcher@1f0726[collection1] main
   [junit4]   2> 830073 INFO  (coreLoadExecutor-2959-thread-1) [    ] o.a.s.c.c.ZkStateReader Load collection config from: [/collections/control_collection]
   [junit4]   2> 830073 INFO  (coreLoadExecutor-2959-thread-1) [    ] o.a.s.c.c.ZkStateReader path=[/collections/control_collection] [configName]=[conf1] specified config exists in ZooKeeper
   [junit4]   2> 830073 INFO  (coreLoadExecutor-2959-thread-1) [    ] o.a.s.r.ManagedResourceStorage Setting up ZooKeeper-based storage for the RestManager with znodeBase: /configs/conf1
   [junit4]   2> 830074 INFO  (coreLoadExecutor-2959-thread-1) [    ] o.a.s.r.ManagedResourceStorage Configured ZooKeeperStorageIO with znodeBase: /configs/conf1
   [junit4]   2> 830074 INFO  (coreLoadExecutor-2959-thread-1) [    ] o.a.s.r.RestManager Initializing RestManager with initArgs: {}
   [junit4]   2> 830074 INFO  (coreLoadExecutor-2959-thread-1) [    ] o.a.s.r.ManagedResourceStorage Reading _rest_managed.json using ZooKeeperStorageIO:path=/configs/conf1
   [junit4]   2> 830074 INFO  (coreLoadExecutor-2959-thread-1) [    ] o.a.s.r.ManagedResourceStorage No data found for znode /configs/conf1/_rest_managed.json
   [junit4]   2> 830074 INFO  (coreLoadExecutor-2959-thread-1) [    ] o.a.s.r.ManagedResourceStorage Loaded null at path _rest_managed.json using ZooKeeperStorageIO:path=/configs/conf1
   [junit4]   2> 830074 INFO  (coreLoadExecutor-2959-thread-1) [    ] o.a.s.r.RestManager Initializing 0 registered ManagedResources
   [junit4]   2> 830074 INFO  (coreLoadExecutor-2959-thread-1) [    ] o.a.s.h.ReplicationHandler Commits will be reserved for  10000
   [junit4]   2> 830075 INFO  (searcherExecutor-2960-thread-1) [    ] o.a.s.c.SolrCore [collection1] Registered new searcher Searcher@1f0726[collection1] main{ExitableDirectoryReader(UninvertingDirectoryReader())}
   [junit4]   2> 830075 INFO  (coreLoadExecutor-2959-thread-1) [    ] o.a.s.u.UpdateLog Looking up max value of version field to seed version buckets
   [junit4]   2> 830075 INFO  (coreLoadExecutor-2959-thread-1) [    ] o.a.s.u.VersionInfo Refreshing highest value of _version_ for 65536 version buckets from index
   [junit4]   2> 830075 INFO  (coreLoadExecutor-2959-thread-1) [    ] o.a.s.u.VersionInfo No terms found for _version_, cannot seed version bucket highest value from index
   [junit4]   2> 830075 INFO  (coreLoadExecutor-2959-thread-1) [    ] o.a.s.u.UpdateLog Could not find max version in index or recent updates, using new clock 1527722725517295616
   [junit4]   2> 830077 INFO  (coreLoadExecutor-2959-thread-1) [    ] o.a.s.u.UpdateLog Took 1.0ms to seed version buckets with highest version 1527722725517295616
   [junit4]   2> 830077 INFO  (coreLoadExecutor-2959-thread-1) [    ] o.a.s.c.ZkController watch zkdir /configs/conf1
   [junit4]   2> 830077 INFO  (coreLoadExecutor-2959-thread-1) [    ] o.a.s.c.CoreContainer registering core: collection1
   [junit4]   2> 830077 INFO  (coreZkRegister-2953-thread-1) [    ] o.a.s.c.ZkController Register replica - core:collection1 address:http://127.0.0.1:49251/z_sl collection:control_collection shard:shard1
   [junit4]   2> 830078 INFO  (coreZkRegister-2953-thread-1) [    ] o.a.s.c.c.SolrZkClient makePath: /collections/control_collection/leader_elect/shard1/election
   [junit4]   2> 830079 INFO  (coreZkRegister-2953-thread-1) [    ] o.a.s.c.LeaderElector Joined leadership election with path: /collections/control_collection/leader_elect/shard1/election/95482670253146118-core_node1-n_0000000000
   [junit4]   2> 830079 INFO  (coreZkRegister-2953-thread-1) [    ] o.a.s.c.ShardLeaderElectionContext Running the leader process for shard=shard1 and weAreReplacement=false and leaderVoteWait=180000
   [junit4]   2> 830080 INFO  (coreZkRegister-2953-thread-1) [    ] o.a.s.c.ShardLeaderElectionContext Enough replicas found to continue.
   [junit4]   2> 830080 INFO  (coreZkRegister-2953-thread-1) [    ] o.a.s.c.ShardLeaderElectionContext I may be the new leader - try and sync
   [junit4]   2> 830080 INFO  (coreZkRegister-2953-thread-1) [    ] o.a.s.c.SyncStrategy Sync replicas to http://127.0.0.1:49251/z_sl/collection1/
   [junit4]   2> 830080 INFO  (coreZkRegister-2953-thread-1) [    ] o.a.s.c.SyncStrategy Sync Success - now sync replicas to me
   [junit4]   2> 830080 INFO  (coreZkRegister-2953-thread-1) [    ] o.a.s.c.SyncStrategy http://127.0.0.1:49251/z_sl/collection1/ has no replicas
   [junit4]   2> 830080 INFO  (OverseerStateUpdate-95482670253146118-127.0.0.1:49251_z_sl-n_0000000000) [    ] o.a.s.c.Overseer processMessage: queueSize: 1, message = {
   [junit4]   2>   "operation":"leader",
   [junit4]   2>   "shard":"shard1",
   [junit4]   2>   "collection":"control_collection"} current state version: 1
   [junit4]   2> 830080 INFO  (coreZkRegister-2953-thread-1) [    ] o.a.s.c.c.SolrZkClient makePath: /collections/control_collection/leaders/shard1
   [junit4]   2> 830082 INFO  (coreZkRegister-2953-thread-1) [    ] o.a.s.c.ShardLeaderElectionContextBase Creating leader registration node
   [junit4]   2> 830082 INFO  (coreZkRegister-2953-thread-1) [    ] o.a.s.c.ShardLeaderElectionContext I am the new leader: http://127.0.0.1:49251/z_sl/collection1/ shard1
   [junit4]   2> 830083 INFO  (OverseerStateUpdate-95482670253146118-127.0.0.1:49251_z_sl-n_0000000000) [    ] o.a.s.c.Overseer processMessage: queueSize: 1, message = {
   [junit4]   2>   "operation":"leader",
   [junit4]   2>   "shard":"shard1",
   [junit4]   2>   "collection":"control_collection",
   [junit4]   2>   "base_url":"http://127.0.0.1:49251/z_sl",
   [junit4]   2>   "core":"collection1",
   [junit4]   2>   "state":"active"} current state version: 1
   [junit4]   2> 830184 INFO  (zkCallback-872-thread-1) [    ] o.a.s.c.c.ZkStateReader A cluster state change: [WatchedEvent state:SyncConnected type:NodeDataChanged path:/clusterstate.json], has occurred - updating... (live nodes size: [1])
   [junit4]   2> 830233 INFO  (coreZkRegister-2953-thread-1) [    ] o.a.s.c.ZkController We are http://127.0.0.1:49251/z_sl/collection1/ and leader is http://127.0.0.1:49251/z_sl/collection1/
   [junit4]   2> 830233 INFO  (coreZkRegister-2953-thread-1) [    ] o.a.s.c.ZkController No LogReplay needed for core=collection1 baseURL=http://127.0.0.1:49251/z_sl
   [junit4]   2> 830233 INFO  (coreZkRegister-2953-thread-1) [    ] o.a.s.c.ZkController I am the leader, no recovery necessary
   [junit4]   2> 830233 INFO  (coreZkRegister-2953-thread-1) [    ] o.a.s.c.ZkController publishing state=active
   [junit4]   2> 830233 INFO  (coreZkRegister-2953-thread-1) [    ] o.a.s.c.ZkController numShards not found on descriptor - reading it from system property
   [junit4]   2> 830234 INFO  (OverseerStateUpdate-95482670253146118-127.0.0.1:49251_z_sl-n_0000000000) [    ] o.a.s.c.Overseer processMessage: queueSize: 1, message = {
   [junit4]   2>   "core":"collection1",
   [junit4]   2>   "core_node_name":"core_node1",
   [junit4]   2>   "roles":null,
   [junit4]   2>   "base_url":"http://127.0.0.1:49251/z_sl",
   [junit4]   2>   "node_name":"127.0.0.1:49251_z_sl",
   [junit4]   2>   "numShards":"1",
   [junit4]   2>   "state":"active",
   [junit4]   2>   "shard":"shard1",
   [junit4]   2>   "collection":"control_collection",
   [junit4]   2>   "operation":"state"} current state version: 2
   [junit4]   2> 830234 INFO  (OverseerStateUpdate-95482670253146118-127.0.0.1:49251_z_sl-n_0000000000) [    ] o.a.s.c.o.ReplicaMutator Update state numShards=1 message={
   [junit4]   2>   "core":"collection1",
   [junit4]   2>   "core_node_name":"core_node1",
   [junit4]   2>   "roles":null,
   [junit4]   2>   "base_url":"http://127.0.0.1:49251/z_sl",
   [junit4]   2>   "node_name":"127.0.0.1:49251_z_sl",
   [junit4]   2>   "numShards":"1",
   [junit4]   2>   "state":"active",
   [junit4]   2>   "shard":"shard1",
   [junit4]   2>   "collection":"control_collection",
   [junit4]   2>   "operation":"state"}
   [junit4]   2> 830336 INFO  (zkCallback-872-thread-2) [    ] o.a.s.c.c.ZkStateReader A cluster state change: [WatchedEvent state:SyncConnected type:NodeDataChanged path:/clusterstate.json], has occurred - updating... (live nodes size: [1])
   [junit4]   2> 830443 INFO  (TEST-CollectionsAPIDistributedZkTest.test-seed#[C387C3BEE221F6]) [    ] o.a.s.c.c.SolrZkClient Using default ZkCredentialsProvider
   [junit4]   2> 830443 INFO  (TEST-CollectionsAPIDistributedZkTest.test-seed#[C387C3BEE221F6]) [    ] o.a.s.c.c.ConnectionManager Waiting for client to connect to ZooKeeper
   [junit4]   2> 830444 INFO  (zkCallback-874-thread-1) [    ] o.a.s.c.c.ConnectionManager Watcher org.apache.solr.common.cloud.ConnectionManager@c78531 name:ZooKeeperConnection Watcher:127.0.0.1:35191/solr got event WatchedEvent state:SyncConnected type:None path:null path:null type:None
   [junit4]   2> 830444 INFO  (TEST-CollectionsAPIDistributedZkTest.test-seed#[C387C3BEE221F6]) [    ] o.a.s.c.c.ConnectionManager Client is connected to ZooKeeper
   [junit4]   2> 830444 INFO  (TEST-CollectionsAPIDistributedZkTest.test-seed#[C387C3BEE221F6]) [    ] o.a.s.c.c.SolrZkClient Using default ZkACLProvider
   [junit4]   2> 830444 INFO  (TEST-CollectionsAPIDistributedZkTest.test-seed#[C387C3BEE221F6]) [    ] o.a.s.c.c.ZkStateReader Updating cluster state from ZooKeeper... 
   [junit4]   2> 830445 INFO  (TEST-CollectionsAPIDistributedZkTest.test-seed#[C387C3BEE221F6]) [    ] o.a.s.c.ChaosMonkey monkey: init - expire sessions:false cause connection loss:false
   [junit4]   2> 830445 INFO  (TEST-CollectionsAPIDistributedZkTest.test-seed#[C387C3BEE221F6]) [    ] o.a.s.c.AbstractFullDistribZkTestBase Creating collection1 with stateFormat=2
   [junit4]   2> 830446 INFO  (TEST-CollectionsAPIDistributedZkTest.test-seed#[C387C3BEE221F6]) [    ] o.a.s.c.c.SolrZkClient Using default ZkCredentialsProvider
   [junit4]   2> 830446 INFO  (TEST-CollectionsAPIDistributedZkTest.test-seed#[C387C3BEE221F6]) [    ] o.a.s.c.c.ConnectionManager Waiting for client to connect to ZooKeeper
   [junit4]   2> 830446 INFO  (zkCallback-875-thread-1) [    ] o.a.s.c.c.ConnectionManager Watcher org.apache.solr.common.cloud.ConnectionManager@514e70 name:ZooKeeperConnection Watcher:127.0.0.1:35191/solr got event WatchedEvent state:SyncConnected type:None path:null path:null type:None
   [junit4]   2> 830446 INFO  (TEST-CollectionsAPIDistributedZkTest.test-seed#[C387C3BEE221F6]) [    ] o.a.s.c.c.ConnectionManager Client is connected to ZooKeeper
   [junit4]   2> 830447 INFO  (TEST-CollectionsAPIDistributedZkTest.test-seed#[C387C3BEE221F6]) [    ] o.a.s.c.c.SolrZkClient Using default ZkACLProvider
   [junit4]   2> 830448 INFO  (OverseerStateUpdate-95482670253146118-127.0.0.1:49251_z_sl-n_0000000000) [    ] o.a.s.c.Overseer processMessage: queueSize: 1, message = {
   [junit4]   2>   "operation":"create",
   [junit4]   2>   "name":"collection1",
   [junit4]   2>   "numShards":"2",
   [junit4]   2>   "stateFormat":"2"} current state version: 3
   [junit4]   2> 830448 INFO  (OverseerStateUpdate-95482670253146118-127.0.0.1:49251_z_sl-n_0000000000) [    ] o.a.s.c.o.ClusterStateMutator building a new cName: collection1
   [junit4]   2> 830511 INFO  (TEST-CollectionsAPIDistributedZkTest.test-seed#[C387C3BEE221F6]) [    ] o.a.s.SolrTestCaseJ4 Writing core.properties file to /home/jenkins/workspace/Lucene-Solr-5.5-Linux/solr/build/solr-core/test/J0/temp/solr.cloud.CollectionsAPIDistributedZkTest_C387C3BEE221F6-001/shard-1-001/cores/collection1
   [junit4]   2> 830511 INFO  (TEST-CollectionsAPIDistributedZkTest.test-seed#[C387C3BEE221F6]) [    ] o.a.s.c.AbstractFullDistribZkTestBase create jetty 1 in directory /home/jenkins/workspace/Lucene-Solr-5.5-Linux/solr/build/solr-core/test/J0/temp/solr.cloud.CollectionsAPIDistributedZkTest_C387C3BEE221F6-001/shard-1-001
   [junit4]   2> 830512 INFO  (TEST-CollectionsAPIDistributedZkTest.test-seed#[C387C3BEE221F6]) [    ] o.e.j.s.Server jetty-9.2.13.v20150730
   [junit4]   2> 830513 INFO  (TEST-CollectionsAPIDistributedZkTest.test-seed#[C387C3BEE221F6]) [    ] o.e.j.s.h.ContextHandler Started o.e.j.s.ServletContextHandler@19f4138{/z_sl,null,AVAILABLE}
   [junit4]   2> 830513 INFO  (TEST-CollectionsAPIDistributedZkTest.test-seed#[C387C3BEE221F6]) [    ] o.e.j.s.ServerConnector Started ServerConnector@cb5e45{HTTP/1.1}{127.0.0.1:57483}
   [junit4]   2> 830513 INFO  (TEST-CollectionsAPIDistributedZkTest.test-seed#[C387C3BEE221F6]) [    ] o.e.j.s.Server Started @832440ms
   [junit4]   2> 830513 INFO  (TEST-CollectionsAPIDistributedZkTest.test-seed#[C387C3BEE221F6]) [    ] o.a.s.c.s.e.JettySolrRunner Jetty properties: {solr.data.dir=/home/jenkins/workspace/Lucene-Solr-5.5-Linux/solr/build/solr-core/test/J0/temp/solr.cloud.CollectionsAPIDistributedZkTest_C387C3BEE221F6-001/tempDir-001/jetty1, solrconfig=solrconfig.xml, hostContext=/z_sl, hostPort=57483, coreRootDirectory=/home/jenkins/workspace/Lucene-Solr-5.5-Linux/solr/build/solr-core/test/J0/../../../../../../../../../home/jenkins/workspace/Lucene-Solr-5.5-Linux/solr/build/solr-core/test/J0/temp/solr.cloud.CollectionsAPIDistributedZkTest_C387C3BEE221F6-001/shard-1-001/cores}
   [junit4]   2> 830513 INFO  (TEST-CollectionsAPIDistributedZkTest.test-seed#[C387C3BEE221F6]) [    ] o.a.s.s.SolrDispatchFilter SolrDispatchFilter.init(): sun.misc.Launcher$AppClassLoader@163006a
   [junit4]   2> 830513 INFO  (TEST-CollectionsAPIDistributedZkTest.test-seed#[C387C3BEE221F6]) [    ] o.a.s.c.SolrResourceLoader new SolrResourceLoader for directory: '/home/jenkins/workspace/Lucene-Solr-5.5-Linux/solr/build/solr-core/test/J0/temp/solr.cloud.CollectionsAPIDistributedZkTest_C387C3BEE221F6-001/shard-1-001'
   [junit4]   2> 830514 INFO  (TEST-CollectionsAPIDistributedZkTest.test-seed#[C387C3BEE221F6]) [    ] o.a.s.c.SolrResourceLoader JNDI not configured for solr (NoInitialContextEx)
   [junit4]   2> 830514 INFO  (TEST-CollectionsAPIDistributedZkTest.test-seed#[C387C3BEE221F6]) [    ] o.a.s.c.SolrResourceLoader solr home defaulted to 'solr/' (could not find system property or JNDI)
   [junit4]   2> 830514 INFO  (TEST-CollectionsAPIDistributedZkTest.test-seed#[C387C3BEE221F6]) [    ] o.a.s.c.c.SolrZkClient Using default ZkCredentialsProvider
   [junit4]   2> 830514 INFO  (TEST-CollectionsAPIDistributedZkTest.test-seed#[C387C3BEE221F6]) [    ] o.a.s.c.c.ConnectionManager Waiting for client to connect to ZooKeeper
   [junit4]   2> 830519 INFO  (zkCallback-876-thread-1) [    ] o.a.s.c.c.ConnectionManager Watcher org.apache.solr.common.cloud.ConnectionManager@1886048 name:ZooKeeperConnection Watcher:127.0.0.1:35191/solr got event WatchedEvent state:SyncConnected type:None path:null path:null type:None
   [junit4]   2> 830519 INFO  (TEST-CollectionsAPIDistributedZkTest.test-seed#[C387C3BEE221F6]) [    ] o.a.s.c.c.ConnectionManager Client is connected to ZooKeeper
   [junit4]   2> 830519 INFO  (TEST-CollectionsAPIDistributedZkTest.test-seed#[C387C3BEE221F6]) [    ] o.a.s.c.c.SolrZkClient Using default ZkACLProvider
   [junit4]   2> 830520 INFO  (TEST-CollectionsAPIDistributedZkTest.test-seed#[C387C3BEE221F6]) [    ] o.a.s.s.SolrDispatchFilter Loading solr.xml from SolrHome (not found in ZooKeeper)
   [junit4]   2> 830520 INFO  (TEST-CollectionsAPIDistributedZkTest.test-seed#[C387C3BEE221F6]) [    ] o.a.s.c.SolrXmlConfig Loading container configuration from /home/jenkins/workspace/Lucene-Solr-5.5-Linux/solr/build/solr-core/test/J0/temp/solr.cloud.CollectionsAPIDistributedZkTest_C387C3BEE221F6-001/shard-1-001/solr.xml
   [junit4]   2> 830523 INFO  (TEST-CollectionsAPIDistributedZkTest.test-seed#[C387C3BEE221F6]) [    ] o.a.s.c.CorePropertiesLocator Config-defined core root directory: /home/jenkins/workspace/Lucene-Solr-5.5-Linux/solr/build/solr-core/test/J0/../../../../../../../../../home/jenkins/workspace/Lucene-Solr-5.5-Linux/solr/build/solr-core/test/J0/temp/solr.cloud.CollectionsAPIDistributedZkTest_C387C3BEE221F6-001/shard-1-001/cores
   [junit4]   2> 830523 INFO  (TEST-CollectionsAPIDistributedZkTest.test-seed#[C387C3BEE221F6]) [    ] o.a.s.c.CoreContainer New CoreContainer 23920601
   [junit4]   2> 830523 INFO  (TEST-CollectionsAPIDistributedZkTest.test-seed#[C387C3BEE221F6]) [    ] o.a.s.c.CoreContainer Loading cores into CoreContainer [instanceDir=/home/jenkins/workspace/Lucene-Solr-5.5-Linux/solr/build/solr-core/test/J0/temp/solr.cloud.CollectionsAPIDistributedZkTest_C387C3BEE221F6-001/shard-1-001]
   [junit4]   2> 830523 WARN  (TEST-CollectionsAPIDistributedZkTest.test-seed#[C387C3BEE221F6]) [    ] o.a.s.c.CoreContainer Couldn't add files from /home/jenkins/workspace/Lucene-Solr-5.5-Linux/solr/build/solr-core/test/J0/temp/solr.cloud.CollectionsAPIDistributedZkTest_C387C3BEE221F6-001/shard-1-001/lib to classpath: /home/jenkins/workspace/Lucene-Solr-5.5-Linux/solr/build/solr-core/test/J0/temp/solr.cloud.CollectionsAPIDistributedZkTest_C387C3BEE221F6-001/shard-1-001/lib
   [junit4]   2> 830523 INFO  (TEST-CollectionsAPIDistributedZkTest.test-seed#[C387C3BEE221F6]) [    ] o.a.s.h.c.HttpShardHandlerFactory created with socketTimeout : 90000,urlScheme : ,connTimeout : 15000,maxConnectionsPerHost : 20,maxConnections : 10000,corePoolSize : 0,maximumPoolSize : 2147483647,maxThreadIdleTime : 5,sizeOfQueue : -1,fairnessPolicy : false,useRetries : false,
   [junit4]   2> 830524 INFO  (TEST-CollectionsAPIDistributedZkTest.test-seed#[C387C3BEE221F6]) [    ] o.a.s.u.UpdateShardHandler Creating UpdateShardHandler HTTP client with params: socketTimeout=340000&connTimeout=45000&retry=true
   [junit4]   2> 830524 INFO  (TEST-CollectionsAPIDistributedZkTest.test-seed#[C387C3BEE221F6]) [    ] o.a.s.l.LogWatcher SLF4J impl is org.slf4j.impl.Log4jLoggerFactory
   [junit4]   2> 830524 INFO  (TEST-CollectionsAPIDistributedZkTest.test-seed#[C387C3BEE221F6]) [    ] o.a.s.l.LogWatcher Registering Log Listener [Log4j (org.slf4j.impl.Log4jLoggerFactory)]
   [junit4]   2> 830524 INFO  (TEST-CollectionsAPIDistributedZkTest.test-seed#[C387C3BEE221F6]) [    ] o.a.s.c.ZkContainer Zookeeper client=127.0.0.1:35191/solr
   [junit4]   2> 830524 INFO  (TEST-CollectionsAPIDistributedZkTest.test-seed#[C387C3BEE221F6]) [    ] o.a.s.c.ZkController zkHost includes chroot
   [junit4]   2> 830524 INFO  (TEST-CollectionsAPIDistributedZkTest.test-seed#[C387C3BEE221F6]) [    ] o.a.s.c.c.SolrZkClient Using default ZkCredentialsProvider
   [junit4]   2> 830524 INFO  (TEST-CollectionsAPIDistributedZkTest.test-seed#[C387C3BEE221F6]) [    ] o.a.s.c.c.ConnectionManager Waiting for client to connect to ZooKeeper
   [junit4]   2> 830525 INFO  (zkCallback-879-thread-1) [    ] o.a.s.c.c.ConnectionManager Watcher org.apache.solr.common.cloud.ConnectionManager@10f405e name:ZooKeeperConnection Watcher:127.0.0.1:35191 got event WatchedEvent state:SyncConnected type:None path:null path:null type:None
   [junit4]   2> 830525 INFO  (TEST-CollectionsAPIDistributedZkTest.test-seed#[C387C3BEE221F6]) [    ] o.a.s.c.c.ConnectionManager Client is connected to ZooKeeper
   [junit4]   2> 830526 INFO  (TEST-CollectionsAPIDistributedZkTest.test-seed#[C387C3BEE221F6]) [    ] o.a.s.c.c.SolrZkClient Using default ZkACLProvider
   [junit4]   2> 830527 INFO  (TEST-CollectionsAPIDistributedZkTest.test-seed#[C387C3BEE221F6]) [    ] o.a.s.c.c.ConnectionManager Waiting for client to connect to ZooKeeper
   [junit4]   2> 830527 INFO  (zkCallback-880-thread-1) [    ] o.a.s.c.c.ConnectionManager Watcher org.apache.solr.common.cloud.ConnectionManager@f020a0 name:ZooKeeperConnection Watcher:127.0.0.1:35191/solr got event WatchedEvent state:SyncConnected type:None path:null path:null type:None
   [junit4]   2> 830527 INFO  (TEST-CollectionsAPIDistributedZkTest.test-seed#[C387C3BEE221F6]) [    ] o.a.s.c.c.ConnectionManager Client is connected to ZooKeeper
   [junit4]   2> 830529 INFO  (TEST-CollectionsAPIDistributedZkTest.test-seed#[C387C3BEE221F6]) [    ] o.a.s.c.c.ZkStateReader Updating cluster state from ZooKeeper... 
   [junit4]   2> 830549 INFO  (OverseerStateUpdate-95482670253146118-127.0.0.1:49251_z_sl-n_0000000000) [    ] o.a.s.c.o.ZkStateWriter going to create_collection /collections/collection1/state.json
   [junit4]   2> 831531 INFO  (TEST-CollectionsAPIDistributedZkTest.test-seed#[C387C3BEE221F6]) [    ] o.a.s.c.ZkController Register node as live in ZooKeeper:/live_nodes/127.0.0.1:57483_z_sl
   [junit4]   2> 831531 INFO  (TEST-CollectionsAPIDistributedZkTest.test-seed#[C387C3BEE221F6]) [    ] o.a.s.c.c.SolrZkClient makePath: /live_nodes/127.0.0.1:57483_z_sl
   [junit4]   2> 831531 INFO  (zkCallback-874-thread-1) [    ] o.a.s.c.c.ZkStateReader A live node change: [WatchedEvent state:SyncConnected type:NodeChildrenChanged path:/live_nodes], has occurred - updating... (live nodes size: [1])
   [junit4]   2> 831531 INFO  (zkCallback-880-thread-1) [    ] o.a.s.c.c.ZkStateReader A live node change: [WatchedEvent state:SyncConnected type:NodeChildrenChanged path:/live_nodes], has occurred - updating... (live nodes size: [1])
   [junit4]   2> 831531 INFO  (zkCallback-872-thread-2) [    ] o.a.s.c.c.ZkStateReader A live node change: [WatchedEvent state:SyncConnected type:NodeChildrenChanged path:/live_nodes], has occurred - updating... (live nodes size: [1])
   [junit4]   2> 831532 INFO  (TEST-CollectionsAPIDistributedZkTest.test-seed#[C387C3BEE221F6]) [    ] o.a.s.c.Overseer Overseer (id=null) closing
   [junit4]   2> 831532 INFO  (TEST-CollectionsAPIDistributedZkTest.test-seed#[C387C3BEE221F6]) [    ] o.a.s.c.LeaderElector Joined leadership election with path: /overseer_elect/election/95482670253146123-127.0.0.1:57483_z_sl-n_0000000001
   [junit4]   2> 831533 INFO  (TEST-CollectionsAPIDistributedZkTest.test-seed#[C387C3BEE221F6]) [    ] o.a.s.c.LeaderElector Watching path /overseer_elect/election/95482670253146118-127.0.0.1:49251_z_sl-n_0000000000 to know if I could be the leader
   [junit4]   2> 831543 INFO  (TEST-CollectionsAPIDistributedZkTest.test-seed#[C387C3BEE221F6]) [    ] o.a.s.c.CoreContainer Security conf doesn't exist. Skipping setup for authorization module.
   [junit4]   2> 831543 INFO  (TEST-CollectionsAPIDistributedZkTest.test-seed#[C387C3BEE221F6]) [    ] o.a.s.c.CoreContainer No authentication plugin used.
   [junit4]   2> 831543 INFO  (TEST-CollectionsAPIDistributedZkTest.test-seed#[C387C3BEE221F6]) [    ] o.a.s.c.CorePropertiesLocator Looking for core definitions underneath /home/jenkins/workspace/Lucene-Solr-5.5-Linux/solr/build/solr-core/test/J0/../../../../../../../../../home/jenkins/workspace/Lucene-Solr-5.5-Linux/solr/build/solr-core/test/J0/temp/solr.cloud.CollectionsAPIDistributedZkTest_C387C3BEE221F6-001/shard-1-001/cores
   [junit4]   2> 831544 INFO  (TEST-CollectionsAPIDistributedZkTest.test-seed#[C387C3BEE221F6]) [    ] o.a.s.c.CoreDescriptor Created CoreDescriptor: {name=collection1, config=solrconfig.xml, transient=false, schema=schema.xml, loadOnStartup=true, configSetProperties=configsetprops.json, collection=collection1, coreNodeName=, dataDir=data/, shard=}
   [junit4]   2> 831544 INFO  (TEST-CollectionsAPIDistributedZkTest.test-seed#[C387C3BEE221F6]) [    ] o.a.s.c.CorePropertiesLocator Found core collection1 in /home/jenkins/workspace/Lucene-Solr-5.5-Linux/solr/build/solr-core/test/J0/../../../../../../../../../home/jenkins/workspace/Lucene-Solr-5.5-Linux/solr/build/solr-core/test/J0/temp/solr.cloud.CollectionsAPIDistributedZkTest_C387C3BEE221F6-001/shard-1-001/cores/collection1
   [junit4]   2> 831544 INFO  (TEST-CollectionsAPIDistributedZkTest.test-seed#[C387C3BEE221F6]) [    ] o.a.s.c.CorePropertiesLocator Found 1 core definitions
   [junit4]   2> 831544 INFO  (TEST-CollectionsAPIDistributedZkTest.test-seed#[C387C3BEE221F6]) [    ] o.a.s.s.SolrDispatchFilter user.dir=/home/jenkins/workspace/Lucene-Solr-5.5-Linux/solr/build/solr-core/test/J0
   [junit4]   2> 831544 INFO  (TEST-CollectionsAPIDistributedZkTest.test-seed#[C387C3BEE221F6]) [    ] o.a.s.s.SolrDispatchFilter SolrDispatchFilter.init() done
   [junit4]   2> 831544 INFO  (coreLoadExecutor-2970-thread-1) [    ] o.a.s.c.ZkController publishing state=down
   [junit4]   2> 831544 INFO  (coreLoadExecutor-2970-thread-1) [    ] o.a.s.c.ZkController numShards not found on descriptor - reading it from system property
   [junit4]   2> 831545 INFO  (coreLoadExecutor-2970-thread-1) [    ] o.a.s.c.ZkController Registering watch for collection collection1
   [junit4]   2> 831545 INFO  (coreLoadExecutor-2970-thread-1) [    ] o.a.s.c.c.ZkStateReader addZkWatch [collection1]
   [junit4]   2> 831546 INFO  (OverseerStateUpdate-95482670253146118-127.0.0.1:49251_z_sl-n_0000000000) [    ] o.a.s.c.Overseer processMessage: queueSize: 1, message = {
   [junit4]   2>   "core":"collection1",
   [junit4]   2>   "roles":null,
   [junit4]   2>   "base_url":"http://127.0.0.1:57483/z_sl",
   [junit4]   2>   "node_name":"127.0.0.1:57483_z_sl",
   [junit4]   2>   "numShards":"2",
   [junit4]   2>   "state":"down",
   [junit4]   2>   "shard":null,
   [junit4]   2>   "collection":"collection1",
   [junit4]   2>   "operation":"state"} current state version: 3
   [junit4]   2> 831546 INFO  (coreLoadExecutor-2970-thread-1) [    ] o.a.s.c.c.ZkStateReader Add data for [collection1] ver [0]
   [junit4]   2> 831546 INFO  (coreLoadExecutor-2970-thread-1) [    ] o.a.s.c.ZkController look for our core node name
   [junit4]   2> 831546 INFO  (OverseerStateUpdate-95482670253146118-127.0.0.1:49251_z_sl-n_0000000000) [    ] o.a.s.c.o.ReplicaMutator Update state numShards=2 message={
   [junit4]   2>   "core":"collection1",
   [junit4]   2>   "roles":null,
   [junit4]   2>   "base_url":"http://127.0.0.1:57483/z_sl",
   [junit4]   2>   "node_name":"127.0.0.1:57483_z_sl",
   [junit4]   2>   "numShards":"2",
   [junit4]   2>   "state":"down",
   [junit4]   2>   "shard":null,
   [junit4]   2>   "collection":"collection1",
   [junit4]   2>   "operation":"state"}
   [junit4]   2> 831546 INFO  (OverseerStateUpdate-95482670253146118-127.0.0.1:49251_z_sl-n_0000000000) [    ] o.a.s.c.o.ReplicaMutator Collection already exists with numShards=2
   [junit4]   2> 831546 INFO  (OverseerStateUpdate-95482670253146118-127.0.0.1:49251_z_sl-n_0000000000) [    ] o.a.s.c.o.ReplicaMutator Assigning new node to shard shard=shard2
   [junit4]   2> 831647 INFO  (OverseerStateUpdate-95482670253146118-127.0.0.1:49251_z_sl-n_0000000000) [    ] o.a.s.c.o.ZkStateWriter going to update_collection /collections/collection1/state.json version: 0
   [junit4]   2> 831647 INFO  (zkCallback-880-thread-1) [    ] o.a.s.c.c.ZkStateReader A cluster state change: [WatchedEvent state:SyncConnected type:NodeDataChanged path:/collections/collection1/state.json] for collection [collection1] has occurred - updating... (live nodes size: [2])
   [junit4]   2> 831647 INFO  (zkCallback-880-thread-1) [    ] o.a.s.c.c.ZkStateReader Updating data for [collection1] from [0] to [1]
   [junit4]   2> 832546 INFO  (coreLoadExecutor-2970-thread-1) [    ] o.a.s.c.ZkController waiting to find shard id in clusterstate for collection1
   [junit4]   2> 832546 INFO  (coreLoadExecutor-2970-thread-1) [    ] o.a.s.c.ZkController Check for collection zkNode:collection1
   [junit4]   2> 832546 INFO  (coreLoadExecutor-2970-thread-1) [    ] o.a.s.c.ZkController Collection zkNode exists
   [junit4]   2> 832546 INFO  (coreLoadExecutor-2970-thread-1) [    ] o.a.s.c.c.ZkStateReader Load collection config from: [/collections/collection1]
   [junit4]   2> 832546 INFO  (coreLoadExecutor-2970-thread-1) [    ] o.a.s.c.c.ZkStateReader path=[/collections/collection1] [configName]=[conf1] specified config exists in ZooKeeper
   [junit4]   2> 832547 INFO  (coreLoadExecutor-2970-thread-1) [    ] o.a.s.c.SolrResourceLoader new SolrResourceLoader for directory: '/home/jenkins/workspace/Lucene-Solr-5.5-Linux/solr/build/solr-core/test/J0/temp/solr.cloud.CollectionsAPIDistributedZkTest_C387C3BEE221F6-001/shard-1-001/cores/collection1'
   [junit4]   2> 832547 INFO  (coreLoadExecutor-2970-thread-1) [    ] o.a.s.c.SolrResourceLoader JNDI not configured for solr (NoInitialContextEx)
   [junit4]   2> 832547 INFO  (coreLoadExecutor-2970-thread-1) [    ] o.a.s.c.SolrResourceLoader solr home defaulted to 'solr/' (could not find system property or JNDI)
   [junit4]   2> 832548 INFO  (coreLoadExecutor-2970-thread-1) [    ] o.a.s.c.Config loaded config solrconfig.xml with version 0 
   [junit4]   2> 832552 INFO  (coreLoadExecutor-2970-thread-1) [    ] o.a.s.c.SolrConfig current version of requestparams : -1
   [junit4]   2> 832566 INFO  (coreLoadExecutor-2970-thread-1) [    ] o.a.s.c.SolrConfig Using Lucene MatchVersion: 5.5.0
   [junit4]   2> 832576 INFO  (coreLoadExecutor-2970-thread-1) [    ] o.a.s.c.SolrConfig Loaded SolrConfig: solrconfig.xml
   [junit4]   2> 832581 INFO  (coreLoadExecutor-2970-thread-1) [    ] o.a.s.s.IndexSchema [collection1] Schema name=test
   [junit4]   2> 832664 INFO  (coreLoadExecutor-2970-thread-1) [    ] o.a.s.s.OpenExchangeRatesOrgProvider Initialized with rates=open-exchange-rates.json, refreshInterval=1440.
   [junit4]   2> 832667 INFO  (coreLoadExecutor-2970-thread-1) [    ] o.a.s.s.IndexSchema default search field in schema is text
   [junit4]   2> 832668 INFO  (coreLoadExecutor-2970-thread-1) [    ] o.a.s.s.IndexSchema unique key field: id
   [junit4]   2> 832672 INFO  (coreLoadExecutor-2970-thread-1) [    ] o.a.s.s.FileExchangeRateProvider Reloading exchange rates from file currency.xml
   [junit4]   2> 832673 INFO  (coreLoadExecutor-2970-thread-1) [    ] o.a.s.s.FileExchangeRateProvider Reloading exchange rates from file currency.xml
   [junit4]   2> 832674 INFO  (coreLoadExecutor-2970-thread-1) [    ] o.a.s.s.OpenExchangeRatesOrgProvider Reloading exchange rates from open-exchange-rates.json
   [junit4]   2> 832675 INFO  (coreLoadExecutor-2970-thread-1) [    ] o.a.s.s.OpenExchangeRatesOrgProvider Reloading exchange rates from open-exchange-rates.json
   [junit4]   2> 832675 INFO  (coreLoadExecutor-2970-thread-1) [    ] o.a.s.c.ConfigSetProperties Did not find ConfigSet properties, assuming default properties: Can't find resource 'configsetprops.json' in classpath or '/configs/conf1', cwd=/home/jenkins/workspace/Lucene-Solr-5.5-Linux/solr/build/solr-core/test/J0
   [junit4]   2> 832675 INFO  (coreLoadExecutor-2970-thread-1) [    ] o.a.s.c.CoreContainer Creating SolrCore 'collection1' using configuration from collection collection1
   [junit4]   2> 832676 INFO  (coreLoadExecutor-2970-thread-1) [    ] o.a.s.c.SolrCore org.apache.solr.core.MockDirectoryFactory
   [junit4]   2> 832676 INFO  (coreLoadExecutor-2970-thread-1) [    ] o.a.s.c.SolrCore [[collection1] ] Opening new SolrCore at [/home/jenkins/workspace/Lucene-Solr-5.5-Linux/solr/build/solr-core/test/J0/temp/solr.cloud.CollectionsAPIDistributedZkTest_C387C3BEE221F6-001/shard-1-001/cores/collection1], dataDir=[/home/jenkins/workspace/Lucene-Solr-5.5-Linux/solr/build/solr-core/test/J0/../../../../../../../../../home/jenkins/workspace/Lucene-Solr-5.5-Linux/solr/build/solr-core/test/J0/temp/solr.cloud.CollectionsAPIDistributedZkTest_C387C3BEE221F6-001/shard-1-001/cores/collection1/data/]
   [junit4]   2> 832676 INFO  (coreLoadExecutor-2970-thread-1) [    ] o.a.s.c.JmxMonitoredMap JMX monitoring is enabled. Adding Solr mbeans to JMX Server: com.sun.jmx.mbeanserver.JmxMBeanServer@14e0c66
   [junit4]   2> 832676 INFO  (coreLoadExecutor-2970-thread-1) [    ] o.a.s.c.CachingDirectoryFactory return new directory for /home/jenkins/workspace/Lucene-Solr-5.5-Linux/solr/build/solr-core/test/J0/../../../../../../../../../home/jenkins/workspace/Lucene-Solr-5.5-Linux/solr/build/solr-core/test/J0/temp/solr.cloud.CollectionsAPIDistributedZkTest_C387C3BEE221F6-001/shard-1-001/cores/collection1/data
   [junit4]   2> 832676 INFO  (coreLoadExecutor-2970-thread-1) [    ] o.a.s.c.SolrCore New index directory detected: old=null new=/home/jenkins/workspace/Lucene-Solr-5.5-Linux/solr/build/solr-core/test/J0/../../../../../../../../../home/jenkins/workspace/Lucene-Solr-5.5-Linux/solr/build/solr-core/test/J0/temp/solr.cloud.CollectionsAPIDistributedZkTest_C387C3BEE221F6-001/shard-1-001/cores/collection1/data/index/
   [junit4]   2> 832676 WARN  (coreLoadExecutor-2970-thread-1) [    ] o.a.s.c.SolrCore [collection1] Solr index directory '/home/jenkins/workspace/Lucene-Solr-5.5-Linux/solr/build/solr-core/test/J0/../../../../../../../../../home/jenkins/workspace/Lucene-Solr-5.5-Linux/solr/build/solr-core/test/J0/temp/solr.cloud.CollectionsAPIDistributedZkTest_C387C3BEE221F6-001/shard-1-001/cores/collection1/data/index' doesn't exist. Creating new index...
   [junit4]   2> 832677 INFO  (coreLoadExecutor-2970-thread-1) [    ] o.a.s.c.CachingDirectoryFactory return new directory for /home/jenkins/workspace/Lucene-Solr-5.5-Linux/solr/build/solr-core/test/J0/../../../../../../../../../home/jenkins/workspace/Lucene-Solr-5.5-Linux/solr/build/solr-core/test/J0/temp/solr.cloud.CollectionsAPIDistributedZkTest_C387C3BEE221F6-001/shard-1-001/cores/collection1/data/index
   [junit4]   2> 832677 INFO  (coreLoadExecutor-2970-thread-1) [    ] o.a.s.u.RandomMergePolicy RandomMergePolicy wrapping class org.apache.lucene.index.TieredMergePolicy: [TieredMergePolicy: maxMergeAtOnce=36, maxMergeAtOnceExplicit=22, maxMergedSegmentMB=75.7216796875, floorSegmentMB=0.6650390625, forceMergeDeletesPctAllowed=16.439724252570254, segmentsPerTier=31.0, maxCFSSegmentSizeMB=8.796093022207999E12, noCFSRatio=1.0
   [junit4]   2> 832677 INFO  (coreLoadExecutor-2970-thread-1) [    ] o.a.s.c.SolrDeletionPolicy SolrDeletionPolicy.onCommit: commits: num=1
   [junit4]   2> 	commit{dir=MockDirectoryWrapper(RAMDirectory@9046a0 lockFactory=org.apache.lucene.store.SingleInstanceLockFactory@1ee6d99),segFN=segments_1,generation=1}
   [junit4]   2> 832677 INFO  (coreLoadExecutor-2970-thread-1) [    ] o.a.s.c.SolrDeletionPolicy newest commit generation = 1
   [junit4]   2> 832677 INFO  (OldIndexDirectoryCleanupThreadForCore-collection1) [    ] o.a.s.c.SolrCore Looking for old index directories to cleanup for core collection1 in /home/jenkins/workspace/Lucene-Solr-5.5-Linux/solr/build/solr-core/test/J0/../../../../../../../../../home/jenkins/workspace/Lucene-Solr-5.5-Linux/solr/build/solr-core/test/J0/temp/solr.cloud.CollectionsAPIDistributedZkTest_C387C3BEE221F6-001/shard-1-001/cores/collection1/data/
   [junit4]   2> 832678 WARN  (OldIndexDirectoryCleanupThreadForCore-collection1) [    ] o.a.s.c.DirectoryFactory /home/jenkins/workspace/Lucene-Solr-5.5-Linux/solr/build/solr-core/test/J0/../../../../../../../../../home/jenkins/workspace/Lucene-Solr-5.5-Linux/solr/build/solr-core/test/J0/temp/solr.cloud.CollectionsAPIDistributedZkTest_C387C3BEE221F6-001/shard-1-001/cores/collection1/data/ does not point to a valid data directory; skipping clean-up of old index directories.
   [junit4]   2> 832679 INFO  (coreLoadExecutor-2970-thread-1) [    ] o.a.s.u.p.UpdateRequestProcessorChain creating updateRequestProcessorChain "nodistrib"
   [junit4]   2> 832679 INFO  (coreLoadExecutor-2970-thread-1) [    ] o.a.s.u.p.UpdateRequestProcessorChain creating updateRequestProcessorChain "dedupe"
   [junit4]   2> 832679 INFO  (coreLoadExecutor-2970-thread-1) [    ] o.a.s.u.p.UpdateRequestProcessorChain inserting DistributedUpdateProcessorFactory into updateRequestProcessorChain "dedupe"
   [junit4]   2> 832679 INFO  (coreLoadExecutor-2970-thread-1) [    ] o.a.s.u.p.UpdateRequestProcessorChain creating updateRequestProcessorChain "stored_sig"
   [junit4]   2> 832679 INFO  (coreLoadExecutor-2970-thread-1) [    ] o.a.s.u.p.UpdateRequestProcessorChain inserting DistributedUpdateProcessorFactory into updateRequestProcessorChain "stored_sig"
   [junit4]   2> 832679 INFO  (coreLoadExecutor-2970-thread-1) [    ] o.a.s.u.p.UpdateRequestProcessorChain creating updateRequestProcessorChain "distrib-dup-test-chain-explicit"
   [junit4]   2> 832680 INFO  (coreLoadExecutor-2970-thread-1) [    ] o.a.s.u.p.UpdateRequestProcessorChain creating updateRequestProcessorChain "distrib-dup-test-chain-implicit"
   [junit4]   2> 832680 INFO  (coreLoadExecutor-2970-thread-1) [    ] o.a.s.u.p.UpdateRequestProcessorChain inserting DistributedUpdateProcessorFactory into updateRequestProcessorChain "distrib-dup-test-chain-implicit"
   [junit4]   2> 832680 INFO  (coreLoadExecutor-2970-thread-1) [    ] o.a.s.c.SolrCore no updateRequestProcessorChain defined as default, creating implicit default
   [junit4]   2> 832680 WARN  (coreLoadExecutor-2970-thread-1) [    ] o.a.s.c.RequestHandlers INVALID paramSet a in requestHandler {type = requestHandler,name = /dump,class = DumpRequestHandler,args = {defaults={a=A,b=B}}}
   [junit4]   2> 832681 INFO  (coreLoadExecutor-2970-thread-1) [    ] o.a.s.h.l.XMLLoader xsltCacheLifetimeSeconds=60
   [junit4]   2> 832682 INFO  (coreLoadExecutor-2970-thread-1) [    ] o.a.s.h.l.XMLLoader xsltCacheLifetimeSeconds=60
   [junit4]   2> 832682 INFO  (coreLoadExecutor-2970-thread-1) [    ] o.a.s.h.l.XMLLoader xsltCacheLifetimeSeconds=60
   [junit4]   2> 832683 INFO  (coreLoadExecutor-2970-thread-1) [    ] o.a.s.h.l.XMLLoader xsltCacheLifetimeSeconds=60
   [junit4]   2> 832684 INFO  (coreLoadExecutor-2970-thread-1) [    ] o.a.s.c.RequestHandlers Registered paths: /admin/mbeans,standard,/dump,/update/csv,/update/json/docs,/admin/luke,/admin/segments,/get,/admin/system,/replication,/admin/properties,/config,/schema,/admin/plugins,/admin/logging,/update/json,/admin/threads,/admin/ping,/update,/admin/file
   [junit4]   2> 832685 INFO  (coreLoadExecutor-2970-thread-1) [    ] o.a.s.c.SolrCore Using default statsCache cache: org.apache.solr.search.stats.LocalStatsCache
   [junit4]   2> 832698 INFO  (coreLoadExecutor-2970-thread-1) [    ] o.a.s.u.UpdateHandler Using UpdateLog implementation: org.apache.solr.update.UpdateLog
   [junit4]   2> 832698 INFO  (coreLoadExecutor-2970-thread-1) [    ] o.a.s.u.UpdateLog Initializing UpdateLog: dataDir= defaultSyncLevel=FLUSH numRecordsToKeep=100 maxNumLogsToKeep=10 numVersionBuckets=65536
   [junit4]   2> 832699 INFO  (coreLoadExecutor-2970-thread-1) [    ] o.a.s.u.CommitTracker Hard AutoCommit: disabled
   [junit4]   2> 832699 INFO  (coreLoadExecutor-2970-thread-1) [    ] o.a.s.u.CommitTracker Soft AutoCommit: disabled
   [junit4]   2> 832699 INFO  (coreLoadExecutor-2970-thread-1) [    ] o.a.s.u.RandomMergePolicy RandomMergePolicy wrapping class org.apache.lucene.index.LogByteSizeMergePolicy: [LogByteSizeMergePolicy: minMergeSize=1677721, mergeFactor=41, maxMergeSize=2147483648, maxMergeSizeForForcedMerge=9223372036854775807, calibrateSizeByDeletes=true, maxMergeDocs=2147483647, maxCFSSegmentSizeMB=8.796093022207999E12, noCFSRatio=1.0]
   [junit4]   2> 832699 INFO  (coreLoadExecutor-2970-thread-1) [    ] o.a.s.c.SolrDeletionPolicy SolrDeletionPolicy.onInit: commits: num=1
   [junit4]   2> 	commit{dir=MockDirectoryWrapper(RAMDirectory@9046a0 lockFactory=org.apache.lucene.store.SingleInstanceLockFactory@1ee6d99),segFN=segments_1,generation=1}
   [junit4]   2> 832699 INFO  (coreLoadExecutor-2970-thread-1) [    ] o.a.s.c.SolrDeletionPolicy newest commit generation = 1
   [junit4]   2> 832699 INFO  (coreLoadExecutor-2970-thread-1) [    ] o.a.s.s.SolrIndexSearcher Opening Searcher@6631c9[collection1] main
   [junit4]   2> 832699 INFO  (coreLoadExecutor-2970-thread-1) [    ] o.a.s.c.c.ZkStateReader Load collection config from: [/collections/collection1]
   [junit4]   2> 832700 INFO  (coreLoadExecutor-2970-thread-1) [    ] o.a.s.c.c.ZkStateReader path=[/collections/collection1] [configName]=[conf1] specified config exists in ZooKeeper
   [junit4]   2> 832700 INFO  (coreLoadExecutor-2970-thread-1) [    ] o.a.s.r.ManagedResourceStorage Setting up ZooKeeper-based storage for the RestManager with znodeBase: /configs/conf1
   [junit4]   2> 832700 INFO  (coreLoadExecutor-2970-thread-1) [    ] o.a.s.r.ManagedResourceStorage Configured ZooKeeperStorageIO with znodeBase: /configs/conf1
   [junit4]   2> 832700 INFO  (coreLoadExecutor-2970-thread-1) [    ] o.a.s.r.RestManager Initializing RestManager with initArgs: {}
   [junit4]   2> 832700 INFO  (coreLoadExecutor-2970-thread-1) [    ] o.a.s.r.ManagedResourceStorage Reading _rest_managed.json using ZooKeeperStorageIO:path=/configs/conf1
   [junit4]   2> 832700 INFO  (coreLoadExecutor-2970-thread-1) [    ] o.a.s.r.ManagedResourceStorage No data found for znode /configs/conf1/_rest_managed.json
   [junit4]   2> 832700 INFO  (coreLoadExecutor-2970-thread-1) [    ] o.a.s.r.ManagedResourceStorage Loaded null at path _rest_managed.json using ZooKeeperStorageIO:path=/configs/conf1
   [junit4]   2> 832700 INFO  (coreLoadExecutor-2970-thread-1) [    ] o.a.s.r.RestMana

[...truncated too long message...]

ild/solr-core/test/J0/temp/solr.cloud.CollectionsAPIDistributedZkTest_C387C3BEE221F6-001/shard-4-001/cores/nodes_used_collection_shard2_replica1/data/index
   [junit4]   2> 856472 INFO  (recoveryExecutor-894-thread-2) [    ] o.a.s.c.CachingDirectoryFactory looking to close /home/jenkins/workspace/Lucene-Solr-5.5-Linux/solr/build/solr-core/test/J0/temp/solr.cloud.CollectionsAPIDistributedZkTest_C387C3BEE221F6-001/shard-4-001/cores/nodes_used_collection_shard2_replica1/data [CachedDir<<refCount=0;path=/home/jenkins/workspace/Lucene-Solr-5.5-Linux/solr/build/solr-core/test/J0/temp/solr.cloud.CollectionsAPIDistributedZkTest_C387C3BEE221F6-001/shard-4-001/cores/nodes_used_collection_shard2_replica1/data;done=false>>]
   [junit4]   2> 856472 INFO  (recoveryExecutor-894-thread-2) [    ] o.a.s.c.CachingDirectoryFactory Closing directory: /home/jenkins/workspace/Lucene-Solr-5.5-Linux/solr/build/solr-core/test/J0/temp/solr.cloud.CollectionsAPIDistributedZkTest_C387C3BEE221F6-001/shard-4-001/cores/nodes_used_collection_shard2_replica1/data
   [junit4]   2> 856472 INFO  (TEST-CollectionsAPIDistributedZkTest.test-seed#[C387C3BEE221F6]) [    ] o.a.s.c.Overseer Overseer (id=95482670253146132-127.0.0.1:58681_z_sl-n_0000000004) closing
   [junit4]   2> 856472 INFO  (OverseerStateUpdate-95482670253146132-127.0.0.1:58681_z_sl-n_0000000004) [    ] o.a.s.c.Overseer Overseer Loop exiting : 127.0.0.1:58681_z_sl
   [junit4]   2> 856474 INFO  (zkCallback-896-thread-2) [    ] o.a.s.c.c.ZkStateReader A live node change: [WatchedEvent state:SyncConnected type:NodeChildrenChanged path:/live_nodes], has occurred - updating... (live nodes size: [1])
   [junit4]   2> 856474 WARN  (zkCallback-896-thread-2) [    ] o.a.s.c.c.ZkStateReader ZooKeeper watch triggered, but Solr cannot talk to ZK: [KeeperErrorCode = Session expired for /live_nodes]
   [junit4]   2> 856475 INFO  (TEST-CollectionsAPIDistributedZkTest.test-seed#[C387C3BEE221F6]) [    ] o.e.j.s.ServerConnector Stopped ServerConnector@3919{HTTP/1.1}{127.0.0.1:0}
   [junit4]   2> 856475 INFO  (TEST-CollectionsAPIDistributedZkTest.test-seed#[C387C3BEE221F6]) [    ] o.e.j.s.h.ContextHandler Stopped o.e.j.s.ServletContextHandler@cc38{/z_sl,null,UNAVAILABLE}
   [junit4]   2> 856475 INFO  (TEST-CollectionsAPIDistributedZkTest.test-seed#[C387C3BEE221F6]) [    ] o.a.s.c.ZkTestServer connecting to 127.0.0.1:35191 35191
   [junit4]   2> 856582 INFO  (Thread-2632) [    ] o.a.s.c.ZkTestServer connecting to 127.0.0.1:35191 35191
   [junit4]   2> 856582 WARN  (Thread-2632) [    ] o.a.s.c.ZkTestServer Watch limit violations: 
   [junit4]   2> Maximum concurrent create/delete watches above limit:
   [junit4]   2> 
   [junit4]   2> 	8	/solr/aliases.json
   [junit4]   2> 	5	/solr/security.json
   [junit4]   2> 	5	/solr/configs/conf1
   [junit4]   2> 	2	/solr/configs/conf2
   [junit4]   2> 
   [junit4]   2> Maximum concurrent data watches above limit:
   [junit4]   2> 
   [junit4]   2> 	8	/solr/clusterstate.json
   [junit4]   2> 	4	/solr/collections/nodes_used_collection/state.json
   [junit4]   2> 	4	/solr/collections/collection1/state.json
   [junit4]   2> 	2	/solr/collections/awholynewcollection_0/state.json
   [junit4]   2> 
   [junit4]   2> Maximum concurrent children watches above limit:
   [junit4]   2> 
   [junit4]   2> 	8	/solr/live_nodes
   [junit4]   2> 	8	/solr/collections
   [junit4]   2> 	5	/solr/overseer/collection-queue-work
   [junit4]   2> 	4	/solr/overseer/queue
   [junit4]   2> 	3	/solr/overseer/queue-work
   [junit4]   2> 
   [junit4]   2> NOTE: reproduce with: ant test  -Dtestcase=CollectionsAPIDistributedZkTest -Dtests.method=test -Dtests.seed=C387C3BEE221F6 -Dtests.multiplier=3 -Dtests.slow=true -Dtests.locale=en-WS -Dtests.timezone=America/Jamaica -Dtests.asserts=true -Dtests.file.encoding=ISO-8859-1
   [junit4] ERROR   27.9s J0 | CollectionsAPIDistributedZkTest.test <<<
   [junit4]    > Throwable #1: org.apache.solr.client.solrj.impl.HttpSolrClient$RemoteSolrException: Error from server at http://127.0.0.1:54385/z_sl/awholynewcollection_0: non ok status: 500, message:Server Error
   [junit4]    > 	at __randomizedtesting.SeedInfo.seed([C387C3BEE221F6:8897B819101E4C0E]:0)
   [junit4]    > 	at org.apache.solr.client.solrj.impl.HttpSolrClient.executeMethod(HttpSolrClient.java:511)
   [junit4]    > 	at org.apache.solr.client.solrj.impl.HttpSolrClient.request(HttpSolrClient.java:240)
   [junit4]    > 	at org.apache.solr.client.solrj.impl.HttpSolrClient.request(HttpSolrClient.java:229)
   [junit4]    > 	at org.apache.solr.client.solrj.SolrRequest.process(SolrRequest.java:149)
   [junit4]    > 	at org.apache.solr.client.solrj.SolrClient.query(SolrClient.java:942)
   [junit4]    > 	at org.apache.solr.client.solrj.SolrClient.query(SolrClient.java:957)
   [junit4]    > 	at org.apache.solr.cloud.AbstractFullDistribZkTestBase.waitForNon403or404or503(AbstractFullDistribZkTestBase.java:1753)
   [junit4]    > 	at org.apache.solr.cloud.CollectionsAPIDistributedZkTest.testCollectionsAPI(CollectionsAPIDistributedZkTest.java:717)
   [junit4]    > 	at org.apache.solr.cloud.CollectionsAPIDistributedZkTest.test(CollectionsAPIDistributedZkTest.java:160)
   [junit4]    > 	at org.apache.solr.BaseDistributedSearchTestCase$ShardsRepeatRule$ShardsFixedStatement.callStatement(BaseDistributedSearchTestCase.java:964)
   [junit4]    > 	at org.apache.solr.BaseDistributedSearchTestCase$ShardsRepeatRule$ShardsStatement.evaluate(BaseDistributedSearchTestCase.java:939)
   [junit4]    > 	at java.lang.Thread.run(Thread.java:804)
   [junit4]   2> 856585 INFO  (SUITE-CollectionsAPIDistributedZkTest-seed#[C387C3BEE221F6]-worker) [    ] o.a.s.SolrTestCaseJ4 ###deleteCore
   [junit4]   2> NOTE: leaving temporary files on disk at: /home/jenkins/workspace/Lucene-Solr-5.5-Linux/solr/build/solr-core/test/J0/temp/solr.cloud.CollectionsAPIDistributedZkTest_C387C3BEE221F6-001
   [junit4]   2> Mar 02, 2016 8:19:12 PM com.carrotsearch.randomizedtesting.ThreadLeakControl checkThreadLeaks
   [junit4]   2> WARNING: Will linger awaiting termination of 1 leaked thread(s).
   [junit4]   2> NOTE: test params are: codec=Asserting(Lucene54), sim=DefaultSimilarity, locale=en-WS, timezone=America/Jamaica
   [junit4]   2> NOTE: Linux 3.19.0-51-generic i386/Oracle Corporation 9-ea (32-bit)/cpus=12,threads=1,free=235674416,total=339316736
   [junit4]   2> NOTE: All tests run in this JVM: [TestRequestForwarding, TestBulkSchemaConcurrent, RecoveryAfterSoftCommitTest, TestValueSourceCache, FileBasedSpellCheckerTest, PeerSyncTest, DistributedFacetPivotLargeTest, TestInfoStreamLogging, BigEndianAscendingWordDeserializerTest, TestConfigSets, SaslZkACLProviderTest, ExplicitHLLTest, ResourceLoaderTest, TestFieldCollectionResource, DefaultValueUpdateProcessorTest, DistributedQueryComponentOptimizationTest, ZkNodePropsTest, DistribCursorPagingTest, TestLeaderElectionZkExpiry, TestDFISimilarityFactory, CollectionStateFormat2Test, OutOfBoxZkACLAndCredentialsProvidersTest, TestAddFieldRealTimeGet, TestPhraseSuggestions, ZkStateReaderTest, CurrencyFieldOpenExchangeTest, EchoParamsTest, TestRealTimeGet, TestManagedSchemaFieldTypeResource, TestBulkSchemaAPI, StandardRequestHandlerTest, ActionThrottleTest, TestXmlQParser, BadCopyFieldTest, HttpPartitionTest, JsonLoaderTest, TestLazyCores, TestOmitPositions, CoreMergeIndexesAdminHandlerTest, CloneFieldUpdateProcessorFactoryTest, DisMaxRequestHandlerTest, TestSchemaManager, SolrRequestParserTest, TestSchemaResource, TestBlobHandler, RestartWhileUpdatingTest, TestRecoveryHdfs, RulesTest, SOLR749Test, TestRandomCollapseQParserPlugin, TestManagedResource, BufferStoreTest, RequiredFieldsTest, TestDocBasedVersionConstraints, TestRandomRequestDistribution, RAMDirectoryFactoryTest, TestBlendedInfixSuggestions, URLClassifyProcessorTest, TestComplexPhraseQParserPlugin, TestFunctionQuery, DistributedFacetPivotSmallTest, CursorPagingTest, ResponseHeaderTest, TestTrackingShardHandlerFactory, WrapperMergePolicyFactoryTest, PingRequestHandlerTest, TestMergePolicyConfig, IndexSchemaRuntimeFieldTest, PrimUtilsTest, TestCSVLoader, SmileWriterTest, SpatialHeatmapFacetsTest, ResponseLogComponentTest, TestConfigOverlay, TestMiniSolrCloudClusterBase, SignatureUpdateProcessorFactoryTest, TestDocSet, TestRawTransformer, IndexSchemaTest, TestRangeQuery, TestOrdValues, BasicAuthIntegrationTest, LeaderInitiatedRecoveryOnShardRestartTest, HdfsWriteToMultipleCollectionsTest, TestConfig, TestRemoteStreaming, TestBadConfig, DocumentAnalysisRequestHandlerTest, TestHashQParserPlugin, TestMissingGroups, TestScoreJoinQPNoScore, CacheHeaderTest, TestPseudoReturnFields, SystemInfoHandlerTest, ChaosMonkeySafeLeaderTest, CollectionsAPIDistributedZkTest]
   [junit4] Completed [288/566 (1!)] on J0 in 28.68s, 1 test, 1 error <<< FAILURES!

[...truncated 881 lines...]
BUILD FAILED
/home/jenkins/workspace/Lucene-Solr-5.5-Linux/build.xml:750: The following error occurred while executing this line:
/home/jenkins/workspace/Lucene-Solr-5.5-Linux/build.xml:694: The following error occurred while executing this line:
/home/jenkins/workspace/Lucene-Solr-5.5-Linux/build.xml:59: The following error occurred while executing this line:
/home/jenkins/workspace/Lucene-Solr-5.5-Linux/solr/build.xml:233: The following error occurred while executing this line:
/home/jenkins/workspace/Lucene-Solr-5.5-Linux/solr/common-build.xml:534: The following error occurred while executing this line:
/home/jenkins/workspace/Lucene-Solr-5.5-Linux/lucene/common-build.xml:1477: The following error occurred while executing this line:
/home/jenkins/workspace/Lucene-Solr-5.5-Linux/lucene/common-build.xml:1033: There were test failures: 566 suites (7 ignored), 2277 tests, 1 error, 85 ignored (39 assumptions) [seed: C387C3BEE221F6]

Total time: 54 minutes 49 seconds
Build step 'Invoke Ant' marked build as failure
Archiving artifacts
[WARNINGS] Skipping publisher since build result is FAILURE
Recording test results
Email was triggered for: Failure - Any
Sending email for trigger: Failure - Any



Mime
View raw message