lucene-dev mailing list archives

Site index · List index
Message view « Date » · « Thread »
Top « Date » · « Thread »
From Policeman Jenkins Server <jenk...@thetaphi.de>
Subject [JENKINS] Lucene-Solr-trunk-Windows (64bit/jdk1.8.0_72) - Build # 5663 - Still Failing!
Date Thu, 03 Mar 2016 07:58:06 GMT
Build: http://jenkins.thetaphi.de/job/Lucene-Solr-trunk-Windows/5663/
Java: 64bit/jdk1.8.0_72 -XX:+UseCompressedOops -XX:+UseSerialGC

2 tests failed.
FAILED:  org.apache.solr.handler.TestSolrConfigHandlerConcurrent.test

Error Message:


Stack Trace:
java.lang.NullPointerException
	at __randomizedtesting.SeedInfo.seed([7138193552298324:F96C26EFFCD5EEDC]:0)
	at org.apache.solr.handler.TestSolrConfigHandlerConcurrent.test(TestSolrConfigHandlerConcurrent.java:116)
	at sun.reflect.NativeMethodAccessorImpl.invoke0(Native Method)
	at sun.reflect.NativeMethodAccessorImpl.invoke(NativeMethodAccessorImpl.java:62)
	at sun.reflect.DelegatingMethodAccessorImpl.invoke(DelegatingMethodAccessorImpl.java:43)
	at java.lang.reflect.Method.invoke(Method.java:498)
	at com.carrotsearch.randomizedtesting.RandomizedRunner.invoke(RandomizedRunner.java:1764)
	at com.carrotsearch.randomizedtesting.RandomizedRunner$8.evaluate(RandomizedRunner.java:871)
	at com.carrotsearch.randomizedtesting.RandomizedRunner$9.evaluate(RandomizedRunner.java:907)
	at com.carrotsearch.randomizedtesting.RandomizedRunner$10.evaluate(RandomizedRunner.java:921)
	at org.apache.solr.BaseDistributedSearchTestCase$ShardsRepeatRule$ShardsFixedStatement.callStatement(BaseDistributedSearchTestCase.java:996)
	at org.apache.solr.BaseDistributedSearchTestCase$ShardsRepeatRule$ShardsStatement.evaluate(BaseDistributedSearchTestCase.java:971)
	at com.carrotsearch.randomizedtesting.rules.SystemPropertiesRestoreRule$1.evaluate(SystemPropertiesRestoreRule.java:57)
	at org.apache.lucene.util.TestRuleSetupTeardownChained$1.evaluate(TestRuleSetupTeardownChained.java:49)
	at org.apache.lucene.util.AbstractBeforeAfterRule$1.evaluate(AbstractBeforeAfterRule.java:45)
	at org.apache.lucene.util.TestRuleThreadAndTestName$1.evaluate(TestRuleThreadAndTestName.java:48)
	at org.apache.lucene.util.TestRuleIgnoreAfterMaxFailures$1.evaluate(TestRuleIgnoreAfterMaxFailures.java:64)
	at org.apache.lucene.util.TestRuleMarkFailure$1.evaluate(TestRuleMarkFailure.java:47)
	at com.carrotsearch.randomizedtesting.rules.StatementAdapter.evaluate(StatementAdapter.java:36)
	at com.carrotsearch.randomizedtesting.ThreadLeakControl$StatementRunner.run(ThreadLeakControl.java:367)
	at com.carrotsearch.randomizedtesting.ThreadLeakControl.forkTimeoutingTask(ThreadLeakControl.java:809)
	at com.carrotsearch.randomizedtesting.ThreadLeakControl$3.evaluate(ThreadLeakControl.java:460)
	at com.carrotsearch.randomizedtesting.RandomizedRunner.runSingleTest(RandomizedRunner.java:880)
	at com.carrotsearch.randomizedtesting.RandomizedRunner$5.evaluate(RandomizedRunner.java:781)
	at com.carrotsearch.randomizedtesting.RandomizedRunner$6.evaluate(RandomizedRunner.java:816)
	at com.carrotsearch.randomizedtesting.RandomizedRunner$7.evaluate(RandomizedRunner.java:827)
	at com.carrotsearch.randomizedtesting.rules.StatementAdapter.evaluate(StatementAdapter.java:36)
	at com.carrotsearch.randomizedtesting.rules.SystemPropertiesRestoreRule$1.evaluate(SystemPropertiesRestoreRule.java:57)
	at org.apache.lucene.util.AbstractBeforeAfterRule$1.evaluate(AbstractBeforeAfterRule.java:45)
	at com.carrotsearch.randomizedtesting.rules.StatementAdapter.evaluate(StatementAdapter.java:36)
	at org.apache.lucene.util.TestRuleStoreClassName$1.evaluate(TestRuleStoreClassName.java:41)
	at com.carrotsearch.randomizedtesting.rules.NoShadowingOrOverridesOnMethodsRule$1.evaluate(NoShadowingOrOverridesOnMethodsRule.java:40)
	at com.carrotsearch.randomizedtesting.rules.NoShadowingOrOverridesOnMethodsRule$1.evaluate(NoShadowingOrOverridesOnMethodsRule.java:40)
	at com.carrotsearch.randomizedtesting.rules.StatementAdapter.evaluate(StatementAdapter.java:36)
	at com.carrotsearch.randomizedtesting.rules.StatementAdapter.evaluate(StatementAdapter.java:36)
	at com.carrotsearch.randomizedtesting.rules.StatementAdapter.evaluate(StatementAdapter.java:36)
	at org.apache.lucene.util.TestRuleAssertionsRequired$1.evaluate(TestRuleAssertionsRequired.java:53)
	at org.apache.lucene.util.TestRuleMarkFailure$1.evaluate(TestRuleMarkFailure.java:47)
	at org.apache.lucene.util.TestRuleIgnoreAfterMaxFailures$1.evaluate(TestRuleIgnoreAfterMaxFailures.java:64)
	at org.apache.lucene.util.TestRuleIgnoreTestSuites$1.evaluate(TestRuleIgnoreTestSuites.java:54)
	at com.carrotsearch.randomizedtesting.rules.StatementAdapter.evaluate(StatementAdapter.java:36)
	at com.carrotsearch.randomizedtesting.ThreadLeakControl$StatementRunner.run(ThreadLeakControl.java:367)
	at java.lang.Thread.run(Thread.java:745)


FAILED:  org.apache.solr.internal.csv.CSVStrategyTest.testSetCSVStrategy

Error Message:
expected:<false> but was:<true>

Stack Trace:
junit.framework.AssertionFailedError: expected:<false> but was:<true>
	at junit.framework.Assert.fail(Assert.java:50)
	at junit.framework.Assert.failNotEquals(Assert.java:287)
	at junit.framework.Assert.assertEquals(Assert.java:67)
	at junit.framework.Assert.assertEquals(Assert.java:147)
	at junit.framework.Assert.assertEquals(Assert.java:153)
	at org.apache.solr.internal.csv.CSVStrategyTest.testSetCSVStrategy(CSVStrategyTest.java:70)
	at sun.reflect.NativeMethodAccessorImpl.invoke0(Native Method)
	at sun.reflect.NativeMethodAccessorImpl.invoke(NativeMethodAccessorImpl.java:62)
	at sun.reflect.DelegatingMethodAccessorImpl.invoke(DelegatingMethodAccessorImpl.java:43)
	at java.lang.reflect.Method.invoke(Method.java:498)
	at junit.framework.TestCase.runTest(TestCase.java:168)
	at junit.framework.TestCase.runBare(TestCase.java:134)
	at junit.framework.TestResult$1.protect(TestResult.java:110)
	at junit.framework.TestResult.runProtected(TestResult.java:128)
	at junit.framework.TestResult.run(TestResult.java:113)
	at junit.framework.TestCase.run(TestCase.java:124)
	at junit.framework.TestSuite.runTest(TestSuite.java:243)
	at junit.framework.TestSuite.run(TestSuite.java:238)
	at org.junit.internal.runners.JUnit38ClassRunner.run(JUnit38ClassRunner.java:83)
	at com.carrotsearch.ant.tasks.junit4.slave.SlaveMain.execute(SlaveMain.java:243)
	at com.carrotsearch.ant.tasks.junit4.slave.SlaveMain.main(SlaveMain.java:354)
	at com.carrotsearch.ant.tasks.junit4.slave.SlaveMainSafe.main(SlaveMainSafe.java:10)




Build Log:
[...truncated 11818 lines...]
   [junit4] Suite: org.apache.solr.internal.csv.CSVStrategyTest
   [junit4] FAILURE 0.01s J0 | CSVStrategyTest.testSetCSVStrategy <<<
   [junit4]    > Throwable #1: junit.framework.AssertionFailedError: expected:<false> but was:<true>
   [junit4]    > 	at junit.framework.Assert.fail(Assert.java:50)
   [junit4]    > 	at junit.framework.Assert.failNotEquals(Assert.java:287)
   [junit4]    > 	at junit.framework.Assert.assertEquals(Assert.java:67)
   [junit4]    > 	at junit.framework.Assert.assertEquals(Assert.java:147)
   [junit4]    > 	at junit.framework.Assert.assertEquals(Assert.java:153)
   [junit4]    > 	at org.apache.solr.internal.csv.CSVStrategyTest.testSetCSVStrategy(CSVStrategyTest.java:70)
   [junit4]    > 	at junit.framework.TestCase.runTest(TestCase.java:168)
   [junit4]    > 	at junit.framework.TestCase.runBare(TestCase.java:134)
   [junit4]    > 	at junit.framework.TestResult$1.protect(TestResult.java:110)
   [junit4]    > 	at junit.framework.TestResult.runProtected(TestResult.java:128)
   [junit4]    > 	at junit.framework.TestResult.run(TestResult.java:113)
   [junit4]    > 	at junit.framework.TestCase.run(TestCase.java:124)
   [junit4]    > 	at junit.framework.TestSuite.runTest(TestSuite.java:243)
   [junit4]    > 	at junit.framework.TestSuite.run(TestSuite.java:238)
   [junit4] Completed [414/581 (1!)] on J0 in 0.01s, 5 tests, 1 failure <<< FAILURES!

[...truncated 270 lines...]
   [junit4] Suite: org.apache.solr.handler.TestSolrConfigHandlerConcurrent
   [junit4]   2> Creating dataDir: C:\Users\JenkinsSlave\workspace\Lucene-Solr-trunk-Windows\solr\build\solr-core\test\J0\temp\solr.handler.TestSolrConfigHandlerConcurrent_7138193552298324-001\init-core-data-001
   [junit4]   2> 2990546 INFO  (SUITE-TestSolrConfigHandlerConcurrent-seed#[7138193552298324]-worker) [    ] o.a.s.SolrTestCaseJ4 Randomized ssl (false) and clientAuth (true)
   [junit4]   2> 2990546 INFO  (SUITE-TestSolrConfigHandlerConcurrent-seed#[7138193552298324]-worker) [    ] o.a.s.BaseDistributedSearchTestCase Setting hostContext system property: /_yl/kq
   [junit4]   2> 2990548 INFO  (TEST-TestSolrConfigHandlerConcurrent.test-seed#[7138193552298324]) [    ] o.a.s.c.ZkTestServer STARTING ZK TEST SERVER
   [junit4]   2> 2990548 INFO  (Thread-7349) [    ] o.a.s.c.ZkTestServer client port:0.0.0.0/0.0.0.0:0
   [junit4]   2> 2990548 INFO  (Thread-7349) [    ] o.a.s.c.ZkTestServer Starting server
   [junit4]   2> 2990634 INFO  (TEST-TestSolrConfigHandlerConcurrent.test-seed#[7138193552298324]) [    ] o.a.s.c.ZkTestServer start zk server on port:53027
   [junit4]   2> 2990634 INFO  (TEST-TestSolrConfigHandlerConcurrent.test-seed#[7138193552298324]) [    ] o.a.s.c.c.SolrZkClient Using default ZkCredentialsProvider
   [junit4]   2> 2990635 INFO  (TEST-TestSolrConfigHandlerConcurrent.test-seed#[7138193552298324]) [    ] o.a.s.c.c.ConnectionManager Waiting for client to connect to ZooKeeper
   [junit4]   2> 2990637 INFO  (zkCallback-2796-thread-1) [    ] o.a.s.c.c.ConnectionManager Watcher org.apache.solr.common.cloud.ConnectionManager@14774722 name:ZooKeeperConnection Watcher:127.0.0.1:53027 got event WatchedEvent state:SyncConnected type:None path:null path:null type:None
   [junit4]   2> 2990637 INFO  (TEST-TestSolrConfigHandlerConcurrent.test-seed#[7138193552298324]) [    ] o.a.s.c.c.ConnectionManager Client is connected to ZooKeeper
   [junit4]   2> 2990637 INFO  (TEST-TestSolrConfigHandlerConcurrent.test-seed#[7138193552298324]) [    ] o.a.s.c.c.SolrZkClient Using default ZkACLProvider
   [junit4]   2> 2990637 INFO  (TEST-TestSolrConfigHandlerConcurrent.test-seed#[7138193552298324]) [    ] o.a.s.c.c.SolrZkClient makePath: /solr
   [junit4]   2> 2990639 WARN  (NIOServerCxn.Factory:0.0.0.0/0.0.0.0:0) [    ] o.a.z.s.NIOServerCnxn caught end of stream exception
   [junit4]   2> EndOfStreamException: Unable to read additional data from client sessionid 0x1533b75b9730000, likely client has closed socket
   [junit4]   2> 	at org.apache.zookeeper.server.NIOServerCnxn.doIO(NIOServerCnxn.java:228)
   [junit4]   2> 	at org.apache.zookeeper.server.NIOServerCnxnFactory.run(NIOServerCnxnFactory.java:208)
   [junit4]   2> 	at java.lang.Thread.run(Thread.java:745)
   [junit4]   2> 2990640 INFO  (TEST-TestSolrConfigHandlerConcurrent.test-seed#[7138193552298324]) [    ] o.a.s.c.c.SolrZkClient Using default ZkCredentialsProvider
   [junit4]   2> 2990641 INFO  (TEST-TestSolrConfigHandlerConcurrent.test-seed#[7138193552298324]) [    ] o.a.s.c.c.ConnectionManager Waiting for client to connect to ZooKeeper
   [junit4]   2> 2990642 INFO  (zkCallback-2797-thread-1) [    ] o.a.s.c.c.ConnectionManager Watcher org.apache.solr.common.cloud.ConnectionManager@68202f0e name:ZooKeeperConnection Watcher:127.0.0.1:53027/solr got event WatchedEvent state:SyncConnected type:None path:null path:null type:None
   [junit4]   2> 2990642 INFO  (TEST-TestSolrConfigHandlerConcurrent.test-seed#[7138193552298324]) [    ] o.a.s.c.c.ConnectionManager Client is connected to ZooKeeper
   [junit4]   2> 2990642 INFO  (TEST-TestSolrConfigHandlerConcurrent.test-seed#[7138193552298324]) [    ] o.a.s.c.c.SolrZkClient Using default ZkACLProvider
   [junit4]   2> 2990642 INFO  (TEST-TestSolrConfigHandlerConcurrent.test-seed#[7138193552298324]) [    ] o.a.s.c.c.SolrZkClient makePath: /collections/collection1
   [junit4]   2> 2990643 INFO  (TEST-TestSolrConfigHandlerConcurrent.test-seed#[7138193552298324]) [    ] o.a.s.c.c.SolrZkClient makePath: /collections/collection1/shards
   [junit4]   2> 2990644 INFO  (TEST-TestSolrConfigHandlerConcurrent.test-seed#[7138193552298324]) [    ] o.a.s.c.c.SolrZkClient makePath: /collections/control_collection
   [junit4]   2> 2990646 INFO  (TEST-TestSolrConfigHandlerConcurrent.test-seed#[7138193552298324]) [    ] o.a.s.c.c.SolrZkClient makePath: /collections/control_collection/shards
   [junit4]   2> 2990648 INFO  (TEST-TestSolrConfigHandlerConcurrent.test-seed#[7138193552298324]) [    ] o.a.s.c.AbstractZkTestCase put C:\Users\JenkinsSlave\workspace\Lucene-Solr-trunk-Windows\solr\core\src\test-files\solr\collection1\conf\solrconfig-tlog.xml to /configs/conf1/solrconfig.xml
   [junit4]   2> 2990648 INFO  (TEST-TestSolrConfigHandlerConcurrent.test-seed#[7138193552298324]) [    ] o.a.s.c.c.SolrZkClient makePath: /configs/conf1/solrconfig.xml
   [junit4]   2> 2990650 INFO  (TEST-TestSolrConfigHandlerConcurrent.test-seed#[7138193552298324]) [    ] o.a.s.c.AbstractZkTestCase put C:\Users\JenkinsSlave\workspace\Lucene-Solr-trunk-Windows\solr\core\src\test-files\solr\collection1\conf\schema.xml to /configs/conf1/schema.xml
   [junit4]   2> 2990652 INFO  (TEST-TestSolrConfigHandlerConcurrent.test-seed#[7138193552298324]) [    ] o.a.s.c.c.SolrZkClient makePath: /configs/conf1/schema.xml
   [junit4]   2> 2990653 INFO  (TEST-TestSolrConfigHandlerConcurrent.test-seed#[7138193552298324]) [    ] o.a.s.c.AbstractZkTestCase put C:\Users\JenkinsSlave\workspace\Lucene-Solr-trunk-Windows\solr\core\src\test-files\solr\collection1\conf\solrconfig.snippet.randomindexconfig.xml to /configs/conf1/solrconfig.snippet.randomindexconfig.xml
   [junit4]   2> 2990653 INFO  (TEST-TestSolrConfigHandlerConcurrent.test-seed#[7138193552298324]) [    ] o.a.s.c.c.SolrZkClient makePath: /configs/conf1/solrconfig.snippet.randomindexconfig.xml
   [junit4]   2> 2990655 INFO  (TEST-TestSolrConfigHandlerConcurrent.test-seed#[7138193552298324]) [    ] o.a.s.c.AbstractZkTestCase put C:\Users\JenkinsSlave\workspace\Lucene-Solr-trunk-Windows\solr\core\src\test-files\solr\collection1\conf\stopwords.txt to /configs/conf1/stopwords.txt
   [junit4]   2> 2990655 INFO  (TEST-TestSolrConfigHandlerConcurrent.test-seed#[7138193552298324]) [    ] o.a.s.c.c.SolrZkClient makePath: /configs/conf1/stopwords.txt
   [junit4]   2> 2990657 INFO  (TEST-TestSolrConfigHandlerConcurrent.test-seed#[7138193552298324]) [    ] o.a.s.c.AbstractZkTestCase put C:\Users\JenkinsSlave\workspace\Lucene-Solr-trunk-Windows\solr\core\src\test-files\solr\collection1\conf\protwords.txt to /configs/conf1/protwords.txt
   [junit4]   2> 2990657 INFO  (TEST-TestSolrConfigHandlerConcurrent.test-seed#[7138193552298324]) [    ] o.a.s.c.c.SolrZkClient makePath: /configs/conf1/protwords.txt
   [junit4]   2> 2990659 INFO  (TEST-TestSolrConfigHandlerConcurrent.test-seed#[7138193552298324]) [    ] o.a.s.c.AbstractZkTestCase put C:\Users\JenkinsSlave\workspace\Lucene-Solr-trunk-Windows\solr\core\src\test-files\solr\collection1\conf\currency.xml to /configs/conf1/currency.xml
   [junit4]   2> 2990659 INFO  (TEST-TestSolrConfigHandlerConcurrent.test-seed#[7138193552298324]) [    ] o.a.s.c.c.SolrZkClient makePath: /configs/conf1/currency.xml
   [junit4]   2> 2990661 INFO  (TEST-TestSolrConfigHandlerConcurrent.test-seed#[7138193552298324]) [    ] o.a.s.c.AbstractZkTestCase put C:\Users\JenkinsSlave\workspace\Lucene-Solr-trunk-Windows\solr\core\src\test-files\solr\collection1\conf\enumsConfig.xml to /configs/conf1/enumsConfig.xml
   [junit4]   2> 2990661 INFO  (TEST-TestSolrConfigHandlerConcurrent.test-seed#[7138193552298324]) [    ] o.a.s.c.c.SolrZkClient makePath: /configs/conf1/enumsConfig.xml
   [junit4]   2> 2990663 INFO  (TEST-TestSolrConfigHandlerConcurrent.test-seed#[7138193552298324]) [    ] o.a.s.c.AbstractZkTestCase put C:\Users\JenkinsSlave\workspace\Lucene-Solr-trunk-Windows\solr\core\src\test-files\solr\collection1\conf\open-exchange-rates.json to /configs/conf1/open-exchange-rates.json
   [junit4]   2> 2990663 INFO  (TEST-TestSolrConfigHandlerConcurrent.test-seed#[7138193552298324]) [    ] o.a.s.c.c.SolrZkClient makePath: /configs/conf1/open-exchange-rates.json
   [junit4]   2> 2990663 INFO  (TEST-TestSolrConfigHandlerConcurrent.test-seed#[7138193552298324]) [    ] o.a.s.c.AbstractZkTestCase put C:\Users\JenkinsSlave\workspace\Lucene-Solr-trunk-Windows\solr\core\src\test-files\solr\collection1\conf\mapping-ISOLatin1Accent.txt to /configs/conf1/mapping-ISOLatin1Accent.txt
   [junit4]   2> 2990663 INFO  (TEST-TestSolrConfigHandlerConcurrent.test-seed#[7138193552298324]) [    ] o.a.s.c.c.SolrZkClient makePath: /configs/conf1/mapping-ISOLatin1Accent.txt
   [junit4]   2> 2990665 INFO  (TEST-TestSolrConfigHandlerConcurrent.test-seed#[7138193552298324]) [    ] o.a.s.c.AbstractZkTestCase put C:\Users\JenkinsSlave\workspace\Lucene-Solr-trunk-Windows\solr\core\src\test-files\solr\collection1\conf\old_synonyms.txt to /configs/conf1/old_synonyms.txt
   [junit4]   2> 2990665 INFO  (TEST-TestSolrConfigHandlerConcurrent.test-seed#[7138193552298324]) [    ] o.a.s.c.c.SolrZkClient makePath: /configs/conf1/old_synonyms.txt
   [junit4]   2> 2990666 INFO  (TEST-TestSolrConfigHandlerConcurrent.test-seed#[7138193552298324]) [    ] o.a.s.c.AbstractZkTestCase put C:\Users\JenkinsSlave\workspace\Lucene-Solr-trunk-Windows\solr\core\src\test-files\solr\collection1\conf\synonyms.txt to /configs/conf1/synonyms.txt
   [junit4]   2> 2990667 INFO  (TEST-TestSolrConfigHandlerConcurrent.test-seed#[7138193552298324]) [    ] o.a.s.c.c.SolrZkClient makePath: /configs/conf1/synonyms.txt
   [junit4]   2> 2991071 INFO  (TEST-TestSolrConfigHandlerConcurrent.test-seed#[7138193552298324]) [    ] o.a.s.SolrTestCaseJ4 Writing core.properties file to C:\Users\JenkinsSlave\workspace\Lucene-Solr-trunk-Windows\solr\build\solr-core\test\J0\temp\solr.handler.TestSolrConfigHandlerConcurrent_7138193552298324-001\control-001\cores\collection1
   [junit4]   2> 2991073 INFO  (TEST-TestSolrConfigHandlerConcurrent.test-seed#[7138193552298324]) [    ] o.e.j.s.Server jetty-9.3.6.v20151106
   [junit4]   2> 2991075 INFO  (TEST-TestSolrConfigHandlerConcurrent.test-seed#[7138193552298324]) [    ] o.e.j.s.h.ContextHandler Started o.e.j.s.ServletContextHandler@4d868336{/_yl/kq,null,AVAILABLE}
   [junit4]   2> 2991075 INFO  (TEST-TestSolrConfigHandlerConcurrent.test-seed#[7138193552298324]) [    ] o.e.j.s.ServerConnector Started ServerConnector@2b1f8564{HTTP/1.1,[http/1.1]}{127.0.0.1:53034}
   [junit4]   2> 2991076 INFO  (TEST-TestSolrConfigHandlerConcurrent.test-seed#[7138193552298324]) [    ] o.e.j.s.Server Started @3001383ms
   [junit4]   2> 2991076 INFO  (TEST-TestSolrConfigHandlerConcurrent.test-seed#[7138193552298324]) [    ] o.a.s.c.s.e.JettySolrRunner Jetty properties: {solr.data.dir=C:\Users\JenkinsSlave\workspace\Lucene-Solr-trunk-Windows\solr\build\solr-core\test\J0\temp\solr.handler.TestSolrConfigHandlerConcurrent_7138193552298324-001\tempDir-001/control/data, hostContext=/_yl/kq, hostPort=53034, coreRootDirectory=C:\Users\JenkinsSlave\workspace\Lucene-Solr-trunk-Windows\solr\build\solr-core\test\J0\..\..\..\..\..\..\..\..\..\Users\JenkinsSlave\workspace\Lucene-Solr-trunk-Windows\solr\build\solr-core\test\J0\temp\solr.handler.TestSolrConfigHandlerConcurrent_7138193552298324-001\control-001\cores}
   [junit4]   2> 2991076 INFO  (TEST-TestSolrConfigHandlerConcurrent.test-seed#[7138193552298324]) [    ] o.a.s.s.SolrDispatchFilter SolrDispatchFilter.init(): sun.misc.Launcher$AppClassLoader@73d16e93
   [junit4]   2> 2991076 INFO  (TEST-TestSolrConfigHandlerConcurrent.test-seed#[7138193552298324]) [    ] o.a.s.c.SolrResourceLoader new SolrResourceLoader for directory: 'C:\Users\JenkinsSlave\workspace\Lucene-Solr-trunk-Windows\solr\build\solr-core\test\J0\temp\solr.handler.TestSolrConfigHandlerConcurrent_7138193552298324-001\control-001'
   [junit4]   2> 2991076 INFO  (TEST-TestSolrConfigHandlerConcurrent.test-seed#[7138193552298324]) [    ] o.a.s.c.SolrResourceLoader JNDI not configured for solr (NoInitialContextEx)
   [junit4]   2> 2991076 INFO  (TEST-TestSolrConfigHandlerConcurrent.test-seed#[7138193552298324]) [    ] o.a.s.c.SolrResourceLoader solr home defaulted to 'solr/' (could not find system property or JNDI)
   [junit4]   2> 2991077 INFO  (TEST-TestSolrConfigHandlerConcurrent.test-seed#[7138193552298324]) [    ] o.a.s.c.c.SolrZkClient Using default ZkCredentialsProvider
   [junit4]   2> 2991077 INFO  (TEST-TestSolrConfigHandlerConcurrent.test-seed#[7138193552298324]) [    ] o.a.s.c.c.ConnectionManager Waiting for client to connect to ZooKeeper
   [junit4]   2> 2991079 INFO  (zkCallback-2798-thread-1) [    ] o.a.s.c.c.ConnectionManager Watcher org.apache.solr.common.cloud.ConnectionManager@5fdd2c4e name:ZooKeeperConnection Watcher:127.0.0.1:53027/solr got event WatchedEvent state:SyncConnected type:None path:null path:null type:None
   [junit4]   2> 2991079 INFO  (TEST-TestSolrConfigHandlerConcurrent.test-seed#[7138193552298324]) [    ] o.a.s.c.c.ConnectionManager Client is connected to ZooKeeper
   [junit4]   2> 2991079 INFO  (TEST-TestSolrConfigHandlerConcurrent.test-seed#[7138193552298324]) [    ] o.a.s.c.c.SolrZkClient Using default ZkACLProvider
   [junit4]   2> 2991080 INFO  (TEST-TestSolrConfigHandlerConcurrent.test-seed#[7138193552298324]) [    ] o.a.s.s.SolrDispatchFilter Loading solr.xml from SolrHome (not found in ZooKeeper)
   [junit4]   2> 2991080 INFO  (TEST-TestSolrConfigHandlerConcurrent.test-seed#[7138193552298324]) [    ] o.a.s.c.SolrXmlConfig Loading container configuration from C:\Users\JenkinsSlave\workspace\Lucene-Solr-trunk-Windows\solr\build\solr-core\test\J0\temp\solr.handler.TestSolrConfigHandlerConcurrent_7138193552298324-001\control-001\solr.xml
   [junit4]   2> 2991087 INFO  (TEST-TestSolrConfigHandlerConcurrent.test-seed#[7138193552298324]) [    ] o.a.s.c.CorePropertiesLocator Config-defined core root directory: C:\Users\JenkinsSlave\workspace\Lucene-Solr-trunk-Windows\solr\build\solr-core\test\J0\..\..\..\..\..\..\..\..\..\Users\JenkinsSlave\workspace\Lucene-Solr-trunk-Windows\solr\build\solr-core\test\J0\temp\solr.handler.TestSolrConfigHandlerConcurrent_7138193552298324-001\control-001\cores
   [junit4]   2> 2991087 INFO  (TEST-TestSolrConfigHandlerConcurrent.test-seed#[7138193552298324]) [    ] o.a.s.c.CoreContainer New CoreContainer 1887120297
   [junit4]   2> 2991087 INFO  (TEST-TestSolrConfigHandlerConcurrent.test-seed#[7138193552298324]) [    ] o.a.s.c.CoreContainer Loading cores into CoreContainer [instanceDir=C:\Users\JenkinsSlave\workspace\Lucene-Solr-trunk-Windows\solr\build\solr-core\test\J0\temp\solr.handler.TestSolrConfigHandlerConcurrent_7138193552298324-001\control-001]
   [junit4]   2> 2991087 WARN  (TEST-TestSolrConfigHandlerConcurrent.test-seed#[7138193552298324]) [    ] o.a.s.c.CoreContainer Couldn't add files from C:\Users\JenkinsSlave\workspace\Lucene-Solr-trunk-Windows\solr\build\solr-core\test\J0\temp\solr.handler.TestSolrConfigHandlerConcurrent_7138193552298324-001\control-001\lib to classpath: C:\Users\JenkinsSlave\workspace\Lucene-Solr-trunk-Windows\solr\build\solr-core\test\J0\temp\solr.handler.TestSolrConfigHandlerConcurrent_7138193552298324-001\control-001\lib
   [junit4]   2> 2991087 INFO  (TEST-TestSolrConfigHandlerConcurrent.test-seed#[7138193552298324]) [    ] o.a.s.h.c.HttpShardHandlerFactory created with socketTimeout : 90000,urlScheme : ,connTimeout : 15000,maxConnectionsPerHost : 20,maxConnections : 10000,corePoolSize : 0,maximumPoolSize : 2147483647,maxThreadIdleTime : 5,sizeOfQueue : -1,fairnessPolicy : false,useRetries : false,
   [junit4]   2> 2991090 INFO  (TEST-TestSolrConfigHandlerConcurrent.test-seed#[7138193552298324]) [    ] o.a.s.u.UpdateShardHandler Creating UpdateShardHandler HTTP client with params: socketTimeout=340000&connTimeout=45000&retry=true
   [junit4]   2> 2991091 INFO  (TEST-TestSolrConfigHandlerConcurrent.test-seed#[7138193552298324]) [    ] o.a.s.l.LogWatcher SLF4J impl is org.slf4j.impl.Log4jLoggerFactory
   [junit4]   2> 2991091 INFO  (TEST-TestSolrConfigHandlerConcurrent.test-seed#[7138193552298324]) [    ] o.a.s.l.LogWatcher Registering Log Listener [Log4j (org.slf4j.impl.Log4jLoggerFactory)]
   [junit4]   2> 2991091 INFO  (TEST-TestSolrConfigHandlerConcurrent.test-seed#[7138193552298324]) [    ] o.a.s.c.ZkContainer Zookeeper client=127.0.0.1:53027/solr
   [junit4]   2> 2991091 INFO  (TEST-TestSolrConfigHandlerConcurrent.test-seed#[7138193552298324]) [    ] o.a.s.c.ZkController zkHost includes chroot
   [junit4]   2> 2991091 INFO  (TEST-TestSolrConfigHandlerConcurrent.test-seed#[7138193552298324]) [    ] o.a.s.c.c.SolrZkClient Using default ZkCredentialsProvider
   [junit4]   2> 2991093 INFO  (TEST-TestSolrConfigHandlerConcurrent.test-seed#[7138193552298324]) [    ] o.a.s.c.c.ConnectionManager Waiting for client to connect to ZooKeeper
   [junit4]   2> 2991094 INFO  (zkCallback-2801-thread-1) [    ] o.a.s.c.c.ConnectionManager Watcher org.apache.solr.common.cloud.ConnectionManager@6cec70a9 name:ZooKeeperConnection Watcher:127.0.0.1:53027 got event WatchedEvent state:SyncConnected type:None path:null path:null type:None
   [junit4]   2> 2991094 INFO  (TEST-TestSolrConfigHandlerConcurrent.test-seed#[7138193552298324]) [    ] o.a.s.c.c.ConnectionManager Client is connected to ZooKeeper
   [junit4]   2> 2991095 INFO  (TEST-TestSolrConfigHandlerConcurrent.test-seed#[7138193552298324]) [    ] o.a.s.c.c.SolrZkClient Using default ZkACLProvider
   [junit4]   2> 2991096 INFO  (TEST-TestSolrConfigHandlerConcurrent.test-seed#[7138193552298324]) [n:127.0.0.1:53034__yl%2Fkq    ] o.a.s.c.c.ConnectionManager Waiting for client to connect to ZooKeeper
   [junit4]   2> 2991097 INFO  (zkCallback-2802-thread-1-processing-n:127.0.0.1:53034__yl%2Fkq) [n:127.0.0.1:53034__yl%2Fkq    ] o.a.s.c.c.ConnectionManager Watcher org.apache.solr.common.cloud.ConnectionManager@635bc5 name:ZooKeeperConnection Watcher:127.0.0.1:53027/solr got event WatchedEvent state:SyncConnected type:None path:null path:null type:None
   [junit4]   2> 2991097 INFO  (TEST-TestSolrConfigHandlerConcurrent.test-seed#[7138193552298324]) [n:127.0.0.1:53034__yl%2Fkq    ] o.a.s.c.c.ConnectionManager Client is connected to ZooKeeper
   [junit4]   2> 2991099 INFO  (TEST-TestSolrConfigHandlerConcurrent.test-seed#[7138193552298324]) [n:127.0.0.1:53034__yl%2Fkq    ] o.a.s.c.c.SolrZkClient makePath: /overseer/queue
   [junit4]   2> 2991101 INFO  (TEST-TestSolrConfigHandlerConcurrent.test-seed#[7138193552298324]) [n:127.0.0.1:53034__yl%2Fkq    ] o.a.s.c.c.SolrZkClient makePath: /overseer/collection-queue-work
   [junit4]   2> 2991106 INFO  (TEST-TestSolrConfigHandlerConcurrent.test-seed#[7138193552298324]) [n:127.0.0.1:53034__yl%2Fkq    ] o.a.s.c.c.SolrZkClient makePath: /overseer/collection-map-running
   [junit4]   2> 2991107 INFO  (TEST-TestSolrConfigHandlerConcurrent.test-seed#[7138193552298324]) [n:127.0.0.1:53034__yl%2Fkq    ] o.a.s.c.c.SolrZkClient makePath: /overseer/collection-map-completed
   [junit4]   2> 2991109 INFO  (TEST-TestSolrConfigHandlerConcurrent.test-seed#[7138193552298324]) [n:127.0.0.1:53034__yl%2Fkq    ] o.a.s.c.c.SolrZkClient makePath: /overseer/collection-map-failure
   [junit4]   2> 2991111 INFO  (TEST-TestSolrConfigHandlerConcurrent.test-seed#[7138193552298324]) [n:127.0.0.1:53034__yl%2Fkq    ] o.a.s.c.c.SolrZkClient makePath: /live_nodes
   [junit4]   2> 2991113 INFO  (TEST-TestSolrConfigHandlerConcurrent.test-seed#[7138193552298324]) [n:127.0.0.1:53034__yl%2Fkq    ] o.a.s.c.c.SolrZkClient makePath: /aliases.json
   [junit4]   2> 2991114 INFO  (TEST-TestSolrConfigHandlerConcurrent.test-seed#[7138193552298324]) [n:127.0.0.1:53034__yl%2Fkq    ] o.a.s.c.c.SolrZkClient makePath: /clusterstate.json
   [junit4]   2> 2991116 INFO  (TEST-TestSolrConfigHandlerConcurrent.test-seed#[7138193552298324]) [n:127.0.0.1:53034__yl%2Fkq    ] o.a.s.c.c.SolrZkClient makePath: /security.json
   [junit4]   2> 2991116 INFO  (TEST-TestSolrConfigHandlerConcurrent.test-seed#[7138193552298324]) [n:127.0.0.1:53034__yl%2Fkq    ] o.a.s.c.c.ZkStateReader Updating cluster state from ZooKeeper... 
   [junit4]   2> 2991118 INFO  (TEST-TestSolrConfigHandlerConcurrent.test-seed#[7138193552298324]) [n:127.0.0.1:53034__yl%2Fkq    ] o.a.s.c.c.ZkStateReader Updated live nodes from ZooKeeper... (0) -> (0)
   [junit4]   2> 2991120 INFO  (TEST-TestSolrConfigHandlerConcurrent.test-seed#[7138193552298324]) [n:127.0.0.1:53034__yl%2Fkq    ] o.a.s.c.c.SolrZkClient makePath: /overseer_elect
   [junit4]   2> 2991122 INFO  (TEST-TestSolrConfigHandlerConcurrent.test-seed#[7138193552298324]) [n:127.0.0.1:53034__yl%2Fkq    ] o.a.s.c.c.SolrZkClient makePath: /overseer_elect/election
   [junit4]   2> 2991124 INFO  (TEST-TestSolrConfigHandlerConcurrent.test-seed#[7138193552298324]) [n:127.0.0.1:53034__yl%2Fkq    ] o.a.s.c.Overseer Overseer (id=null) closing
   [junit4]   2> 2991124 INFO  (TEST-TestSolrConfigHandlerConcurrent.test-seed#[7138193552298324]) [n:127.0.0.1:53034__yl%2Fkq    ] o.a.s.c.LeaderElector Joined leadership election with path: /overseer_elect/election/95485393913446404-127.0.0.1:53034__yl%2Fkq-n_0000000000
   [junit4]   2> 2991125 INFO  (TEST-TestSolrConfigHandlerConcurrent.test-seed#[7138193552298324]) [n:127.0.0.1:53034__yl%2Fkq    ] o.a.s.c.OverseerElectionContext I am going to be the leader 127.0.0.1:53034__yl%2Fkq
   [junit4]   2> 2991125 INFO  (TEST-TestSolrConfigHandlerConcurrent.test-seed#[7138193552298324]) [n:127.0.0.1:53034__yl%2Fkq    ] o.a.s.c.c.SolrZkClient makePath: /overseer_elect/leader
   [junit4]   2> 2991126 INFO  (TEST-TestSolrConfigHandlerConcurrent.test-seed#[7138193552298324]) [n:127.0.0.1:53034__yl%2Fkq    ] o.a.s.c.Overseer Overseer (id=95485393913446404-127.0.0.1:53034__yl%2Fkq-n_0000000000) starting
   [junit4]   2> 2991128 INFO  (TEST-TestSolrConfigHandlerConcurrent.test-seed#[7138193552298324]) [n:127.0.0.1:53034__yl%2Fkq    ] o.a.s.c.c.SolrZkClient makePath: /overseer/queue-work
   [junit4]   2> 2991134 INFO  (TEST-TestSolrConfigHandlerConcurrent.test-seed#[7138193552298324]) [n:127.0.0.1:53034__yl%2Fkq    ] o.a.s.c.OverseerAutoReplicaFailoverThread Starting OverseerAutoReplicaFailoverThread autoReplicaFailoverWorkLoopDelay=10000 autoReplicaFailoverWaitAfterExpiration=30000 autoReplicaFailoverBadNodeExpiration=60000
   [junit4]   2> 2991134 INFO  (OverseerCollectionConfigSetProcessor-95485393913446404-127.0.0.1:53034__yl%2Fkq-n_0000000000) [n:127.0.0.1:53034__yl%2Fkq    ] o.a.s.c.OverseerTaskProcessor Process current queue of overseer operations
   [junit4]   2> 2991135 INFO  (OverseerStateUpdate-95485393913446404-127.0.0.1:53034__yl%2Fkq-n_0000000000) [n:127.0.0.1:53034__yl%2Fkq    ] o.a.s.c.Overseer Starting to work on the main queue
   [junit4]   2> 2991135 INFO  (TEST-TestSolrConfigHandlerConcurrent.test-seed#[7138193552298324]) [n:127.0.0.1:53034__yl%2Fkq    ] o.a.s.c.ZkController Register node as live in ZooKeeper:/live_nodes/127.0.0.1:53034__yl%2Fkq
   [junit4]   2> 2991136 INFO  (TEST-TestSolrConfigHandlerConcurrent.test-seed#[7138193552298324]) [n:127.0.0.1:53034__yl%2Fkq    ] o.a.s.c.c.SolrZkClient makePath: /live_nodes/127.0.0.1:53034__yl%2Fkq
   [junit4]   2> 2991136 INFO  (zkCallback-2802-thread-1-processing-n:127.0.0.1:53034__yl%2Fkq) [n:127.0.0.1:53034__yl%2Fkq    ] o.a.s.c.c.ZkStateReader A live node change: [WatchedEvent state:SyncConnected type:NodeChildrenChanged path:/live_nodes], has occurred - updating... (live nodes size: [0])
   [junit4]   2> 2991137 INFO  (OverseerStateUpdate-95485393913446404-127.0.0.1:53034__yl%2Fkq-n_0000000000) [n:127.0.0.1:53034__yl%2Fkq    ] o.a.s.c.c.ZkStateReader Updated live nodes from ZooKeeper... (0) -> (1)
   [junit4]   2> 2991137 INFO  (zkCallback-2802-thread-1-processing-n:127.0.0.1:53034__yl%2Fkq) [n:127.0.0.1:53034__yl%2Fkq    ] o.a.s.c.c.ZkStateReader Updated live nodes from ZooKeeper... (1) -> (1)
   [junit4]   2> 2991143 INFO  (TEST-TestSolrConfigHandlerConcurrent.test-seed#[7138193552298324]) [n:127.0.0.1:53034__yl%2Fkq    ] o.a.s.c.CoreContainer Security conf doesn't exist. Skipping setup for authorization module.
   [junit4]   2> 2991143 INFO  (TEST-TestSolrConfigHandlerConcurrent.test-seed#[7138193552298324]) [n:127.0.0.1:53034__yl%2Fkq    ] o.a.s.c.CoreContainer No authentication plugin used.
   [junit4]   2> 2991145 INFO  (TEST-TestSolrConfigHandlerConcurrent.test-seed#[7138193552298324]) [n:127.0.0.1:53034__yl%2Fkq    ] o.a.s.c.CorePropertiesLocator Looking for core definitions underneath C:\Users\JenkinsSlave\workspace\Lucene-Solr-trunk-Windows\solr\build\solr-core\test\J0\..\..\..\..\..\..\..\..\..\Users\JenkinsSlave\workspace\Lucene-Solr-trunk-Windows\solr\build\solr-core\test\J0\temp\solr.handler.TestSolrConfigHandlerConcurrent_7138193552298324-001\control-001\cores
   [junit4]   2> 2991147 INFO  (TEST-TestSolrConfigHandlerConcurrent.test-seed#[7138193552298324]) [n:127.0.0.1:53034__yl%2Fkq    ] o.a.s.c.CoreDescriptor Created CoreDescriptor: {name=collection1, config=solrconfig.xml, transient=false, schema=schema.xml, loadOnStartup=true, configSetProperties=configsetprops.json, collection=control_collection, coreNodeName=, dataDir=data\, shard=}
   [junit4]   2> 2991147 INFO  (TEST-TestSolrConfigHandlerConcurrent.test-seed#[7138193552298324]) [n:127.0.0.1:53034__yl%2Fkq    ] o.a.s.c.CorePropertiesLocator Found core collection1 in C:\Users\JenkinsSlave\workspace\Lucene-Solr-trunk-Windows\solr\build\solr-core\test\J0\..\..\..\..\..\..\..\..\..\Users\JenkinsSlave\workspace\Lucene-Solr-trunk-Windows\solr\build\solr-core\test\J0\temp\solr.handler.TestSolrConfigHandlerConcurrent_7138193552298324-001\control-001\cores\collection1
   [junit4]   2> 2991147 INFO  (TEST-TestSolrConfigHandlerConcurrent.test-seed#[7138193552298324]) [n:127.0.0.1:53034__yl%2Fkq    ] o.a.s.c.CorePropertiesLocator Found 1 core definitions
   [junit4]   2> 2991149 INFO  (coreLoadExecutor-9431-thread-1-processing-n:127.0.0.1:53034__yl%2Fkq) [n:127.0.0.1:53034__yl%2Fkq c:control_collection   x:collection1] o.a.s.c.ZkController publishing state=down
   [junit4]   2> 2991149 INFO  (coreLoadExecutor-9431-thread-1-processing-n:127.0.0.1:53034__yl%2Fkq) [n:127.0.0.1:53034__yl%2Fkq c:control_collection   x:collection1] o.a.s.c.ZkController numShards not found on descriptor - reading it from system property
   [junit4]   2> 2991149 INFO  (TEST-TestSolrConfigHandlerConcurrent.test-seed#[7138193552298324]) [n:127.0.0.1:53034__yl%2Fkq    ] o.a.s.s.SolrDispatchFilter user.dir=C:\Users\JenkinsSlave\workspace\Lucene-Solr-trunk-Windows\solr\build\solr-core\test\J0
   [junit4]   2> 2991149 INFO  (TEST-TestSolrConfigHandlerConcurrent.test-seed#[7138193552298324]) [n:127.0.0.1:53034__yl%2Fkq    ] o.a.s.s.SolrDispatchFilter SolrDispatchFilter.init() done
   [junit4]   2> 2991151 INFO  (OverseerStateUpdate-95485393913446404-127.0.0.1:53034__yl%2Fkq-n_0000000000) [n:127.0.0.1:53034__yl%2Fkq    ] o.a.s.c.Overseer processMessage: queueSize: 1, message = {
   [junit4]   2>   "core":"collection1",
   [junit4]   2>   "roles":null,
   [junit4]   2>   "base_url":"http://127.0.0.1:53034/_yl/kq",
   [junit4]   2>   "node_name":"127.0.0.1:53034__yl%2Fkq",
   [junit4]   2>   "numShards":"1",
   [junit4]   2>   "state":"down",
   [junit4]   2>   "shard":null,
   [junit4]   2>   "collection":"control_collection",
   [junit4]   2>   "operation":"state"} current state version: 0
   [junit4]   2> 2991151 INFO  (coreLoadExecutor-9431-thread-1-processing-n:127.0.0.1:53034__yl%2Fkq) [n:127.0.0.1:53034__yl%2Fkq c:control_collection   x:collection1] o.a.s.c.ZkController look for our core node name
   [junit4]   2> 2991151 INFO  (OverseerStateUpdate-95485393913446404-127.0.0.1:53034__yl%2Fkq-n_0000000000) [n:127.0.0.1:53034__yl%2Fkq    ] o.a.s.c.o.ReplicaMutator Update state numShards=1 message={
   [junit4]   2>   "core":"collection1",
   [junit4]   2>   "roles":null,
   [junit4]   2>   "base_url":"http://127.0.0.1:53034/_yl/kq",
   [junit4]   2>   "node_name":"127.0.0.1:53034__yl%2Fkq",
   [junit4]   2>   "numShards":"1",
   [junit4]   2>   "state":"down",
   [junit4]   2>   "shard":null,
   [junit4]   2>   "collection":"control_collection",
   [junit4]   2>   "operation":"state"}
   [junit4]   2> 2991151 INFO  (OverseerStateUpdate-95485393913446404-127.0.0.1:53034__yl%2Fkq-n_0000000000) [n:127.0.0.1:53034__yl%2Fkq    ] o.a.s.c.o.ClusterStateMutator building a new cName: control_collection
   [junit4]   2> 2991151 INFO  (OverseerStateUpdate-95485393913446404-127.0.0.1:53034__yl%2Fkq-n_0000000000) [n:127.0.0.1:53034__yl%2Fkq    ] o.a.s.c.o.ReplicaMutator Assigning new node to shard shard=shard1
   [junit4]   2> 2991153 INFO  (zkCallback-2802-thread-1-processing-n:127.0.0.1:53034__yl%2Fkq) [n:127.0.0.1:53034__yl%2Fkq    ] o.a.s.c.c.ZkStateReader A cluster state change: [WatchedEvent state:SyncConnected type:NodeDataChanged path:/clusterstate.json], has occurred - updating... (live nodes size: [1])
   [junit4]   2> 2992007 INFO  (coreLoadExecutor-9431-thread-1-processing-n:127.0.0.1:53034__yl%2Fkq) [n:127.0.0.1:53034__yl%2Fkq c:control_collection   x:collection1] o.a.s.c.ZkController waiting to find shard id in clusterstate for collection1
   [junit4]   2> 2992007 INFO  (coreLoadExecutor-9431-thread-1-processing-n:127.0.0.1:53034__yl%2Fkq) [n:127.0.0.1:53034__yl%2Fkq c:control_collection   x:collection1] o.a.s.c.ZkController Check for collection zkNode:control_collection
   [junit4]   2> 2992007 INFO  (coreLoadExecutor-9431-thread-1-processing-n:127.0.0.1:53034__yl%2Fkq) [n:127.0.0.1:53034__yl%2Fkq c:control_collection   x:collection1] o.a.s.c.ZkController Collection zkNode exists
   [junit4]   2> 2992007 INFO  (coreLoadExecutor-9431-thread-1-processing-n:127.0.0.1:53034__yl%2Fkq) [n:127.0.0.1:53034__yl%2Fkq c:control_collection   x:collection1] o.a.s.c.c.ZkStateReader Load collection config from: [/collections/control_collection]
   [junit4]   2> 2992007 INFO  (coreLoadExecutor-9431-thread-1-processing-n:127.0.0.1:53034__yl%2Fkq) [n:127.0.0.1:53034__yl%2Fkq c:control_collection   x:collection1] o.a.s.c.c.ZkStateReader path=[/collections/control_collection] [configName]=[conf1] specified config exists in ZooKeeper
   [junit4]   2> 2992007 INFO  (coreLoadExecutor-9431-thread-1-processing-n:127.0.0.1:53034__yl%2Fkq) [n:127.0.0.1:53034__yl%2Fkq c:control_collection   x:collection1] o.a.s.c.SolrResourceLoader new SolrResourceLoader for directory: 'C:\Users\JenkinsSlave\workspace\Lucene-Solr-trunk-Windows\solr\build\solr-core\test\J0\temp\solr.handler.TestSolrConfigHandlerConcurrent_7138193552298324-001\control-001\cores\collection1'
   [junit4]   2> 2992007 INFO  (coreLoadExecutor-9431-thread-1-processing-n:127.0.0.1:53034__yl%2Fkq) [n:127.0.0.1:53034__yl%2Fkq c:control_collection   x:collection1] o.a.s.c.SolrResourceLoader JNDI not configured for solr (NoInitialContextEx)
   [junit4]   2> 2992007 INFO  (coreLoadExecutor-9431-thread-1-processing-n:127.0.0.1:53034__yl%2Fkq) [n:127.0.0.1:53034__yl%2Fkq c:control_collection   x:collection1] o.a.s.c.SolrResourceLoader solr home defaulted to 'solr/' (could not find system property or JNDI)
   [junit4]   2> 2992010 INFO  (coreLoadExecutor-9431-thread-1-processing-n:127.0.0.1:53034__yl%2Fkq) [n:127.0.0.1:53034__yl%2Fkq c:control_collection   x:collection1] o.a.s.c.Config loaded config solrconfig.xml with version 0 
   [junit4]   2> 2992015 INFO  (coreLoadExecutor-9431-thread-1-processing-n:127.0.0.1:53034__yl%2Fkq) [n:127.0.0.1:53034__yl%2Fkq c:control_collection   x:collection1] o.a.s.c.SolrConfig current version of requestparams : -1
   [junit4]   2> 2992017 INFO  (coreLoadExecutor-9431-thread-1-processing-n:127.0.0.1:53034__yl%2Fkq) [n:127.0.0.1:53034__yl%2Fkq c:control_collection   x:collection1] o.a.s.c.SolrConfig Using Lucene MatchVersion: 7.0.0
   [junit4]   2> 2992022 INFO  (coreLoadExecutor-9431-thread-1-processing-n:127.0.0.1:53034__yl%2Fkq) [n:127.0.0.1:53034__yl%2Fkq c:control_collection   x:collection1] o.a.s.c.SolrConfig Loaded SolrConfig: solrconfig.xml
   [junit4]   2> 2992027 INFO  (coreLoadExecutor-9431-thread-1-processing-n:127.0.0.1:53034__yl%2Fkq) [n:127.0.0.1:53034__yl%2Fkq c:control_collection   x:collection1] o.a.s.s.IndexSchema [collection1] Schema name=test
   [junit4]   2> 2992100 INFO  (coreLoadExecutor-9431-thread-1-processing-n:127.0.0.1:53034__yl%2Fkq) [n:127.0.0.1:53034__yl%2Fkq c:control_collection   x:collection1] o.a.s.s.OpenExchangeRatesOrgProvider Initialized with rates=open-exchange-rates.json, refreshInterval=1440.
   [junit4]   2> 2992106 INFO  (coreLoadExecutor-9431-thread-1-processing-n:127.0.0.1:53034__yl%2Fkq) [n:127.0.0.1:53034__yl%2Fkq c:control_collection   x:collection1] o.a.s.s.IndexSchema default search field in schema is text
   [junit4]   2> 2992107 INFO  (coreLoadExecutor-9431-thread-1-processing-n:127.0.0.1:53034__yl%2Fkq) [n:127.0.0.1:53034__yl%2Fkq c:control_collection   x:collection1] o.a.s.s.IndexSchema unique key field: id
   [junit4]   2> 2992114 INFO  (coreLoadExecutor-9431-thread-1-processing-n:127.0.0.1:53034__yl%2Fkq) [n:127.0.0.1:53034__yl%2Fkq c:control_collection   x:collection1] o.a.s.s.FileExchangeRateProvider Reloading exchange rates from file currency.xml
   [junit4]   2> 2992115 INFO  (coreLoadExecutor-9431-thread-1-processing-n:127.0.0.1:53034__yl%2Fkq) [n:127.0.0.1:53034__yl%2Fkq c:control_collection   x:collection1] o.a.s.s.FileExchangeRateProvider Reloading exchange rates from file currency.xml
   [junit4]   2> 2992116 INFO  (coreLoadExecutor-9431-thread-1-processing-n:127.0.0.1:53034__yl%2Fkq) [n:127.0.0.1:53034__yl%2Fkq c:control_collection   x:collection1] o.a.s.s.OpenExchangeRatesOrgProvider Reloading exchange rates from open-exchange-rates.json
   [junit4]   2> 2992117 INFO  (coreLoadExecutor-9431-thread-1-processing-n:127.0.0.1:53034__yl%2Fkq) [n:127.0.0.1:53034__yl%2Fkq c:control_collection   x:collection1] o.a.s.s.OpenExchangeRatesOrgProvider Reloading exchange rates from open-exchange-rates.json
   [junit4]   2> 2992120 INFO  (coreLoadExecutor-9431-thread-1-processing-n:127.0.0.1:53034__yl%2Fkq) [n:127.0.0.1:53034__yl%2Fkq c:control_collection   x:collection1] o.a.s.c.ConfigSetProperties Did not find ConfigSet properties, assuming default properties: Can't find resource 'configsetprops.json' in classpath or '/configs/conf1', cwd=C:\Users\JenkinsSlave\workspace\Lucene-Solr-trunk-Windows\solr\build\solr-core\test\J0
   [junit4]   2> 2992120 INFO  (coreLoadExecutor-9431-thread-1-processing-n:127.0.0.1:53034__yl%2Fkq) [n:127.0.0.1:53034__yl%2Fkq c:control_collection   x:collection1] o.a.s.c.CoreContainer Creating SolrCore 'collection1' using configuration from collection control_collection
   [junit4]   2> 2992120 INFO  (coreLoadExecutor-9431-thread-1-processing-n:127.0.0.1:53034__yl%2Fkq) [n:127.0.0.1:53034__yl%2Fkq c:control_collection s:shard1 r:core_node1 x:collection1] o.a.s.c.SolrCore org.apache.solr.core.MockDirectoryFactory
   [junit4]   2> 2992120 INFO  (coreLoadExecutor-9431-thread-1-processing-n:127.0.0.1:53034__yl%2Fkq) [n:127.0.0.1:53034__yl%2Fkq c:control_collection s:shard1 r:core_node1 x:collection1] o.a.s.c.SolrCore [[collection1] ] Opening new SolrCore at [C:\Users\JenkinsSlave\workspace\Lucene-Solr-trunk-Windows\solr\build\solr-core\test\J0\temp\solr.handler.TestSolrConfigHandlerConcurrent_7138193552298324-001\control-001\cores\collection1], dataDir=[C:\Users\JenkinsSlave\workspace\Lucene-Solr-trunk-Windows\solr\build\solr-core\test\J0\..\..\..\..\..\..\..\..\..\Users\JenkinsSlave\workspace\Lucene-Solr-trunk-Windows\solr\build\solr-core\test\J0\temp\solr.handler.TestSolrConfigHandlerConcurrent_7138193552298324-001\control-001\cores\collection1\data\]
   [junit4]   2> 2992120 INFO  (coreLoadExecutor-9431-thread-1-processing-n:127.0.0.1:53034__yl%2Fkq) [n:127.0.0.1:53034__yl%2Fkq c:control_collection s:shard1 r:core_node1 x:collection1] o.a.s.c.JmxMonitoredMap JMX monitoring is enabled. Adding Solr mbeans to JMX Server: com.sun.jmx.mbeanserver.JmxMBeanServer@21b6b3d9
   [junit4]   2> 2992121 INFO  (coreLoadExecutor-9431-thread-1-processing-n:127.0.0.1:53034__yl%2Fkq) [n:127.0.0.1:53034__yl%2Fkq c:control_collection s:shard1 r:core_node1 x:collection1] o.a.s.c.CachingDirectoryFactory return new directory for C:\Users\JenkinsSlave\workspace\Lucene-Solr-trunk-Windows\solr\build\solr-core\test\J0\..\..\..\..\..\..\..\..\..\Users\JenkinsSlave\workspace\Lucene-Solr-trunk-Windows\solr\build\solr-core\test\J0\temp\solr.handler.TestSolrConfigHandlerConcurrent_7138193552298324-001\control-001\cores\collection1\data\
   [junit4]   2> 2992121 INFO  (coreLoadExecutor-9431-thread-1-processing-n:127.0.0.1:53034__yl%2Fkq) [n:127.0.0.1:53034__yl%2Fkq c:control_collection s:shard1 r:core_node1 x:collection1] o.a.s.c.SolrCore New index directory detected: old=null new=C:\Users\JenkinsSlave\workspace\Lucene-Solr-trunk-Windows\solr\build\solr-core\test\J0\..\..\..\..\..\..\..\..\..\Users\JenkinsSlave\workspace\Lucene-Solr-trunk-Windows\solr\build\solr-core\test\J0\temp\solr.handler.TestSolrConfigHandlerConcurrent_7138193552298324-001\control-001\cores\collection1\data\index/
   [junit4]   2> 2992121 WARN  (coreLoadExecutor-9431-thread-1-processing-n:127.0.0.1:53034__yl%2Fkq) [n:127.0.0.1:53034__yl%2Fkq c:control_collection s:shard1 r:core_node1 x:collection1] o.a.s.c.SolrCore [collection1] Solr index directory 'C:\Users\JenkinsSlave\workspace\Lucene-Solr-trunk-Windows\solr\build\solr-core\test\J0\..\..\..\..\..\..\..\..\..\Users\JenkinsSlave\workspace\Lucene-Solr-trunk-Windows\solr\build\solr-core\test\J0\temp\solr.handler.TestSolrConfigHandlerConcurrent_7138193552298324-001\control-001\cores\collection1\data\index' doesn't exist. Creating new index...
   [junit4]   2> 2992121 INFO  (coreLoadExecutor-9431-thread-1-processing-n:127.0.0.1:53034__yl%2Fkq) [n:127.0.0.1:53034__yl%2Fkq c:control_collection s:shard1 r:core_node1 x:collection1] o.a.s.c.CachingDirectoryFactory return new directory for C:\Users\JenkinsSlave\workspace\Lucene-Solr-trunk-Windows\solr\build\solr-core\test\J0\..\..\..\..\..\..\..\..\..\Users\JenkinsSlave\workspace\Lucene-Solr-trunk-Windows\solr\build\solr-core\test\J0\temp\solr.handler.TestSolrConfigHandlerConcurrent_7138193552298324-001\control-001\cores\collection1\data\index
   [junit4]   2> 2992122 INFO  (coreLoadExecutor-9431-thread-1-processing-n:127.0.0.1:53034__yl%2Fkq) [n:127.0.0.1:53034__yl%2Fkq c:control_collection s:shard1 r:core_node1 x:collection1] o.a.s.u.RandomMergePolicy RandomMergePolicy wrapping class org.apache.lucene.index.TieredMergePolicy: [TieredMergePolicy: maxMergeAtOnce=35, maxMergeAtOnceExplicit=24, maxMergedSegmentMB=34.052734375, floorSegmentMB=0.87890625, forceMergeDeletesPctAllowed=23.85444397818215, segmentsPerTier=33.0, maxCFSSegmentSizeMB=8.796093022207999E12, noCFSRatio=0.0
   [junit4]   2> 2992122 INFO  (coreLoadExecutor-9431-thread-1-processing-n:127.0.0.1:53034__yl%2Fkq) [n:127.0.0.1:53034__yl%2Fkq c:control_collection s:shard1 r:core_node1 x:collection1] o.a.s.c.SolrDeletionPolicy SolrDeletionPolicy.onCommit: commits: num=1
   [junit4]   2> 	commit{dir=MockDirectoryWrapper(RAMDirectory@27085d1c lockFactory=org.apache.lucene.store.SingleInstanceLockFactory@749be621),segFN=segments_1,generation=1}
   [junit4]   2> 2992122 INFO  (coreLoadExecutor-9431-thread-1-processing-n:127.0.0.1:53034__yl%2Fkq) [n:127.0.0.1:53034__yl%2Fkq c:control_collection s:shard1 r:core_node1 x:collection1] o.a.s.c.SolrDeletionPolicy newest commit generation = 1
   [junit4]   2> 2992122 INFO  (OldIndexDirectoryCleanupThreadForCore-collection1) [n:127.0.0.1:53034__yl%2Fkq c:control_collection s:shard1 r:core_node1 x:collection1] o.a.s.c.SolrCore Looking for old index directories to cleanup for core collection1 in C:\Users\JenkinsSlave\workspace\Lucene-Solr-trunk-Windows\solr\build\solr-core\test\J0\..\..\..\..\..\..\..\..\..\Users\JenkinsSlave\workspace\Lucene-Solr-trunk-Windows\solr\build\solr-core\test\J0\temp\solr.handler.TestSolrConfigHandlerConcurrent_7138193552298324-001\control-001\cores\collection1\data\
   [junit4]   2> 2992122 WARN  (OldIndexDirectoryCleanupThreadForCore-collection1) [n:127.0.0.1:53034__yl%2Fkq c:control_collection s:shard1 r:core_node1 x:collection1] o.a.s.c.DirectoryFactory C:\Users\JenkinsSlave\workspace\Lucene-Solr-trunk-Windows\solr\build\solr-core\test\J0\..\..\..\..\..\..\..\..\..\Users\JenkinsSlave\workspace\Lucene-Solr-trunk-Windows\solr\build\solr-core\test\J0\temp\solr.handler.TestSolrConfigHandlerConcurrent_7138193552298324-001\control-001\cores\collection1\data\ does not point to a valid data directory; skipping clean-up of old index directories.
   [junit4]   2> 2992124 INFO  (coreLoadExecutor-9431-thread-1-processing-n:127.0.0.1:53034__yl%2Fkq) [n:127.0.0.1:53034__yl%2Fkq c:control_collection s:shard1 r:core_node1 x:collection1] o.a.s.u.p.UpdateRequestProcessorChain creating updateRequestProcessorChain "nodistrib"
   [junit4]   2> 2992124 INFO  (coreLoadExecutor-9431-thread-1-processing-n:127.0.0.1:53034__yl%2Fkq) [n:127.0.0.1:53034__yl%2Fkq c:control_collection s:shard1 r:core_node1 x:collection1] o.a.s.u.p.UpdateRequestProcessorChain creating updateRequestProcessorChain "dedupe"
   [junit4]   2> 2992124 INFO  (coreLoadExecutor-9431-thread-1-processing-n:127.0.0.1:53034__yl%2Fkq) [n:127.0.0.1:53034__yl%2Fkq c:control_collection s:shard1 r:core_node1 x:collection1] o.a.s.u.p.UpdateRequestProcessorChain inserting DistributedUpdateProcessorFactory into updateRequestProcessorChain "dedupe"
   [junit4]   2> 2992124 INFO  (coreLoadExecutor-9431-thread-1-processing-n:127.0.0.1:53034__yl%2Fkq) [n:127.0.0.1:53034__yl%2Fkq c:control_collection s:shard1 r:core_node1 x:collection1] o.a.s.u.p.UpdateRequestProcessorChain creating updateRequestProcessorChain "stored_sig"
   [junit4]   2> 2992124 INFO  (coreLoadExecutor-9431-thread-1-processing-n:127.0.0.1:53034__yl%2Fkq) [n:127.0.0.1:53034__yl%2Fkq c:control_collection s:shard1 r:core_node1 x:collection1] o.a.s.u.p.UpdateRequestProcessorChain inserting DistributedUpdateProcessorFactory into updateRequestProcessorChain "stored_sig"
   [junit4]   2> 2992124 INFO  (coreLoadExecutor-9431-thread-1-processing-n:127.0.0.1:53034__yl%2Fkq) [n:127.0.0.1:53034__yl%2Fkq c:control_collection s:shard1 r:core_node1 x:collection1] o.a.s.u.p.UpdateRequestProcessorChain creating updateRequestProcessorChain "distrib-dup-test-chain-explicit"
   [junit4]   2> 2992124 INFO  (coreLoadExecutor-9431-thread-1-processing-n:127.0.0.1:53034__yl%2Fkq) [n:127.0.0.1:53034__yl%2Fkq c:control_collection s:shard1 r:core_node1 x:collection1] o.a.s.u.p.UpdateRequestProcessorChain creating updateRequestProcessorChain "distrib-dup-test-chain-implicit"
   [junit4]   2> 2992124 INFO  (coreLoadExecutor-9431-thread-1-processing-n:127.0.0.1:53034__yl%2Fkq) [n:127.0.0.1:53034__yl%2Fkq c:control_collection s:shard1 r:core_node1 x:collection1] o.a.s.u.p.UpdateRequestProcessorChain inserting DistributedUpdateProcessorFactory into updateRequestProcessorChain "distrib-dup-test-chain-implicit"
   [junit4]   2> 2992124 INFO  (coreLoadExecutor-9431-thread-1-processing-n:127.0.0.1:53034__yl%2Fkq) [n:127.0.0.1:53034__yl%2Fkq c:control_collection s:shard1 r:core_node1 x:collection1] o.a.s.c.SolrCore no updateRequestProcessorChain defined as default, creating implicit default
   [junit4]   2> 2992124 WARN  (coreLoadExecutor-9431-thread-1-processing-n:127.0.0.1:53034__yl%2Fkq) [n:127.0.0.1:53034__yl%2Fkq c:control_collection s:shard1 r:core_node1 x:collection1] o.a.s.c.RequestHandlers INVALID paramSet a in requestHandler {type = requestHandler,name = /dump,class = DumpRequestHandler,args = {defaults={a=A,b=B}}}
   [junit4]   2> 2992129 INFO  (coreLoadExecutor-9431-thread-1-processing-n:127.0.0.1:53034__yl%2Fkq) [n:127.0.0.1:53034__yl%2Fkq c:control_collection s:shard1 r:core_node1 x:collection1] o.a.s.h.l.XMLLoader xsltCacheLifetimeSeconds=60
   [junit4]   2> 2992129 INFO  (coreLoadExecutor-9431-thread-1-processing-n:127.0.0.1:53034__yl%2Fkq) [n:127.0.0.1:53034__yl%2Fkq c:control_collection s:shard1 r:core_node1 x:collection1] o.a.s.h.l.XMLLoader xsltCacheLifetimeSeconds=60
   [junit4]   2> 2992130 INFO  (coreLoadExecutor-9431-thread-1-processing-n:127.0.0.1:53034__yl%2Fkq) [n:127.0.0.1:53034__yl%2Fkq c:control_collection s:shard1 r:core_node1 x:collection1] o.a.s.h.l.XMLLoader xsltCacheLifetimeSeconds=60
   [junit4]   2> 2992131 INFO  (coreLoadExecutor-9431-thread-1-processing-n:127.0.0.1:53034__yl%2Fkq) [n:127.0.0.1:53034__yl%2Fkq c:control_collection s:shard1 r:core_node1 x:collection1] o.a.s.h.l.XMLLoader xsltCacheLifetimeSeconds=60
   [junit4]   2> 2992133 INFO  (coreLoadExecutor-9431-thread-1-processing-n:127.0.0.1:53034__yl%2Fkq) [n:127.0.0.1:53034__yl%2Fkq c:control_collection s:shard1 r:core_node1 x:collection1] o.a.s.c.RequestHandlers Registered paths: /admin/mbeans,standard,/dump,/update/csv,/sql,/update/json/docs,/admin/luke,/export,/admin/segments,/get,/admin/system,/replication,/admin/properties,/config,/stream,/schema,/admin/plugins,/admin/logging,/update/json,/admin/ping,/admin/threads,/update,/admin/file
   [junit4]   2> 2992134 INFO  (coreLoadExecutor-9431-thread-1-processing-n:127.0.0.1:53034__yl%2Fkq) [n:127.0.0.1:53034__yl%2Fkq c:control_collection s:shard1 r:core_node1 x:collection1] o.a.s.c.SolrCore Using default statsCache cache: org.apache.solr.search.stats.LocalStatsCache
   [junit4]   2> 2992134 INFO  (coreLoadExecutor-9431-thread-1-processing-n:127.0.0.1:53034__yl%2Fkq) [n:127.0.0.1:53034__yl%2Fkq c:control_collection s:shard1 r:core_node1 x:collection1] o.a.s.u.UpdateHandler Using UpdateLog implementation: org.apache.solr.update.UpdateLog
   [junit4]   2> 2992134 INFO  (coreLoadExecutor-9431-thread-1-processing-n:127.0.0.1:53034__yl%2Fkq) [n:127.0.0.1:53034__yl%2Fkq c:control_collection s:shard1 r:core_node1 x:collection1] o.a.s.u.UpdateLog Initializing UpdateLog: dataDir= defaultSyncLevel=FLUSH numRecordsToKeep=100 maxNumLogsToKeep=10 numVersionBuckets=65536
   [junit4]   2> 2992136 INFO  (coreLoadExecutor-9431-thread-1-processing-n:127.0.0.1:53034__yl%2Fkq) [n:127.0.0.1:53034__yl%2Fkq c:control_collection s:shard1 r:core_node1 x:collection1] o.a.s.u.CommitTracker Hard AutoCommit: disabled
   [junit4]   2> 2992136 INFO  (coreLoadExecutor-9431-thread-1-processing-n:127.0.0.1:53034__yl%2Fkq) [n:127.0.0.1:53034__yl%2Fkq c:control_collection s:shard1 r:core_node1 x:collection1] o.a.s.u.CommitTracker Soft AutoCommit: disabled
   [junit4]   2> 2992136 INFO  (coreLoadExecutor-9431-thread-1-processing-n:127.0.0.1:53034__yl%2Fkq) [n:127.0.0.1:53034__yl%2Fkq c:control_collection s:shard1 r:core_node1 x:collection1] o.a.s.u.RandomMergePolicy RandomMergePolicy wrapping class org.apache.lucene.index.LogByteSizeMergePolicy: [LogByteSizeMergePolicy: minMergeSize=1677721, mergeFactor=39, maxMergeSize=2147483648, maxMergeSizeForForcedMerge=9223372036854775807, calibrateSizeByDeletes=true, maxMergeDocs=2147483647, maxCFSSegmentSizeMB=8.796093022207999E12, noCFSRatio=0.3499644956988869]
   [junit4]   2> 2992136 INFO  (coreLoadExecutor-9431-thread-1-processing-n:127.0.0.1:53034__yl%2Fkq) [n:127.0.0.1:53034__yl%2Fkq c:control_collection s:shard1 r:core_node1 x:collection1] o.a.s.c.SolrDeletionPolicy SolrDeletionPolicy.onInit: commits: num=1
   [junit4]   2> 	commit{dir=MockDirectoryWrapper(RAMDirectory@27085d1c lockFactory=org.apache.lucene.store.SingleInstanceLockFactory@749be621),segFN=segments_1,generation=1}
   [junit4]   2> 2992136 INFO  (coreLoadExecutor-9431-thread-1-processing-n:127.0.0.1:53034__yl%2Fkq) [n:127.0.0.1:53034__yl%2Fkq c:control_collection s:shard1 r:core_node1 x:collection1] o.a.s.c.SolrDeletionPolicy newest commit generation = 1
   [junit4]   2> 2992136 INFO  (coreLoadExecutor-9431-thread-1-processing-n:127.0.0.1:53034__yl%2Fkq) [n:127.0.0.1:53034__yl%2Fkq c:control_collection s:shard1 r:core_node1 x:collection1] o.a.s.s.SolrIndexSearcher Opening [Searcher@63e5c52a[collection1] main]
   [junit4]   2> 2992136 INFO  (coreLoadExecutor-9431-thread-1-processing-n:127.0.0.1:53034__yl%2Fkq) [n:127.0.0.1:53034__yl%2Fkq c:control_collection s:shard1 r:core_node1 x:collection1] o.a.s.c.c.ZkStateReader Load collection config from: [/collections/control_collection]
   [junit4]   2> 2992137 INFO  (coreLoadExecutor-9431-thread-1-processing-n:127.0.0.1:53034__yl%2Fkq) [n:127.0.0.1:53034__yl%2Fkq c:control_collection s:shard1 r:core_node1 x:collection1] o.a.s.c.c.ZkStateReader path=[/collections/control_collection] [configName]=[conf1] specified config exists in ZooKeeper
   [junit4]   2> 2992137 INFO  (coreLoadExecutor-9431-thread-1-processing-n:127.0.0.1:53034__yl%2Fkq) [n:127.0.0.1:53034__yl%2Fkq c:control_collection s:shard1 r:core_node1 x:collection1] o.a.s.r.ManagedResourceStorage Setting up ZooKeeper-based storage for the RestManager with znodeBase: /configs/conf1
   [junit4]   2> 2992137 INFO  (coreLoadExecutor-9431-thread-1-processing-n:127.0.0.1:53034__yl%2Fkq) [n:127.0.0.1:53034__yl%2Fkq c:control_collection s:shard1 r:core_node1 x:collection1] o.a.s.r.ManagedResourceStorage Configured ZooKeeperStorageIO with znodeBase: /configs/conf1
   [junit4]   2> 2992137 INFO  (coreLoadExecutor-9431-thread-1-processing-n:127.0.0.1:53034__yl%2Fkq) [n:127.0.0.1:53034__yl%2Fkq c:control_collection s:shard1 r:core_node1 x:collection1] o.a.s.r.RestManager Initializing RestManager with initArgs: {}
   [junit4]   2> 2992137 INFO  (coreLoadExecutor-9431-thread-1-processing-n:127.0.0.1:53034__yl%2Fkq) [n:127.0.0.1:53034__yl%2Fkq c:control_collection s:shard1 r:core_node1 x:collection1] o.a.s.r.ManagedResourceStorage Reading _rest_managed.json using ZooKeeperStorageIO:path=/configs/conf1
   [junit4]   2> 2992138 INFO  (coreLoadExecutor-9431-thread-1-processing-n:127.0.0.1:53034__yl%2Fkq) [n:127.0.0.1:53034__yl%2Fkq c:control_collection s:shard1 r:core_node1 x:collection1] o.a.s.r.ManagedResourceStorage No data found for znode /configs/conf1/_rest_managed.json
   [junit4]   2> 2992138 INFO  (coreLoadExecutor-9431-thread-1-processing-n:127.0.0.1:53034__yl%2Fkq) [n:127.0.0.1:53034__yl%2Fkq c:control_collection s:shard1 r:core_node1 x:collection1] o.a.s.r.ManagedResourceStorage Loaded null at path _rest_managed.json using ZooKeeperStorageIO:path=/configs/conf1
   [junit4]   2> 2992138 INFO  (coreLoadExecutor-9431-thread-1-processing-n:127.0.0.1:53034__yl%2Fkq) [n:127.0.0.1:53034__yl%2Fkq c:control_collection s:shard1 r:core_node1 x:collection1] o.a.s.r.RestManager Initializing 0 registered ManagedResources
   [junit4]   2> 2992138 INFO  (coreLoadExecutor-9431-thread-1-processing-n:127.0.0.1:53034__yl%2Fkq) [n:127.0.0.1:53034__yl%2Fkq c:control_collection s:shard1 r:core_node1 x:collection1] o.a.s.h.ReplicationHandler Commits will be reserved for  10000
   [junit4]   2> 2992138 INFO  (coreLoadExecutor-9431-thread-1-processing-n:127.0.0.1:53034__yl%2Fkq) [n:127.0.0.1:53034__yl%2Fkq c:control_collection s:shard1 r:core_node1 x:collection1] o.a.s.u.UpdateLog Looking up max value of version field to seed version buckets
   [junit4]   2> 2992138 INFO  (coreLoadExecutor-9431-thread-1-processing-n:127.0.0.1:53034__yl%2Fkq) [n:127.0.0.1:53034__yl%2Fkq c:control_collection s:shard1 r:core_node1 x:collection1] o.a.s.u.VersionInfo Refreshing highest value of _version_ for 65536 version buckets from index
   [junit4]   2> 2992138 INFO  (coreLoadExecutor-9431-thread-1-processing-n:127.0.0.1:53034__yl%2Fkq) [n:127.0.0.1:53034__yl%2Fkq c:control_collection s:shard1 r:core_node1 x:collection1] o.a.s.u.VersionInfo No terms found for _version_, cannot seed version bucket highest value from index
   [junit4]   2> 2992138 INFO  (coreLoadExecutor-9431-thread-1-processing-n:127.0.0.1:53034__yl%2Fkq) [n:127.0.0.1:53034__yl%2Fkq c:control_collection s:shard1 r:core_node1 x:collection1] o.a.s.u.UpdateLog Could not find max version in index or recent updates, using new clock 1527766304279232512
   [junit4]   2> 2992139 INFO  (searcherExecutor-9432-thread-1-processing-n:127.0.0.1:53034__yl%2Fkq x:collection1 s:shard1 c:control_collection r:core_node1) [n:127.0.0.1:53034__yl%2Fkq c:control_collection s:shard1 r:core_node1 x:collection1] o.a.s.c.SolrCore [collection1] Registered new searcher Searcher@63e5c52a[collection1] main{ExitableDirectoryReader(UninvertingDirectoryReader())}
   [junit4]   2> 2992139 INFO  (coreLoadExecutor-9431-thread-1-processing-n:127.0.0.1:53034__yl%2Fkq) [n:127.0.0.1:53034__yl%2Fkq c:control_collection s:shard1 r:core_node1 x:collection1] o.a.s.u.UpdateLog Took 2.0ms to seed version buckets with highest version 1527766304279232512
   [junit4]   2> 2992139 INFO  (coreLoadExecutor-9431-thread-1-processing-n:127.0.0.1:53034__yl%2Fkq) [n:127.0.0.1:53034__yl%2Fkq c:control_collection s:shard1 r:core_node1 x:collection1] o.a.s.c.ZkController watch zkdir /configs/conf1
   [junit4]   2> 2992140 INFO  (coreLoadExecutor-9431-thread-1-processing-n:127.0.0.1:53034__yl%2Fkq) [n:127.0.0.1:53034__yl%2Fkq c:control_collection s:shard1 r:core_node1 x:collection1] o.a.s.c.CoreContainer registering core: collection1
   [junit4]   2> 2992140 INFO  (coreZkRegister-9425-thread-1-processing-n:127.0.0.1:53034__yl%2Fkq x:collection1 s:shard1 c:control_collection r:core_node1) [n:127.0.0.1:53034__yl%2Fkq c:control_collection s:shard1 r:core_node1 x:collection1] o.a.s.c.ZkController Register replica - core:collection1 address:http://127.0.0.1:53034/_yl/kq collection:control_collection shard:shard1
   [junit4]   2> 2992141 INFO  (coreZkRegister-9425-thread-1-processing-n:127.0.0.1:53034__yl%2Fkq x:collection1 s:shard1 c:control_collection r:core_node1) [n:127.0.0.1:53034__yl%2Fkq c:control_collection s:shard1 r:core_node1 x:collection1] o.a.s.c.c.SolrZkClient makePath: /collections/control_collection/leader_elect/shard1/election
   [junit4]   2> 2992144 INFO  (coreZkRegister-9425-thread-1-processing-n:127.0.0.1:53034__yl%2Fkq x:collection1 s:shard1 c:control_collection r:core_node1) [n:127.0.0.1:53034__yl%2Fkq c:control_collection s:shard1 r:core_node1 x:collection1] o.a.s.c.LeaderElector Joined leadership election with path: /collections/control_collection/leader_elect/shard1/election/95485393913446404-core_node1-n_0000000000
   [junit4]   2> 2992144 INFO  (coreZkRegister-9425-thread-1-processing-n:127.0.0.1:53034__yl%2Fkq x:collection1 s:shard1 c:control_collection r:core_node1) [n:127.0.0.1:53034__yl%2Fkq c:control_collection s:shard1 r:core_node1 x:collection1] o.a.s.c.ShardLeaderElectionContext Running the leader process for shard=shard1 and weAreReplacement=false and leaderVoteWait=10000
   [junit4]   2> 2992145 INFO  (coreZkRegister-9425-thread-1-processing-n:127.0.0.1:53034__yl%2Fkq x:collection1 s:shard1 c:control_collection r:core_node1) [n:127.0.0.1:53034__yl%2Fkq c:control_collection s:shard1 r:core_node1 x:collection1] o.a.s.c.ShardLeaderElectionContext Enough replicas found to continue.
   [junit4]   2> 2992145 INFO  (coreZkRegister-9425-thread-1-processing-n:127.0.0.1:53034__yl%2Fkq x:collection1 s:shard1 c:control_collection r:core_node1) [n:127.0.0.1:53034__yl%2Fkq c:control_collection s:shard1 r:core_node1 x:collection1] o.a.s.c.ShardLeaderElectionContext I may be the new leader - try and sync
   [junit4]   2> 2992145 INFO  (coreZkRegister-9425-thread-1-processing-n:127.0.0.1:53034__yl%2Fkq x:collection1 s:shard1 c:control_collection r:core_node1) [n:127.0.0.1:53034__yl%2Fkq c:control_collection s:shard1 r:core_node1 x:collection1] o.a.s.c.SyncStrategy Sync replicas to http://127.0.0.1:53034/_yl/kq/collection1/
   [junit4]   2> 2992145 INFO  (coreZkRegister-9425-thread-1-processing-n:127.0.0.1:53034__yl%2Fkq x:collection1 s:shard1 c:control_collection r:core_node1) [n:127.0.0.1:53034__yl%2Fkq c:control_collection s:shard1 r:core_node1 x:collection1] o.a.s.c.SyncStrategy Sync Success - now sync replicas to me
   [junit4]   2> 2992145 INFO  (coreZkRegister-9425-thread-1-processing-n:127.0.0.1:53034__yl%2Fkq x:collection1 s:shard1 c:control_collection r:core_node1) [n:127.0.0.1:53034__yl%2Fkq c:control_collection s:shard1 r:core_node1 x:collection1] o.a.s.c.SyncStrategy http://127.0.0.1:53034/_yl/kq/collection1/ has no replicas
   [junit4]   2> 2992145 INFO  (OverseerStateUpdate-95485393913446404-127.0.0.1:53034__yl%2Fkq-n_0000000000) [n:127.0.0.1:53034__yl%2Fkq    ] o.a.s.c.Overseer processMessage: queueSize: 1, message = {
   [junit4]   2>   "operation":"leader",
   [junit4]   2>   "shard":"shard1",
   [junit4]   2>   "collection":"control_collection"} current state version: 1
   [junit4]   2> 2992146 INFO  (coreZkRegister-9425-thread-1-processing-n:127.0.0.1:53034__yl%2Fkq x:collection1 s:shard1 c:control_collection r:core_node1) [n:127.0.0.1:53034__yl%2Fkq c:control_collection s:shard1 r:core_node1 x:collection1] o.a.s.c.c.SolrZkClient makePath: /collections/control_collection/leaders/shard1
   [junit4]   2> 2992149 INFO  (coreZkRegister-9425-thread-1-processing-n:127.0.0.1:53034__yl%2Fkq x:collection1 s:shard1 c:control_collection r:core_node1) [n:127.0.0.1:53034__yl%2Fkq c:control_collection s:shard1 r:core_node1 x:collection1] o.a.s.c.ShardLeaderElectionContextBase Creating leader registration node /collections/control_collection/leaders/shard1/leader after winning as /collections/control_collection/leader_elect/shard1/election/95485393913446404-core_node1-n_0000000000
   [junit4]   2> 2992149 INFO  (coreZkRegister-9425-thread-1-processing-n:127.0.0.1:53034__yl%2Fkq x:collection1 s:shard1 c:control_collection r:core_node1) [n:127.0.0.1:53034__yl%2Fkq c:control_collection s:shard1 r:core_node1 x:collection1] o.a.s.c.ShardLeaderElectionContext I am the new leader: http://127.0.0.1:53034/_yl/kq/collection1/ shard1
   [junit4]   2> 2992150 INFO  (OverseerStateUpdate-95485393913446404-127.0.0.1:53034__yl%2Fkq-n_0000000000) [n:127.0.0.1:53034__yl%2Fkq    ] o.a.s.c.Overseer processMessage: queueSize: 1, message = {
   [junit4]   2>   "operation":"leader",
   [junit4]   2>   "shard":"shard1",
   [junit4]   2>   "collection":"control_collection",
   [junit4]   2>   "base_url":"http://127.0.0.1:53034/_yl/kq",
   [junit4]   2>   "core":"collection1",
   [junit4]   2>   "state":"active"} current state version: 1
   [junit4]   2> 2992238 INFO  (zkCallback-2802-thread-1-processing-n:127.0.0.1:53034__yl%2Fkq) [n:127.0.0.1:53034__yl%2Fkq    ] o.a.s.c.c.ZkStateReader A cluster state change: [WatchedEvent state:SyncConnected type:NodeDataChanged path:/clusterstate.json], has occurred - updating... (live nodes size: [1])
   [junit4]   2> 2992281 INFO  (coreZkRegister-9425-thread-1-processing-n:127.0.0.1:53034__yl%2Fkq x:collection1 s:shard1 c:control_collection r:core_node1) [n:127.0.0.1:53034__yl%2Fkq c:control_collection s:shard1 r:core_node1 x:collection1] o.a.s.c.ZkController We are http://127.0.0.1:53034/_yl/kq/collection1/ and leader is http://127.0.0.1:53034/_yl/kq/collection1/
   [junit4]   2> 2992281 INFO  (coreZkRegister-9425-thread-1-processing-n:127.0.0.1:53034__yl%2Fkq x:collection1 s:shard1 c:control_collection r:core_node1) [n:127.0.0.1:53034__yl%2Fkq c:control_collection s:shard1 r:core_node1 x:collection1] o.a.s.c.ZkController No LogReplay needed for core=collection1 baseURL=http://127.0.0.1:53034/_yl/kq
   [junit4]   2> 2992281 INFO  (coreZkRegister-9425-thread-1-processing-n:127.0.0.1:53034__yl%2Fkq x:collection1 s:shard1 c:control_collection r:core_node1) [n:127.0.0.1:53034__yl%2Fkq c:control_collection s:shard1 r:core_node1 x:collection1] o.a.s.c.ZkController I am the leader, no recovery necessary
   [junit4]   2> 2992281 INFO  (coreZkRegister-9425-thread-1-processing-n:127.0.0.1:53034__yl%2Fkq x:collection1 s:shard1 c:control_collection r:core_node1) [n:127.0.0.1:53034__yl%2Fkq c:control_collection s:shard1 r:core_node1 x:collection1] o.a.s.c.ZkController publishing state=active
   [junit4]   2> 2992281 INFO  (coreZkRegister-9425-thread-1-processing-n:127.0.0.1:53034__yl%2Fkq x:collection1 s:shard1 c:control_collection r:core_node1) [n:127.0.0.1:53034__yl%2Fkq c:control_collection s:shard1 r:core_node1 x:collection1] o.a.s.c.ZkController numShards not found on descriptor - reading it from system property
   [junit4]   2> 2992282 INFO  (OverseerStateUpdate-95485393913446404-127.0.0.1:53034__yl%2Fkq-n_0000000000) [n:127.0.0.1:53034__yl%2Fkq    ] o.a.s.c.Overseer processMessage: queueSize: 1, message = {
   [junit4]   2>   "core":"collection1",
   [junit4]   2>   "core_node_name":"core_node1",
   [junit4]   2>   "roles":null,
   [junit4]   2>   "base_url":"http://127.0.0.1:53034/_yl/kq",
   [junit4]   2>   "node_name":"127.0.0.1:53034__yl%2Fkq",
   [junit4]   2>   "numShards":"1",
   [junit4]   2>   "state":"active",
   [junit4]   2>   "shard":"shard1",
   [junit4]   2>   "collection":"control_collection",
   [junit4]   2>   "operation":"state"} current state version: 2
   [junit4]   2> 2992282 INFO  (coreZkRegister-9425-thread-1-processing-n:127.0.0.1:53034__yl%2Fkq x:collection1 s:shard1 c:control_collection r:core_node1) [n:127.0.0.1:53034__yl%2Fkq c:control_collection s:shard1 r:core_node1 x:collection1] o.a.s.c.c.ZkStateReader Updated live nodes from ZooKeeper... (1) -> (1)
   [junit4]   2> 2992282 INFO  (OverseerStateUpdate-95485393913446404-127.0.0.1:53034__yl%2Fkq-n_0000000000) [n:127.0.0.1:53034__yl%2Fkq    ] o.a.s.c.o.ReplicaMutator Update state numShards=1 message={
   [junit4]   2>   "core":"collection1",
   [junit4]   2>   "core_node_name":"core_node1",
   [junit4]   2>   "roles":null,
   [junit4]   2>   "base_url":"http://127.0.0.1:53034/_yl/kq",
   [junit4]   2>   "node_name":"127.0.0.1:53034__yl%2Fkq",
   [junit4]   2>   "numShards":"1",
   [junit4]   2>   "state":"active",
   [junit4]   2>   "shard":"shard1",
   [junit4]   2>   "collection":"control_collection",
   [junit4]   2>   "operation":"state"}
   [junit4]   2> 2992371 INFO  (zkCallback-2802-thread-1-processing-n:127.0.0.1:53034__yl%2Fkq) [n:127.0.0.1:53034__yl%2Fkq    ] o.a.s.c.c.ZkStateReader A cluster state change: [WatchedEvent state:SyncConnected type:NodeDataChanged path:/clusterstate.json], has occurred - updating... (live nodes size: [1])
   [junit4]   2> 2992434 INFO  (TEST-TestSolrConfigHandlerConcurrent.test-seed#[7138193552298324]) [    ] o.a.s.c.c.SolrZkClient Using default ZkCredentialsProvider
   [junit4]   2> 2992434 INFO  (TEST-TestSolrConfigHandlerConcurrent.test-seed#[7138193552298324]) [    ] o.a.s.c.c.ConnectionManager Waiting for client to connect to ZooKeeper
   [junit4]   2> 2992435 INFO  (zkCallback-2804-thread-1) [    ] o.a.s.c.c.ConnectionManager Watcher org.apache.solr.common.cloud.ConnectionManager@7bfc6b2b name:ZooKeeperConnection Watcher:127.0.0.1:53027/solr got event WatchedEvent state:SyncConnected type:None path:null path:null type:None
   [junit4]   2> 2992435 INFO  (TEST-TestSolrConfigHandlerConcurrent.test-seed#[7138193552298324]) [    ] o.a.s.c.c.ConnectionManager Client is connected to ZooKeeper
   [junit4]   2> 2992436 INFO  (TEST-TestSolrConfigHandlerConcurrent.test-seed#[7138193552298324]) [    ] o.a.s.c.c.SolrZkClient Using default ZkACLProvider
   [junit4]   2> 2992436 INFO  (TEST-TestSolrConfigHandlerConcurrent.test-seed#[7138193552298324]) [    ] o.a.s.c.c.ZkStateReader Updating cluster state from ZooKeeper... 
   [junit4]   2> 2992437 INFO  (TEST-TestSolrConfigHandlerConcurrent.test-seed#[7138193552298324]) [    ] o.a.s.c.c.ZkStateReader Updated live nodes from ZooKeeper... (0) -> (1)
   [junit4]   2> 2992438 INFO  (TEST-TestSolrConfigHandlerConcurrent.test-seed#[7138193552298324]) [    ] o.a.s.c.ChaosMonkey monkey: init - expire sessions:false cause connection loss:false
   [junit4]   2> 2992959 INFO  (TEST-TestSolrConfigHandlerConcurrent.test-seed#[7138193552298324]) [    ] o.a.s.SolrTestCaseJ4 Writing core.properties file to C:\Users\JenkinsSlave\workspace\Lucene-Solr-trunk-Windows\solr\build\solr-core\test\J0\temp\solr.handler.TestSolrConfigHandlerConcurrent_7138193552298324-001\shard-1-001\cores\collection1
   [junit4]   2> 2992962 INFO  (TEST-TestSolrConfigHandlerConcurrent.test-seed#[7138193552298324]) [    ] o.a.s.c.AbstractFullDistribZkTestBase create jetty 1 in directory C:\Users\JenkinsSlave\workspace\Lucene-Solr-trunk-Windows\solr\build\solr-core\test\J0\temp\solr.handler.TestSolrConfigHandlerConcurrent_7138193552298324-001\shard-1-001
   [junit4]   2> 2992962 INFO  (TEST-TestSolrConfigHandlerConcurrent.test-seed#[7138193552298324]) [    ] o.e.j.s.Server jetty-9.3.6.v20151106
   [junit4]   2> 2992964 INFO  (TEST-TestSolrConfigHandlerConcurrent.test-seed#[7138193552298324]) [    ] o.e.j.s.h.ContextHandler Started o.e.j.s.ServletContextHandler@6809967{/_yl/kq,null,AVAILABLE}
   [junit4]   2> 2992964 INFO  (TEST-TestSolrConfigHandlerConcurrent.test-seed#[7138193552298324]) [    ] o.e.j.s.ServerConnector Started ServerConnector@52b66bf8{HTTP/1.1,[http/1.1]}{127.0.0.1:53077}
   [junit4]   2> 2992964 INFO  (TEST-TestSolrConfigHandlerConcurrent.test-seed#[7138193552298324]) [    ] o.e.j.s.Server Started @3003589ms
   [junit4]   2> 2992964 INFO  (TEST-TestSolrConfigHandlerConcurrent.test-seed#[7138193552298324]) [    ] o.a.s.c.s.e.JettySolrRunner Jetty properties: {solr.data.dir=C:\Users\JenkinsSlave\workspace\Lucene-Solr-trunk-Windows\solr\build\solr-core\test\J0\temp\solr.handler.TestSolrConfigHandlerConcurrent_7138193552298324-001\tempDir-001/jetty1, solrconfig=solrconfig.xml, hostContext=/_yl/kq, hostPort=53077, coreRootDirectory=C:\Users\JenkinsSlave\workspace\Lucene-Solr-trunk-Windows\solr\build\solr-core\test\J0\..\..\..\..\..\..\..\..\..\Users\JenkinsSlave\workspace\Lucene-Solr-trunk-Windows\solr\build\solr-core\test\J0\temp\solr.handler.TestSolrConfigHandlerConcurrent_7138193552298324-001\shard-1-001\cores}
   [junit4]   2> 2992964 INFO  (TEST-TestSolrConfigHandlerConcurrent.test-seed#[7138193552298324]) [    ] o.a.s.s.SolrDispatchFilter SolrDispatchFilter.init(): sun.misc.Launcher$AppClassLoader@73d16e93
   [junit4]   2> 2992964 INFO  (TEST-TestSolrConfigHandlerConcurrent.test-seed#[7138193552298324]) [    ] o.a.s.c.SolrResourceLoader new SolrResourceLoader for directory: 'C:\Users\JenkinsSlave\workspace\Lucene-Solr-trunk-Windows\solr\build\solr-core\test\J0\temp\solr.handler.TestSolrConfigHandlerConcurrent_7138193552298324-001\shard-1-001'
   [junit4]   2> 2992964 INFO  (TEST-TestSolrConfigHandlerConcurrent.test-seed#[7138193552298324]) [    ] o.a.s.c.SolrResourceLoader JNDI not configured for solr (NoInitialContextEx)
   [junit4]   2> 2992964 INFO  (TEST-TestSolrConfigHandlerConcurrent.test-seed#[7138193552298324]) [    ] o.a.s.c.SolrResourceLoader solr home defaulted to 'solr/' (could not find system property or JNDI)
   [junit4]   2> 2992965 INFO  (TEST-TestSolrConfigHandlerConcurrent.test-seed#[7138193552298324]) [    ] o.a.s.c.c.SolrZkClient Using default ZkCredentialsProvider
   [junit4]   2> 2992967 INFO  (TEST-TestSolrConfigHandlerConcurrent.test-seed#[7138193552298324]) [    ] o.a.s.c.c.ConnectionManager Waiting for client to connect to ZooKeeper
   [junit4]   2> 2992967 INFO  (zkCallback-2805-thread-1) [    ] o.a.s.c.c.ConnectionManager Watcher org.apache.solr.common.cloud.ConnectionManager@6f7a0c6f name:ZooKeeperConnection Watcher:127.0.0.1:53027/solr got event WatchedEvent state:SyncConnected type:None path:null path:null type:None
   [junit4]   2> 2992967 INFO  (TEST-TestSolrConfigHandlerConcurrent.test-seed#[7138193552298324]) [    ] o.a.s.c.c.ConnectionManager Client is connected to ZooKeeper
   [junit4]   2> 2992967 INFO  (TEST-TestSolrConfigHandlerConcurrent.test-seed#[7138193552298324]) [    ] o.a.s.c.c.SolrZkClient Using default ZkACLProvider
   [junit4]   2> 2992969 INFO  (TEST-TestSolrConfigHandlerConcurrent.test-seed#[7138193552298324]) [    ] o.a.s.s.SolrDispatchFilter Loading solr.xml from SolrHome (not found in ZooKeeper)
   [junit4]   2> 2992969 INFO  (TEST-TestSolrConfigHandlerConcurrent.test-seed#[7138193552298324]) [    ] o.a.s.c.SolrXmlConfig Loading container configuration from C:\Users\JenkinsSlave\workspace\Lucene-Solr-trunk-Windows\solr\build\solr-core\test\J0\temp\solr.handler.TestSolrConfigHandlerConcurrent_7138193552298324-001\shard-1-001\solr.xml
   [junit4]   2> 2992975 INFO  (TEST-TestSolrConfigHandlerConcurrent.test-seed#[7138193552298324]) [    ] o.a.s.c.CorePropertiesLocator Config-defined core root directory: C:\Users\JenkinsSlave\workspace\Lucene-Solr-trunk-Windows\solr\build\solr-core\test\J0\..\..\..\..\..\..\..\..\..\Users\JenkinsSlave\workspace\Lucene-Solr-trunk-Windows\solr\build\solr-core\test\J0\temp\solr.handler.TestSolrConfigHandlerConcurrent_7138193552298324-001\shard-1-001\cores
   [junit4]   2> 2992975 INFO  (TEST-TestSolrConfigHandlerConcurrent.test-seed#[7138193552298324]) [    ] o.a.s.c.CoreContainer New CoreContainer 1985298816
   [junit4]   2> 2992975 INFO  (TEST-TestSolrConfigHandlerConcurrent.test-seed#[7138193552298324]) [    ] o.a.s.c.CoreContainer Loading cores into CoreContainer [instanceDir=C:\Users\JenkinsSlave\workspace\Lucene-Solr-trunk-Windows\solr\build\solr-core\test\J0\temp\solr.handler.TestSolrConfigHandlerConcurrent_7138193552298324-001\shard-1-001]
   [junit4]   2> 2992975 WARN  (TEST-TestSolrConfigHandlerConcurrent.test-seed#[7138193552298324]) [    ] o.a.s.c.CoreContainer Couldn't add files from C:\Users\JenkinsSlave\workspace\Lucene-Solr-trunk-Windows\solr\build\solr-core\test\J0\temp\solr.handler.TestSolrConfigHandlerConcurrent_7138193552298324-001\shard-1-001\lib to classpath: C:\Users\JenkinsSlave\workspace\Lucene-Solr-trunk-Windows\solr\build\solr-core\test\J0\temp\solr.handler.TestSolrConfigHandlerConcurrent_7138193552298324-001\shard-1-001\lib
   [junit4]   2> 2992975 INFO  (TEST-TestSolrConfigHandlerConcurrent.test-seed#[7138193552298324]) [    ] o.a.s.h.c.HttpShardHandlerFactory created with socketTimeout : 90000,urlScheme : ,connTimeout : 15000,maxConnectionsPerHost : 20,maxConnections : 10000,corePoolSize : 0,maximumPoolSize : 2147483647,maxThreadIdleTime : 5,sizeOfQueue : -1,fairnessPolicy : false,useRetries : false,
   [junit4]   2> 2992978 INFO  (TEST-TestSolrConfigHandlerConcurrent.test-seed#[7138193552298324]) [    ] o.a.s.u.UpdateShardHandler Creating UpdateShardHandler HTTP client with params: socketTimeout=340000&connTimeout=45000&retry=true
   [junit4]   2> 2992978 INFO  (TEST-TestSolrConfigHandlerConcurrent.test-seed#[7138193552298324]) [    ] o.a.s.l.LogWatcher SLF4J impl is org.slf4j.impl.Log4jLoggerFactory
   [junit4]   2> 2992978 INFO  (TEST-TestSolrConfigHandlerConcurrent.test-seed#[7138193552298324]) [    ] o.a.s.l.LogWatcher Registering Log Listener [Log4j (org.slf4j.impl.Log4jLoggerFactory)]
   [junit4]   2> 2992978 INFO  (TEST-TestSolrConfigHandlerConcurrent.test-seed#[7138193552298324]) [    ] o.a.s.c.ZkContainer Zookeeper client=127.0.0.1:53027/solr
   [junit4]   2> 2992978 INFO  (TEST-TestSolrConfigHandlerConcurrent.test-seed#[7138193552298324]) [    ] o.a.s.c.ZkController zkHost includes chroot
   [junit4]   2> 2992978 INFO  (TEST-TestSolrConfigHandlerConcurrent.test-seed#[7138193552298324]) [    ] o.a.s.c.c.SolrZkClient Using default ZkCredentialsProvider
   [junit4]   2> 2992979 INFO  (TEST-TestSolrConfigHandlerConcurrent.test-seed#[7138193552298324]) [    ] o.a.s.c.c.ConnectionManager Waiting for client to connect to ZooKeeper
   [junit4]   2> 2992980 INFO  (zkCallback-2808-thread-1) [    ] o.a.s.c.c.ConnectionManager Watcher org.apache.solr.common.cloud.ConnectionManager@44f77a74 name:ZooKeeperConnection Watcher:127.0.0.1:53027 got event WatchedEvent state:SyncConnected type:None path:null path:null type:None
   [junit4]   2> 2992980 INFO  (TEST-TestSolrConfigHandlerConcurrent.test-seed#[7138193552298324]) [    ] o.a.s.c.c.ConnectionManager Client is connected to ZooKeeper
   [junit4]   2> 2992980 INFO  (TEST-TestSolrConfigHandlerConcurrent.test-seed#[7138193552298324]) [    ] o.a.s.c.c.SolrZkClient Using default ZkACLProvider
   [junit4]   2> 2992983 INFO  (TEST-TestSolrConfigHandlerConcurrent.test-seed#[7138193552298324]) [n:127.0.0.1:53077__yl%2Fkq    ] o.a.s.c.c.ConnectionManager Waiting for client to connect to ZooKeeper
   [junit4]   2> 2992984 INFO  (zkCallback-2809-thread-1-processing-n:127.0.0.1:53077__yl%2Fkq) [n:127.0.0.1:53077__yl%2Fkq    ] o.a.s.c.c.ConnectionManager Watcher org.apache.solr.common.cloud.ConnectionManager@6dd5e199 name:ZooKeeperConnection Watcher:127.0.0.1:53027/solr got event WatchedEvent state:SyncConnected type:None path:null path:null type:None
   [junit4]   2> 2992984 INFO  (TEST-TestSolrConfigHandlerConcurrent.test-seed#[7138193552298324]) [n:127.0.0.1:53077__yl%2Fkq    ] o.a.s.c.c.ConnectionManager Client is connected to ZooKeeper
   [junit4]   2> 2992989 INFO  (TEST-TestSolrConfigHandlerConcurrent.test-seed#[7138193552298324]) [n:127.0.0.1:53077__yl%2Fkq    ] o.a.s.c.c.ZkStateReader Updating cluster state from ZooKeeper... 
   [junit4]   2> 2992989 INFO  (TEST-TestSolrConfigHandlerConcurrent.test-seed#[7138193552298324]) [n:127.0.0.1:53077__yl%2Fkq    ] o.a.s.c.c.ZkStateReader Updated live nodes from ZooKeeper... (0) -> (1)
   [junit4]   2> 2992992 INFO  (TEST-TestSolrConfigHandlerConcurrent.test-seed#[7138193552298324]) [n:127.0.0.1:53077__yl%2Fkq    ] o.a.s.c.Overseer Overseer (id=null) closing
   [junit4]   2> 2992992 INFO  (TEST-TestSolrConfigHandlerConcurrent.test-seed#[7138193552298324]) [n:127.0.0.1:53077__yl%2Fkq    ] o.a.s.c.LeaderElector Joined leadership election with path: /overseer_elect/election/95485393913446408-127.0.0.1:53077__yl%2Fkq-n_0000000001
   [junit4]   2> 2992993 INFO  (TEST-TestSolrConfigHandlerConcurrent.test-seed#[7138193552298324]) [n:127.0.0.1:53077__yl%2Fkq    ] o.a.s.c.LeaderElector Watching path /overseer_elect/election/95485393913446404-127.0.0.1:53034__yl%2Fkq-n_0000000000 to know if I could be the leader
   [junit4]   2> 2992993 INFO  (TEST-TestSolrConfigHandlerConcurrent.test-seed#[7138193552298324]) [n:127.0.0.1:53077__yl%2Fkq    ] o.a.s.c.ZkController Publish node=127.0.0.1:53077__yl%2Fkq as DOWN
   [junit4]   2> 2992994 INFO  (OverseerStateUpdate-95485393913446404-127.0.0.1:53034__yl%2Fkq-n_0000000000) [n:127.0.0.1:53034__yl%2Fkq    ] o.a.s.c.Overseer processMessage: queueSize: 1, message = {
   [junit4]   2>   "operation":"downnode",
   [junit4]   2>   "node_name":"127.0.0.1:53077__yl%2Fkq"} current state version: 3
   [junit4]   2> 2992994 INFO  (OverseerStateUpdate-95485393913446404-127.0.0.1:53034__yl%2Fkq-n_0000000000) [n:127.0.0.1:53034__yl%2Fkq    ] o.a.s.c.o.NodeMutator DownNode state invoked for node: 127.0.0.1:53077__yl%2Fkq
   [junit4]   2> 2993083 INFO  (zkCallback-2802-thread-1-processing-n:127.0.0.1:53034__yl%2Fkq) [n:127.0.0.1:53034__yl%2Fkq    ] o.a.s.c.c.ZkStateReader A cluster state change: [WatchedEvent state:SyncConnected type:NodeDataChanged path:/clusterstate.json], has occurred - updating... (live nodes size: [1])
   [junit4]   2> 2993083 INFO  (zkCallback-2804-thread-1) [    ] o.a.s.c.c.ZkStateReader A cluster state change: [WatchedEvent state:SyncConnected type:NodeDataChanged path:/clusterstate.json], has occurred - updating... (live nodes size: [1])
   [junit4]   2> 2993083 INFO  (zkCallback-2809-thread-1-processing-n:127.0.0.1:53077__yl%2Fkq) [n:127.0.0.1:53077__yl%2Fkq    ] o.a.s.c.c.ZkStateReader A cluster state change: [WatchedEvent state:SyncConnected type:NodeDataChanged path:/clusterstate.json], has occurred - updating... (live nodes size: [1])
   [junit4]   2> 2993850 INFO  (TEST-TestSolrConfigHandlerConcurrent.test-seed#[7138193552298324]) [n:127.0.0.1:53077__yl%2Fkq    ] o.a.s.c.ZkController Register node as live in ZooKeeper:/live_nodes/127.0.0.1:53077__yl%2Fkq
   [junit4]   2> 2993850 INFO  (TEST-TestSolrConfigHandlerConcurrent.test-seed#[7138193552298324]) [n:127.0.0.1:53077__yl%2Fkq    ] o.a.s.c.c.SolrZkClient makePath: /live_nodes/127.0.0.1:53077__yl%2Fkq
   [junit4]   2> 2993851 INFO  (zkCallback-2802-thread-1-processing-n:127.0.0.1:53034__yl%2Fkq) [n:127.0.0.1:53034__yl%2Fkq    ] o.a.s.c.c.ZkStateReader A live node change: [WatchedEvent state:SyncConnected type:NodeChildrenChanged path:/live_nodes], has occurred - updating... (live nodes size: [1])
   [junit4]   2> 2993851 INFO  (zkCallback-2804-thread-1) [    ] o.a.s.c.c.ZkStateReader A live node change: [WatchedEvent state:SyncConnected type:NodeChildrenChanged path:/live_nodes], has occurred - updating... (live nodes size: [1])
   [junit4]   2> 2993852 INFO  (zkCallback-2802-thread-1-processing-n:127.0.0.1:53034__yl%2Fkq) [n:127.0.0.1:53034__yl%2Fkq    ] o.a.s.c.c.ZkStateReader Updated live nodes from ZooKeeper... (1) -> (2)
   [junit4]   2> 2993852 INFO  (zkCallback-2809-thread-1-processing-n:127.0.0.1:53077__yl%2Fkq) [n:127.0.0.1:53077__yl%2Fkq    ] o.a.s.c.c.ZkStateReader A live node change: [WatchedEvent state:SyncConnected type:NodeChildrenChanged path:/live_nodes], has occurred - updating... (live nodes size: [1])
   [junit4]   2> 2993852 INFO  (zkCallback-2804-thread-1) [    ] o.a.s.c.c.ZkStateReader Updated live nodes from ZooKeeper... (1) -> (2)
   [junit4]   2> 2993854 INFO  (zkCallback-2809-thread-1-processing-n:127.0.0.1:53077__yl%2Fkq) [n:127.0.0.1:53077__yl%2Fkq    ] o.a.s.c.c.ZkStateReader Updated live nodes from ZooKeeper... (1) -> (2)
   [junit4]   2> 2993857 INFO  (TEST-TestSolrConfigHandlerConcurrent.test-seed#[7138193552298324]) [n:127.0.0.1:53077__yl%2Fkq    ] o.a.s.c.CoreContainer Security conf doesn't exist. Skipping setup for authorization module.
   [junit4]   2> 2993857 INFO  (TEST-TestSolrConfigHandlerConcurrent.test-seed#[7138193552298324]) [n:127.0.0.1:53077__yl%2Fkq    ] o.a.s.c.CoreContainer No authentication plugin used.
   [junit4]   2> 2993858 INFO  (TEST-TestSolrConfigHandlerConcurrent.test-seed#[7138193552298324]) [n:127.0.0.1:53077__yl%2Fkq    ] o.a.s.c.CorePropertiesLocator Looking for core definitions underneath C:\Users\JenkinsSlave\workspace\Lucene-Solr-trunk-Windows\solr\build\solr-core\test\J0\..\..\..\..\..\..\..\..\..\Users\JenkinsSlave\workspace\Lucene-Solr-trunk-Windows\solr\build\solr-core\test\J0\temp\solr.handler.TestSolrConfigHandlerConcurrent_7138193552298324-001\shard-1-001\cores
   [junit4]   2> 2993859 INFO  (TEST-TestSolrConfigHandlerConcurrent.test-seed#[7138193552298324]) [n:127.0.0.1:53077__yl%2Fkq    ] o.a.s.c.CoreDescriptor Created CoreDescriptor: {name=collection1, config=solrconfig.xml, transient=false, schema=schema.xml, loadOnStartup=true, configSetProperties=configsetprops.json, collection=collection1, coreNodeName=, dataDir=data\, shard=}
   [junit4]   2> 2993859 INFO  (TEST-TestSolrConfigHandlerConcurrent.test-seed#[7138193552298324]) [n:127.0.0.1:53077__yl%2Fkq    ] o.a.s.c.CorePropertiesLocator Found core collection1 in C:\Users\JenkinsSlave\workspace\Lucene-Solr-trunk-Windows\solr\build\solr-core\test\J0\..\..\..\..\..\..\..\..\..\Users\JenkinsSlave\workspace\Lucene-Solr-trunk-Windows\solr\build\solr-core\test\J0\temp\solr.handler.TestSolrConfigHandlerConcurrent_7138193552298324-001\shard-1-001\cores\collection1
   [junit4]   2> 2993859 INFO  (TEST-TestSolrConfigHandlerConcurrent.test-seed#[7138193552298324]) [n:127.0.0.1:53077__yl%2Fkq    ] o.a.s.c.CorePropertiesLocator Found 1 core definitions
   [junit4]   2> 2993860 INFO  (TEST-TestSolrConfigHandlerConcurrent.test-seed#[7138193552298324]) [n:127.0.0.1:53077__yl%2Fkq    ] o.a.s.s.SolrDispatchFilter user.dir=C:\Users\JenkinsSlave\workspace\Lucene-Solr-trunk-Windows\solr\build\solr-core\test\J0
   [junit4]   2> 2993860 INFO  (TEST-TestSolrConfigHandlerConcurrent.test-seed#[7138193552298324]) [n:127.0.0.1:53077__yl%2Fkq    ] o.a.s.s.SolrDispatchFilter SolrDispatchFilter.init() done
   [junit4]   2> 2993861 INFO  (coreLoadExecutor-9442-thread-1-processing-n:127.0.0.1:53077__yl%2Fkq) [n:127.0.0.1:53077__yl%2Fkq c:collection1   x:collection1] o.a.s.c.ZkController publishing state=down
   [junit4]   2> 2993861 INFO  (coreLoadExecutor-9442-thread-1-processing-n:127.0.0.1:53077__yl%2Fkq) [n:127.0.0.1:53077__yl%2Fkq c:collection1   x:collection1] o.a.s.c.ZkController numShards not found on descriptor - reading it from system property
   [junit4]   2> 2993862 INFO  (coreLoadExecutor-9442-thread-1-processing-n:127.0.0.1:53077__yl%2Fkq) [n:127.0.0.1:53077__yl%2Fkq c:collection1   x:collection1] o.a.s.c.ZkController look for our core node name
   [junit4]   2> 2993863 INFO  (OverseerStateUpdate-95485393913446404-127.0.0.1:53034__yl%2Fkq-n_0000000000) [n:127.0.0.1:53034__yl%2Fkq    ] o.a.s.c.Overseer processMessage: queueSize: 1, message = {
   [junit4]   2>   "core":"collection1",
   [junit4]   2>   "roles":null,
   [junit4]   2>   "base_url":"http://127.0.0.1:53077/_yl/kq",
   [junit4]   2>   "node_name":"127.0.0.1:53077__yl%2Fkq",
   [junit4]   2>   "numShards":"2",
   [junit4]   2>   "state":"down",
   [junit4]   2>   "shard":null,
   [junit4]   2>   "collection":"collection1",
   [junit4]   2>   "operation":"state"} current state version: 4
   [junit4]   2> 2993863 INFO  (OverseerStateUpdate-95485393913446404-127.0.0.1:53034__yl%2Fkq-n_0000000000) [n:127.0.0.1:53034__yl%2Fkq    ] o.a.s.c.o.ReplicaMutator Update state numShards=2 message={
   [junit4]   2>   "core":"collection1",
   [junit4]   2>   "roles":null,
   [junit4]   2>   "base_url":"http://127.0.0.1:53077/_yl/kq",
   [junit4]   2>   "node_name":"127.0.0.1:53077__yl%2Fkq",
   [junit4]   2>   "numShards":"2",
   [junit4]   2>   "state":"down",
   [junit4]   2>   "shard":null,
   [junit4]   2>   "collection":"collection1",
   [junit4]   2>   "operation":"state"}
   [junit4]   2> 2993863 INFO  (OverseerStateUpdate-95485393913446404-127.0.0.1:53034__yl%2Fkq-n_0000000000) [n:127.0.0.1:53034__yl%2Fkq    ] o.a.s.c.o.ClusterStateMutator building a new cName: collection1
   [junit4]   2> 2993863 INFO  (OverseerStateUpdate-95485393913446404-127.0.0.1:53034__yl%2Fkq-n_0000000000) [n:127.0.0.1:53034__yl%2Fkq    ] o.a.s.c.o.ReplicaMutator Assigning new node to shard shard=shard2
   [junit4]   2> 2993951 INFO  (zkCallback-2802-thread-1-processing-n:127.0.0.1:53034__yl%2Fkq) [n:127.0.0.1:53034__yl%2Fkq    ] o.a.s.c.c.ZkStateReader A cluster state change: [WatchedEvent state:SyncConnected type:NodeDataChanged path:/clusterstate.json], has occurred - updating... (live nodes s

[...truncated too long message...]

.0.0.1:0}
   [junit4]   2> 3010907 INFO  (TEST-TestSolrConfigHandlerConcurrent.test-seed#[7138193552298324]) [    ] o.e.j.s.h.ContextHandler Stopped o.e.j.s.ServletContextHandler@6ab1eeec{/_yl/kq,null,UNAVAILABLE}
   [junit4]   2> 3010910 INFO  (TEST-TestSolrConfigHandlerConcurrent.test-seed#[7138193552298324]) [    ] o.a.s.c.ZkTestServer connecting to 127.0.0.1:53027 53027
   [junit4]   2> 3013242 INFO  (Thread-7349) [    ] o.a.s.c.ZkTestServer connecting to 127.0.0.1:53027 53027
   [junit4]   2> 3013242 WARN  (Thread-7349) [    ] o.a.s.c.ZkTestServer Watch limit violations: 
   [junit4]   2> Maximum concurrent create/delete watches above limit:
   [junit4]   2> 
   [junit4]   2> 	17	/solr/configs/conf1
   [junit4]   2> 	6	/solr/aliases.json
   [junit4]   2> 	5	/solr/security.json
   [junit4]   2> 
   [junit4]   2> Maximum concurrent data watches above limit:
   [junit4]   2> 
   [junit4]   2> 	6	/solr/clusterstate.json
   [junit4]   2> 
   [junit4]   2> Maximum concurrent children watches above limit:
   [junit4]   2> 
   [junit4]   2> 	6	/solr/live_nodes
   [junit4]   2> 	6	/solr/collections
   [junit4]   2> 	3	/solr/overseer/queue
   [junit4]   2> 	3	/solr/overseer/collection-queue-work
   [junit4]   2> 	2	/solr/overseer/queue-work
   [junit4]   2> 
   [junit4]   2> NOTE: reproduce with: ant test  -Dtestcase=TestSolrConfigHandlerConcurrent -Dtests.method=test -Dtests.seed=7138193552298324 -Dtests.slow=true -Dtests.locale=en-US -Dtests.timezone=NZ-CHAT -Dtests.asserts=true -Dtests.file.encoding=UTF-8
   [junit4] ERROR   22.7s J0 | TestSolrConfigHandlerConcurrent.test <<<
   [junit4]    > Throwable #1: java.lang.NullPointerException
   [junit4]    > 	at __randomizedtesting.SeedInfo.seed([7138193552298324:F96C26EFFCD5EEDC]:0)
   [junit4]    > 	at org.apache.solr.handler.TestSolrConfigHandlerConcurrent.test(TestSolrConfigHandlerConcurrent.java:116)
   [junit4]    > 	at org.apache.solr.BaseDistributedSearchTestCase$ShardsRepeatRule$ShardsFixedStatement.callStatement(BaseDistributedSearchTestCase.java:996)
   [junit4]    > 	at org.apache.solr.BaseDistributedSearchTestCase$ShardsRepeatRule$ShardsStatement.evaluate(BaseDistributedSearchTestCase.java:971)
   [junit4]    > 	at java.lang.Thread.run(Thread.java:745)
   [junit4]   2> 3013244 INFO  (SUITE-TestSolrConfigHandlerConcurrent-seed#[7138193552298324]-worker) [    ] o.a.s.SolrTestCaseJ4 ###deleteCore
   [junit4]   2> NOTE: leaving temporary files on disk at: C:\Users\JenkinsSlave\workspace\Lucene-Solr-trunk-Windows\solr\build\solr-core\test\J0\temp\solr.handler.TestSolrConfigHandlerConcurrent_7138193552298324-001
   [junit4]   2> NOTE: test params are: codec=Asserting(Lucene60): {}, docValues:{}, maxPointsInLeafNode=1444, maxMBSortInHeap=6.771216616356195, sim=RandomSimilarity(queryNorm=true,coord=yes): {}, locale=en-US, timezone=NZ-CHAT
   [junit4]   2> NOTE: Windows 7 6.1 amd64/Oracle Corporation 1.8.0_72 (64-bit)/cpus=3,threads=1,free=124538856,total=518979584
   [junit4]   2> NOTE: All tests run in this JVM: [ActionThrottleTest, URLClassifyProcessorTest, UUIDFieldTest, TestXIncludeConfig, DistributedFacetPivotLongTailTest, ExternalFileFieldSortTest, MigrateRouteKeyTest, TestCopyFieldCollectionResource, DirectSolrSpellCheckerTest, TestRemoteStreaming, OverseerStatusTest, ReplicationFactorTest, DistributedSuggestComponentTest, TestFunctionQuery, DeleteLastCustomShardedReplicaTest, TestLFUCache, IgnoreCommitOptimizeUpdateProcessorFactoryTest, ShardRoutingTest, HighlighterTest, IndexBasedSpellCheckerTest, TestCustomDocTransformer, TestSort, TestSurroundQueryParser, PreAnalyzedFieldTest, TestPartialUpdateDeduplication, TestCoreContainer, TestArbitraryIndexDir, SolrXmlInZkTest, BadComponentTest, ZkControllerTest, UpdateParamsTest, ScriptEngineTest, TestComplexPhraseQParserPlugin, TestDFRSimilarityFactory, RecoveryAfterSoftCommitTest, CustomCollectionTest, TestElisionMultitermQuery, PrimitiveFieldTypeTest, TestManagedResourceStorage, TestShortCircuitedRequests, CloudMLTQParserTest, BlockDirectoryTest, TestSQLHandler, TestFieldTypeCollectionResource, TestCodecSupport, TestHighFrequencyDictionaryFactory, TestRequestForwarding, XmlUpdateRequestHandlerTest, TestFieldSortValues, TestManagedStopFilterFactory, TestDocumentBuilder, HdfsRestartWhileUpdatingTest, SolrIndexConfigTest, CoreAdminRequestStatusTest, TestBulkSchemaAPI, TestCollationFieldDocValues, XsltUpdateRequestHandlerTest, TestSweetSpotSimilarityFactory, TestExtendedDismaxParser, MergeStrategyTest, StressHdfsTest, TestDynamicFieldCollectionResource, SoftAutoCommitTest, TestMacros, CollectionStateFormat2Test, TestFieldCollectionResource, HLLUtilTest, TestSchemaNameResource, SegmentsInfoRequestHandlerTest, UnloadDistributedZkTest, CdcrReplicationDistributedZkTest, TestJmxIntegration, HdfsDirectoryFactoryTest, TestQueryWrapperFilter, SOLR749Test, SolrRequestParserTest, TestSmileRequest, AnalysisAfterCoreReloadTest, DistributedQueryComponentCustomSortTest, SyncSliceTest, BitVectorTest, TestLuceneMatchVersion, HdfsCollectionsAPIDistributedZkTest, TestHighlightDedupGrouping, DocValuesTest, TestSolrCloudWithKerberosAlt, TestHashPartitioner, TimeZoneUtilsTest, CheckHdfsIndexTest, ClusterStateTest, FullHLLTest, PeerSyncTest, AddBlockUpdateTest, JSONWriterTest, EnumFieldTest, TestNoOpRegenerator, CdcrRequestHandlerTest, TestMaxScoreQueryParser, TestNonDefinedSimilarityFactory, TestStandardQParsers, StatelessScriptUpdateProcessorFactoryTest, HdfsThreadLeakTest, TestEmbeddedSolrServerConstructors, TestLazyCores, TestRuleBasedAuthorizationPlugin, DirectoryFactoryTest, TestCloudPivotFacet, SuggestComponentTest, TestSearchPerf, RequiredFieldsTest, TestCSVLoader, ResponseHeaderTest, DocumentBuilderTest, DisMaxRequestHandlerTest, SpatialFilterTest, DistribCursorPagingTest, RollingRestartTest, TestDocBasedVersionConstraints, IndexSchemaTest, HttpPartitionTest, ChaosMonkeyNothingIsSafeTest, TestLMDirichletSimilarityFactory, TestDistribIDF, HighlighterMaxOffsetTest, ClusterStateUpdateTest, TestMiniSolrCloudClusterBase, TestQuerySenderNoQuery, SpatialHeatmapFacetsTest, SmileWriterTest, RecoveryZkTest, TestRawTransformer, TestConfigOverlay, TestConfig, LeaderElectionTest, CollectionsAPIAsyncDistributedZkTest, QueryEqualityTest, TestManagedSchemaFieldTypeResource, RegexBoostProcessorTest, TestScoreJoinQPScore, CloudExitableDirectoryReaderTest, ChaosMonkeySafeLeaderTest, BasicDistributedZk2Test, LeaderElectionIntegrationTest, TestReplicationHandler, TestRandomDVFaceting, ZkCLITest, TestFaceting, TestRecovery, DistributedSpellCheckComponentTest, TestStressReorder, TestReload, TestStressVersions, HardAutoCommitTest, SimpleFacetsTest, SolrCoreTest, StatsComponentTest, SpellCheckComponentTest, TestGroupingSearch, SolrCmdDistributorTest, QueryElevationComponentTest, BasicFunctionalityTest, DirectUpdateHandlerTest, TestIndexSearcher, CurrencyFieldOpenExchangeTest, DistributedQueryElevationComponentTest, CurrencyFieldXmlFileTest, SimplePostToolTest, TestCoreDiscovery, SpellCheckCollatorTest, SuggesterFSTTest, TestFoldingMultitermQuery, SuggesterTSTTest, SuggesterTest, TestStressLucene, TestTrie, PolyFieldTest, NoCacheHeaderTest, WordBreakSolrSpellCheckerTest, SchemaVersionSpecificBehaviorTest, SolrCoreCheckLockOnStartupTest, TestPseudoReturnFields, TestUpdate, FieldMutatingUpdateProcessorTest, TestWordDelimiterFilterFactory, DirectUpdateHandlerOptimizeTest, DocValuesMultiTest, DistanceFunctionTest, SolrInfoMBeanTest, StandardRequestHandlerTest, TestQueryTypes, TermsComponentTest, TestValueSourceCache, TermVectorComponentTest, FieldAnalysisRequestHandlerTest, IndexSchemaRuntimeFieldTest, UpdateRequestProcessorFactoryTest, TestAnalyzedSuggestions, PingRequestHandlerTest, TestJmxMonitoredMap, TestFastLRUCache, TestSystemIdResolver, RAMDirectoryFactoryTest, TestLRUCache, SliceStateTest, SystemInfoHandlerTest, FileUtilsTest, SolrTestCaseJ4Test, TestCursorMarkWithoutUniqueKey, TestTolerantSearch, AliasIntegrationTest, BaseCdcrDistributedZkTest, CdcrReplicationHandlerTest, CdcrVersionReplicationTest, ConcurrentDeleteAndCreateCollectionTest, ConfigSetsAPITest, ConnectionManagerTest, DeleteInactiveReplicaTest, DeleteShardTest, DeleteStatusTest, LeaderInitiatedRecoveryOnCommitTest, MultiThreadedOCPTest, ShardSplitTest, TestCloudDeleteByQuery, TestConfigSetsAPI, TestConfigSetsAPIZkFailure, TestDistribDocBasedVersion, TestExclusionRuleCollectionAccess, TestLeaderElectionZkExpiry, TestLeaderInitiatedRecoveryThread, TestRebalanceLeaders, TriLevelCompositeIdRoutingTest, RulesTest, TestSolrConfigHandlerConcurrent]
   [junit4] Completed [495/581 (2!)] on J0 in 22.73s, 1 test, 1 error <<< FAILURES!

[...truncated 295 lines...]
BUILD FAILED
C:\Users\JenkinsSlave\workspace\Lucene-Solr-trunk-Windows\build.xml:740: The following error occurred while executing this line:
C:\Users\JenkinsSlave\workspace\Lucene-Solr-trunk-Windows\build.xml:684: The following error occurred while executing this line:
C:\Users\JenkinsSlave\workspace\Lucene-Solr-trunk-Windows\build.xml:59: The following error occurred while executing this line:
C:\Users\JenkinsSlave\workspace\Lucene-Solr-trunk-Windows\solr\build.xml:233: The following error occurred while executing this line:
C:\Users\JenkinsSlave\workspace\Lucene-Solr-trunk-Windows\solr\common-build.xml:524: The following error occurred while executing this line:
C:\Users\JenkinsSlave\workspace\Lucene-Solr-trunk-Windows\lucene\common-build.xml:1457: The following error occurred while executing this line:
C:\Users\JenkinsSlave\workspace\Lucene-Solr-trunk-Windows\lucene\common-build.xml:1014: There were test failures: 581 suites (8 ignored), 2345 tests, 1 error, 1 failure, 126 ignored (81 assumptions) [seed: 7138193552298324]

Total time: 77 minutes 2 seconds
Build step 'Invoke Ant' marked build as failure
Archiving artifacts
[WARNINGS] Skipping publisher since build result is FAILURE
Recording test results
Email was triggered for: Failure - Any
Sending email for trigger: Failure - Any



Mime
View raw message