lucene-dev mailing list archives

Site index · List index
Message view « Date » · « Thread »
Top « Date » · « Thread »
From Apache Jenkins Server <jenk...@builds.apache.org>
Subject [JENKINS] Lucene-Solr-Tests-6.x - Build # 94 - Failure
Date Mon, 21 Mar 2016 22:39:47 GMT
Build: https://builds.apache.org/job/Lucene-Solr-Tests-6.x/94/

1 tests failed.
FAILED:  org.apache.solr.cloud.DistribDocExpirationUpdateProcessorTest.test

Error Message:
Exactly one shard should have changed, instead: [shard2, shard1] nodes=([core_node3(shard2), core_node2(shard1), core_node4(shard1)]) expected:<1> but was:<2>

Stack Trace:
java.lang.AssertionError: Exactly one shard should have changed, instead: [shard2, shard1] nodes=([core_node3(shard2), core_node2(shard1), core_node4(shard1)]) expected:<1> but was:<2>
	at __randomizedtesting.SeedInfo.seed([75D6750A576B1C11:FD824AD0F99771E9]:0)
	at org.junit.Assert.fail(Assert.java:93)
	at org.junit.Assert.failNotEquals(Assert.java:647)
	at org.junit.Assert.assertEquals(Assert.java:128)
	at org.junit.Assert.assertEquals(Assert.java:472)
	at org.apache.solr.cloud.DistribDocExpirationUpdateProcessorTest.test(DistribDocExpirationUpdateProcessorTest.java:118)
	at sun.reflect.NativeMethodAccessorImpl.invoke0(Native Method)
	at sun.reflect.NativeMethodAccessorImpl.invoke(NativeMethodAccessorImpl.java:62)
	at sun.reflect.DelegatingMethodAccessorImpl.invoke(DelegatingMethodAccessorImpl.java:43)
	at java.lang.reflect.Method.invoke(Method.java:498)
	at com.carrotsearch.randomizedtesting.RandomizedRunner.invoke(RandomizedRunner.java:1764)
	at com.carrotsearch.randomizedtesting.RandomizedRunner$8.evaluate(RandomizedRunner.java:871)
	at com.carrotsearch.randomizedtesting.RandomizedRunner$9.evaluate(RandomizedRunner.java:907)
	at com.carrotsearch.randomizedtesting.RandomizedRunner$10.evaluate(RandomizedRunner.java:921)
	at org.apache.solr.BaseDistributedSearchTestCase$ShardsRepeatRule$ShardsFixedStatement.callStatement(BaseDistributedSearchTestCase.java:996)
	at org.apache.solr.BaseDistributedSearchTestCase$ShardsRepeatRule$ShardsStatement.evaluate(BaseDistributedSearchTestCase.java:971)
	at com.carrotsearch.randomizedtesting.rules.SystemPropertiesRestoreRule$1.evaluate(SystemPropertiesRestoreRule.java:57)
	at org.apache.lucene.util.TestRuleSetupTeardownChained$1.evaluate(TestRuleSetupTeardownChained.java:49)
	at org.apache.lucene.util.AbstractBeforeAfterRule$1.evaluate(AbstractBeforeAfterRule.java:45)
	at org.apache.lucene.util.TestRuleThreadAndTestName$1.evaluate(TestRuleThreadAndTestName.java:48)
	at org.apache.lucene.util.TestRuleIgnoreAfterMaxFailures$1.evaluate(TestRuleIgnoreAfterMaxFailures.java:64)
	at org.apache.lucene.util.TestRuleMarkFailure$1.evaluate(TestRuleMarkFailure.java:47)
	at com.carrotsearch.randomizedtesting.rules.StatementAdapter.evaluate(StatementAdapter.java:36)
	at com.carrotsearch.randomizedtesting.ThreadLeakControl$StatementRunner.run(ThreadLeakControl.java:367)
	at com.carrotsearch.randomizedtesting.ThreadLeakControl.forkTimeoutingTask(ThreadLeakControl.java:809)
	at com.carrotsearch.randomizedtesting.ThreadLeakControl$3.evaluate(ThreadLeakControl.java:460)
	at com.carrotsearch.randomizedtesting.RandomizedRunner.runSingleTest(RandomizedRunner.java:880)
	at com.carrotsearch.randomizedtesting.RandomizedRunner$5.evaluate(RandomizedRunner.java:781)
	at com.carrotsearch.randomizedtesting.RandomizedRunner$6.evaluate(RandomizedRunner.java:816)
	at com.carrotsearch.randomizedtesting.RandomizedRunner$7.evaluate(RandomizedRunner.java:827)
	at com.carrotsearch.randomizedtesting.rules.StatementAdapter.evaluate(StatementAdapter.java:36)
	at com.carrotsearch.randomizedtesting.rules.SystemPropertiesRestoreRule$1.evaluate(SystemPropertiesRestoreRule.java:57)
	at org.apache.lucene.util.AbstractBeforeAfterRule$1.evaluate(AbstractBeforeAfterRule.java:45)
	at com.carrotsearch.randomizedtesting.rules.StatementAdapter.evaluate(StatementAdapter.java:36)
	at org.apache.lucene.util.TestRuleStoreClassName$1.evaluate(TestRuleStoreClassName.java:41)
	at com.carrotsearch.randomizedtesting.rules.NoShadowingOrOverridesOnMethodsRule$1.evaluate(NoShadowingOrOverridesOnMethodsRule.java:40)
	at com.carrotsearch.randomizedtesting.rules.NoShadowingOrOverridesOnMethodsRule$1.evaluate(NoShadowingOrOverridesOnMethodsRule.java:40)
	at com.carrotsearch.randomizedtesting.rules.StatementAdapter.evaluate(StatementAdapter.java:36)
	at com.carrotsearch.randomizedtesting.rules.StatementAdapter.evaluate(StatementAdapter.java:36)
	at com.carrotsearch.randomizedtesting.rules.StatementAdapter.evaluate(StatementAdapter.java:36)
	at org.apache.lucene.util.TestRuleAssertionsRequired$1.evaluate(TestRuleAssertionsRequired.java:53)
	at org.apache.lucene.util.TestRuleMarkFailure$1.evaluate(TestRuleMarkFailure.java:47)
	at org.apache.lucene.util.TestRuleIgnoreAfterMaxFailures$1.evaluate(TestRuleIgnoreAfterMaxFailures.java:64)
	at org.apache.lucene.util.TestRuleIgnoreTestSuites$1.evaluate(TestRuleIgnoreTestSuites.java:54)
	at com.carrotsearch.randomizedtesting.rules.StatementAdapter.evaluate(StatementAdapter.java:36)
	at com.carrotsearch.randomizedtesting.ThreadLeakControl$StatementRunner.run(ThreadLeakControl.java:367)
	at java.lang.Thread.run(Thread.java:745)




Build Log:
[...truncated 11982 lines...]
   [junit4] Suite: org.apache.solr.cloud.DistribDocExpirationUpdateProcessorTest
   [junit4]   2> Creating dataDir: /x1/jenkins/jenkins-slave/workspace/Lucene-Solr-Tests-6.x/solr/build/solr-core/test/J2/temp/solr.cloud.DistribDocExpirationUpdateProcessorTest_75D6750A576B1C11-001/init-core-data-001
   [junit4]   2> 1398884 INFO  (SUITE-DistribDocExpirationUpdateProcessorTest-seed#[75D6750A576B1C11]-worker) [    ] o.a.s.SolrTestCaseJ4 Randomized ssl (false) and clientAuth (true)
   [junit4]   2> 1398885 INFO  (SUITE-DistribDocExpirationUpdateProcessorTest-seed#[75D6750A576B1C11]-worker) [    ] o.a.s.BaseDistributedSearchTestCase Setting hostContext system property: /_/x
   [junit4]   2> 1398887 INFO  (TEST-DistribDocExpirationUpdateProcessorTest.test-seed#[75D6750A576B1C11]) [    ] o.a.s.c.ZkTestServer STARTING ZK TEST SERVER
   [junit4]   2> 1398887 INFO  (Thread-4158) [    ] o.a.s.c.ZkTestServer client port:0.0.0.0/0.0.0.0:0
   [junit4]   2> 1398887 INFO  (Thread-4158) [    ] o.a.s.c.ZkTestServer Starting server
   [junit4]   2> 1398987 INFO  (TEST-DistribDocExpirationUpdateProcessorTest.test-seed#[75D6750A576B1C11]) [    ] o.a.s.c.ZkTestServer start zk server on port:54438
   [junit4]   2> 1398987 INFO  (TEST-DistribDocExpirationUpdateProcessorTest.test-seed#[75D6750A576B1C11]) [    ] o.a.s.c.c.SolrZkClient Using default ZkCredentialsProvider
   [junit4]   2> 1398988 INFO  (TEST-DistribDocExpirationUpdateProcessorTest.test-seed#[75D6750A576B1C11]) [    ] o.a.s.c.c.ConnectionManager Waiting for client to connect to ZooKeeper
   [junit4]   2> 1398990 INFO  (zkCallback-1914-thread-1) [    ] o.a.s.c.c.ConnectionManager Watcher org.apache.solr.common.cloud.ConnectionManager@1dc9dc9b name:ZooKeeperConnection Watcher:127.0.0.1:54438 got event WatchedEvent state:SyncConnected type:None path:null path:null type:None
   [junit4]   2> 1398990 INFO  (TEST-DistribDocExpirationUpdateProcessorTest.test-seed#[75D6750A576B1C11]) [    ] o.a.s.c.c.ConnectionManager Client is connected to ZooKeeper
   [junit4]   2> 1398990 INFO  (TEST-DistribDocExpirationUpdateProcessorTest.test-seed#[75D6750A576B1C11]) [    ] o.a.s.c.c.SolrZkClient Using default ZkACLProvider
   [junit4]   2> 1398990 INFO  (TEST-DistribDocExpirationUpdateProcessorTest.test-seed#[75D6750A576B1C11]) [    ] o.a.s.c.c.SolrZkClient makePath: /solr
   [junit4]   2> 1398992 INFO  (TEST-DistribDocExpirationUpdateProcessorTest.test-seed#[75D6750A576B1C11]) [    ] o.a.s.c.c.SolrZkClient Using default ZkCredentialsProvider
   [junit4]   2> 1398992 INFO  (TEST-DistribDocExpirationUpdateProcessorTest.test-seed#[75D6750A576B1C11]) [    ] o.a.s.c.c.ConnectionManager Waiting for client to connect to ZooKeeper
   [junit4]   2> 1398996 INFO  (zkCallback-1915-thread-1) [    ] o.a.s.c.c.ConnectionManager Watcher org.apache.solr.common.cloud.ConnectionManager@3cef4dda name:ZooKeeperConnection Watcher:127.0.0.1:54438/solr got event WatchedEvent state:SyncConnected type:None path:null path:null type:None
   [junit4]   2> 1398996 INFO  (TEST-DistribDocExpirationUpdateProcessorTest.test-seed#[75D6750A576B1C11]) [    ] o.a.s.c.c.ConnectionManager Client is connected to ZooKeeper
   [junit4]   2> 1398996 INFO  (TEST-DistribDocExpirationUpdateProcessorTest.test-seed#[75D6750A576B1C11]) [    ] o.a.s.c.c.SolrZkClient Using default ZkACLProvider
   [junit4]   2> 1398996 INFO  (TEST-DistribDocExpirationUpdateProcessorTest.test-seed#[75D6750A576B1C11]) [    ] o.a.s.c.c.SolrZkClient makePath: /collections/collection1
   [junit4]   2> 1398997 INFO  (TEST-DistribDocExpirationUpdateProcessorTest.test-seed#[75D6750A576B1C11]) [    ] o.a.s.c.c.SolrZkClient makePath: /collections/collection1/shards
   [junit4]   2> 1398998 INFO  (TEST-DistribDocExpirationUpdateProcessorTest.test-seed#[75D6750A576B1C11]) [    ] o.a.s.c.c.SolrZkClient makePath: /collections/control_collection
   [junit4]   2> 1398999 INFO  (TEST-DistribDocExpirationUpdateProcessorTest.test-seed#[75D6750A576B1C11]) [    ] o.a.s.c.c.SolrZkClient makePath: /collections/control_collection/shards
   [junit4]   2> 1399001 INFO  (TEST-DistribDocExpirationUpdateProcessorTest.test-seed#[75D6750A576B1C11]) [    ] o.a.s.c.AbstractZkTestCase put /x1/jenkins/jenkins-slave/workspace/Lucene-Solr-Tests-6.x/solr/core/src/test-files/solr/collection1/conf/solrconfig-doc-expire-update-processor.xml to /configs/conf1/solrconfig.xml
   [junit4]   2> 1399001 INFO  (TEST-DistribDocExpirationUpdateProcessorTest.test-seed#[75D6750A576B1C11]) [    ] o.a.s.c.c.SolrZkClient makePath: /configs/conf1/solrconfig.xml
   [junit4]   2> 1399003 INFO  (TEST-DistribDocExpirationUpdateProcessorTest.test-seed#[75D6750A576B1C11]) [    ] o.a.s.c.AbstractZkTestCase put /x1/jenkins/jenkins-slave/workspace/Lucene-Solr-Tests-6.x/solr/core/src/test-files/solr/collection1/conf/schema15.xml to /configs/conf1/schema.xml
   [junit4]   2> 1399003 INFO  (TEST-DistribDocExpirationUpdateProcessorTest.test-seed#[75D6750A576B1C11]) [    ] o.a.s.c.c.SolrZkClient makePath: /configs/conf1/schema.xml
   [junit4]   2> 1399004 INFO  (TEST-DistribDocExpirationUpdateProcessorTest.test-seed#[75D6750A576B1C11]) [    ] o.a.s.c.AbstractZkTestCase put /x1/jenkins/jenkins-slave/workspace/Lucene-Solr-Tests-6.x/solr/core/src/test-files/solr/collection1/conf/solrconfig.snippet.randomindexconfig.xml to /configs/conf1/solrconfig.snippet.randomindexconfig.xml
   [junit4]   2> 1399004 INFO  (TEST-DistribDocExpirationUpdateProcessorTest.test-seed#[75D6750A576B1C11]) [    ] o.a.s.c.c.SolrZkClient makePath: /configs/conf1/solrconfig.snippet.randomindexconfig.xml
   [junit4]   2> 1399006 INFO  (TEST-DistribDocExpirationUpdateProcessorTest.test-seed#[75D6750A576B1C11]) [    ] o.a.s.c.AbstractZkTestCase put /x1/jenkins/jenkins-slave/workspace/Lucene-Solr-Tests-6.x/solr/core/src/test-files/solr/collection1/conf/stopwords.txt to /configs/conf1/stopwords.txt
   [junit4]   2> 1399006 INFO  (TEST-DistribDocExpirationUpdateProcessorTest.test-seed#[75D6750A576B1C11]) [    ] o.a.s.c.c.SolrZkClient makePath: /configs/conf1/stopwords.txt
   [junit4]   2> 1399007 INFO  (TEST-DistribDocExpirationUpdateProcessorTest.test-seed#[75D6750A576B1C11]) [    ] o.a.s.c.AbstractZkTestCase put /x1/jenkins/jenkins-slave/workspace/Lucene-Solr-Tests-6.x/solr/core/src/test-files/solr/collection1/conf/protwords.txt to /configs/conf1/protwords.txt
   [junit4]   2> 1399007 INFO  (TEST-DistribDocExpirationUpdateProcessorTest.test-seed#[75D6750A576B1C11]) [    ] o.a.s.c.c.SolrZkClient makePath: /configs/conf1/protwords.txt
   [junit4]   2> 1399008 INFO  (TEST-DistribDocExpirationUpdateProcessorTest.test-seed#[75D6750A576B1C11]) [    ] o.a.s.c.AbstractZkTestCase put /x1/jenkins/jenkins-slave/workspace/Lucene-Solr-Tests-6.x/solr/core/src/test-files/solr/collection1/conf/currency.xml to /configs/conf1/currency.xml
   [junit4]   2> 1399009 INFO  (TEST-DistribDocExpirationUpdateProcessorTest.test-seed#[75D6750A576B1C11]) [    ] o.a.s.c.c.SolrZkClient makePath: /configs/conf1/currency.xml
   [junit4]   2> 1399010 INFO  (TEST-DistribDocExpirationUpdateProcessorTest.test-seed#[75D6750A576B1C11]) [    ] o.a.s.c.AbstractZkTestCase put /x1/jenkins/jenkins-slave/workspace/Lucene-Solr-Tests-6.x/solr/core/src/test-files/solr/collection1/conf/enumsConfig.xml to /configs/conf1/enumsConfig.xml
   [junit4]   2> 1399010 INFO  (TEST-DistribDocExpirationUpdateProcessorTest.test-seed#[75D6750A576B1C11]) [    ] o.a.s.c.c.SolrZkClient makePath: /configs/conf1/enumsConfig.xml
   [junit4]   2> 1399011 INFO  (TEST-DistribDocExpirationUpdateProcessorTest.test-seed#[75D6750A576B1C11]) [    ] o.a.s.c.AbstractZkTestCase put /x1/jenkins/jenkins-slave/workspace/Lucene-Solr-Tests-6.x/solr/core/src/test-files/solr/collection1/conf/open-exchange-rates.json to /configs/conf1/open-exchange-rates.json
   [junit4]   2> 1399011 INFO  (TEST-DistribDocExpirationUpdateProcessorTest.test-seed#[75D6750A576B1C11]) [    ] o.a.s.c.c.SolrZkClient makePath: /configs/conf1/open-exchange-rates.json
   [junit4]   2> 1399013 INFO  (TEST-DistribDocExpirationUpdateProcessorTest.test-seed#[75D6750A576B1C11]) [    ] o.a.s.c.AbstractZkTestCase put /x1/jenkins/jenkins-slave/workspace/Lucene-Solr-Tests-6.x/solr/core/src/test-files/solr/collection1/conf/mapping-ISOLatin1Accent.txt to /configs/conf1/mapping-ISOLatin1Accent.txt
   [junit4]   2> 1399013 INFO  (TEST-DistribDocExpirationUpdateProcessorTest.test-seed#[75D6750A576B1C11]) [    ] o.a.s.c.c.SolrZkClient makePath: /configs/conf1/mapping-ISOLatin1Accent.txt
   [junit4]   2> 1399014 INFO  (TEST-DistribDocExpirationUpdateProcessorTest.test-seed#[75D6750A576B1C11]) [    ] o.a.s.c.AbstractZkTestCase put /x1/jenkins/jenkins-slave/workspace/Lucene-Solr-Tests-6.x/solr/core/src/test-files/solr/collection1/conf/old_synonyms.txt to /configs/conf1/old_synonyms.txt
   [junit4]   2> 1399014 INFO  (TEST-DistribDocExpirationUpdateProcessorTest.test-seed#[75D6750A576B1C11]) [    ] o.a.s.c.c.SolrZkClient makePath: /configs/conf1/old_synonyms.txt
   [junit4]   2> 1399016 INFO  (TEST-DistribDocExpirationUpdateProcessorTest.test-seed#[75D6750A576B1C11]) [    ] o.a.s.c.AbstractZkTestCase put /x1/jenkins/jenkins-slave/workspace/Lucene-Solr-Tests-6.x/solr/core/src/test-files/solr/collection1/conf/synonyms.txt to /configs/conf1/synonyms.txt
   [junit4]   2> 1399016 INFO  (TEST-DistribDocExpirationUpdateProcessorTest.test-seed#[75D6750A576B1C11]) [    ] o.a.s.c.c.SolrZkClient makePath: /configs/conf1/synonyms.txt
   [junit4]   2> 1399106 INFO  (TEST-DistribDocExpirationUpdateProcessorTest.test-seed#[75D6750A576B1C11]) [    ] o.a.s.SolrTestCaseJ4 Writing core.properties file to /x1/jenkins/jenkins-slave/workspace/Lucene-Solr-Tests-6.x/solr/build/solr-core/test/J2/temp/solr.cloud.DistribDocExpirationUpdateProcessorTest_75D6750A576B1C11-001/control-001/cores/collection1
   [junit4]   2> 1399108 INFO  (TEST-DistribDocExpirationUpdateProcessorTest.test-seed#[75D6750A576B1C11]) [    ] o.e.j.s.Server jetty-9.3.8.v20160314
   [junit4]   2> 1399109 INFO  (TEST-DistribDocExpirationUpdateProcessorTest.test-seed#[75D6750A576B1C11]) [    ] o.e.j.s.h.ContextHandler Started o.e.j.s.ServletContextHandler@5c7a57b4{/_/x,null,AVAILABLE}
   [junit4]   2> 1399110 INFO  (TEST-DistribDocExpirationUpdateProcessorTest.test-seed#[75D6750A576B1C11]) [    ] o.e.j.s.ServerConnector Started ServerConnector@3c1e28c1{HTTP/1.1,[http/1.1]}{127.0.0.1:39425}
   [junit4]   2> 1399110 INFO  (TEST-DistribDocExpirationUpdateProcessorTest.test-seed#[75D6750A576B1C11]) [    ] o.e.j.s.Server Started @1402073ms
   [junit4]   2> 1399111 INFO  (TEST-DistribDocExpirationUpdateProcessorTest.test-seed#[75D6750A576B1C11]) [    ] o.a.s.c.s.e.JettySolrRunner Jetty properties: {solr.data.dir=/x1/jenkins/jenkins-slave/workspace/Lucene-Solr-Tests-6.x/solr/build/solr-core/test/J2/temp/solr.cloud.DistribDocExpirationUpdateProcessorTest_75D6750A576B1C11-001/tempDir-001/control/data, hostContext=/_/x, hostPort=39425, coreRootDirectory=/x1/jenkins/jenkins-slave/workspace/Lucene-Solr-Tests-6.x/solr/build/solr-core/test/J2/temp/solr.cloud.DistribDocExpirationUpdateProcessorTest_75D6750A576B1C11-001/control-001/cores}
   [junit4]   2> 1399111 INFO  (TEST-DistribDocExpirationUpdateProcessorTest.test-seed#[75D6750A576B1C11]) [    ] o.a.s.s.SolrDispatchFilter SolrDispatchFilter.init(): sun.misc.Launcher$AppClassLoader@73d16e93
   [junit4]   2> 1399111 INFO  (TEST-DistribDocExpirationUpdateProcessorTest.test-seed#[75D6750A576B1C11]) [    ] o.a.s.c.SolrResourceLoader new SolrResourceLoader for directory: '/x1/jenkins/jenkins-slave/workspace/Lucene-Solr-Tests-6.x/solr/build/solr-core/test/J2/temp/solr.cloud.DistribDocExpirationUpdateProcessorTest_75D6750A576B1C11-001/control-001'
   [junit4]   2> 1399111 INFO  (TEST-DistribDocExpirationUpdateProcessorTest.test-seed#[75D6750A576B1C11]) [    ] o.a.s.c.SolrResourceLoader JNDI not configured for solr (NoInitialContextEx)
   [junit4]   2> 1399111 INFO  (TEST-DistribDocExpirationUpdateProcessorTest.test-seed#[75D6750A576B1C11]) [    ] o.a.s.c.SolrResourceLoader solr home defaulted to 'solr/' (could not find system property or JNDI)
   [junit4]   2> 1399111 INFO  (TEST-DistribDocExpirationUpdateProcessorTest.test-seed#[75D6750A576B1C11]) [    ] o.a.s.c.c.SolrZkClient Using default ZkCredentialsProvider
   [junit4]   2> 1399112 INFO  (TEST-DistribDocExpirationUpdateProcessorTest.test-seed#[75D6750A576B1C11]) [    ] o.a.s.c.c.ConnectionManager Waiting for client to connect to ZooKeeper
   [junit4]   2> 1399113 INFO  (zkCallback-1916-thread-1) [    ] o.a.s.c.c.ConnectionManager Watcher org.apache.solr.common.cloud.ConnectionManager@5957b1ff name:ZooKeeperConnection Watcher:127.0.0.1:54438/solr got event WatchedEvent state:SyncConnected type:None path:null path:null type:None
   [junit4]   2> 1399113 INFO  (TEST-DistribDocExpirationUpdateProcessorTest.test-seed#[75D6750A576B1C11]) [    ] o.a.s.c.c.ConnectionManager Client is connected to ZooKeeper
   [junit4]   2> 1399113 INFO  (TEST-DistribDocExpirationUpdateProcessorTest.test-seed#[75D6750A576B1C11]) [    ] o.a.s.c.c.SolrZkClient Using default ZkACLProvider
   [junit4]   2> 1399114 INFO  (TEST-DistribDocExpirationUpdateProcessorTest.test-seed#[75D6750A576B1C11]) [    ] o.a.s.s.SolrDispatchFilter Loading solr.xml from SolrHome (not found in ZooKeeper)
   [junit4]   2> 1399114 INFO  (TEST-DistribDocExpirationUpdateProcessorTest.test-seed#[75D6750A576B1C11]) [    ] o.a.s.c.SolrXmlConfig Loading container configuration from /x1/jenkins/jenkins-slave/workspace/Lucene-Solr-Tests-6.x/solr/build/solr-core/test/J2/temp/solr.cloud.DistribDocExpirationUpdateProcessorTest_75D6750A576B1C11-001/control-001/solr.xml
   [junit4]   2> 1399120 INFO  (TEST-DistribDocExpirationUpdateProcessorTest.test-seed#[75D6750A576B1C11]) [    ] o.a.s.c.CorePropertiesLocator Config-defined core root directory: /x1/jenkins/jenkins-slave/workspace/Lucene-Solr-Tests-6.x/solr/build/solr-core/test/J2/temp/solr.cloud.DistribDocExpirationUpdateProcessorTest_75D6750A576B1C11-001/control-001/cores
   [junit4]   2> 1399120 INFO  (TEST-DistribDocExpirationUpdateProcessorTest.test-seed#[75D6750A576B1C11]) [    ] o.a.s.c.CoreContainer New CoreContainer 916581490
   [junit4]   2> 1399120 INFO  (TEST-DistribDocExpirationUpdateProcessorTest.test-seed#[75D6750A576B1C11]) [    ] o.a.s.c.CoreContainer Loading cores into CoreContainer [instanceDir=/x1/jenkins/jenkins-slave/workspace/Lucene-Solr-Tests-6.x/solr/build/solr-core/test/J2/temp/solr.cloud.DistribDocExpirationUpdateProcessorTest_75D6750A576B1C11-001/control-001]
   [junit4]   2> 1399120 WARN  (TEST-DistribDocExpirationUpdateProcessorTest.test-seed#[75D6750A576B1C11]) [    ] o.a.s.c.CoreContainer Couldn't add files from /x1/jenkins/jenkins-slave/workspace/Lucene-Solr-Tests-6.x/solr/build/solr-core/test/J2/temp/solr.cloud.DistribDocExpirationUpdateProcessorTest_75D6750A576B1C11-001/control-001/lib to classpath: /x1/jenkins/jenkins-slave/workspace/Lucene-Solr-Tests-6.x/solr/build/solr-core/test/J2/temp/solr.cloud.DistribDocExpirationUpdateProcessorTest_75D6750A576B1C11-001/control-001/lib
   [junit4]   2> 1399120 INFO  (TEST-DistribDocExpirationUpdateProcessorTest.test-seed#[75D6750A576B1C11]) [    ] o.a.s.h.c.HttpShardHandlerFactory created with socketTimeout : 90000,urlScheme : ,connTimeout : 15000,maxConnectionsPerHost : 20,maxConnections : 10000,corePoolSize : 0,maximumPoolSize : 2147483647,maxThreadIdleTime : 5,sizeOfQueue : -1,fairnessPolicy : false,useRetries : false,
   [junit4]   2> 1399122 INFO  (TEST-DistribDocExpirationUpdateProcessorTest.test-seed#[75D6750A576B1C11]) [    ] o.a.s.u.UpdateShardHandler Creating UpdateShardHandler HTTP client with params: socketTimeout=340000&connTimeout=45000&retry=true
   [junit4]   2> 1399123 INFO  (TEST-DistribDocExpirationUpdateProcessorTest.test-seed#[75D6750A576B1C11]) [    ] o.a.s.l.LogWatcher SLF4J impl is org.slf4j.impl.Log4jLoggerFactory
   [junit4]   2> 1399123 INFO  (TEST-DistribDocExpirationUpdateProcessorTest.test-seed#[75D6750A576B1C11]) [    ] o.a.s.l.LogWatcher Registering Log Listener [Log4j (org.slf4j.impl.Log4jLoggerFactory)]
   [junit4]   2> 1399123 INFO  (TEST-DistribDocExpirationUpdateProcessorTest.test-seed#[75D6750A576B1C11]) [    ] o.a.s.c.ZkContainer Zookeeper client=127.0.0.1:54438/solr
   [junit4]   2> 1399123 INFO  (TEST-DistribDocExpirationUpdateProcessorTest.test-seed#[75D6750A576B1C11]) [    ] o.a.s.c.ZkController zkHost includes chroot
   [junit4]   2> 1399123 INFO  (TEST-DistribDocExpirationUpdateProcessorTest.test-seed#[75D6750A576B1C11]) [    ] o.a.s.c.c.SolrZkClient Using default ZkCredentialsProvider
   [junit4]   2> 1399123 INFO  (TEST-DistribDocExpirationUpdateProcessorTest.test-seed#[75D6750A576B1C11]) [    ] o.a.s.c.c.ConnectionManager Waiting for client to connect to ZooKeeper
   [junit4]   2> 1399124 INFO  (zkCallback-1919-thread-1) [    ] o.a.s.c.c.ConnectionManager Watcher org.apache.solr.common.cloud.ConnectionManager@4e8dd9e3 name:ZooKeeperConnection Watcher:127.0.0.1:54438 got event WatchedEvent state:SyncConnected type:None path:null path:null type:None
   [junit4]   2> 1399125 INFO  (TEST-DistribDocExpirationUpdateProcessorTest.test-seed#[75D6750A576B1C11]) [    ] o.a.s.c.c.ConnectionManager Client is connected to ZooKeeper
   [junit4]   2> 1399125 INFO  (TEST-DistribDocExpirationUpdateProcessorTest.test-seed#[75D6750A576B1C11]) [    ] o.a.s.c.c.SolrZkClient Using default ZkACLProvider
   [junit4]   2> 1399126 INFO  (TEST-DistribDocExpirationUpdateProcessorTest.test-seed#[75D6750A576B1C11]) [n:127.0.0.1:39425__%2Fx    ] o.a.s.c.c.ConnectionManager Waiting for client to connect to ZooKeeper
   [junit4]   2> 1399129 INFO  (zkCallback-1920-thread-1-processing-n:127.0.0.1:39425__%2Fx) [n:127.0.0.1:39425__%2Fx    ] o.a.s.c.c.ConnectionManager Watcher org.apache.solr.common.cloud.ConnectionManager@451d5813 name:ZooKeeperConnection Watcher:127.0.0.1:54438/solr got event WatchedEvent state:SyncConnected type:None path:null path:null type:None
   [junit4]   2> 1399130 INFO  (TEST-DistribDocExpirationUpdateProcessorTest.test-seed#[75D6750A576B1C11]) [n:127.0.0.1:39425__%2Fx    ] o.a.s.c.c.ConnectionManager Client is connected to ZooKeeper
   [junit4]   2> 1399131 INFO  (TEST-DistribDocExpirationUpdateProcessorTest.test-seed#[75D6750A576B1C11]) [n:127.0.0.1:39425__%2Fx    ] o.a.s.c.c.SolrZkClient makePath: /overseer/queue
   [junit4]   2> 1399132 INFO  (TEST-DistribDocExpirationUpdateProcessorTest.test-seed#[75D6750A576B1C11]) [n:127.0.0.1:39425__%2Fx    ] o.a.s.c.c.SolrZkClient makePath: /overseer/collection-queue-work
   [junit4]   2> 1399135 INFO  (TEST-DistribDocExpirationUpdateProcessorTest.test-seed#[75D6750A576B1C11]) [n:127.0.0.1:39425__%2Fx    ] o.a.s.c.c.SolrZkClient makePath: /overseer/collection-map-running
   [junit4]   2> 1399137 INFO  (TEST-DistribDocExpirationUpdateProcessorTest.test-seed#[75D6750A576B1C11]) [n:127.0.0.1:39425__%2Fx    ] o.a.s.c.c.SolrZkClient makePath: /overseer/collection-map-completed
   [junit4]   2> 1399139 INFO  (TEST-DistribDocExpirationUpdateProcessorTest.test-seed#[75D6750A576B1C11]) [n:127.0.0.1:39425__%2Fx    ] o.a.s.c.c.SolrZkClient makePath: /overseer/collection-map-failure
   [junit4]   2> 1399140 INFO  (TEST-DistribDocExpirationUpdateProcessorTest.test-seed#[75D6750A576B1C11]) [n:127.0.0.1:39425__%2Fx    ] o.a.s.c.c.SolrZkClient makePath: /live_nodes
   [junit4]   2> 1399141 INFO  (TEST-DistribDocExpirationUpdateProcessorTest.test-seed#[75D6750A576B1C11]) [n:127.0.0.1:39425__%2Fx    ] o.a.s.c.c.SolrZkClient makePath: /aliases.json
   [junit4]   2> 1399142 INFO  (TEST-DistribDocExpirationUpdateProcessorTest.test-seed#[75D6750A576B1C11]) [n:127.0.0.1:39425__%2Fx    ] o.a.s.c.c.SolrZkClient makePath: /clusterstate.json
   [junit4]   2> 1399143 INFO  (TEST-DistribDocExpirationUpdateProcessorTest.test-seed#[75D6750A576B1C11]) [n:127.0.0.1:39425__%2Fx    ] o.a.s.c.c.SolrZkClient makePath: /security.json
   [junit4]   2> 1399144 INFO  (TEST-DistribDocExpirationUpdateProcessorTest.test-seed#[75D6750A576B1C11]) [n:127.0.0.1:39425__%2Fx    ] o.a.s.c.c.ZkStateReader Updating cluster state from ZooKeeper... 
   [junit4]   2> 1399145 INFO  (TEST-DistribDocExpirationUpdateProcessorTest.test-seed#[75D6750A576B1C11]) [n:127.0.0.1:39425__%2Fx    ] o.a.s.c.c.ZkStateReader Updated live nodes from ZooKeeper... (0) -> (0)
   [junit4]   2> 1399146 INFO  (TEST-DistribDocExpirationUpdateProcessorTest.test-seed#[75D6750A576B1C11]) [n:127.0.0.1:39425__%2Fx    ] o.a.s.c.c.SolrZkClient makePath: /overseer_elect
   [junit4]   2> 1399147 INFO  (TEST-DistribDocExpirationUpdateProcessorTest.test-seed#[75D6750A576B1C11]) [n:127.0.0.1:39425__%2Fx    ] o.a.s.c.c.SolrZkClient makePath: /overseer_elect/election
   [junit4]   2> 1399148 INFO  (TEST-DistribDocExpirationUpdateProcessorTest.test-seed#[75D6750A576B1C11]) [n:127.0.0.1:39425__%2Fx    ] o.a.s.c.Overseer Overseer (id=null) closing
   [junit4]   2> 1399149 INFO  (TEST-DistribDocExpirationUpdateProcessorTest.test-seed#[75D6750A576B1C11]) [n:127.0.0.1:39425__%2Fx    ] o.a.s.c.LeaderElector Joined leadership election with path: /overseer_elect/election/95590748479291396-127.0.0.1:39425__%2Fx-n_0000000000
   [junit4]   2> 1399149 INFO  (TEST-DistribDocExpirationUpdateProcessorTest.test-seed#[75D6750A576B1C11]) [n:127.0.0.1:39425__%2Fx    ] o.a.s.c.OverseerElectionContext I am going to be the leader 127.0.0.1:39425__%2Fx
   [junit4]   2> 1399149 INFO  (TEST-DistribDocExpirationUpdateProcessorTest.test-seed#[75D6750A576B1C11]) [n:127.0.0.1:39425__%2Fx    ] o.a.s.c.c.SolrZkClient makePath: /overseer_elect/leader
   [junit4]   2> 1399150 INFO  (TEST-DistribDocExpirationUpdateProcessorTest.test-seed#[75D6750A576B1C11]) [n:127.0.0.1:39425__%2Fx    ] o.a.s.c.Overseer Overseer (id=95590748479291396-127.0.0.1:39425__%2Fx-n_0000000000) starting
   [junit4]   2> 1399152 INFO  (TEST-DistribDocExpirationUpdateProcessorTest.test-seed#[75D6750A576B1C11]) [n:127.0.0.1:39425__%2Fx    ] o.a.s.c.c.SolrZkClient makePath: /overseer/queue-work
   [junit4]   2> 1399156 INFO  (TEST-DistribDocExpirationUpdateProcessorTest.test-seed#[75D6750A576B1C11]) [n:127.0.0.1:39425__%2Fx    ] o.a.s.c.OverseerAutoReplicaFailoverThread Starting OverseerAutoReplicaFailoverThread autoReplicaFailoverWorkLoopDelay=10000 autoReplicaFailoverWaitAfterExpiration=30000 autoReplicaFailoverBadNodeExpiration=60000
   [junit4]   2> 1399157 INFO  (OverseerCollectionConfigSetProcessor-95590748479291396-127.0.0.1:39425__%2Fx-n_0000000000) [n:127.0.0.1:39425__%2Fx    ] o.a.s.c.OverseerTaskProcessor Process current queue of overseer operations
   [junit4]   2> 1399157 INFO  (OverseerStateUpdate-95590748479291396-127.0.0.1:39425__%2Fx-n_0000000000) [n:127.0.0.1:39425__%2Fx    ] o.a.s.c.Overseer Starting to work on the main queue
   [junit4]   2> 1399157 INFO  (TEST-DistribDocExpirationUpdateProcessorTest.test-seed#[75D6750A576B1C11]) [n:127.0.0.1:39425__%2Fx    ] o.a.s.c.ZkController Register node as live in ZooKeeper:/live_nodes/127.0.0.1:39425__%2Fx
   [junit4]   2> 1399157 INFO  (TEST-DistribDocExpirationUpdateProcessorTest.test-seed#[75D6750A576B1C11]) [n:127.0.0.1:39425__%2Fx    ] o.a.s.c.c.SolrZkClient makePath: /live_nodes/127.0.0.1:39425__%2Fx
   [junit4]   2> 1399158 INFO  (OverseerStateUpdate-95590748479291396-127.0.0.1:39425__%2Fx-n_0000000000) [n:127.0.0.1:39425__%2Fx    ] o.a.s.c.c.ZkStateReader Updated live nodes from ZooKeeper... (0) -> (0)
   [junit4]   2> 1399159 INFO  (zkCallback-1920-thread-1-processing-n:127.0.0.1:39425__%2Fx) [n:127.0.0.1:39425__%2Fx    ] o.a.s.c.c.ZkStateReader A live node change: [WatchedEvent state:SyncConnected type:NodeChildrenChanged path:/live_nodes], has occurred - updating... (live nodes size: [0])
   [junit4]   2> 1399159 INFO  (zkCallback-1920-thread-1-processing-n:127.0.0.1:39425__%2Fx) [n:127.0.0.1:39425__%2Fx    ] o.a.s.c.c.ZkStateReader Updated live nodes from ZooKeeper... (0) -> (1)
   [junit4]   2> 1399166 INFO  (TEST-DistribDocExpirationUpdateProcessorTest.test-seed#[75D6750A576B1C11]) [n:127.0.0.1:39425__%2Fx    ] o.a.s.c.CoreContainer Security conf doesn't exist. Skipping setup for authorization module.
   [junit4]   2> 1399167 INFO  (TEST-DistribDocExpirationUpdateProcessorTest.test-seed#[75D6750A576B1C11]) [n:127.0.0.1:39425__%2Fx    ] o.a.s.c.CoreContainer No authentication plugin used.
   [junit4]   2> 1399167 INFO  (TEST-DistribDocExpirationUpdateProcessorTest.test-seed#[75D6750A576B1C11]) [n:127.0.0.1:39425__%2Fx    ] o.a.s.c.CorePropertiesLocator Looking for core definitions underneath /x1/jenkins/jenkins-slave/workspace/Lucene-Solr-Tests-6.x/solr/build/solr-core/test/J2/temp/solr.cloud.DistribDocExpirationUpdateProcessorTest_75D6750A576B1C11-001/control-001/cores
   [junit4]   2> 1399168 INFO  (TEST-DistribDocExpirationUpdateProcessorTest.test-seed#[75D6750A576B1C11]) [n:127.0.0.1:39425__%2Fx    ] o.a.s.c.CoreDescriptor Created CoreDescriptor: {name=collection1, config=solrconfig.xml, transient=false, schema=schema.xml, loadOnStartup=true, configSetProperties=configsetprops.json, collection=control_collection, coreNodeName=, dataDir=data/, shard=}
   [junit4]   2> 1399168 INFO  (TEST-DistribDocExpirationUpdateProcessorTest.test-seed#[75D6750A576B1C11]) [n:127.0.0.1:39425__%2Fx    ] o.a.s.c.CorePropertiesLocator Found core collection1 in /x1/jenkins/jenkins-slave/workspace/Lucene-Solr-Tests-6.x/solr/build/solr-core/test/J2/temp/solr.cloud.DistribDocExpirationUpdateProcessorTest_75D6750A576B1C11-001/control-001/cores/collection1
   [junit4]   2> 1399168 INFO  (TEST-DistribDocExpirationUpdateProcessorTest.test-seed#[75D6750A576B1C11]) [n:127.0.0.1:39425__%2Fx    ] o.a.s.c.CorePropertiesLocator Found 1 core definitions
   [junit4]   2> 1399169 INFO  (TEST-DistribDocExpirationUpdateProcessorTest.test-seed#[75D6750A576B1C11]) [n:127.0.0.1:39425__%2Fx    ] o.a.s.s.SolrDispatchFilter user.dir=/x1/jenkins/jenkins-slave/workspace/Lucene-Solr-Tests-6.x/solr/build/solr-core/test/J2
   [junit4]   2> 1399169 INFO  (coreLoadExecutor-5394-thread-1-processing-n:127.0.0.1:39425__%2Fx) [n:127.0.0.1:39425__%2Fx c:control_collection   x:collection1] o.a.s.c.ZkController publishing state=down
   [junit4]   2> 1399169 INFO  (TEST-DistribDocExpirationUpdateProcessorTest.test-seed#[75D6750A576B1C11]) [n:127.0.0.1:39425__%2Fx    ] o.a.s.s.SolrDispatchFilter SolrDispatchFilter.init() done
   [junit4]   2> 1399169 INFO  (coreLoadExecutor-5394-thread-1-processing-n:127.0.0.1:39425__%2Fx) [n:127.0.0.1:39425__%2Fx c:control_collection   x:collection1] o.a.s.c.ZkController numShards not found on descriptor - reading it from system property
   [junit4]   2> 1399171 INFO  (OverseerStateUpdate-95590748479291396-127.0.0.1:39425__%2Fx-n_0000000000) [n:127.0.0.1:39425__%2Fx    ] o.a.s.c.Overseer processMessage: queueSize: 1, message = {
   [junit4]   2>   "core":"collection1",
   [junit4]   2>   "roles":null,
   [junit4]   2>   "base_url":"http://127.0.0.1:39425/_/x",
   [junit4]   2>   "node_name":"127.0.0.1:39425__%2Fx",
   [junit4]   2>   "numShards":"1",
   [junit4]   2>   "state":"down",
   [junit4]   2>   "shard":null,
   [junit4]   2>   "collection":"control_collection",
   [junit4]   2>   "operation":"state"} current state version: 0
   [junit4]   2> 1399171 INFO  (coreLoadExecutor-5394-thread-1-processing-n:127.0.0.1:39425__%2Fx) [n:127.0.0.1:39425__%2Fx c:control_collection   x:collection1] o.a.s.c.ZkController look for our core node name
   [junit4]   2> 1399171 INFO  (OverseerStateUpdate-95590748479291396-127.0.0.1:39425__%2Fx-n_0000000000) [n:127.0.0.1:39425__%2Fx    ] o.a.s.c.o.ReplicaMutator Update state numShards=1 message={
   [junit4]   2>   "core":"collection1",
   [junit4]   2>   "roles":null,
   [junit4]   2>   "base_url":"http://127.0.0.1:39425/_/x",
   [junit4]   2>   "node_name":"127.0.0.1:39425__%2Fx",
   [junit4]   2>   "numShards":"1",
   [junit4]   2>   "state":"down",
   [junit4]   2>   "shard":null,
   [junit4]   2>   "collection":"control_collection",
   [junit4]   2>   "operation":"state"}
   [junit4]   2> 1399171 INFO  (OverseerStateUpdate-95590748479291396-127.0.0.1:39425__%2Fx-n_0000000000) [n:127.0.0.1:39425__%2Fx    ] o.a.s.c.o.ClusterStateMutator building a new cName: control_collection
   [junit4]   2> 1399172 INFO  (OverseerStateUpdate-95590748479291396-127.0.0.1:39425__%2Fx-n_0000000000) [n:127.0.0.1:39425__%2Fx    ] o.a.s.c.o.ReplicaMutator Assigning new node to shard shard=shard1
   [junit4]   2> 1399173 INFO  (zkCallback-1920-thread-1-processing-n:127.0.0.1:39425__%2Fx) [n:127.0.0.1:39425__%2Fx    ] o.a.s.c.c.ZkStateReader A cluster state change: [WatchedEvent state:SyncConnected type:NodeDataChanged path:/clusterstate.json], has occurred - updating... (live nodes size: [1])
   [junit4]   2> 1400171 INFO  (coreLoadExecutor-5394-thread-1-processing-n:127.0.0.1:39425__%2Fx) [n:127.0.0.1:39425__%2Fx c:control_collection   x:collection1] o.a.s.c.ZkController waiting to find shard id in clusterstate for collection1
   [junit4]   2> 1400171 INFO  (coreLoadExecutor-5394-thread-1-processing-n:127.0.0.1:39425__%2Fx) [n:127.0.0.1:39425__%2Fx c:control_collection   x:collection1] o.a.s.c.ZkController Check for collection zkNode:control_collection
   [junit4]   2> 1400172 INFO  (coreLoadExecutor-5394-thread-1-processing-n:127.0.0.1:39425__%2Fx) [n:127.0.0.1:39425__%2Fx c:control_collection   x:collection1] o.a.s.c.ZkController Collection zkNode exists
   [junit4]   2> 1400172 INFO  (coreLoadExecutor-5394-thread-1-processing-n:127.0.0.1:39425__%2Fx) [n:127.0.0.1:39425__%2Fx c:control_collection   x:collection1] o.a.s.c.c.ZkStateReader Load collection config from: [/collections/control_collection]
   [junit4]   2> 1400172 INFO  (coreLoadExecutor-5394-thread-1-processing-n:127.0.0.1:39425__%2Fx) [n:127.0.0.1:39425__%2Fx c:control_collection   x:collection1] o.a.s.c.c.ZkStateReader path=[/collections/control_collection] [configName]=[conf1] specified config exists in ZooKeeper
   [junit4]   2> 1400172 INFO  (coreLoadExecutor-5394-thread-1-processing-n:127.0.0.1:39425__%2Fx) [n:127.0.0.1:39425__%2Fx c:control_collection   x:collection1] o.a.s.c.SolrResourceLoader new SolrResourceLoader for directory: '/x1/jenkins/jenkins-slave/workspace/Lucene-Solr-Tests-6.x/solr/build/solr-core/test/J2/temp/solr.cloud.DistribDocExpirationUpdateProcessorTest_75D6750A576B1C11-001/control-001/cores/collection1'
   [junit4]   2> 1400173 INFO  (coreLoadExecutor-5394-thread-1-processing-n:127.0.0.1:39425__%2Fx) [n:127.0.0.1:39425__%2Fx c:control_collection   x:collection1] o.a.s.c.SolrResourceLoader JNDI not configured for solr (NoInitialContextEx)
   [junit4]   2> 1400173 INFO  (coreLoadExecutor-5394-thread-1-processing-n:127.0.0.1:39425__%2Fx) [n:127.0.0.1:39425__%2Fx c:control_collection   x:collection1] o.a.s.c.SolrResourceLoader solr home defaulted to 'solr/' (could not find system property or JNDI)
   [junit4]   2> 1400174 INFO  (coreLoadExecutor-5394-thread-1-processing-n:127.0.0.1:39425__%2Fx) [n:127.0.0.1:39425__%2Fx c:control_collection   x:collection1] o.a.s.c.Config loaded config solrconfig.xml with version 0 
   [junit4]   2> 1400179 INFO  (coreLoadExecutor-5394-thread-1-processing-n:127.0.0.1:39425__%2Fx) [n:127.0.0.1:39425__%2Fx c:control_collection   x:collection1] o.a.s.c.SolrConfig current version of requestparams : -1
   [junit4]   2> 1400182 INFO  (coreLoadExecutor-5394-thread-1-processing-n:127.0.0.1:39425__%2Fx) [n:127.0.0.1:39425__%2Fx c:control_collection   x:collection1] o.a.s.c.SolrConfig Using Lucene MatchVersion: 6.1.0
   [junit4]   2> 1400189 INFO  (coreLoadExecutor-5394-thread-1-processing-n:127.0.0.1:39425__%2Fx) [n:127.0.0.1:39425__%2Fx c:control_collection   x:collection1] o.a.s.c.SolrConfig Loaded SolrConfig: solrconfig.xml
   [junit4]   2> 1400194 INFO  (coreLoadExecutor-5394-thread-1-processing-n:127.0.0.1:39425__%2Fx) [n:127.0.0.1:39425__%2Fx c:control_collection   x:collection1] o.a.s.s.IndexSchema [collection1] Schema name=test
   [junit4]   2> 1400279 INFO  (coreLoadExecutor-5394-thread-1-processing-n:127.0.0.1:39425__%2Fx) [n:127.0.0.1:39425__%2Fx c:control_collection   x:collection1] o.a.s.s.IndexSchema default search field in schema is text
   [junit4]   2> 1400280 INFO  (coreLoadExecutor-5394-thread-1-processing-n:127.0.0.1:39425__%2Fx) [n:127.0.0.1:39425__%2Fx c:control_collection   x:collection1] o.a.s.s.IndexSchema unique key field: id
   [junit4]   2> 1400281 INFO  (coreLoadExecutor-5394-thread-1-processing-n:127.0.0.1:39425__%2Fx) [n:127.0.0.1:39425__%2Fx c:control_collection   x:collection1] o.a.s.s.FileExchangeRateProvider Reloading exchange rates from file currency.xml
   [junit4]   2> 1400283 INFO  (coreLoadExecutor-5394-thread-1-processing-n:127.0.0.1:39425__%2Fx) [n:127.0.0.1:39425__%2Fx c:control_collection   x:collection1] o.a.s.s.FileExchangeRateProvider Reloading exchange rates from file currency.xml
   [junit4]   2> 1400295 INFO  (coreLoadExecutor-5394-thread-1-processing-n:127.0.0.1:39425__%2Fx) [n:127.0.0.1:39425__%2Fx c:control_collection   x:collection1] o.a.s.c.ConfigSetProperties Did not find ConfigSet properties, assuming default properties: Can't find resource 'configsetprops.json' in classpath or '/configs/conf1', cwd=/x1/jenkins/jenkins-slave/workspace/Lucene-Solr-Tests-6.x/solr/build/solr-core/test/J2
   [junit4]   2> 1400295 INFO  (coreLoadExecutor-5394-thread-1-processing-n:127.0.0.1:39425__%2Fx) [n:127.0.0.1:39425__%2Fx c:control_collection   x:collection1] o.a.s.c.CoreContainer Creating SolrCore 'collection1' using configuration from collection control_collection
   [junit4]   2> 1400295 INFO  (coreLoadExecutor-5394-thread-1-processing-n:127.0.0.1:39425__%2Fx) [n:127.0.0.1:39425__%2Fx c:control_collection s:shard1 r:core_node1 x:collection1] o.a.s.c.SolrCore org.apache.solr.core.MockDirectoryFactory
   [junit4]   2> 1400296 INFO  (coreLoadExecutor-5394-thread-1-processing-n:127.0.0.1:39425__%2Fx) [n:127.0.0.1:39425__%2Fx c:control_collection s:shard1 r:core_node1 x:collection1] o.a.s.c.SolrCore [[collection1] ] Opening new SolrCore at [/x1/jenkins/jenkins-slave/workspace/Lucene-Solr-Tests-6.x/solr/build/solr-core/test/J2/temp/solr.cloud.DistribDocExpirationUpdateProcessorTest_75D6750A576B1C11-001/control-001/cores/collection1], dataDir=[/x1/jenkins/jenkins-slave/workspace/Lucene-Solr-Tests-6.x/solr/build/solr-core/test/J2/temp/solr.cloud.DistribDocExpirationUpdateProcessorTest_75D6750A576B1C11-001/control-001/cores/collection1/data/]
   [junit4]   2> 1400296 INFO  (coreLoadExecutor-5394-thread-1-processing-n:127.0.0.1:39425__%2Fx) [n:127.0.0.1:39425__%2Fx c:control_collection s:shard1 r:core_node1 x:collection1] o.a.s.c.SolrCore JMX monitoring not detected for core: collection1
   [junit4]   2> 1400296 INFO  (coreLoadExecutor-5394-thread-1-processing-n:127.0.0.1:39425__%2Fx) [n:127.0.0.1:39425__%2Fx c:control_collection s:shard1 r:core_node1 x:collection1] o.a.s.c.CachingDirectoryFactory return new directory for /x1/jenkins/jenkins-slave/workspace/Lucene-Solr-Tests-6.x/solr/build/solr-core/test/J2/temp/solr.cloud.DistribDocExpirationUpdateProcessorTest_75D6750A576B1C11-001/control-001/cores/collection1/data
   [junit4]   2> 1400296 INFO  (coreLoadExecutor-5394-thread-1-processing-n:127.0.0.1:39425__%2Fx) [n:127.0.0.1:39425__%2Fx c:control_collection s:shard1 r:core_node1 x:collection1] o.a.s.c.SolrCore New index directory detected: old=null new=/x1/jenkins/jenkins-slave/workspace/Lucene-Solr-Tests-6.x/solr/build/solr-core/test/J2/temp/solr.cloud.DistribDocExpirationUpdateProcessorTest_75D6750A576B1C11-001/control-001/cores/collection1/data/index/
   [junit4]   2> 1400296 WARN  (coreLoadExecutor-5394-thread-1-processing-n:127.0.0.1:39425__%2Fx) [n:127.0.0.1:39425__%2Fx c:control_collection s:shard1 r:core_node1 x:collection1] o.a.s.c.SolrCore [collection1] Solr index directory '/x1/jenkins/jenkins-slave/workspace/Lucene-Solr-Tests-6.x/solr/build/solr-core/test/J2/temp/solr.cloud.DistribDocExpirationUpdateProcessorTest_75D6750A576B1C11-001/control-001/cores/collection1/data/index' doesn't exist. Creating new index...
   [junit4]   2> 1400296 INFO  (coreLoadExecutor-5394-thread-1-processing-n:127.0.0.1:39425__%2Fx) [n:127.0.0.1:39425__%2Fx c:control_collection s:shard1 r:core_node1 x:collection1] o.a.s.c.CachingDirectoryFactory return new directory for /x1/jenkins/jenkins-slave/workspace/Lucene-Solr-Tests-6.x/solr/build/solr-core/test/J2/temp/solr.cloud.DistribDocExpirationUpdateProcessorTest_75D6750A576B1C11-001/control-001/cores/collection1/data/index
   [junit4]   2> 1400297 INFO  (coreLoadExecutor-5394-thread-1-processing-n:127.0.0.1:39425__%2Fx) [n:127.0.0.1:39425__%2Fx c:control_collection s:shard1 r:core_node1 x:collection1] o.a.s.u.RandomMergePolicy RandomMergePolicy wrapping class org.apache.lucene.index.AlcoholicMergePolicy: [AlcoholicMergePolicy: minMergeSize=0, mergeFactor=10, maxMergeSize=1696769561, maxMergeSizeForForcedMerge=9223372036854775807, calibrateSizeByDeletes=true, maxMergeDocs=2147483647, maxCFSSegmentSizeMB=8.796093022207999E12, noCFSRatio=0.1]
   [junit4]   2> 1400297 INFO  (coreLoadExecutor-5394-thread-1-processing-n:127.0.0.1:39425__%2Fx) [n:127.0.0.1:39425__%2Fx c:control_collection s:shard1 r:core_node1 x:collection1] o.a.s.c.SolrDeletionPolicy SolrDeletionPolicy.onCommit: commits: num=1
   [junit4]   2> 	commit{dir=MockDirectoryWrapper(RAMDirectory@105fbddf lockFactory=org.apache.lucene.store.SingleInstanceLockFactory@4359e4c0),segFN=segments_1,generation=1}
   [junit4]   2> 1400297 INFO  (coreLoadExecutor-5394-thread-1-processing-n:127.0.0.1:39425__%2Fx) [n:127.0.0.1:39425__%2Fx c:control_collection s:shard1 r:core_node1 x:collection1] o.a.s.c.SolrDeletionPolicy newest commit generation = 1
   [junit4]   2> 1400298 INFO  (OldIndexDirectoryCleanupThreadForCore-collection1) [n:127.0.0.1:39425__%2Fx c:control_collection s:shard1 r:core_node1 x:collection1] o.a.s.c.SolrCore Looking for old index directories to cleanup for core collection1 in /x1/jenkins/jenkins-slave/workspace/Lucene-Solr-Tests-6.x/solr/build/solr-core/test/J2/temp/solr.cloud.DistribDocExpirationUpdateProcessorTest_75D6750A576B1C11-001/control-001/cores/collection1/data/
   [junit4]   2> 1400298 WARN  (OldIndexDirectoryCleanupThreadForCore-collection1) [n:127.0.0.1:39425__%2Fx c:control_collection s:shard1 r:core_node1 x:collection1] o.a.s.c.DirectoryFactory /x1/jenkins/jenkins-slave/workspace/Lucene-Solr-Tests-6.x/solr/build/solr-core/test/J2/temp/solr.cloud.DistribDocExpirationUpdateProcessorTest_75D6750A576B1C11-001/control-001/cores/collection1/data/ does not point to a valid data directory; skipping clean-up of old index directories.
   [junit4]   2> 1400299 INFO  (coreLoadExecutor-5394-thread-1-processing-n:127.0.0.1:39425__%2Fx) [n:127.0.0.1:39425__%2Fx c:control_collection s:shard1 r:core_node1 x:collection1] o.a.s.u.p.UpdateRequestProcessorChain creating updateRequestProcessorChain "convert-ttl-defaults"
   [junit4]   2> 1400309 INFO  (coreLoadExecutor-5394-thread-1-processing-n:127.0.0.1:39425__%2Fx) [n:127.0.0.1:39425__%2Fx c:control_collection s:shard1 r:core_node1 x:collection1] o.a.s.u.p.UpdateRequestProcessorChain creating updateRequestProcessorChain "convert-ttl-field"
   [junit4]   2> 1400318 INFO  (coreLoadExecutor-5394-thread-1-processing-n:127.0.0.1:39425__%2Fx) [n:127.0.0.1:39425__%2Fx c:control_collection s:shard1 r:core_node1 x:collection1] o.a.s.u.p.UpdateRequestProcessorChain creating updateRequestProcessorChain "convert-ttl-param"
   [junit4]   2> 1400318 INFO  (coreLoadExecutor-5394-thread-1-processing-n:127.0.0.1:39425__%2Fx) [n:127.0.0.1:39425__%2Fx c:control_collection s:shard1 r:core_node1 x:collection1] o.a.s.u.p.UpdateRequestProcessorChain creating updateRequestProcessorChain "convert-ttl-field-with-param-default"
   [junit4]   2> 1400318 INFO  (coreLoadExecutor-5394-thread-1-processing-n:127.0.0.1:39425__%2Fx) [n:127.0.0.1:39425__%2Fx c:control_collection s:shard1 r:core_node1 x:collection1] o.a.s.u.p.UpdateRequestProcessorChain creating updateRequestProcessorChain "scheduled-delete" (default)
   [junit4]   2> 1400326 INFO  (coreLoadExecutor-5394-thread-1-processing-n:127.0.0.1:39425__%2Fx) [n:127.0.0.1:39425__%2Fx c:control_collection s:shard1 r:core_node1 x:collection1] o.a.s.u.p.UpdateRequestProcessorChain inserting DistributedUpdateProcessorFactory into updateRequestProcessorChain "scheduled-delete" (default)
   [junit4]   2> 1400328 INFO  (coreLoadExecutor-5394-thread-1-processing-n:127.0.0.1:39425__%2Fx) [n:127.0.0.1:39425__%2Fx c:control_collection s:shard1 r:core_node1 x:collection1] o.a.s.h.l.XMLLoader xsltCacheLifetimeSeconds=60
   [junit4]   2> 1400329 INFO  (coreLoadExecutor-5394-thread-1-processing-n:127.0.0.1:39425__%2Fx) [n:127.0.0.1:39425__%2Fx c:control_collection s:shard1 r:core_node1 x:collection1] o.a.s.h.l.XMLLoader xsltCacheLifetimeSeconds=60
   [junit4]   2> 1400329 INFO  (coreLoadExecutor-5394-thread-1-processing-n:127.0.0.1:39425__%2Fx) [n:127.0.0.1:39425__%2Fx c:control_collection s:shard1 r:core_node1 x:collection1] o.a.s.h.l.XMLLoader xsltCacheLifetimeSeconds=60
   [junit4]   2> 1400330 INFO  (coreLoadExecutor-5394-thread-1-processing-n:127.0.0.1:39425__%2Fx) [n:127.0.0.1:39425__%2Fx c:control_collection s:shard1 r:core_node1 x:collection1] o.a.s.h.l.XMLLoader xsltCacheLifetimeSeconds=60
   [junit4]   2> 1400331 INFO  (coreLoadExecutor-5394-thread-1-processing-n:127.0.0.1:39425__%2Fx) [n:127.0.0.1:39425__%2Fx c:control_collection s:shard1 r:core_node1 x:collection1] o.a.s.c.RequestHandlers Registered paths: /admin/mbeans,,/update/csv,/sql,/update/json/docs,/admin/luke,/export,/select,/admin/segments,/get,/admin/system,/replication,/admin/properties,/config,/stream,/schema,/admin/plugins,/admin/logging,/update/json,/admin/ping,/admin/threads,/update,/admin/file
   [junit4]   2> 1400331 INFO  (coreLoadExecutor-5394-thread-1-processing-n:127.0.0.1:39425__%2Fx) [n:127.0.0.1:39425__%2Fx c:control_collection s:shard1 r:core_node1 x:collection1] o.a.s.c.SolrCore Using default statsCache cache: org.apache.solr.search.stats.LocalStatsCache
   [junit4]   2> 1400332 INFO  (coreLoadExecutor-5394-thread-1-processing-n:127.0.0.1:39425__%2Fx) [n:127.0.0.1:39425__%2Fx c:control_collection s:shard1 r:core_node1 x:collection1] o.a.s.u.UpdateHandler Using UpdateLog implementation: org.apache.solr.update.UpdateLog
   [junit4]   2> 1400332 INFO  (coreLoadExecutor-5394-thread-1-processing-n:127.0.0.1:39425__%2Fx) [n:127.0.0.1:39425__%2Fx c:control_collection s:shard1 r:core_node1 x:collection1] o.a.s.u.UpdateLog Initializing UpdateLog: dataDir= defaultSyncLevel=FLUSH numRecordsToKeep=100 maxNumLogsToKeep=10 numVersionBuckets=65536
   [junit4]   2> 1400332 INFO  (coreLoadExecutor-5394-thread-1-processing-n:127.0.0.1:39425__%2Fx) [n:127.0.0.1:39425__%2Fx c:control_collection s:shard1 r:core_node1 x:collection1] o.a.s.u.CommitTracker Hard AutoCommit: disabled
   [junit4]   2> 1400332 INFO  (coreLoadExecutor-5394-thread-1-processing-n:127.0.0.1:39425__%2Fx) [n:127.0.0.1:39425__%2Fx c:control_collection s:shard1 r:core_node1 x:collection1] o.a.s.u.CommitTracker Soft AutoCommit: disabled
   [junit4]   2> 1400333 INFO  (coreLoadExecutor-5394-thread-1-processing-n:127.0.0.1:39425__%2Fx) [n:127.0.0.1:39425__%2Fx c:control_collection s:shard1 r:core_node1 x:collection1] o.a.s.u.RandomMergePolicy RandomMergePolicy wrapping class org.apache.lucene.index.LogDocMergePolicy: [LogDocMergePolicy: minMergeSize=1000, mergeFactor=14, maxMergeSize=9223372036854775807, maxMergeSizeForForcedMerge=9223372036854775807, calibrateSizeByDeletes=false, maxMergeDocs=2147483647, maxCFSSegmentSizeMB=8.796093022207999E12, noCFSRatio=0.0]
   [junit4]   2> 1400333 INFO  (coreLoadExecutor-5394-thread-1-processing-n:127.0.0.1:39425__%2Fx) [n:127.0.0.1:39425__%2Fx c:control_collection s:shard1 r:core_node1 x:collection1] o.a.s.c.SolrDeletionPolicy SolrDeletionPolicy.onInit: commits: num=1
   [junit4]   2> 	commit{dir=MockDirectoryWrapper(RAMDirectory@105fbddf lockFactory=org.apache.lucene.store.SingleInstanceLockFactory@4359e4c0),segFN=segments_1,generation=1}
   [junit4]   2> 1400333 INFO  (coreLoadExecutor-5394-thread-1-processing-n:127.0.0.1:39425__%2Fx) [n:127.0.0.1:39425__%2Fx c:control_collection s:shard1 r:core_node1 x:collection1] o.a.s.c.SolrDeletionPolicy newest commit generation = 1
   [junit4]   2> 1400333 INFO  (coreLoadExecutor-5394-thread-1-processing-n:127.0.0.1:39425__%2Fx) [n:127.0.0.1:39425__%2Fx c:control_collection s:shard1 r:core_node1 x:collection1] o.a.s.s.SolrIndexSearcher Opening [Searcher@78b7db77[collection1] main]
   [junit4]   2> 1400333 INFO  (coreLoadExecutor-5394-thread-1-processing-n:127.0.0.1:39425__%2Fx) [n:127.0.0.1:39425__%2Fx c:control_collection s:shard1 r:core_node1 x:collection1] o.a.s.c.c.ZkStateReader Load collection config from: [/collections/control_collection]
   [junit4]   2> 1400334 INFO  (coreLoadExecutor-5394-thread-1-processing-n:127.0.0.1:39425__%2Fx) [n:127.0.0.1:39425__%2Fx c:control_collection s:shard1 r:core_node1 x:collection1] o.a.s.c.c.ZkStateReader path=[/collections/control_collection] [configName]=[conf1] specified config exists in ZooKeeper
   [junit4]   2> 1400334 INFO  (coreLoadExecutor-5394-thread-1-processing-n:127.0.0.1:39425__%2Fx) [n:127.0.0.1:39425__%2Fx c:control_collection s:shard1 r:core_node1 x:collection1] o.a.s.r.ManagedResourceStorage Setting up ZooKeeper-based storage for the RestManager with znodeBase: /configs/conf1
   [junit4]   2> 1400334 INFO  (coreLoadExecutor-5394-thread-1-processing-n:127.0.0.1:39425__%2Fx) [n:127.0.0.1:39425__%2Fx c:control_collection s:shard1 r:core_node1 x:collection1] o.a.s.r.ManagedResourceStorage Configured ZooKeeperStorageIO with znodeBase: /configs/conf1
   [junit4]   2> 1400334 INFO  (coreLoadExecutor-5394-thread-1-processing-n:127.0.0.1:39425__%2Fx) [n:127.0.0.1:39425__%2Fx c:control_collection s:shard1 r:core_node1 x:collection1] o.a.s.r.RestManager Initializing RestManager with initArgs: {}
   [junit4]   2> 1400335 INFO  (coreLoadExecutor-5394-thread-1-processing-n:127.0.0.1:39425__%2Fx) [n:127.0.0.1:39425__%2Fx c:control_collection s:shard1 r:core_node1 x:collection1] o.a.s.r.ManagedResourceStorage Reading _rest_managed.json using ZooKeeperStorageIO:path=/configs/conf1
   [junit4]   2> 1400335 INFO  (coreLoadExecutor-5394-thread-1-processing-n:127.0.0.1:39425__%2Fx) [n:127.0.0.1:39425__%2Fx c:control_collection s:shard1 r:core_node1 x:collection1] o.a.s.r.ManagedResourceStorage No data found for znode /configs/conf1/_rest_managed.json
   [junit4]   2> 1400335 INFO  (coreLoadExecutor-5394-thread-1-processing-n:127.0.0.1:39425__%2Fx) [n:127.0.0.1:39425__%2Fx c:control_collection s:shard1 r:core_node1 x:collection1] o.a.s.r.ManagedResourceStorage Loaded null at path _rest_managed.json using ZooKeeperStorageIO:path=/configs/conf1
   [junit4]   2> 1400335 INFO  (coreLoadExecutor-5394-thread-1-processing-n:127.0.0.1:39425__%2Fx) [n:127.0.0.1:39425__%2Fx c:control_collection s:shard1 r:core_node1 x:collection1] o.a.s.r.RestManager Initializing 0 registered ManagedResources
   [junit4]   2> 1400342 INFO  (coreLoadExecutor-5394-thread-1-processing-n:127.0.0.1:39425__%2Fx) [n:127.0.0.1:39425__%2Fx c:control_collection s:shard1 r:core_node1 x:collection1] o.a.s.h.ReplicationHandler Commits will be reserved for  10000
   [junit4]   2> 1400342 INFO  (searcherExecutor-5395-thread-1-processing-n:127.0.0.1:39425__%2Fx x:collection1 s:shard1 c:control_collection r:core_node1) [n:127.0.0.1:39425__%2Fx c:control_collection s:shard1 r:core_node1 x:collection1] o.a.s.c.SolrCore [collection1] Registered new searcher Searcher@78b7db77[collection1] main{ExitableDirectoryReader(UninvertingDirectoryReader())}
   [junit4]   2> 1400342 INFO  (coreLoadExecutor-5394-thread-1-processing-n:127.0.0.1:39425__%2Fx) [n:127.0.0.1:39425__%2Fx c:control_collection s:shard1 r:core_node1 x:collection1] o.a.s.u.UpdateLog Looking up max value of version field to seed version buckets
   [junit4]   2> 1400342 INFO  (coreLoadExecutor-5394-thread-1-processing-n:127.0.0.1:39425__%2Fx) [n:127.0.0.1:39425__%2Fx c:control_collection s:shard1 r:core_node1 x:collection1] o.a.s.u.VersionInfo Refreshing highest value of _version_ for 65536 version buckets from index
   [junit4]   2> 1400342 INFO  (coreLoadExecutor-5394-thread-1-processing-n:127.0.0.1:39425__%2Fx) [n:127.0.0.1:39425__%2Fx c:control_collection s:shard1 r:core_node1 x:collection1] o.a.s.u.VersionInfo No terms found for _version_, cannot seed version bucket highest value from index
   [junit4]   2> 1400343 INFO  (coreLoadExecutor-5394-thread-1-processing-n:127.0.0.1:39425__%2Fx) [n:127.0.0.1:39425__%2Fx c:control_collection s:shard1 r:core_node1 x:collection1] o.a.s.u.UpdateLog Could not find max version in index or recent updates, using new clock 1529451977194340352
   [junit4]   2> 1400344 INFO  (coreLoadExecutor-5394-thread-1-processing-n:127.0.0.1:39425__%2Fx) [n:127.0.0.1:39425__%2Fx c:control_collection s:shard1 r:core_node1 x:collection1] o.a.s.u.UpdateLog Took 1.0ms to seed version buckets with highest version 1529451977194340352
   [junit4]   2> 1400344 INFO  (coreLoadExecutor-5394-thread-1-processing-n:127.0.0.1:39425__%2Fx) [n:127.0.0.1:39425__%2Fx c:control_collection s:shard1 r:core_node1 x:collection1] o.a.s.c.ZkController watch zkdir /configs/conf1
   [junit4]   2> 1400345 INFO  (coreLoadExecutor-5394-thread-1-processing-n:127.0.0.1:39425__%2Fx) [n:127.0.0.1:39425__%2Fx c:control_collection s:shard1 r:core_node1 x:collection1] o.a.s.c.CoreContainer registering core: collection1
   [junit4]   2> 1400345 INFO  (coreZkRegister-5388-thread-1-processing-n:127.0.0.1:39425__%2Fx x:collection1 s:shard1 c:control_collection r:core_node1) [n:127.0.0.1:39425__%2Fx c:control_collection s:shard1 r:core_node1 x:collection1] o.a.s.c.ZkController Register replica - core:collection1 address:http://127.0.0.1:39425/_/x collection:control_collection shard:shard1
   [junit4]   2> 1400346 INFO  (coreZkRegister-5388-thread-1-processing-n:127.0.0.1:39425__%2Fx x:collection1 s:shard1 c:control_collection r:core_node1) [n:127.0.0.1:39425__%2Fx c:control_collection s:shard1 r:core_node1 x:collection1] o.a.s.c.c.SolrZkClient makePath: /collections/control_collection/leader_elect/shard1/election
   [junit4]   2> 1400349 INFO  (coreZkRegister-5388-thread-1-processing-n:127.0.0.1:39425__%2Fx x:collection1 s:shard1 c:control_collection r:core_node1) [n:127.0.0.1:39425__%2Fx c:control_collection s:shard1 r:core_node1 x:collection1] o.a.s.c.LeaderElector Joined leadership election with path: /collections/control_collection/leader_elect/shard1/election/95590748479291396-core_node1-n_0000000000
   [junit4]   2> 1400349 INFO  (coreZkRegister-5388-thread-1-processing-n:127.0.0.1:39425__%2Fx x:collection1 s:shard1 c:control_collection r:core_node1) [n:127.0.0.1:39425__%2Fx c:control_collection s:shard1 r:core_node1 x:collection1] o.a.s.c.ShardLeaderElectionContext Running the leader process for shard=shard1 and weAreReplacement=false and leaderVoteWait=10000
   [junit4]   2> 1400350 INFO  (coreZkRegister-5388-thread-1-processing-n:127.0.0.1:39425__%2Fx x:collection1 s:shard1 c:control_collection r:core_node1) [n:127.0.0.1:39425__%2Fx c:control_collection s:shard1 r:core_node1 x:collection1] o.a.s.c.ShardLeaderElectionContext Enough replicas found to continue.
   [junit4]   2> 1400350 INFO  (coreZkRegister-5388-thread-1-processing-n:127.0.0.1:39425__%2Fx x:collection1 s:shard1 c:control_collection r:core_node1) [n:127.0.0.1:39425__%2Fx c:control_collection s:shard1 r:core_node1 x:collection1] o.a.s.c.ShardLeaderElectionContext I may be the new leader - try and sync
   [junit4]   2> 1400350 INFO  (coreZkRegister-5388-thread-1-processing-n:127.0.0.1:39425__%2Fx x:collection1 s:shard1 c:control_collection r:core_node1) [n:127.0.0.1:39425__%2Fx c:control_collection s:shard1 r:core_node1 x:collection1] o.a.s.c.SyncStrategy Sync replicas to http://127.0.0.1:39425/_/x/collection1/
   [junit4]   2> 1400350 INFO  (coreZkRegister-5388-thread-1-processing-n:127.0.0.1:39425__%2Fx x:collection1 s:shard1 c:control_collection r:core_node1) [n:127.0.0.1:39425__%2Fx c:control_collection s:shard1 r:core_node1 x:collection1] o.a.s.c.SyncStrategy Sync Success - now sync replicas to me
   [junit4]   2> 1400350 INFO  (coreZkRegister-5388-thread-1-processing-n:127.0.0.1:39425__%2Fx x:collection1 s:shard1 c:control_collection r:core_node1) [n:127.0.0.1:39425__%2Fx c:control_collection s:shard1 r:core_node1 x:collection1] o.a.s.c.SyncStrategy http://127.0.0.1:39425/_/x/collection1/ has no replicas
   [junit4]   2> 1400350 INFO  (OverseerStateUpdate-95590748479291396-127.0.0.1:39425__%2Fx-n_0000000000) [n:127.0.0.1:39425__%2Fx    ] o.a.s.c.Overseer processMessage: queueSize: 1, message = {
   [junit4]   2>   "operation":"leader",
   [junit4]   2>   "shard":"shard1",
   [junit4]   2>   "collection":"control_collection"} current state version: 1
   [junit4]   2> 1400351 INFO  (coreZkRegister-5388-thread-1-processing-n:127.0.0.1:39425__%2Fx x:collection1 s:shard1 c:control_collection r:core_node1) [n:127.0.0.1:39425__%2Fx c:control_collection s:shard1 r:core_node1 x:collection1] o.a.s.c.c.SolrZkClient makePath: /collections/control_collection/leaders/shard1
   [junit4]   2> 1400353 INFO  (coreZkRegister-5388-thread-1-processing-n:127.0.0.1:39425__%2Fx x:collection1 s:shard1 c:control_collection r:core_node1) [n:127.0.0.1:39425__%2Fx c:control_collection s:shard1 r:core_node1 x:collection1] o.a.s.c.ShardLeaderElectionContextBase Creating leader registration node /collections/control_collection/leaders/shard1/leader after winning as /collections/control_collection/leader_elect/shard1/election/95590748479291396-core_node1-n_0000000000
   [junit4]   2> 1400354 INFO  (coreZkRegister-5388-thread-1-processing-n:127.0.0.1:39425__%2Fx x:collection1 s:shard1 c:control_collection r:core_node1) [n:127.0.0.1:39425__%2Fx c:control_collection s:shard1 r:core_node1 x:collection1] o.a.s.c.ShardLeaderElectionContext I am the new leader: http://127.0.0.1:39425/_/x/collection1/ shard1
   [junit4]   2> 1400355 INFO  (OverseerStateUpdate-95590748479291396-127.0.0.1:39425__%2Fx-n_0000000000) [n:127.0.0.1:39425__%2Fx    ] o.a.s.c.Overseer processMessage: queueSize: 1, message = {
   [junit4]   2>   "operation":"leader",
   [junit4]   2>   "shard":"shard1",
   [junit4]   2>   "collection":"control_collection",
   [junit4]   2>   "base_url":"http://127.0.0.1:39425/_/x",
   [junit4]   2>   "core":"collection1",
   [junit4]   2>   "state":"active"} current state version: 1
   [junit4]   2> 1400457 INFO  (zkCallback-1920-thread-1-processing-n:127.0.0.1:39425__%2Fx) [n:127.0.0.1:39425__%2Fx    ] o.a.s.c.c.ZkStateReader A cluster state change: [WatchedEvent state:SyncConnected type:NodeDataChanged path:/clusterstate.json], has occurred - updating... (live nodes size: [1])
   [junit4]   2> 1400506 INFO  (coreZkRegister-5388-thread-1-processing-n:127.0.0.1:39425__%2Fx x:collection1 s:shard1 c:control_collection r:core_node1) [n:127.0.0.1:39425__%2Fx c:control_collection s:shard1 r:core_node1 x:collection1] o.a.s.c.ZkController We are http://127.0.0.1:39425/_/x/collection1/ and leader is http://127.0.0.1:39425/_/x/collection1/
   [junit4]   2> 1400506 INFO  (coreZkRegister-5388-thread-1-processing-n:127.0.0.1:39425__%2Fx x:collection1 s:shard1 c:control_collection r:core_node1) [n:127.0.0.1:39425__%2Fx c:control_collection s:shard1 r:core_node1 x:collection1] o.a.s.c.ZkController No LogReplay needed for core=collection1 baseURL=http://127.0.0.1:39425/_/x
   [junit4]   2> 1400506 INFO  (coreZkRegister-5388-thread-1-processing-n:127.0.0.1:39425__%2Fx x:collection1 s:shard1 c:control_collection r:core_node1) [n:127.0.0.1:39425__%2Fx c:control_collection s:shard1 r:core_node1 x:collection1] o.a.s.c.ZkController I am the leader, no recovery necessary
   [junit4]   2> 1400506 INFO  (coreZkRegister-5388-thread-1-processing-n:127.0.0.1:39425__%2Fx x:collection1 s:shard1 c:control_collection r:core_node1) [n:127.0.0.1:39425__%2Fx c:control_collection s:shard1 r:core_node1 x:collection1] o.a.s.c.ZkController publishing state=active
   [junit4]   2> 1400506 INFO  (coreZkRegister-5388-thread-1-processing-n:127.0.0.1:39425__%2Fx x:collection1 s:shard1 c:control_collection r:core_node1) [n:127.0.0.1:39425__%2Fx c:control_collection s:shard1 r:core_node1 x:collection1] o.a.s.c.ZkController numShards not found on descriptor - reading it from system property
   [junit4]   2> 1400509 INFO  (OverseerStateUpdate-95590748479291396-127.0.0.1:39425__%2Fx-n_0000000000) [n:127.0.0.1:39425__%2Fx    ] o.a.s.c.Overseer processMessage: queueSize: 1, message = {
   [junit4]   2>   "core":"collection1",
   [junit4]   2>   "core_node_name":"core_node1",
   [junit4]   2>   "roles":null,
   [junit4]   2>   "base_url":"http://127.0.0.1:39425/_/x",
   [junit4]   2>   "node_name":"127.0.0.1:39425__%2Fx",
   [junit4]   2>   "numShards":"1",
   [junit4]   2>   "state":"active",
   [junit4]   2>   "shard":"shard1",
   [junit4]   2>   "collection":"control_collection",
   [junit4]   2>   "operation":"state"} current state version: 2
   [junit4]   2> 1400510 INFO  (OverseerStateUpdate-95590748479291396-127.0.0.1:39425__%2Fx-n_0000000000) [n:127.0.0.1:39425__%2Fx    ] o.a.s.c.o.ReplicaMutator Update state numShards=1 message={
   [junit4]   2>   "core":"collection1",
   [junit4]   2>   "core_node_name":"core_node1",
   [junit4]   2>   "roles":null,
   [junit4]   2>   "base_url":"http://127.0.0.1:39425/_/x",
   [junit4]   2>   "node_name":"127.0.0.1:39425__%2Fx",
   [junit4]   2>   "numShards":"1",
   [junit4]   2>   "state":"active",
   [junit4]   2>   "shard":"shard1",
   [junit4]   2>   "collection":"control_collection",
   [junit4]   2>   "operation":"state"}
   [junit4]   2> 1400612 INFO  (zkCallback-1920-thread-1-processing-n:127.0.0.1:39425__%2Fx) [n:127.0.0.1:39425__%2Fx    ] o.a.s.c.c.ZkStateReader A cluster state change: [WatchedEvent state:SyncConnected type:NodeDataChanged path:/clusterstate.json], has occurred - updating... (live nodes size: [1])
   [junit4]   2> 1400671 INFO  (TEST-DistribDocExpirationUpdateProcessorTest.test-seed#[75D6750A576B1C11]) [    ] o.a.s.c.c.SolrZkClient Using default ZkCredentialsProvider
   [junit4]   2> 1400672 INFO  (TEST-DistribDocExpirationUpdateProcessorTest.test-seed#[75D6750A576B1C11]) [    ] o.a.s.c.c.ConnectionManager Waiting for client to connect to ZooKeeper
   [junit4]   2> 1400673 INFO  (zkCallback-1922-thread-1) [    ] o.a.s.c.c.ConnectionManager Watcher org.apache.solr.common.cloud.ConnectionManager@7bf54dcd name:ZooKeeperConnection Watcher:127.0.0.1:54438/solr got event WatchedEvent state:SyncConnected type:None path:null path:null type:None
   [junit4]   2> 1400673 INFO  (TEST-DistribDocExpirationUpdateProcessorTest.test-seed#[75D6750A576B1C11]) [    ] o.a.s.c.c.ConnectionManager Client is connected to ZooKeeper
   [junit4]   2> 1400673 INFO  (TEST-DistribDocExpirationUpdateProcessorTest.test-seed#[75D6750A576B1C11]) [    ] o.a.s.c.c.SolrZkClient Using default ZkACLProvider
   [junit4]   2> 1400673 INFO  (TEST-DistribDocExpirationUpdateProcessorTest.test-seed#[75D6750A576B1C11]) [    ] o.a.s.c.c.ZkStateReader Updating cluster state from ZooKeeper... 
   [junit4]   2> 1400674 INFO  (TEST-DistribDocExpirationUpdateProcessorTest.test-seed#[75D6750A576B1C11]) [    ] o.a.s.c.c.ZkStateReader Updated live nodes from ZooKeeper... (0) -> (1)
   [junit4]   2> 1400675 INFO  (TEST-DistribDocExpirationUpdateProcessorTest.test-seed#[75D6750A576B1C11]) [    ] o.a.s.c.ChaosMonkey monkey: init - expire sessions:false cause connection loss:false
   [junit4]   2> 1400675 INFO  (TEST-DistribDocExpirationUpdateProcessorTest.test-seed#[75D6750A576B1C11]) [    ] o.a.s.c.AbstractFullDistribZkTestBase Creating collection1 with stateFormat=2
   [junit4]   2> 1400675 INFO  (TEST-DistribDocExpirationUpdateProcessorTest.test-seed#[75D6750A576B1C11]) [    ] o.a.s.c.c.SolrZkClient Using default ZkCredentialsProvider
   [junit4]   2> 1400675 INFO  (TEST-DistribDocExpirationUpdateProcessorTest.test-seed#[75D6750A576B1C11]) [    ] o.a.s.c.c.ConnectionManager Waiting for client to connect to ZooKeeper
   [junit4]   2> 1400676 INFO  (zkCallback-1923-thread-1) [    ] o.a.s.c.c.ConnectionManager Watcher org.apache.solr.common.cloud.ConnectionManager@26adac6b name:ZooKeeperConnection Watcher:127.0.0.1:54438/solr got event WatchedEvent state:SyncConnected type:None path:null path:null type:None
   [junit4]   2> 1400676 INFO  (TEST-DistribDocExpirationUpdateProcessorTest.test-seed#[75D6750A576B1C11]) [    ] o.a.s.c.c.ConnectionManager Client is connected to ZooKeeper
   [junit4]   2> 1400676 INFO  (TEST-DistribDocExpirationUpdateProcessorTest.test-seed#[75D6750A576B1C11]) [    ] o.a.s.c.c.SolrZkClient Using default ZkACLProvider
   [junit4]   2> 1400679 INFO  (OverseerStateUpdate-95590748479291396-127.0.0.1:39425__%2Fx-n_0000000000) [n:127.0.0.1:39425__%2Fx    ] o.a.s.c.Overseer processMessage: queueSize: 1, message = {
   [junit4]   2>   "operation":"create",
   [junit4]   2>   "name":"collection1",
   [junit4]   2>   "numShards":"2",
   [junit4]   2>   "stateFormat":"2"} current state version: 3
   [junit4]   2> 1400679 INFO  (OverseerStateUpdate-95590748479291396-127.0.0.1:39425__%2Fx-n_0000000000) [n:127.0.0.1:39425__%2Fx    ] o.a.s.c.o.ClusterStateMutator building a new cName: collection1
   [junit4]   2> 1400763 INFO  (TEST-DistribDocExpirationUpdateProcessorTest.test-seed#[75D6750A576B1C11]) [    ] o.a.s.SolrTestCaseJ4 Writing core.properties file to /x1/jenkins/jenkins-slave/workspace/Lucene-Solr-Tests-6.x/solr/build/solr-core/test/J2/temp/solr.cloud.DistribDocExpirationUpdateProcessorTest_75D6750A576B1C11-001/shard-1-001/cores/collection1
   [junit4]   2> 1400764 INFO  (TEST-DistribDocExpirationUpdateProcessorTest.test-seed#[75D6750A576B1C11]) [    ] o.a.s.c.AbstractFullDistribZkTestBase create jetty 1 in directory /x1/jenkins/jenkins-slave/workspace/Lucene-Solr-Tests-6.x/solr/build/solr-core/test/J2/temp/solr.cloud.DistribDocExpirationUpdateProcessorTest_75D6750A576B1C11-001/shard-1-001
   [junit4]   2> 1400765 INFO  (TEST-DistribDocExpirationUpdateProcessorTest.test-seed#[75D6750A576B1C11]) [    ] o.e.j.s.Server jetty-9.3.8.v20160314
   [junit4]   2> 1400766 INFO  (TEST-DistribDocExpirationUpdateProcessorTest.test-seed#[75D6750A576B1C11]) [    ] o.e.j.s.h.ContextHandler Started o.e.j.s.ServletContextHandler@f443df5{/_/x,null,AVAILABLE}
   [junit4]   2> 1400767 INFO  (TEST-DistribDocExpirationUpdateProcessorTest.test-seed#[75D6750A576B1C11]) [    ] o.e.j.s.ServerConnector Started ServerConnector@5a1457a8{HTTP/1.1,[http/1.1]}{127.0.0.1:49689}
   [junit4]   2> 1400767 INFO  (TEST-DistribDocExpirationUpdateProcessorTest.test-seed#[75D6750A576B1C11]) [    ] o.e.j.s.Server Started @1403729ms
   [junit4]   2> 1400767 INFO  (TEST-DistribDocExpirationUpdateProcessorTest.test-seed#[75D6750A576B1C11]) [    ] o.a.s.c.s.e.JettySolrRunner Jetty properties: {solr.data.dir=/x1/jenkins/jenkins-slave/workspace/Lucene-Solr-Tests-6.x/solr/build/solr-core/test/J2/temp/solr.cloud.DistribDocExpirationUpdateProcessorTest_75D6750A576B1C11-001/tempDir-001/jetty1, solrconfig=solrconfig.xml, hostContext=/_/x, hostPort=49689, coreRootDirectory=/x1/jenkins/jenkins-slave/workspace/Lucene-Solr-Tests-6.x/solr/build/solr-core/test/J2/../../../../../../../../../../x1/jenkins/jenkins-slave/workspace/Lucene-Solr-Tests-6.x/solr/build/solr-core/test/J2/temp/solr.cloud.DistribDocExpirationUpdateProcessorTest_75D6750A576B1C11-001/shard-1-001/cores}
   [junit4]   2> 1400768 INFO  (TEST-DistribDocExpirationUpdateProcessorTest.test-seed#[75D6750A576B1C11]) [    ] o.a.s.s.SolrDispatchFilter SolrDispatchFilter.init(): sun.misc.Launcher$AppClassLoader@73d16e93
   [junit4]   2> 1400768 INFO  (TEST-DistribDocExpirationUpdateProcessorTest.test-seed#[75D6750A576B1C11]) [    ] o.a.s.c.SolrResourceLoader new SolrResourceLoader for directory: '/x1/jenkins/jenkins-slave/workspace/Lucene-Solr-Tests-6.x/solr/build/solr-core/test/J2/temp/solr.cloud.DistribDocExpirationUpdateProcessorTest_75D6750A576B1C11-001/shard-1-001'
   [junit4]   2> 1400768 INFO  (TEST-DistribDocExpirationUpdateProcessorTest.test-seed#[75D6750A576B1C11]) [    ] o.a.s.c.SolrResourceLoader JNDI not configured for solr (NoInitialContextEx)
   [junit4]   2> 1400768 INFO  (TEST-DistribDocExpirationUpdateProcessorTest.test-seed#[75D6750A576B1C11]) [    ] o.a.s.c.SolrResourceLoader solr home defaulted to 'solr/' (could not find system property or JNDI)
   [junit4]   2> 1400768 INFO  (TEST-DistribDocExpirationUpdateProcessorTest.test-seed#[75D6750A576B1C11]) [    ] o.a.s.c.c.SolrZkClient Using default ZkCredentialsProvider
   [junit4]   2> 1400769 INFO  (TEST-DistribDocExpirationUpdateProcessorTest.test-seed#[75D6750A576B1C11]) [    ] o.a.s.c.c.ConnectionManager Waiting for client to connect to ZooKeeper
   [junit4]   2> 1400770 INFO  (zkCallback-1924-thread-1) [    ] o.a.s.c.c.ConnectionManager Watcher org.apache.solr.common.cloud.ConnectionManager@306eada2 name:ZooKeeperConnection Watcher:127.0.0.1:54438/solr got event WatchedEvent state:SyncConnected type:None path:null path:null type:None
   [junit4]   2> 1400770 INFO  (TEST-DistribDocExpirationUpdateProcessorTest.test-seed#[75D6750A576B1C11]) [    ] o.a.s.c.c.ConnectionManager Client is connected to ZooKeeper
   [junit4]   2> 1400770 INFO  (TEST-DistribDocExpirationUpdateProcessorTest.test-seed#[75D6750A576B1C11]) [    ] o.a.s.c.c.SolrZkClient Using default ZkACLProvider
   [junit4]   2> 1400771 INFO  (TEST-DistribDocExpirationUpdateProcessorTest.test-seed#[75D6750A576B1C11]) [    ] o.a.s.s.SolrDispatchFilter Loading solr.xml from SolrHome (not found in ZooKeeper)
   [junit4]   2> 1400771 INFO  (TEST-DistribDocExpirationUpdateProcessorTest.test-seed#[75D6750A576B1C11]) [    ] o.a.s.c.SolrXmlConfig Loading container configuration from /x1/jenkins/jenkins-slave/workspace/Lucene-Solr-Tests-6.x/solr/build/solr-core/test/J2/temp/solr.cloud.DistribDocExpirationUpdateProcessorTest_75D6750A576B1C11-001/shard-1-001/solr.xml
   [junit4]   2> 1400776 INFO  (TEST-DistribDocExpirationUpdateProcessorTest.test-seed#[75D6750A576B1C11]) [    ] o.a.s.c.CorePropertiesLocator Config-defined core root directory: /x1/jenkins/jenkins-slave/workspace/Lucene-Solr-Tests-6.x/solr/build/solr-core/test/J2/../../../../../../../../../../x1/jenkins/jenkins-slave/workspace/Lucene-Solr-Tests-6.x/solr/build/solr-core/test/J2/temp/solr.cloud.DistribDocExpirationUpdateProcessorTest_75D6750A576B1C11-001/shard-1-001/cores
   [junit4]   2> 1400776 INFO  (TEST-DistribDocExpirationUpdateProcessorTest.test-seed#[75D6750A576B1C11]) [    ] o.a.s.c.CoreContainer New CoreContainer 1586063936
   [junit4]   2> 1400776 INFO  (TEST-DistribDocExpirationUpdateProcessorTest.test-seed#[75D6750A576B1C11]) [    ] o.a.s.c.CoreContainer Loading cores into CoreContainer [instanceDir=/x1/jenkins/jenkins-slave/workspace/Lucene-Solr-Tests-6.x/solr/build/solr-core/test/J2/temp/solr.cloud.DistribDocExpirationUpdateProcessorTest_75D6750A576B1C11-001/shard-1-001]
   [junit4]   2> 1400776 WARN  (TEST-DistribDocExpirationUpdateProcessorTest.test-seed#[75D6750A576B1C11]) [    ] o.a.s.c.CoreContainer Couldn't add files from /x1/jenkins/jenkins-slave/workspace/Lucene-Solr-Tests-6.x/solr/build/solr-core/test/J2/temp/solr.cloud.DistribDocExpirationUpdateProcessorTest_75D6750A576B1C11-001/shard-1-001/lib to classpath: /x1/jenkins/jenkins-slave/workspace/Lucene-Solr-Tests-6.x/solr/build/solr-core/test/J2/temp/solr.cloud.DistribDocExpirationUpdateProcessorTest_75D6750A576B1C11-001/shard-1-001/lib
   [junit4]   2> 1400776 INFO  (TEST-DistribDocExpirationUpdateProcessorTest.test-seed#[75D6750A576B1C11]) [    ] o.a.s.h.c.HttpShardHandlerFactory created with socketTimeout : 90000,urlScheme : ,connTimeout : 15000,maxConnectionsPerHost : 20,maxConnections : 10000,corePoolSize : 0,maximumPoolSize : 2147483647,maxThreadIdleTime : 5,sizeOfQueue : -1,fairnessPolicy : false,useRetries : false,
   [junit4]   2> 1400778 INFO  (TEST-DistribDocExpirationUpdateProcessorTest.test-seed#[75D6750A576B1C11]) [    ] o.a.s.u.UpdateShardHandler Creating UpdateShardHandler HTTP client with params: socketTimeout=340000&connTimeout=45000&retry=true
   [junit4]   2> 1400778 INFO  (TEST-DistribDocExpirationUpdateProcessorTest.test-seed#[75D6750A576B1C11]) [    ] o.a.s.l.LogWatcher SLF4J impl is org.slf4j.impl.Log4jLoggerFactory
   [junit4]   2> 1400778 INFO  (TEST-DistribDocExpirationUpdateProcessorTest.test-seed#[75D6750A576B1C11]) [    ] o.a.s.l.LogWatcher Registering Log Listener [Log4j (org.slf4j.impl.Log4jLoggerFactory)]
   [junit4]   2> 1400778 INFO  (TEST-DistribDocExpirationUpdateProcessorTest.test-seed#[75D6750A576B1C11]) [    ] o.a.s.c.ZkContainer Zookeeper client=127.0.0.1:54438/solr
   [junit4]   2> 1400778 INFO  (TEST-DistribDocExpirationUpdateProcessorTest.test-seed#[75D6750A576B1C11]) [    ] o.a.s.c.ZkController zkHost includes chroot
   [junit4]   2> 1400779 INFO  (TEST-DistribDocExpirationUpdateProcessorTest.test-seed#[75D6750A576B1C11]) [    ] o.a.s.c.c.SolrZkClient Using default ZkCredentialsProvider
   [junit4]   2> 1400779 INFO  (TEST-DistribDocExpirationUpdateProcessorTest.test-seed#[75D6750A576B1C11]) [    ] o.a.s.c.c.ConnectionManager Waiting for client to connect to ZooKeeper
   [junit4]   2> 1400780 INFO  (zkCallback-1927-thread-1) [    ] o.a.s.c.c.ConnectionManager Watcher org.apache.solr.common.cloud.ConnectionManager@40d41e5f name:ZooKeeperConnection Watcher:127.0.0.1:54438 got event WatchedEvent state:SyncConnected type:None path:null path:null type:None
   [junit4]   2> 1400780 INFO  (TEST-DistribDocExpirationUpdateProcessorTest.test-seed#[75D6750A576B1C11]) [    ] o.a.s.c.c.ConnectionManager Client is connected to ZooKeeper
   [junit4]   2> 1400780 INFO  (OverseerStateUpdate-95590748479291396-127.0.0.1:39425__%2Fx-n_0000000000) [n:127.0.0.1:39425__%2Fx    ] o.a.s.c.o.ZkStateWriter going to create_collection /collections/collection1/state.json
   [junit4]   2> 1400781 INFO  (TEST-DistribDocExpirationUpdateProcessorTest.test-seed#[75D6750A576B1C11]) [    ] o.a.s.c.c.SolrZkClient Using default ZkACLProvider
   [junit4]   2> 1400782 INFO  (TEST-DistribDocExpirationUpdateProcessorTest.test-seed#[75D6750A576B1C11]) [n:127.0.0.1:49689__%2Fx    ] o.a.s.c.c.ConnectionManager Waiting for client to connect to ZooKeeper
   [junit4]   2> 1400783 INFO  (zkCallback-1928-thread-1-processing-n:127.0.0.1:49689__%2Fx) [n:127.0.0.1:49689__%2Fx    ] o.a.s.c.c.ConnectionManager Watcher org.apache.solr.common.cloud.ConnectionManager@58247751 name:ZooKeeperConnection Watcher:127.0.0.1:54438/solr got event WatchedEvent state:SyncConnected type:None path:null path:null type:None
   [junit4]   2> 1400783 INFO  (TEST-DistribDocExpirationUpdateProcessorTest.test-seed#[75D6750A576B1C11]) [n:127.0.0.1:49689__%2Fx    ] o.a.s.c.c.ConnectionManager Client is connected to ZooKeeper
   [junit4]   2> 1400788 INFO  (TEST-DistribDocExpirationUpdateProcessorTest.test-seed#[75D6750A576B1C11]) [n:127.0.0.1:49689__%2Fx    ] o.a.s.c.c.ZkStateReader Updating cluster state from ZooKeeper... 
   [junit4]   2> 1400791 INFO  (TEST-DistribDocExpirationUpdateProcessorTest.test-seed#[75D6750A576B1C11]) [n:127.0.0.1:49689__%2Fx    ] o.a.s.c.c.ZkStateReader Updated live nodes from ZooKeeper... (0) -> (1)
   [junit4]   2> 1400793 INFO  (TEST-DistribDocExpirationUpdateProcessorTest.test-seed#[75D6750A576B1C11]) [n:127.0.0.1:49689__%2Fx    ] o.a.s.c.Overseer Overseer (id=null) closing
   [junit4]   2> 1400793 INFO  (TEST-DistribDocExpirationUpdateProcessorTest.test-seed#[75D6750A576B1C11]) [n:127.0.0.1:49689__%2Fx    ] o.a.s.c.LeaderElector Joined leadership election with path: /overseer_elect/election/95590748479291401-127.0.0.1:49689__%2Fx-n_0000000001
   [junit4]   2> 1400794 INFO  (TEST-DistribDocExpirationUpdateProcessorTest.test-seed#[75D6750A576B1C11]) [n:127.0.0.1:49689__%2Fx    ] o.a.s.c.LeaderElector Watching path /overseer_elect/election/95590748479291396-127.0.0.1:39425__%2Fx-n_0000000000 to know if I could be the leader
   [junit4]   2> 1400794 INFO  (TEST-DistribDocExpirationUpdateProcessorTest.test-seed#[75D6750A576B1C11]) [n:127.0.0.1:49689__%2Fx    ] o.a.s.c.ZkController Publish node=127.0.0.1:49689__%2Fx as DOWN
   [junit4]   2> 1400796 INFO  (OverseerStateUpdate-95590748479291396-127.0.0.1:39425__%2Fx-n_0000000000) [n:127.0.0.1:39425__%2Fx    ] o.a.s.c.Overseer processMessage: queueSize: 1, message = {
   [junit4]   2>   "operation":"downnode",
   [junit4]   2>   "node_name":"127.0.0.1:49689__%2Fx"} current state version: 3
   [junit4]   2> 1400796 INFO  (OverseerStateUpdate-95590748479291396-127.0.0.1:39425__%2Fx-n_0000000000) [n:127.0.0.1:39425__%2Fx    ] o.a.s.c.o.NodeMutator DownNode state invoked for node: 127.0.0.1:49689__%2Fx
   [junit4]   2> 1400797 INFO  (OverseerStateUpdate-95590748479291396-127.0.0.1:39425__%2Fx-n_0000000000) [n:127.0.0.1:39425__%2Fx    ] o.a.s.c.o.ZkStateWriter going to update_collection /collections/collection1/state.json version: 0
   [junit4]   2> 1400900 INFO  (zkCallback-1922-thread-1) [    ] o.a.s.c.c.ZkStateReader A cluster state change: [WatchedEvent state:SyncConnected type:NodeDataChanged path:/clusterstate.json], has occurred - updating... (live nodes size: [1])
   [junit4]   2> 1400900 INFO  (zkCallback-1920-thread-1-processing-n:127.0.0.1:39425__%2Fx) [n:127.0.0.1:39425__%2Fx    ] o.a.s.c.c.ZkStateReader A cluster state change: [WatchedEvent state:SyncConnected type:NodeDataChanged path:/clusterstate.json], has occurred - updating... (live nodes size: [1])
   [junit4]   2> 1400900 INFO  (zkCallback-1928-thread-1-processing-n:127.0.0.1:49689__%2Fx) [n:127.0.0.1:49689__%2Fx    ] o.a.s.c.c.ZkStateReader A cluster state change: [WatchedEvent state:SyncConnected type:NodeDataChanged path:/clusterstate.json], has occurred - updating... (live nodes size: [1])
   [junit4]   2> 1401796 INFO  (TEST-DistribDocExpirationUpdateProcessorTest.test-seed#[75D6750A576B1C11]) [n:127.0.0.1:49689__%2Fx    ] o.a.s.c.ZkController Register node as live in ZooKeeper:/live_nodes/127.0.0.1:49689__%2Fx
   [junit4]   2> 1401797 INFO  (TEST-DistribDocExpirationUpdateProcessorTest.test-seed#[75D6750A576B1C11]) [n:127.0.0.1:49689__%2Fx    ] o.a.s.c.c.SolrZkClient makePath: /live_nodes/127.0.0.1:49689__%2Fx
   [junit4]   2> 1401798 INFO  (zkCallback-1928-thread-1-processing-n:127.0.0.1:49689__%2Fx) [n:127.0.0.1:49689__%2Fx    ] o.a.s.c.c.ZkStateReader A live node change: [WatchedEvent state:SyncConnected type:NodeChildrenChanged path:/live_nodes], has occurred - updating... (live nodes size: [1])
   [junit4]   2> 1401798 INFO  (zkCallback-1922-thread-1) [    ] o.a.s.c.c.ZkStateReader A live node change: [WatchedEvent state:SyncConnected type:NodeChildrenChanged path:/live_nodes], has occurred - updating... (live nodes size: [1])
   [junit4]   2> 1401798 INFO  (zkCallback-1920-thread-1-processing-n:127.0.0.1:39425__%2Fx) [n:127.0.0.1:39425__%2Fx    ] o.a.s.c.c.ZkStateReader A live node change: [WatchedEvent state:SyncConnected type:NodeChildrenChanged path:/live_nodes], has occurred - updating... (live nodes size: [1])
   [junit4]   2> 1401799 INFO  (zkCallback-1928-thread-1-processing-n:127.0.0.1:49689__%2Fx) [n:127.0.0.1:49689__%2Fx    ] o.a.s.c.c.ZkStateReader Updated live nodes from ZooKeeper... (1) -> (2)
   [junit4]   2> 1401799 INFO  (zkCallback-1922-thread-1) [    ] o.a.s.c.c.ZkStateReader Updated live nodes from ZooKeeper... (1) -> (2)
   [junit4]   2> 1401799 INFO  (zkCallback-1920-thread-1-processing-n:127.0.0.1:39425__%2Fx) [n:127.0.0.1:39425__%2Fx    ] o.a.s.c.c.ZkStateReader Updated live nodes from ZooKeeper... (1) -> (2)
   [junit4]   2> 1401822 INFO  (TEST-DistribDocExpirationUpdateProcessorTest.test-seed#[75D6750A576B1C11]) [n:127.0.0.1:49689__%2Fx    ] o.a.s.c.CoreContainer Security conf doesn't exist. Skipping setup for authorization module.
   [junit4]   2> 1401822 INFO  (TEST-DistribDocExpirationUpdateProcessorTest.test-seed#[75D6750A576B1C11]) [n:127.0.0.1:49689__%2Fx    ] o.a.s.c.CoreContainer No authentication plugin used.
   [junit4]   2> 1401822 INFO  (TEST-DistribDocExpirationUpdateProcessorTest.test-seed#[75D6750A576B1C11]) [n:127.0.0.1:49689__%2Fx    ] o.a.s.c.CorePropertiesLocator Looking for core definitions underneath /x1/jenkins/jenkins-slave/workspace/Lucene-Solr-Tests-6.x/solr/build/solr-core/test/J2/../../../../../../../../../../x1/jenkins/jenkins-slave/workspace/Lucene-Solr-Tests-6.x/solr/build/solr-core/test/J2/temp/solr.cloud.DistribDocExpirationUpdateProcessorTest_75D6750A576B1C11-001/shard-1-001/cores
   [junit4]   2> 1401823 INFO  (TEST-DistribDocExpirationUpdateProcessorTest.test-seed#[75D6750A576B1C11]) [n:127.0.0.1:49689__%2Fx    ] o.a.s.c.CoreDescriptor Created CoreDescriptor: {name=collection1, config=solrconfig.xml, transient=false, schema=schema.xml, loadOnStartup=true, configSetProperties=configsetprops.json, collection=collection1, coreNodeName=, dataDir=data/, shard=}
   [junit4]   2> 1401823 INFO  (TEST-DistribDocExpirationUpdateProcessorTest.test-seed#[75D6750A576B1C11]) [n:127.0.0.1:49689__%2Fx    ] o.a.s.c.CorePropertiesLocator Found core collection1 in /x1/jenkins/jenkins-slave/workspace/Lucene-Solr-Tests-6.x/solr/build/solr-core/test/J2/../../../../../../../../../../x1/jenkins/jenkins-slave/workspace/Lucene-Solr-Tests-6.x/solr/build/solr-core/test/J2/temp/solr.cloud.DistribDocExpirationUpdateProcessorTest_75D6750A576B1C11-001/shard-1-001/cores/collection1
   [junit4]   2> 1401823 INFO  (TEST-DistribDocExpirationUpdateProcessorTest.test-seed#[75D6750A576B1C11]) [n:127.0.0.1:49689__%2Fx    ] o.a.s.c.CorePropertiesLocator Found 1 core definitions
   [junit4]   2> 1401824 INFO  (TEST-DistribDocExpirationUpdateProcessorTest.test-seed#[75D6750A576B1C11]) [n:127.0.0.1:49689__%2Fx    ] o.a.s.s.SolrDispatchFilter user.dir=/x1/jenkins/jenkins-slave/workspace/Lucene-Solr-Tests-6.x/solr/build/solr-core/test/J2
   [junit4]   2> 1401824 INFO  (TEST-DistribDocExpirationUpdateProcessorTest.test-seed#[75D6750A576B1C11]) [n:127.0.0.1:49689__%2Fx    ] o.a.s.s.SolrDispatchFilter SolrDispatchFilter.init() done
   [junit4]   2> 1401825 INFO  (coreLoadExecutor-5406-thread-1-processing-n:127.0.0.1:49689__%2Fx) [n:127.0.0.1:49689__%2Fx c:collection1   x:collection1] o.a.s.c.ZkController publishing state=down
   [junit4]   2> 1401825 INFO  (coreLoadExecutor-5406-thread-1-processing-n:127.0.0.1:49689__%2Fx) [n:127.0.0.1:49689__%2Fx c:collection1   x:collection1] o.a.s.c.ZkController numShards not found on descriptor - reading it from system property
   [junit4]   2> 1401826 INFO  (coreLoadExecutor-5406-thread-1-processing-n:127.0.0.1:49689__%2Fx) [n:127.0.0.1:49689__%2Fx c:collection1   x:collection1] o.a.s.c.ZkController Registering watch for collection collection1
   [junit4]   2> 1401826 INFO  (coreLoadExecutor-5406-thread-1-processing-n:127.0.0.1:49689__%2Fx) [n:127.0.0.1:49689__%2Fx c:collection1   x:collection1] o.a.s.c.c.ZkStateReader addZkWatch [collection1]
   [junit4]   2> 1401826 INFO  (OverseerStateUpdate-95590748479291396-127.0.0.1:39425__%2Fx-n_0000000000) [n:127.0.0.1:39425__%2Fx    ] o.a.s.c.Overseer processMessage: queueSize: 1, message = {
   [junit4]   2>   "core":"collection1",
   [junit4]   2>   "roles":null,
   [junit4]   2>   "base_url":"http://127.0.0.1:49689/_/x",
   [junit4]   2>   "node_name":"127.0.0.1:49689__%2Fx",
   [junit4]   2>   "numShards":"2",
   [junit4]   2>   "state":"down",
   [junit4]   2>   "shard":null,
   [junit4]   2>   "collection":"collection1",
   [junit4]   2>   "operation":"state"} current state version: 4
   [junit4]   2> 1401827 INFO  (coreLoadExecutor-5406-thread-1-processing-n:127.0.0.1:49689__%2Fx) [n:127.0.0.1:49689__%2Fx c:collection1   x:collection1] o.a.s.c.c.ZkStateReader Add data for [collection1] ver [1]
   [junit4]   2> 1401827 INFO  (OverseerStateUpdate-95590748479291396-127.0.0.1:39425__%2Fx-n_0000000000) [n:127.0.0.1:39425__%2Fx    ] o.a.s.c.o.ReplicaMutator Update state numShards=2 message={
   [junit4]   2>   "core":"collection1",
   [junit4]   2>   "roles":null,
   [junit4]   2>   "base_url":"http://127.0.0.1:49689/_/x",
   [junit4]   2>   "node_name":"127.0.0.1:49689__%2Fx",
   [junit4]   2>   "numShards":"2",
   [junit4]   2>   "state":"down",
   [junit4]   2>   "shard":null,
   [junit4]   2>   "collection":"collection1",
   [junit4]   2>   "operation":"state"}
   [junit4]   2> 1401827 INFO  (coreLoadExecutor-5406-thread-1-processing-n:127.0.0.1:49689__%2Fx) [n:127.0.0.1:49689__%2Fx c:collection1   x:collection1] o.a.s.c.ZkController look for our core node name
   [junit4]   2> 1401827 INFO  (OverseerStateUpdate-95590748479291396-127.0.0.1:39425__%2Fx-n_0000000000) [n:127.0.0.1:39425__%2Fx    ] o.a.s.c.o.ReplicaMutator Collection already exists with numShards=2
   [junit4]   2> 1401827 INFO  (OverseerStateUpdate-95590748479291396-127.0.0.1:39425__%2Fx-n_0000000000) [n:127.0.0.1:39425__%2Fx    ] o.a.s.c.o.ReplicaMutator Assigning new node to shard shard=shard2
   [junit4]   2> 1401929 INFO  (OverseerStateUpdate-95590748479291396-127.0.0.1:39425__%2Fx-n_0000000000) [n:127.0.0.1:39425__%2Fx    ] o.a.s.c.o.ZkStateWriter going to update_collection /collections/collection1/state.json version: 1
   [junit4]   2> 1401929 INFO  (zkCallback-1928-thread-1-processing-n:127.0.0.1:49689__%2Fx) [n:127.0.0.1:49689__%2Fx    ] o.a.s.c.c.ZkStateReader A cluster state change: [WatchedEvent state:SyncConnected type:NodeDataChanged path:/collections/collection1/state.json] for collection [collection1] has occurred - updating... (live nodes size: [2])
   [junit4]   2> 1401930 INFO  (zkCallback-1928-thread-1-processing-n:127.0.0.1:49689__%2Fx) [n:127.0.0.1:49689__%2Fx    ] o.a.s.c.c.ZkStateReader Updating data for [collection1] from [1] to [2]
   [junit4]   2> 1402827 INFO  (coreLoadExecutor-5406-thread-1-processing-n:127.0.0.1:49689__%2Fx) [n:127.0.0.1:49689__%2Fx c:collection1   x:collection1] o.a.s.c.ZkController waiting to find shard id in clusterstate for collection1
   [junit4]   2> 1402827 INFO  (coreLoadExecutor-5406-thread-1-processing-n:127.0.0.1:49689__%2Fx) [n:127.0.0.1:49689__%2Fx c:collection1   x:collection1] o.a.s.c.ZkController Check for collection zkNode:collection1
   [junit4]   2> 1402827 INFO  (coreLoadExecutor-5406-thread-1-processing-n:127.0.0.1:49689__%2Fx) [n:127.0.0.1:49689__%2Fx c:collection1   x:collection1] o.a.s.c.ZkController Collection zkNode exists
   [junit4]   2> 1402827 INFO  (coreLoadExecutor-5406-thread-1-processing-n:127.0.0.1:49689__%2Fx) [n:127.0.0.1:49689__%2Fx c:collection1   x:collection1] o.a.s.c.c.ZkStateReader Load collection config from: [/collections/collection1]
   [junit4]   2> 1402828 INFO  (coreLoadExecutor-5406-thread-1-processing-n:127.0.0.1:49689__%2Fx) [n:127.0.0.1:49689__%2Fx c:collection1   x:collection1] o.a.s.c.c.ZkStateReader path=[/collections/collection1] [configName]=[conf1] specified config exists in ZooKeeper
   [junit4]   2> 1402828 INFO  (coreLoadExecutor-5406-thread-1-processing-n:127.0.0.1:49689__%2Fx) [n:127.0.0.1:49689__%2Fx c:collection1   x:collection1] o.a.s.c.SolrResourceLoader new SolrResourceLoader for directory: '/x1/jenkins/jenkins-slave/workspace/Lucene-Solr-Tests-6.x/solr/build/solr-core/test/J2/temp/solr.cloud.DistribDocExpirationUpdateProcessorTest_75D6750A576B1C11-001/shard-1-001/cores/collection1'
   [junit4]   2> 1402828 INFO  (coreLoadExecutor-5406-thread-1-processing-n:127.0.0.1:49689__%2Fx) [n:127.0.0.1:49689__%2Fx c:collection1   x:collection1] o.a.s.c.SolrResourceLoader JNDI not configured for solr (NoInitialContextEx)
   [junit4]   2> 1402828 INFO  (coreLoadExecutor-5406-thread-1-processing-n:127.0.0.1:49689__%2Fx) [n:127.0.0.1:49689__%2Fx c:collection1   x:collection1] o.a.s.c.SolrResourceLoader solr home defaulted to 'solr/' (could not find system property or JNDI)
   [junit4]   2> 1402830 INFO  (coreLoadExecutor-5406-thread-1-processing-n:127.0.0.1:49689__%2Fx) [n:127.0.0.1:49689__%2Fx c:collection1   x:collection1] o.a.s.c.Config loaded config solrconfig.xml with version 0 
   [junit4]   2> 1402834 INFO  (coreLoadExecutor-5406-thread-1-processing-n:127.0.0.1:49689__%2Fx) [n:127.0.0.1:49689__%2Fx c:collection1   x:collection1] o.a.s.c.SolrConfig current version of requestparams : -1
   [junit4]   2> 1402837 INFO  (coreLoadExecutor-5406-thread-1-processing-n:127.0.0.1:49689__%2Fx) [n:127.0.0.1:49689__%2Fx c:collection1   x:collection1] o.a.s.c.SolrConfig Using Lucene MatchVersion: 6.1.0
   [junit4]   2> 1402844 INFO  (coreLoadExecutor-5406-thread-1-processing-n:127.0.0.1:49689__%2Fx) [n:127.0.0.1:49689__%2Fx c:collection1   x:collection1] o.a.s.c.SolrConfig Loaded SolrConfig: solrconfig.xml
   [junit4]   2> 1402848 INFO  (coreLoadExecutor-5406-thread-1-processing-n:127.0.0.1:49689__%2Fx) [n:127.0.0.1:49689__%2Fx c:collection1   x:collection1] o.a.s.s.IndexSchema [collection1] Schema name=test
   [junit4]   2> 1402933 INFO  (coreLoadExecutor-5406-thread-1-processing-n:127.0.0.1:49689__%2Fx) [n:127.0.0.1:49689__%2Fx c:collection1   x:collection1] o.a.s.s.IndexSchema default search field in schema is text
   [junit4]   2> 1402934 I

[...truncated too long message...]

ne-Solr-Tests-6.x/solr/build/solr-core/test/J2/../../../../../../../../../../x1/jenkins/jenkins-slave/workspace/Lucene-Solr-Tests-6.x/solr/build/solr-core/test/J2/temp/solr.cloud.DistribDocExpirationUpdateProcessorTest_75D6750A576B1C11-001/shard-4-001/cores/collection1/data/index;done=false>>]
   [junit4]   2> 1459611 INFO  (coreCloseExecutor-5463-thread-1) [n:127.0.0.1:35836__%2Fx c:collection1 s:shard1 r:core_node4 x:collection1] o.a.s.c.CachingDirectoryFactory Closing directory: /x1/jenkins/jenkins-slave/workspace/Lucene-Solr-Tests-6.x/solr/build/solr-core/test/J2/../../../../../../../../../../x1/jenkins/jenkins-slave/workspace/Lucene-Solr-Tests-6.x/solr/build/solr-core/test/J2/temp/solr.cloud.DistribDocExpirationUpdateProcessorTest_75D6750A576B1C11-001/shard-4-001/cores/collection1/data/index
   [junit4]   2> 1459612 INFO  (TEST-DistribDocExpirationUpdateProcessorTest.test-seed#[75D6750A576B1C11]) [    ] o.a.s.c.Overseer Overseer (id=95590748479291410-127.0.0.1:35836__%2Fx-n_0000000004) closing
   [junit4]   2> 1459612 INFO  (OverseerStateUpdate-95590748479291410-127.0.0.1:35836__%2Fx-n_0000000004) [n:127.0.0.1:35836__%2Fx    ] o.a.s.c.Overseer Overseer Loop exiting : 127.0.0.1:35836__%2Fx
   [junit4]   2> 1459613 INFO  (zkCallback-1944-thread-1-processing-n:127.0.0.1:35836__%2Fx) [n:127.0.0.1:35836__%2Fx    ] o.a.s.c.c.ZkStateReader A live node change: [WatchedEvent state:SyncConnected type:NodeChildrenChanged path:/live_nodes], has occurred - updating... (live nodes size: [1])
   [junit4]   2> 1459613 WARN  (zkCallback-1944-thread-1-processing-n:127.0.0.1:35836__%2Fx) [n:127.0.0.1:35836__%2Fx    ] o.a.s.c.c.ZkStateReader ZooKeeper watch triggered, but Solr cannot talk to ZK: [KeeperErrorCode = Session expired for /live_nodes]
   [junit4]   2> 1459614 INFO  (TEST-DistribDocExpirationUpdateProcessorTest.test-seed#[75D6750A576B1C11]) [    ] o.e.j.s.ServerConnector Stopped ServerConnector@27609db6{HTTP/1.1,[http/1.1]}{127.0.0.1:0}
   [junit4]   2> 1459614 INFO  (TEST-DistribDocExpirationUpdateProcessorTest.test-seed#[75D6750A576B1C11]) [    ] o.e.j.s.h.ContextHandler Stopped o.e.j.s.ServletContextHandler@598e6f7a{/_/x,null,UNAVAILABLE}
   [junit4]   2> 1459618 INFO  (TEST-DistribDocExpirationUpdateProcessorTest.test-seed#[75D6750A576B1C11]) [    ] o.a.s.c.ZkTestServer connecting to 127.0.0.1:54438 54438
   [junit4]   2> 1459828 INFO  (Thread-4158) [    ] o.a.s.c.ZkTestServer connecting to 127.0.0.1:54438 54438
   [junit4]   2> 1459829 WARN  (Thread-4158) [    ] o.a.s.c.ZkTestServer Watch limit violations: 
   [junit4]   2> Maximum concurrent create/delete watches above limit:
   [junit4]   2> 
   [junit4]   2> 	6	/solr/aliases.json
   [junit4]   2> 	5	/solr/security.json
   [junit4]   2> 	5	/solr/configs/conf1
   [junit4]   2> 
   [junit4]   2> Maximum concurrent data watches above limit:
   [junit4]   2> 
   [junit4]   2> 	6	/solr/clusterstate.json
   [junit4]   2> 	4	/solr/collections/collection1/state.json
   [junit4]   2> 
   [junit4]   2> Maximum concurrent children watches above limit:
   [junit4]   2> 
   [junit4]   2> 	6	/solr/live_nodes
   [junit4]   2> 	6	/solr/collections
   [junit4]   2> 	4	/solr/overseer/queue
   [junit4]   2> 	4	/solr/overseer/collection-queue-work
   [junit4]   2> 	2	/solr/overseer/queue-work
   [junit4]   2> 
   [junit4]   2> NOTE: reproduce with: ant test  -Dtestcase=DistribDocExpirationUpdateProcessorTest -Dtests.method=test -Dtests.seed=75D6750A576B1C11 -Dtests.multiplier=2 -Dtests.slow=true -Dtests.locale=ar-DZ -Dtests.timezone=Europe/Monaco -Dtests.asserts=true -Dtests.file.encoding=US-ASCII
   [junit4] FAILURE 60.9s J2 | DistribDocExpirationUpdateProcessorTest.test <<<
   [junit4]    > Throwable #1: java.lang.AssertionError: Exactly one shard should have changed, instead: [shard2, shard1] nodes=([core_node3(shard2), core_node2(shard1), core_node4(shard1)]) expected:<1> but was:<2>
   [junit4]    > 	at __randomizedtesting.SeedInfo.seed([75D6750A576B1C11:FD824AD0F99771E9]:0)
   [junit4]    > 	at org.apache.solr.cloud.DistribDocExpirationUpdateProcessorTest.test(DistribDocExpirationUpdateProcessorTest.java:118)
   [junit4]    > 	at org.apache.solr.BaseDistributedSearchTestCase$ShardsRepeatRule$ShardsFixedStatement.callStatement(BaseDistributedSearchTestCase.java:996)
   [junit4]    > 	at org.apache.solr.BaseDistributedSearchTestCase$ShardsRepeatRule$ShardsStatement.evaluate(BaseDistributedSearchTestCase.java:971)
   [junit4]    > 	at java.lang.Thread.run(Thread.java:745)
   [junit4]   2> 1459833 INFO  (SUITE-DistribDocExpirationUpdateProcessorTest-seed#[75D6750A576B1C11]-worker) [    ] o.a.s.SolrTestCaseJ4 ###deleteCore
   [junit4]   2> NOTE: leaving temporary files on disk at: /x1/jenkins/jenkins-slave/workspace/Lucene-Solr-Tests-6.x/solr/build/solr-core/test/J2/temp/solr.cloud.DistribDocExpirationUpdateProcessorTest_75D6750A576B1C11-001
   [junit4]   2> Mar 21, 2016 10:25:28 PM com.carrotsearch.randomizedtesting.ThreadLeakControl checkThreadLeaks
   [junit4]   2> WARNING: Will linger awaiting termination of 1 leaked thread(s).
   [junit4]   2> NOTE: test params are: codec=Asserting(Lucene60): {_version_=PostingsFormat(name=SimpleText), eXpField_tdt=PostingsFormat(name=SimpleText), tTl_s=PostingsFormat(name=SimpleText), id=PostingsFormat(name=MockRandom)}, docValues:{}, maxPointsInLeafNode=989, maxMBSortInHeap=6.742010169507374, sim=RandomSimilarity(queryNorm=true,coord=crazy): {}, locale=ar-DZ, timezone=Europe/Monaco
   [junit4]   2> NOTE: Linux 3.13.0-52-generic amd64/Oracle Corporation 1.8.0_74 (64-bit)/cpus=4,threads=1,free=236637792,total=517472256
   [junit4]   2> NOTE: All tests run in this JVM: [TestReload, BlockJoinFacetSimpleTest, DirectUpdateHandlerTest, TestSuggestSpellingConverter, SSLMigrationTest, BasicAuthIntegrationTest, LukeRequestHandlerTest, OverseerCollectionConfigSetProcessorTest, TestConfigSetsAPIZkFailure, ShowFileRequestHandlerTest, TestRebalanceLeaders, CursorMarkTest, NoCacheHeaderTest, TestExtendedDismaxParser, LeaderElectionTest, HighlighterConfigTest, SimpleMLTQParserTest, TestRecovery, SuggesterTest, TestGeoJSONResponseWriter, TestSchemaNameResource, TestJmxMonitoredMap, TestSolrConfigHandlerCloud, TestConfigOverlay, TestXIncludeConfig, TestPostingsSolrHighlighter, TestBlendedInfixSuggestions, RulesTest, SparseHLLTest, DistribJoinFromCollectionTest, ExitableDirectoryReaderTest, TestExactSharedStatsCache, AtomicUpdatesTest, DirectUpdateHandlerOptimizeTest, TestSolrJ, ReplicationFactorTest, CollectionStateFormat2Test, CollectionsAPISolrJTest, DirectSolrConnectionTest, ZkStateWriterTest, HighlighterMaxOffsetTest, TestNonDefinedSimilarityFactory, TestSearchPerf, TestUseDocValuesAsStored2, HdfsTlogReplayBufferedWhileIndexingTest, TestHdfsUpdateLog, BadIndexSchemaTest, SecurityConfHandlerTest, TestConfigSets, TestStressReorder, DistributedExpandComponentTest, HdfsRestartWhileUpdatingTest, TestWriterPerf, PluginInfoTest, TestManagedResourceStorage, HdfsChaosMonkeyNothingIsSafeTest, TestJettySolrRunner, DateMathParserTest, TestIndexSearcher, TestReloadAndDeleteDocs, StatsComponentTest, SearchHandlerTest, TestMacros, TestSimpleQParserPlugin, CoreAdminRequestStatusTest, SuggestComponentTest, TestSweetSpotSimilarityFactory, TestFuzzyAnalyzedSuggestions, TestGroupingSearch, TestElisionMultitermQuery, LeaderInitiatedRecoveryOnCommitTest, TestLeaderInitiatedRecoveryThread, DeleteStatusTest, ClusterStateTest, FullSolrCloudDistribCmdsTest, TestZkChroot, TestSolrIndexConfig, DistributedFacetPivotSmallAdvancedTest, PrimitiveFieldTypeTest, DataDrivenBlockJoinTest, TestPKIAuthenticationPlugin, BasicDistributedZk2Test, TestCollationField, TestCloudDeleteByQuery, DistributedQueryComponentCustomSortTest, SolrTestCaseJ4Test, TestSolrQueryResponse, TermVectorComponentDistributedTest, TestCoreDiscovery, TestIndexingPerformance, TestDistributedMissingSort, TestSolrCLIRunExample, SpatialRPTFieldTypeTest, UnloadDistributedZkTest, OverseerTest, BasicZkTest, RecoveryZkTest, TestDistributedSearch, SolrCoreTest, TestFiltering, AnalysisAfterCoreReloadTest, SuggesterFSTTest, SolrRequestParserTest, TestStressLucene, TestPseudoReturnFields, TestWordDelimiterFilterFactory, StatelessScriptUpdateProcessorFactoryTest, TestReversedWildcardFilterFactory, XmlUpdateRequestHandlerTest, PathHierarchyTokenizerFactoryTest, RegexBoostProcessorTest, IndexSchemaTest, ReturnFieldsTest, TestCSVResponseWriter, UniqFieldsUpdateProcessorFactoryTest, TestPartialUpdateDeduplication, CSVRequestHandlerTest, TestLFUCache, TestTolerantSearch, AssignTest, CdcrRequestHandlerTest, CloudExitableDirectoryReaderTest, CollectionReloadTest, DistribDocExpirationUpdateProcessorTest]
   [junit4] Completed [440/582 (1!)] on J2 in 61.72s, 1 test, 1 failure <<< FAILURES!

[...truncated 468 lines...]
BUILD FAILED
/x1/jenkins/jenkins-slave/workspace/Lucene-Solr-Tests-6.x/build.xml:740: The following error occurred while executing this line:
/x1/jenkins/jenkins-slave/workspace/Lucene-Solr-Tests-6.x/build.xml:684: The following error occurred while executing this line:
/x1/jenkins/jenkins-slave/workspace/Lucene-Solr-Tests-6.x/build.xml:59: The following error occurred while executing this line:
/x1/jenkins/jenkins-slave/workspace/Lucene-Solr-Tests-6.x/solr/build.xml:233: The following error occurred while executing this line:
/x1/jenkins/jenkins-slave/workspace/Lucene-Solr-Tests-6.x/solr/common-build.xml:529: The following error occurred while executing this line:
/x1/jenkins/jenkins-slave/workspace/Lucene-Solr-Tests-6.x/lucene/common-build.xml:1457: The following error occurred while executing this line:
/x1/jenkins/jenkins-slave/workspace/Lucene-Solr-Tests-6.x/lucene/common-build.xml:1014: There were test failures: 582 suites (10 ignored), 2331 tests, 1 failure, 86 ignored (70 assumptions) [seed: 75D6750A576B1C11]

Total time: 59 minutes 31 seconds
Build step 'Invoke Ant' marked build as failure
Archiving artifacts
Recording test results
Email was triggered for: Failure - Any
Sending email for trigger: Failure - Any



Mime
View raw message