lucene-dev mailing list archives

Site index · List index
Message view « Date » · « Thread »
Top « Date » · « Thread »
From Policeman Jenkins Server <jenk...@thetaphi.de>
Subject [JENKINS] Lucene-Solr-6.x-Solaris (64bit/jdk1.8.0) - Build # 11 - Failure!
Date Thu, 17 Mar 2016 02:36:12 GMT
Build: http://jenkins.thetaphi.de/job/Lucene-Solr-6.x-Solaris/11/
Java: 64bit/jdk1.8.0 -XX:-UseCompressedOops -XX:+UseParallelGC

1 tests failed.
FAILED:  org.apache.solr.handler.TestReqParamsAPI.test

Error Message:
Could not get expected value  'first' for path 'response/params/x/_appends_/add' full output: {   "responseHeader":{     "status":0,     "QTime":0},   "response":{     "znodeVersion":3,     "params":{       "x":{         "a":"A val",         "b":"B val",         "":{"v":0}},       "y":{         "p":"P val",         "q":"Q val",         "":{"v":2}}}}}

Stack Trace:
java.lang.AssertionError: Could not get expected value  'first' for path 'response/params/x/_appends_/add' full output: {
  "responseHeader":{
    "status":0,
    "QTime":0},
  "response":{
    "znodeVersion":3,
    "params":{
      "x":{
        "a":"A val",
        "b":"B val",
        "":{"v":0}},
      "y":{
        "p":"P val",
        "q":"Q val",
        "":{"v":2}}}}}
	at __randomizedtesting.SeedInfo.seed([58D147216C216495:D08578FBC2DD096D]:0)
	at org.junit.Assert.fail(Assert.java:93)
	at org.junit.Assert.assertTrue(Assert.java:43)
	at org.apache.solr.core.TestSolrConfigHandler.testForResponseElement(TestSolrConfigHandler.java:458)
	at org.apache.solr.handler.TestReqParamsAPI.testReqParams(TestReqParamsAPI.java:236)
	at org.apache.solr.handler.TestReqParamsAPI.test(TestReqParamsAPI.java:67)
	at sun.reflect.NativeMethodAccessorImpl.invoke0(Native Method)
	at sun.reflect.NativeMethodAccessorImpl.invoke(NativeMethodAccessorImpl.java:62)
	at sun.reflect.DelegatingMethodAccessorImpl.invoke(DelegatingMethodAccessorImpl.java:43)
	at java.lang.reflect.Method.invoke(Method.java:498)
	at com.carrotsearch.randomizedtesting.RandomizedRunner.invoke(RandomizedRunner.java:1764)
	at com.carrotsearch.randomizedtesting.RandomizedRunner$8.evaluate(RandomizedRunner.java:871)
	at com.carrotsearch.randomizedtesting.RandomizedRunner$9.evaluate(RandomizedRunner.java:907)
	at com.carrotsearch.randomizedtesting.RandomizedRunner$10.evaluate(RandomizedRunner.java:921)
	at org.apache.solr.BaseDistributedSearchTestCase$ShardsRepeatRule$ShardsFixedStatement.callStatement(BaseDistributedSearchTestCase.java:996)
	at org.apache.solr.BaseDistributedSearchTestCase$ShardsRepeatRule$ShardsStatement.evaluate(BaseDistributedSearchTestCase.java:971)
	at com.carrotsearch.randomizedtesting.rules.SystemPropertiesRestoreRule$1.evaluate(SystemPropertiesRestoreRule.java:57)
	at org.apache.lucene.util.TestRuleSetupTeardownChained$1.evaluate(TestRuleSetupTeardownChained.java:49)
	at org.apache.lucene.util.AbstractBeforeAfterRule$1.evaluate(AbstractBeforeAfterRule.java:45)
	at org.apache.lucene.util.TestRuleThreadAndTestName$1.evaluate(TestRuleThreadAndTestName.java:48)
	at org.apache.lucene.util.TestRuleIgnoreAfterMaxFailures$1.evaluate(TestRuleIgnoreAfterMaxFailures.java:64)
	at org.apache.lucene.util.TestRuleMarkFailure$1.evaluate(TestRuleMarkFailure.java:47)
	at com.carrotsearch.randomizedtesting.rules.StatementAdapter.evaluate(StatementAdapter.java:36)
	at com.carrotsearch.randomizedtesting.ThreadLeakControl$StatementRunner.run(ThreadLeakControl.java:367)
	at com.carrotsearch.randomizedtesting.ThreadLeakControl.forkTimeoutingTask(ThreadLeakControl.java:809)
	at com.carrotsearch.randomizedtesting.ThreadLeakControl$3.evaluate(ThreadLeakControl.java:460)
	at com.carrotsearch.randomizedtesting.RandomizedRunner.runSingleTest(RandomizedRunner.java:880)
	at com.carrotsearch.randomizedtesting.RandomizedRunner$5.evaluate(RandomizedRunner.java:781)
	at com.carrotsearch.randomizedtesting.RandomizedRunner$6.evaluate(RandomizedRunner.java:816)
	at com.carrotsearch.randomizedtesting.RandomizedRunner$7.evaluate(RandomizedRunner.java:827)
	at com.carrotsearch.randomizedtesting.rules.StatementAdapter.evaluate(StatementAdapter.java:36)
	at com.carrotsearch.randomizedtesting.rules.SystemPropertiesRestoreRule$1.evaluate(SystemPropertiesRestoreRule.java:57)
	at org.apache.lucene.util.AbstractBeforeAfterRule$1.evaluate(AbstractBeforeAfterRule.java:45)
	at com.carrotsearch.randomizedtesting.rules.StatementAdapter.evaluate(StatementAdapter.java:36)
	at org.apache.lucene.util.TestRuleStoreClassName$1.evaluate(TestRuleStoreClassName.java:41)
	at com.carrotsearch.randomizedtesting.rules.NoShadowingOrOverridesOnMethodsRule$1.evaluate(NoShadowingOrOverridesOnMethodsRule.java:40)
	at com.carrotsearch.randomizedtesting.rules.NoShadowingOrOverridesOnMethodsRule$1.evaluate(NoShadowingOrOverridesOnMethodsRule.java:40)
	at com.carrotsearch.randomizedtesting.rules.StatementAdapter.evaluate(StatementAdapter.java:36)
	at com.carrotsearch.randomizedtesting.rules.StatementAdapter.evaluate(StatementAdapter.java:36)
	at com.carrotsearch.randomizedtesting.rules.StatementAdapter.evaluate(StatementAdapter.java:36)
	at org.apache.lucene.util.TestRuleAssertionsRequired$1.evaluate(TestRuleAssertionsRequired.java:53)
	at org.apache.lucene.util.TestRuleMarkFailure$1.evaluate(TestRuleMarkFailure.java:47)
	at org.apache.lucene.util.TestRuleIgnoreAfterMaxFailures$1.evaluate(TestRuleIgnoreAfterMaxFailures.java:64)
	at org.apache.lucene.util.TestRuleIgnoreTestSuites$1.evaluate(TestRuleIgnoreTestSuites.java:54)
	at com.carrotsearch.randomizedtesting.rules.StatementAdapter.evaluate(StatementAdapter.java:36)
	at com.carrotsearch.randomizedtesting.ThreadLeakControl$StatementRunner.run(ThreadLeakControl.java:367)
	at java.lang.Thread.run(Thread.java:745)




Build Log:
[...truncated 10742 lines...]
   [junit4] Suite: org.apache.solr.handler.TestReqParamsAPI
   [junit4]   2> Creating dataDir: /export/home/jenkins/workspace/Lucene-Solr-6.x-Solaris/solr/build/solr-core/test/J1/temp/solr.handler.TestReqParamsAPI_58D147216C216495-001/init-core-data-001
   [junit4]   2> 595795 INFO  (SUITE-TestReqParamsAPI-seed#[58D147216C216495]-worker) [    ] o.a.s.SolrTestCaseJ4 Randomized ssl (false) and clientAuth (false)
   [junit4]   2> 595795 INFO  (SUITE-TestReqParamsAPI-seed#[58D147216C216495]-worker) [    ] o.a.s.BaseDistributedSearchTestCase Setting hostContext system property: /
   [junit4]   2> 595799 INFO  (TEST-TestReqParamsAPI.test-seed#[58D147216C216495]) [    ] o.a.s.c.ZkTestServer STARTING ZK TEST SERVER
   [junit4]   2> 595800 INFO  (Thread-1049) [    ] o.a.s.c.ZkTestServer client port:0.0.0.0/0.0.0.0:0
   [junit4]   2> 595800 INFO  (Thread-1049) [    ] o.a.s.c.ZkTestServer Starting server
   [junit4]   2> 595900 INFO  (TEST-TestReqParamsAPI.test-seed#[58D147216C216495]) [    ] o.a.s.c.ZkTestServer start zk server on port:41609
   [junit4]   2> 595900 INFO  (TEST-TestReqParamsAPI.test-seed#[58D147216C216495]) [    ] o.a.s.c.c.SolrZkClient Using default ZkCredentialsProvider
   [junit4]   2> 595901 INFO  (TEST-TestReqParamsAPI.test-seed#[58D147216C216495]) [    ] o.a.s.c.c.ConnectionManager Waiting for client to connect to ZooKeeper
   [junit4]   2> 595911 INFO  (zkCallback-443-thread-1) [    ] o.a.s.c.c.ConnectionManager Watcher org.apache.solr.common.cloud.ConnectionManager@6022387c name:ZooKeeperConnection Watcher:127.0.0.1:41609 got event WatchedEvent state:SyncConnected type:None path:null path:null type:None
   [junit4]   2> 595911 INFO  (TEST-TestReqParamsAPI.test-seed#[58D147216C216495]) [    ] o.a.s.c.c.ConnectionManager Client is connected to ZooKeeper
   [junit4]   2> 595912 INFO  (TEST-TestReqParamsAPI.test-seed#[58D147216C216495]) [    ] o.a.s.c.c.SolrZkClient Using default ZkACLProvider
   [junit4]   2> 595912 INFO  (TEST-TestReqParamsAPI.test-seed#[58D147216C216495]) [    ] o.a.s.c.c.SolrZkClient makePath: /solr
   [junit4]   2> 595927 INFO  (TEST-TestReqParamsAPI.test-seed#[58D147216C216495]) [    ] o.a.s.c.c.SolrZkClient Using default ZkCredentialsProvider
   [junit4]   2> 595928 INFO  (TEST-TestReqParamsAPI.test-seed#[58D147216C216495]) [    ] o.a.s.c.c.ConnectionManager Waiting for client to connect to ZooKeeper
   [junit4]   2> 595931 INFO  (zkCallback-444-thread-1) [    ] o.a.s.c.c.ConnectionManager Watcher org.apache.solr.common.cloud.ConnectionManager@620bd21b name:ZooKeeperConnection Watcher:127.0.0.1:41609/solr got event WatchedEvent state:SyncConnected type:None path:null path:null type:None
   [junit4]   2> 595931 INFO  (TEST-TestReqParamsAPI.test-seed#[58D147216C216495]) [    ] o.a.s.c.c.ConnectionManager Client is connected to ZooKeeper
   [junit4]   2> 595931 INFO  (TEST-TestReqParamsAPI.test-seed#[58D147216C216495]) [    ] o.a.s.c.c.SolrZkClient Using default ZkACLProvider
   [junit4]   2> 595931 INFO  (TEST-TestReqParamsAPI.test-seed#[58D147216C216495]) [    ] o.a.s.c.c.SolrZkClient makePath: /collections/collection1
   [junit4]   2> 595940 INFO  (TEST-TestReqParamsAPI.test-seed#[58D147216C216495]) [    ] o.a.s.c.c.SolrZkClient makePath: /collections/collection1/shards
   [junit4]   2> 595947 INFO  (TEST-TestReqParamsAPI.test-seed#[58D147216C216495]) [    ] o.a.s.c.c.SolrZkClient makePath: /collections/control_collection
   [junit4]   2> 595950 INFO  (TEST-TestReqParamsAPI.test-seed#[58D147216C216495]) [    ] o.a.s.c.c.SolrZkClient makePath: /collections/control_collection/shards
   [junit4]   2> 595953 INFO  (TEST-TestReqParamsAPI.test-seed#[58D147216C216495]) [    ] o.a.s.c.AbstractZkTestCase put /export/home/jenkins/workspace/Lucene-Solr-6.x-Solaris/solr/core/src/test-files/solr/collection1/conf/solrconfig-tlog.xml to /configs/conf1/solrconfig.xml
   [junit4]   2> 595953 INFO  (TEST-TestReqParamsAPI.test-seed#[58D147216C216495]) [    ] o.a.s.c.c.SolrZkClient makePath: /configs/conf1/solrconfig.xml
   [junit4]   2> 595968 INFO  (TEST-TestReqParamsAPI.test-seed#[58D147216C216495]) [    ] o.a.s.c.AbstractZkTestCase put /export/home/jenkins/workspace/Lucene-Solr-6.x-Solaris/solr/core/src/test-files/solr/collection1/conf/schema.xml to /configs/conf1/schema.xml
   [junit4]   2> 595968 INFO  (TEST-TestReqParamsAPI.test-seed#[58D147216C216495]) [    ] o.a.s.c.c.SolrZkClient makePath: /configs/conf1/schema.xml
   [junit4]   2> 595974 INFO  (TEST-TestReqParamsAPI.test-seed#[58D147216C216495]) [    ] o.a.s.c.AbstractZkTestCase put /export/home/jenkins/workspace/Lucene-Solr-6.x-Solaris/solr/core/src/test-files/solr/collection1/conf/solrconfig.snippet.randomindexconfig.xml to /configs/conf1/solrconfig.snippet.randomindexconfig.xml
   [junit4]   2> 595974 INFO  (TEST-TestReqParamsAPI.test-seed#[58D147216C216495]) [    ] o.a.s.c.c.SolrZkClient makePath: /configs/conf1/solrconfig.snippet.randomindexconfig.xml
   [junit4]   2> 595980 INFO  (TEST-TestReqParamsAPI.test-seed#[58D147216C216495]) [    ] o.a.s.c.AbstractZkTestCase put /export/home/jenkins/workspace/Lucene-Solr-6.x-Solaris/solr/core/src/test-files/solr/collection1/conf/stopwords.txt to /configs/conf1/stopwords.txt
   [junit4]   2> 595980 INFO  (TEST-TestReqParamsAPI.test-seed#[58D147216C216495]) [    ] o.a.s.c.c.SolrZkClient makePath: /configs/conf1/stopwords.txt
   [junit4]   2> 595984 INFO  (TEST-TestReqParamsAPI.test-seed#[58D147216C216495]) [    ] o.a.s.c.AbstractZkTestCase put /export/home/jenkins/workspace/Lucene-Solr-6.x-Solaris/solr/core/src/test-files/solr/collection1/conf/protwords.txt to /configs/conf1/protwords.txt
   [junit4]   2> 595985 INFO  (TEST-TestReqParamsAPI.test-seed#[58D147216C216495]) [    ] o.a.s.c.c.SolrZkClient makePath: /configs/conf1/protwords.txt
   [junit4]   2> 595989 INFO  (TEST-TestReqParamsAPI.test-seed#[58D147216C216495]) [    ] o.a.s.c.AbstractZkTestCase put /export/home/jenkins/workspace/Lucene-Solr-6.x-Solaris/solr/core/src/test-files/solr/collection1/conf/currency.xml to /configs/conf1/currency.xml
   [junit4]   2> 595989 INFO  (TEST-TestReqParamsAPI.test-seed#[58D147216C216495]) [    ] o.a.s.c.c.SolrZkClient makePath: /configs/conf1/currency.xml
   [junit4]   2> 595993 INFO  (TEST-TestReqParamsAPI.test-seed#[58D147216C216495]) [    ] o.a.s.c.AbstractZkTestCase put /export/home/jenkins/workspace/Lucene-Solr-6.x-Solaris/solr/core/src/test-files/solr/collection1/conf/enumsConfig.xml to /configs/conf1/enumsConfig.xml
   [junit4]   2> 595993 INFO  (TEST-TestReqParamsAPI.test-seed#[58D147216C216495]) [    ] o.a.s.c.c.SolrZkClient makePath: /configs/conf1/enumsConfig.xml
   [junit4]   2> 596000 INFO  (TEST-TestReqParamsAPI.test-seed#[58D147216C216495]) [    ] o.a.s.c.AbstractZkTestCase put /export/home/jenkins/workspace/Lucene-Solr-6.x-Solaris/solr/core/src/test-files/solr/collection1/conf/open-exchange-rates.json to /configs/conf1/open-exchange-rates.json
   [junit4]   2> 596000 INFO  (TEST-TestReqParamsAPI.test-seed#[58D147216C216495]) [    ] o.a.s.c.c.SolrZkClient makePath: /configs/conf1/open-exchange-rates.json
   [junit4]   2> 596003 INFO  (TEST-TestReqParamsAPI.test-seed#[58D147216C216495]) [    ] o.a.s.c.AbstractZkTestCase put /export/home/jenkins/workspace/Lucene-Solr-6.x-Solaris/solr/core/src/test-files/solr/collection1/conf/mapping-ISOLatin1Accent.txt to /configs/conf1/mapping-ISOLatin1Accent.txt
   [junit4]   2> 596004 INFO  (TEST-TestReqParamsAPI.test-seed#[58D147216C216495]) [    ] o.a.s.c.c.SolrZkClient makePath: /configs/conf1/mapping-ISOLatin1Accent.txt
   [junit4]   2> 596007 INFO  (TEST-TestReqParamsAPI.test-seed#[58D147216C216495]) [    ] o.a.s.c.AbstractZkTestCase put /export/home/jenkins/workspace/Lucene-Solr-6.x-Solaris/solr/core/src/test-files/solr/collection1/conf/old_synonyms.txt to /configs/conf1/old_synonyms.txt
   [junit4]   2> 596007 INFO  (TEST-TestReqParamsAPI.test-seed#[58D147216C216495]) [    ] o.a.s.c.c.SolrZkClient makePath: /configs/conf1/old_synonyms.txt
   [junit4]   2> 596010 INFO  (TEST-TestReqParamsAPI.test-seed#[58D147216C216495]) [    ] o.a.s.c.AbstractZkTestCase put /export/home/jenkins/workspace/Lucene-Solr-6.x-Solaris/solr/core/src/test-files/solr/collection1/conf/synonyms.txt to /configs/conf1/synonyms.txt
   [junit4]   2> 596011 INFO  (TEST-TestReqParamsAPI.test-seed#[58D147216C216495]) [    ] o.a.s.c.c.SolrZkClient makePath: /configs/conf1/synonyms.txt
   [junit4]   2> 596247 INFO  (TEST-TestReqParamsAPI.test-seed#[58D147216C216495]) [    ] o.a.s.SolrTestCaseJ4 Writing core.properties file to /export/home/jenkins/workspace/Lucene-Solr-6.x-Solaris/solr/build/solr-core/test/J1/temp/solr.handler.TestReqParamsAPI_58D147216C216495-001/control-001/cores/collection1
   [junit4]   2> 596249 INFO  (TEST-TestReqParamsAPI.test-seed#[58D147216C216495]) [    ] o.e.j.s.Server jetty-9.3.6.v20151106
   [junit4]   2> 596258 INFO  (TEST-TestReqParamsAPI.test-seed#[58D147216C216495]) [    ] o.e.j.s.h.ContextHandler Started o.e.j.s.ServletContextHandler@6ad31555{/,null,AVAILABLE}
   [junit4]   2> 596296 INFO  (TEST-TestReqParamsAPI.test-seed#[58D147216C216495]) [    ] o.e.j.s.ServerConnector Started ServerConnector@61ad63dc{HTTP/1.1,[http/1.1]}{127.0.0.1:33680}
   [junit4]   2> 596296 INFO  (TEST-TestReqParamsAPI.test-seed#[58D147216C216495]) [    ] o.e.j.s.Server Started @599027ms
   [junit4]   2> 596296 INFO  (TEST-TestReqParamsAPI.test-seed#[58D147216C216495]) [    ] o.a.s.c.s.e.JettySolrRunner Jetty properties: {solr.data.dir=/export/home/jenkins/workspace/Lucene-Solr-6.x-Solaris/solr/build/solr-core/test/J1/temp/solr.handler.TestReqParamsAPI_58D147216C216495-001/tempDir-001/control/data, hostContext=/, hostPort=33680, coreRootDirectory=/export/home/jenkins/workspace/Lucene-Solr-6.x-Solaris/solr/build/solr-core/test/J1/temp/solr.handler.TestReqParamsAPI_58D147216C216495-001/control-001/cores}
   [junit4]   2> 596296 INFO  (TEST-TestReqParamsAPI.test-seed#[58D147216C216495]) [    ] o.a.s.s.SolrDispatchFilter SolrDispatchFilter.init(): sun.misc.Launcher$AppClassLoader@6d06d69c
   [junit4]   2> 596296 INFO  (TEST-TestReqParamsAPI.test-seed#[58D147216C216495]) [    ] o.a.s.c.SolrResourceLoader new SolrResourceLoader for directory: '/export/home/jenkins/workspace/Lucene-Solr-6.x-Solaris/solr/build/solr-core/test/J1/temp/solr.handler.TestReqParamsAPI_58D147216C216495-001/control-001'
   [junit4]   2> 596296 INFO  (TEST-TestReqParamsAPI.test-seed#[58D147216C216495]) [    ] o.a.s.c.SolrResourceLoader JNDI not configured for solr (NoInitialContextEx)
   [junit4]   2> 596296 INFO  (TEST-TestReqParamsAPI.test-seed#[58D147216C216495]) [    ] o.a.s.c.SolrResourceLoader solr home defaulted to 'solr/' (could not find system property or JNDI)
   [junit4]   2> 596297 INFO  (TEST-TestReqParamsAPI.test-seed#[58D147216C216495]) [    ] o.a.s.c.c.SolrZkClient Using default ZkCredentialsProvider
   [junit4]   2> 596298 INFO  (TEST-TestReqParamsAPI.test-seed#[58D147216C216495]) [    ] o.a.s.c.c.ConnectionManager Waiting for client to connect to ZooKeeper
   [junit4]   2> 596302 INFO  (zkCallback-445-thread-1) [    ] o.a.s.c.c.ConnectionManager Watcher org.apache.solr.common.cloud.ConnectionManager@367f7b name:ZooKeeperConnection Watcher:127.0.0.1:41609/solr got event WatchedEvent state:SyncConnected type:None path:null path:null type:None
   [junit4]   2> 596302 INFO  (TEST-TestReqParamsAPI.test-seed#[58D147216C216495]) [    ] o.a.s.c.c.ConnectionManager Client is connected to ZooKeeper
   [junit4]   2> 596302 INFO  (TEST-TestReqParamsAPI.test-seed#[58D147216C216495]) [    ] o.a.s.c.c.SolrZkClient Using default ZkACLProvider
   [junit4]   2> 596304 INFO  (TEST-TestReqParamsAPI.test-seed#[58D147216C216495]) [    ] o.a.s.s.SolrDispatchFilter Loading solr.xml from SolrHome (not found in ZooKeeper)
   [junit4]   2> 596304 INFO  (TEST-TestReqParamsAPI.test-seed#[58D147216C216495]) [    ] o.a.s.c.SolrXmlConfig Loading container configuration from /export/home/jenkins/workspace/Lucene-Solr-6.x-Solaris/solr/build/solr-core/test/J1/temp/solr.handler.TestReqParamsAPI_58D147216C216495-001/control-001/solr.xml
   [junit4]   2> 596310 INFO  (TEST-TestReqParamsAPI.test-seed#[58D147216C216495]) [    ] o.a.s.c.CorePropertiesLocator Config-defined core root directory: /export/home/jenkins/workspace/Lucene-Solr-6.x-Solaris/solr/build/solr-core/test/J1/temp/solr.handler.TestReqParamsAPI_58D147216C216495-001/control-001/cores
   [junit4]   2> 596310 INFO  (TEST-TestReqParamsAPI.test-seed#[58D147216C216495]) [    ] o.a.s.c.CoreContainer New CoreContainer 776903139
   [junit4]   2> 596310 INFO  (TEST-TestReqParamsAPI.test-seed#[58D147216C216495]) [    ] o.a.s.c.CoreContainer Loading cores into CoreContainer [instanceDir=/export/home/jenkins/workspace/Lucene-Solr-6.x-Solaris/solr/build/solr-core/test/J1/temp/solr.handler.TestReqParamsAPI_58D147216C216495-001/control-001]
   [junit4]   2> 596311 WARN  (TEST-TestReqParamsAPI.test-seed#[58D147216C216495]) [    ] o.a.s.c.CoreContainer Couldn't add files from /export/home/jenkins/workspace/Lucene-Solr-6.x-Solaris/solr/build/solr-core/test/J1/temp/solr.handler.TestReqParamsAPI_58D147216C216495-001/control-001/lib to classpath: /export/home/jenkins/workspace/Lucene-Solr-6.x-Solaris/solr/build/solr-core/test/J1/temp/solr.handler.TestReqParamsAPI_58D147216C216495-001/control-001/lib
   [junit4]   2> 596311 INFO  (TEST-TestReqParamsAPI.test-seed#[58D147216C216495]) [    ] o.a.s.h.c.HttpShardHandlerFactory created with socketTimeout : 90000,urlScheme : ,connTimeout : 15000,maxConnectionsPerHost : 20,maxConnections : 10000,corePoolSize : 0,maximumPoolSize : 2147483647,maxThreadIdleTime : 5,sizeOfQueue : -1,fairnessPolicy : false,useRetries : false,
   [junit4]   2> 596313 INFO  (TEST-TestReqParamsAPI.test-seed#[58D147216C216495]) [    ] o.a.s.u.UpdateShardHandler Creating UpdateShardHandler HTTP client with params: socketTimeout=340000&connTimeout=45000&retry=true
   [junit4]   2> 596314 INFO  (TEST-TestReqParamsAPI.test-seed#[58D147216C216495]) [    ] o.a.s.l.LogWatcher SLF4J impl is org.slf4j.impl.Log4jLoggerFactory
   [junit4]   2> 596314 INFO  (TEST-TestReqParamsAPI.test-seed#[58D147216C216495]) [    ] o.a.s.l.LogWatcher Registering Log Listener [Log4j (org.slf4j.impl.Log4jLoggerFactory)]
   [junit4]   2> 596314 INFO  (TEST-TestReqParamsAPI.test-seed#[58D147216C216495]) [    ] o.a.s.c.ZkContainer Zookeeper client=127.0.0.1:41609/solr
   [junit4]   2> 596314 INFO  (TEST-TestReqParamsAPI.test-seed#[58D147216C216495]) [    ] o.a.s.c.ZkController zkHost includes chroot
   [junit4]   2> 596314 INFO  (TEST-TestReqParamsAPI.test-seed#[58D147216C216495]) [    ] o.a.s.c.c.SolrZkClient Using default ZkCredentialsProvider
   [junit4]   2> 596315 INFO  (TEST-TestReqParamsAPI.test-seed#[58D147216C216495]) [    ] o.a.s.c.c.ConnectionManager Waiting for client to connect to ZooKeeper
   [junit4]   2> 596319 INFO  (zkCallback-448-thread-1) [    ] o.a.s.c.c.ConnectionManager Watcher org.apache.solr.common.cloud.ConnectionManager@74d65cb1 name:ZooKeeperConnection Watcher:127.0.0.1:41609 got event WatchedEvent state:SyncConnected type:None path:null path:null type:None
   [junit4]   2> 596321 INFO  (TEST-TestReqParamsAPI.test-seed#[58D147216C216495]) [    ] o.a.s.c.c.ConnectionManager Client is connected to ZooKeeper
   [junit4]   2> 596321 INFO  (TEST-TestReqParamsAPI.test-seed#[58D147216C216495]) [    ] o.a.s.c.c.SolrZkClient Using default ZkACLProvider
   [junit4]   2> 596327 INFO  (TEST-TestReqParamsAPI.test-seed#[58D147216C216495]) [n:127.0.0.1:33680_    ] o.a.s.c.c.ConnectionManager Waiting for client to connect to ZooKeeper
   [junit4]   2> 596329 INFO  (zkCallback-449-thread-1-processing-n:127.0.0.1:33680_) [n:127.0.0.1:33680_    ] o.a.s.c.c.ConnectionManager Watcher org.apache.solr.common.cloud.ConnectionManager@19817056 name:ZooKeeperConnection Watcher:127.0.0.1:41609/solr got event WatchedEvent state:SyncConnected type:None path:null path:null type:None
   [junit4]   2> 596330 INFO  (TEST-TestReqParamsAPI.test-seed#[58D147216C216495]) [n:127.0.0.1:33680_    ] o.a.s.c.c.ConnectionManager Client is connected to ZooKeeper
   [junit4]   2> 596331 INFO  (TEST-TestReqParamsAPI.test-seed#[58D147216C216495]) [n:127.0.0.1:33680_    ] o.a.s.c.c.SolrZkClient makePath: /overseer/queue
   [junit4]   2> 596335 INFO  (TEST-TestReqParamsAPI.test-seed#[58D147216C216495]) [n:127.0.0.1:33680_    ] o.a.s.c.c.SolrZkClient makePath: /overseer/collection-queue-work
   [junit4]   2> 596340 INFO  (TEST-TestReqParamsAPI.test-seed#[58D147216C216495]) [n:127.0.0.1:33680_    ] o.a.s.c.c.SolrZkClient makePath: /overseer/collection-map-running
   [junit4]   2> 596351 INFO  (TEST-TestReqParamsAPI.test-seed#[58D147216C216495]) [n:127.0.0.1:33680_    ] o.a.s.c.c.SolrZkClient makePath: /overseer/collection-map-completed
   [junit4]   2> 596354 INFO  (TEST-TestReqParamsAPI.test-seed#[58D147216C216495]) [n:127.0.0.1:33680_    ] o.a.s.c.c.SolrZkClient makePath: /overseer/collection-map-failure
   [junit4]   2> 596357 INFO  (TEST-TestReqParamsAPI.test-seed#[58D147216C216495]) [n:127.0.0.1:33680_    ] o.a.s.c.c.SolrZkClient makePath: /live_nodes
   [junit4]   2> 596359 INFO  (TEST-TestReqParamsAPI.test-seed#[58D147216C216495]) [n:127.0.0.1:33680_    ] o.a.s.c.c.SolrZkClient makePath: /aliases.json
   [junit4]   2> 596360 INFO  (TEST-TestReqParamsAPI.test-seed#[58D147216C216495]) [n:127.0.0.1:33680_    ] o.a.s.c.c.SolrZkClient makePath: /clusterstate.json
   [junit4]   2> 596362 INFO  (TEST-TestReqParamsAPI.test-seed#[58D147216C216495]) [n:127.0.0.1:33680_    ] o.a.s.c.c.SolrZkClient makePath: /security.json
   [junit4]   2> 596363 INFO  (TEST-TestReqParamsAPI.test-seed#[58D147216C216495]) [n:127.0.0.1:33680_    ] o.a.s.c.c.ZkStateReader Updating cluster state from ZooKeeper... 
   [junit4]   2> 596365 INFO  (TEST-TestReqParamsAPI.test-seed#[58D147216C216495]) [n:127.0.0.1:33680_    ] o.a.s.c.c.ZkStateReader Updated live nodes from ZooKeeper... (0) -> (0)
   [junit4]   2> 596368 INFO  (TEST-TestReqParamsAPI.test-seed#[58D147216C216495]) [n:127.0.0.1:33680_    ] o.a.s.c.c.SolrZkClient makePath: /overseer_elect
   [junit4]   2> 596369 INFO  (TEST-TestReqParamsAPI.test-seed#[58D147216C216495]) [n:127.0.0.1:33680_    ] o.a.s.c.c.SolrZkClient makePath: /overseer_elect/election
   [junit4]   2> 596371 INFO  (TEST-TestReqParamsAPI.test-seed#[58D147216C216495]) [n:127.0.0.1:33680_    ] o.a.s.c.Overseer Overseer (id=null) closing
   [junit4]   2> 596372 INFO  (TEST-TestReqParamsAPI.test-seed#[58D147216C216495]) [n:127.0.0.1:33680_    ] o.a.s.c.LeaderElector Joined leadership election with path: /overseer_elect/election/95563246941831172-127.0.0.1:33680_-n_0000000000
   [junit4]   2> 596372 INFO  (TEST-TestReqParamsAPI.test-seed#[58D147216C216495]) [n:127.0.0.1:33680_    ] o.a.s.c.OverseerElectionContext I am going to be the leader 127.0.0.1:33680_
   [junit4]   2> 596372 INFO  (TEST-TestReqParamsAPI.test-seed#[58D147216C216495]) [n:127.0.0.1:33680_    ] o.a.s.c.c.SolrZkClient makePath: /overseer_elect/leader
   [junit4]   2> 596374 INFO  (TEST-TestReqParamsAPI.test-seed#[58D147216C216495]) [n:127.0.0.1:33680_    ] o.a.s.c.Overseer Overseer (id=95563246941831172-127.0.0.1:33680_-n_0000000000) starting
   [junit4]   2> 596376 INFO  (TEST-TestReqParamsAPI.test-seed#[58D147216C216495]) [n:127.0.0.1:33680_    ] o.a.s.c.c.SolrZkClient makePath: /overseer/queue-work
   [junit4]   2> 596382 INFO  (TEST-TestReqParamsAPI.test-seed#[58D147216C216495]) [n:127.0.0.1:33680_    ] o.a.s.c.OverseerAutoReplicaFailoverThread Starting OverseerAutoReplicaFailoverThread autoReplicaFailoverWorkLoopDelay=10000 autoReplicaFailoverWaitAfterExpiration=30000 autoReplicaFailoverBadNodeExpiration=60000
   [junit4]   2> 596383 INFO  (TEST-TestReqParamsAPI.test-seed#[58D147216C216495]) [n:127.0.0.1:33680_    ] o.a.s.c.ZkController Register node as live in ZooKeeper:/live_nodes/127.0.0.1:33680_
   [junit4]   2> 596383 INFO  (OverseerCollectionConfigSetProcessor-95563246941831172-127.0.0.1:33680_-n_0000000000) [n:127.0.0.1:33680_    ] o.a.s.c.OverseerTaskProcessor Process current queue of overseer operations
   [junit4]   2> 596384 INFO  (OverseerStateUpdate-95563246941831172-127.0.0.1:33680_-n_0000000000) [n:127.0.0.1:33680_    ] o.a.s.c.Overseer Starting to work on the main queue
   [junit4]   2> 596384 INFO  (TEST-TestReqParamsAPI.test-seed#[58D147216C216495]) [n:127.0.0.1:33680_    ] o.a.s.c.c.SolrZkClient makePath: /live_nodes/127.0.0.1:33680_
   [junit4]   2> 596387 INFO  (OverseerStateUpdate-95563246941831172-127.0.0.1:33680_-n_0000000000) [n:127.0.0.1:33680_    ] o.a.s.c.c.ZkStateReader Updated live nodes from ZooKeeper... (0) -> (0)
   [junit4]   2> 596388 INFO  (zkCallback-449-thread-1-processing-n:127.0.0.1:33680_) [n:127.0.0.1:33680_    ] o.a.s.c.c.ZkStateReader A live node change: [WatchedEvent state:SyncConnected type:NodeChildrenChanged path:/live_nodes], has occurred - updating... (live nodes size: [0])
   [junit4]   2> 596389 INFO  (zkCallback-449-thread-1-processing-n:127.0.0.1:33680_) [n:127.0.0.1:33680_    ] o.a.s.c.c.ZkStateReader Updated live nodes from ZooKeeper... (0) -> (1)
   [junit4]   2> 596410 INFO  (TEST-TestReqParamsAPI.test-seed#[58D147216C216495]) [n:127.0.0.1:33680_    ] o.a.s.c.CoreContainer Security conf doesn't exist. Skipping setup for authorization module.
   [junit4]   2> 596411 INFO  (TEST-TestReqParamsAPI.test-seed#[58D147216C216495]) [n:127.0.0.1:33680_    ] o.a.s.c.CoreContainer No authentication plugin used.
   [junit4]   2> 596415 INFO  (TEST-TestReqParamsAPI.test-seed#[58D147216C216495]) [n:127.0.0.1:33680_    ] o.a.s.c.CorePropertiesLocator Looking for core definitions underneath /export/home/jenkins/workspace/Lucene-Solr-6.x-Solaris/solr/build/solr-core/test/J1/temp/solr.handler.TestReqParamsAPI_58D147216C216495-001/control-001/cores
   [junit4]   2> 596417 INFO  (TEST-TestReqParamsAPI.test-seed#[58D147216C216495]) [n:127.0.0.1:33680_    ] o.a.s.c.CoreDescriptor Created CoreDescriptor: {name=collection1, config=solrconfig.xml, transient=false, schema=schema.xml, loadOnStartup=true, configSetProperties=configsetprops.json, collection=control_collection, coreNodeName=, dataDir=data/, shard=}
   [junit4]   2> 596417 INFO  (TEST-TestReqParamsAPI.test-seed#[58D147216C216495]) [n:127.0.0.1:33680_    ] o.a.s.c.CorePropertiesLocator Found core collection1 in /export/home/jenkins/workspace/Lucene-Solr-6.x-Solaris/solr/build/solr-core/test/J1/temp/solr.handler.TestReqParamsAPI_58D147216C216495-001/control-001/cores/collection1
   [junit4]   2> 596417 INFO  (TEST-TestReqParamsAPI.test-seed#[58D147216C216495]) [n:127.0.0.1:33680_    ] o.a.s.c.CorePropertiesLocator Found 1 core definitions
   [junit4]   2> 596419 INFO  (TEST-TestReqParamsAPI.test-seed#[58D147216C216495]) [n:127.0.0.1:33680_    ] o.a.s.s.SolrDispatchFilter user.dir=/export/home/jenkins/workspace/Lucene-Solr-6.x-Solaris/solr/build/solr-core/test/J1
   [junit4]   2> 596419 INFO  (TEST-TestReqParamsAPI.test-seed#[58D147216C216495]) [n:127.0.0.1:33680_    ] o.a.s.s.SolrDispatchFilter SolrDispatchFilter.init() done
   [junit4]   2> 596419 INFO  (coreLoadExecutor-1161-thread-1-processing-n:127.0.0.1:33680_) [n:127.0.0.1:33680_ c:control_collection   x:collection1] o.a.s.c.ZkController publishing state=down
   [junit4]   2> 596419 INFO  (coreLoadExecutor-1161-thread-1-processing-n:127.0.0.1:33680_) [n:127.0.0.1:33680_ c:control_collection   x:collection1] o.a.s.c.ZkController numShards not found on descriptor - reading it from system property
   [junit4]   2> 596422 INFO  (OverseerStateUpdate-95563246941831172-127.0.0.1:33680_-n_0000000000) [n:127.0.0.1:33680_    ] o.a.s.c.Overseer processMessage: queueSize: 1, message = {
   [junit4]   2>   "core":"collection1",
   [junit4]   2>   "roles":null,
   [junit4]   2>   "base_url":"http://127.0.0.1:33680",
   [junit4]   2>   "node_name":"127.0.0.1:33680_",
   [junit4]   2>   "numShards":"1",
   [junit4]   2>   "state":"down",
   [junit4]   2>   "shard":null,
   [junit4]   2>   "collection":"control_collection",
   [junit4]   2>   "operation":"state"} current state version: 0
   [junit4]   2> 596423 INFO  (coreLoadExecutor-1161-thread-1-processing-n:127.0.0.1:33680_) [n:127.0.0.1:33680_ c:control_collection   x:collection1] o.a.s.c.ZkController look for our core node name
   [junit4]   2> 596424 INFO  (OverseerStateUpdate-95563246941831172-127.0.0.1:33680_-n_0000000000) [n:127.0.0.1:33680_    ] o.a.s.c.o.ReplicaMutator Update state numShards=1 message={
   [junit4]   2>   "core":"collection1",
   [junit4]   2>   "roles":null,
   [junit4]   2>   "base_url":"http://127.0.0.1:33680",
   [junit4]   2>   "node_name":"127.0.0.1:33680_",
   [junit4]   2>   "numShards":"1",
   [junit4]   2>   "state":"down",
   [junit4]   2>   "shard":null,
   [junit4]   2>   "collection":"control_collection",
   [junit4]   2>   "operation":"state"}
   [junit4]   2> 596425 INFO  (OverseerStateUpdate-95563246941831172-127.0.0.1:33680_-n_0000000000) [n:127.0.0.1:33680_    ] o.a.s.c.o.ClusterStateMutator building a new cName: control_collection
   [junit4]   2> 596426 INFO  (OverseerStateUpdate-95563246941831172-127.0.0.1:33680_-n_0000000000) [n:127.0.0.1:33680_    ] o.a.s.c.o.ReplicaMutator Assigning new node to shard shard=shard1
   [junit4]   2> 596428 INFO  (zkCallback-449-thread-1-processing-n:127.0.0.1:33680_) [n:127.0.0.1:33680_    ] o.a.s.c.c.ZkStateReader A cluster state change: [WatchedEvent state:SyncConnected type:NodeDataChanged path:/clusterstate.json], has occurred - updating... (live nodes size: [1])
   [junit4]   2> 597425 INFO  (coreLoadExecutor-1161-thread-1-processing-n:127.0.0.1:33680_) [n:127.0.0.1:33680_ c:control_collection   x:collection1] o.a.s.c.ZkController waiting to find shard id in clusterstate for collection1
   [junit4]   2> 597425 INFO  (coreLoadExecutor-1161-thread-1-processing-n:127.0.0.1:33680_) [n:127.0.0.1:33680_ c:control_collection   x:collection1] o.a.s.c.ZkController Check for collection zkNode:control_collection
   [junit4]   2> 597426 INFO  (coreLoadExecutor-1161-thread-1-processing-n:127.0.0.1:33680_) [n:127.0.0.1:33680_ c:control_collection   x:collection1] o.a.s.c.ZkController Collection zkNode exists
   [junit4]   2> 597426 INFO  (coreLoadExecutor-1161-thread-1-processing-n:127.0.0.1:33680_) [n:127.0.0.1:33680_ c:control_collection   x:collection1] o.a.s.c.c.ZkStateReader Load collection config from: [/collections/control_collection]
   [junit4]   2> 597427 INFO  (coreLoadExecutor-1161-thread-1-processing-n:127.0.0.1:33680_) [n:127.0.0.1:33680_ c:control_collection   x:collection1] o.a.s.c.c.ZkStateReader path=[/collections/control_collection] [configName]=[conf1] specified config exists in ZooKeeper
   [junit4]   2> 597427 INFO  (coreLoadExecutor-1161-thread-1-processing-n:127.0.0.1:33680_) [n:127.0.0.1:33680_ c:control_collection   x:collection1] o.a.s.c.SolrResourceLoader new SolrResourceLoader for directory: '/export/home/jenkins/workspace/Lucene-Solr-6.x-Solaris/solr/build/solr-core/test/J1/temp/solr.handler.TestReqParamsAPI_58D147216C216495-001/control-001/cores/collection1'
   [junit4]   2> 597427 INFO  (coreLoadExecutor-1161-thread-1-processing-n:127.0.0.1:33680_) [n:127.0.0.1:33680_ c:control_collection   x:collection1] o.a.s.c.SolrResourceLoader JNDI not configured for solr (NoInitialContextEx)
   [junit4]   2> 597427 INFO  (coreLoadExecutor-1161-thread-1-processing-n:127.0.0.1:33680_) [n:127.0.0.1:33680_ c:control_collection   x:collection1] o.a.s.c.SolrResourceLoader solr home defaulted to 'solr/' (could not find system property or JNDI)
   [junit4]   2> 597430 INFO  (coreLoadExecutor-1161-thread-1-processing-n:127.0.0.1:33680_) [n:127.0.0.1:33680_ c:control_collection   x:collection1] o.a.s.c.Config loaded config solrconfig.xml with version 0 
   [junit4]   2> 597443 INFO  (coreLoadExecutor-1161-thread-1-processing-n:127.0.0.1:33680_) [n:127.0.0.1:33680_ c:control_collection   x:collection1] o.a.s.c.SolrConfig current version of requestparams : -1
   [junit4]   2> 597447 INFO  (coreLoadExecutor-1161-thread-1-processing-n:127.0.0.1:33680_) [n:127.0.0.1:33680_ c:control_collection   x:collection1] o.a.s.c.SolrConfig Using Lucene MatchVersion: 6.1.0
   [junit4]   2> 597468 INFO  (coreLoadExecutor-1161-thread-1-processing-n:127.0.0.1:33680_) [n:127.0.0.1:33680_ c:control_collection   x:collection1] o.a.s.c.SolrConfig Loaded SolrConfig: solrconfig.xml
   [junit4]   2> 597477 INFO  (coreLoadExecutor-1161-thread-1-processing-n:127.0.0.1:33680_) [n:127.0.0.1:33680_ c:control_collection   x:collection1] o.a.s.s.IndexSchema [collection1] Schema name=test
   [junit4]   2> 597571 INFO  (coreLoadExecutor-1161-thread-1-processing-n:127.0.0.1:33680_) [n:127.0.0.1:33680_ c:control_collection   x:collection1] o.a.s.s.OpenExchangeRatesOrgProvider Initialized with rates=open-exchange-rates.json, refreshInterval=1440.
   [junit4]   2> 597579 INFO  (coreLoadExecutor-1161-thread-1-processing-n:127.0.0.1:33680_) [n:127.0.0.1:33680_ c:control_collection   x:collection1] o.a.s.s.IndexSchema default search field in schema is text
   [junit4]   2> 597580 INFO  (coreLoadExecutor-1161-thread-1-processing-n:127.0.0.1:33680_) [n:127.0.0.1:33680_ c:control_collection   x:collection1] o.a.s.s.IndexSchema unique key field: id
   [junit4]   2> 597627 INFO  (coreLoadExecutor-1161-thread-1-processing-n:127.0.0.1:33680_) [n:127.0.0.1:33680_ c:control_collection   x:collection1] o.a.s.s.FileExchangeRateProvider Reloading exchange rates from file currency.xml
   [junit4]   2> 597630 INFO  (coreLoadExecutor-1161-thread-1-processing-n:127.0.0.1:33680_) [n:127.0.0.1:33680_ c:control_collection   x:collection1] o.a.s.s.FileExchangeRateProvider Reloading exchange rates from file currency.xml
   [junit4]   2> 597634 INFO  (coreLoadExecutor-1161-thread-1-processing-n:127.0.0.1:33680_) [n:127.0.0.1:33680_ c:control_collection   x:collection1] o.a.s.s.OpenExchangeRatesOrgProvider Reloading exchange rates from open-exchange-rates.json
   [junit4]   2> 597637 INFO  (coreLoadExecutor-1161-thread-1-processing-n:127.0.0.1:33680_) [n:127.0.0.1:33680_ c:control_collection   x:collection1] o.a.s.s.OpenExchangeRatesOrgProvider Reloading exchange rates from open-exchange-rates.json
   [junit4]   2> 597644 INFO  (coreLoadExecutor-1161-thread-1-processing-n:127.0.0.1:33680_) [n:127.0.0.1:33680_ c:control_collection   x:collection1] o.a.s.c.ConfigSetProperties Did not find ConfigSet properties, assuming default properties: Can't find resource 'configsetprops.json' in classpath or '/configs/conf1', cwd=/export/home/jenkins/workspace/Lucene-Solr-6.x-Solaris/solr/build/solr-core/test/J1
   [junit4]   2> 597644 INFO  (coreLoadExecutor-1161-thread-1-processing-n:127.0.0.1:33680_) [n:127.0.0.1:33680_ c:control_collection   x:collection1] o.a.s.c.CoreContainer Creating SolrCore 'collection1' using configuration from collection control_collection
   [junit4]   2> 597645 INFO  (coreLoadExecutor-1161-thread-1-processing-n:127.0.0.1:33680_) [n:127.0.0.1:33680_ c:control_collection s:shard1 r:core_node1 x:collection1] o.a.s.c.SolrCore org.apache.solr.core.MockDirectoryFactory
   [junit4]   2> 597645 INFO  (coreLoadExecutor-1161-thread-1-processing-n:127.0.0.1:33680_) [n:127.0.0.1:33680_ c:control_collection s:shard1 r:core_node1 x:collection1] o.a.s.c.SolrCore [[collection1] ] Opening new SolrCore at [/export/home/jenkins/workspace/Lucene-Solr-6.x-Solaris/solr/build/solr-core/test/J1/temp/solr.handler.TestReqParamsAPI_58D147216C216495-001/control-001/cores/collection1], dataDir=[/export/home/jenkins/workspace/Lucene-Solr-6.x-Solaris/solr/build/solr-core/test/J1/temp/solr.handler.TestReqParamsAPI_58D147216C216495-001/control-001/cores/collection1/data/]
   [junit4]   2> 597645 INFO  (coreLoadExecutor-1161-thread-1-processing-n:127.0.0.1:33680_) [n:127.0.0.1:33680_ c:control_collection s:shard1 r:core_node1 x:collection1] o.a.s.c.JmxMonitoredMap JMX monitoring is enabled. Adding Solr mbeans to JMX Server: com.sun.jmx.mbeanserver.JmxMBeanServer@4456e8a5
   [junit4]   2> 597646 INFO  (coreLoadExecutor-1161-thread-1-processing-n:127.0.0.1:33680_) [n:127.0.0.1:33680_ c:control_collection s:shard1 r:core_node1 x:collection1] o.a.s.c.CachingDirectoryFactory return new directory for /export/home/jenkins/workspace/Lucene-Solr-6.x-Solaris/solr/build/solr-core/test/J1/temp/solr.handler.TestReqParamsAPI_58D147216C216495-001/control-001/cores/collection1/data
   [junit4]   2> 597646 INFO  (coreLoadExecutor-1161-thread-1-processing-n:127.0.0.1:33680_) [n:127.0.0.1:33680_ c:control_collection s:shard1 r:core_node1 x:collection1] o.a.s.c.SolrCore New index directory detected: old=null new=/export/home/jenkins/workspace/Lucene-Solr-6.x-Solaris/solr/build/solr-core/test/J1/temp/solr.handler.TestReqParamsAPI_58D147216C216495-001/control-001/cores/collection1/data/index/
   [junit4]   2> 597646 WARN  (coreLoadExecutor-1161-thread-1-processing-n:127.0.0.1:33680_) [n:127.0.0.1:33680_ c:control_collection s:shard1 r:core_node1 x:collection1] o.a.s.c.SolrCore [collection1] Solr index directory '/export/home/jenkins/workspace/Lucene-Solr-6.x-Solaris/solr/build/solr-core/test/J1/temp/solr.handler.TestReqParamsAPI_58D147216C216495-001/control-001/cores/collection1/data/index' doesn't exist. Creating new index...
   [junit4]   2> 597646 INFO  (coreLoadExecutor-1161-thread-1-processing-n:127.0.0.1:33680_) [n:127.0.0.1:33680_ c:control_collection s:shard1 r:core_node1 x:collection1] o.a.s.c.CachingDirectoryFactory return new directory for /export/home/jenkins/workspace/Lucene-Solr-6.x-Solaris/solr/build/solr-core/test/J1/temp/solr.handler.TestReqParamsAPI_58D147216C216495-001/control-001/cores/collection1/data/index
   [junit4]   2> 597646 INFO  (coreLoadExecutor-1161-thread-1-processing-n:127.0.0.1:33680_) [n:127.0.0.1:33680_ c:control_collection s:shard1 r:core_node1 x:collection1] o.a.s.u.RandomMergePolicy RandomMergePolicy wrapping class org.apache.lucene.index.TieredMergePolicy: [TieredMergePolicy: maxMergeAtOnce=48, maxMergeAtOnceExplicit=29, maxMergedSegmentMB=1.322265625, floorSegmentMB=1.1865234375, forceMergeDeletesPctAllowed=14.194269288540566, segmentsPerTier=23.0, maxCFSSegmentSizeMB=8.796093022207999E12, noCFSRatio=0.0
   [junit4]   2> 597647 INFO  (coreLoadExecutor-1161-thread-1-processing-n:127.0.0.1:33680_) [n:127.0.0.1:33680_ c:control_collection s:shard1 r:core_node1 x:collection1] o.a.s.c.SolrDeletionPolicy SolrDeletionPolicy.onCommit: commits: num=1
   [junit4]   2> 	commit{dir=MockDirectoryWrapper(RAMDirectory@72884a95 lockFactory=org.apache.lucene.store.SingleInstanceLockFactory@12f5ca54),segFN=segments_1,generation=1}
   [junit4]   2> 597647 INFO  (coreLoadExecutor-1161-thread-1-processing-n:127.0.0.1:33680_) [n:127.0.0.1:33680_ c:control_collection s:shard1 r:core_node1 x:collection1] o.a.s.c.SolrDeletionPolicy newest commit generation = 1
   [junit4]   2> 597648 INFO  (OldIndexDirectoryCleanupThreadForCore-collection1) [n:127.0.0.1:33680_ c:control_collection s:shard1 r:core_node1 x:collection1] o.a.s.c.SolrCore Looking for old index directories to cleanup for core collection1 in /export/home/jenkins/workspace/Lucene-Solr-6.x-Solaris/solr/build/solr-core/test/J1/temp/solr.handler.TestReqParamsAPI_58D147216C216495-001/control-001/cores/collection1/data/
   [junit4]   2> 597648 WARN  (OldIndexDirectoryCleanupThreadForCore-collection1) [n:127.0.0.1:33680_ c:control_collection s:shard1 r:core_node1 x:collection1] o.a.s.c.DirectoryFactory /export/home/jenkins/workspace/Lucene-Solr-6.x-Solaris/solr/build/solr-core/test/J1/temp/solr.handler.TestReqParamsAPI_58D147216C216495-001/control-001/cores/collection1/data/ does not point to a valid data directory; skipping clean-up of old index directories.
   [junit4]   2> 597663 INFO  (coreLoadExecutor-1161-thread-1-processing-n:127.0.0.1:33680_) [n:127.0.0.1:33680_ c:control_collection s:shard1 r:core_node1 x:collection1] o.a.s.u.p.UpdateRequestProcessorChain creating updateRequestProcessorChain "nodistrib"
   [junit4]   2> 597663 INFO  (coreLoadExecutor-1161-thread-1-processing-n:127.0.0.1:33680_) [n:127.0.0.1:33680_ c:control_collection s:shard1 r:core_node1 x:collection1] o.a.s.u.p.UpdateRequestProcessorChain creating updateRequestProcessorChain "dedupe"
   [junit4]   2> 597663 INFO  (coreLoadExecutor-1161-thread-1-processing-n:127.0.0.1:33680_) [n:127.0.0.1:33680_ c:control_collection s:shard1 r:core_node1 x:collection1] o.a.s.u.p.UpdateRequestProcessorChain inserting DistributedUpdateProcessorFactory into updateRequestProcessorChain "dedupe"
   [junit4]   2> 597663 INFO  (coreLoadExecutor-1161-thread-1-processing-n:127.0.0.1:33680_) [n:127.0.0.1:33680_ c:control_collection s:shard1 r:core_node1 x:collection1] o.a.s.u.p.UpdateRequestProcessorChain creating updateRequestProcessorChain "stored_sig"
   [junit4]   2> 597663 INFO  (coreLoadExecutor-1161-thread-1-processing-n:127.0.0.1:33680_) [n:127.0.0.1:33680_ c:control_collection s:shard1 r:core_node1 x:collection1] o.a.s.u.p.UpdateRequestProcessorChain inserting DistributedUpdateProcessorFactory into updateRequestProcessorChain "stored_sig"
   [junit4]   2> 597663 INFO  (coreLoadExecutor-1161-thread-1-processing-n:127.0.0.1:33680_) [n:127.0.0.1:33680_ c:control_collection s:shard1 r:core_node1 x:collection1] o.a.s.u.p.UpdateRequestProcessorChain creating updateRequestProcessorChain "distrib-dup-test-chain-explicit"
   [junit4]   2> 597663 INFO  (coreLoadExecutor-1161-thread-1-processing-n:127.0.0.1:33680_) [n:127.0.0.1:33680_ c:control_collection s:shard1 r:core_node1 x:collection1] o.a.s.u.p.UpdateRequestProcessorChain creating updateRequestProcessorChain "distrib-dup-test-chain-implicit"
   [junit4]   2> 597664 INFO  (coreLoadExecutor-1161-thread-1-processing-n:127.0.0.1:33680_) [n:127.0.0.1:33680_ c:control_collection s:shard1 r:core_node1 x:collection1] o.a.s.u.p.UpdateRequestProcessorChain inserting DistributedUpdateProcessorFactory into updateRequestProcessorChain "distrib-dup-test-chain-implicit"
   [junit4]   2> 597664 INFO  (coreLoadExecutor-1161-thread-1-processing-n:127.0.0.1:33680_) [n:127.0.0.1:33680_ c:control_collection s:shard1 r:core_node1 x:collection1] o.a.s.c.SolrCore no updateRequestProcessorChain defined as default, creating implicit default
   [junit4]   2> 597664 WARN  (coreLoadExecutor-1161-thread-1-processing-n:127.0.0.1:33680_) [n:127.0.0.1:33680_ c:control_collection s:shard1 r:core_node1 x:collection1] o.a.s.c.RequestHandlers INVALID paramSet a in requestHandler {type = requestHandler,name = /dump,class = DumpRequestHandler,args = {defaults={a=A,b=B}}}
   [junit4]   2> 597667 INFO  (coreLoadExecutor-1161-thread-1-processing-n:127.0.0.1:33680_) [n:127.0.0.1:33680_ c:control_collection s:shard1 r:core_node1 x:collection1] o.a.s.h.l.XMLLoader xsltCacheLifetimeSeconds=60
   [junit4]   2> 597669 INFO  (coreLoadExecutor-1161-thread-1-processing-n:127.0.0.1:33680_) [n:127.0.0.1:33680_ c:control_collection s:shard1 r:core_node1 x:collection1] o.a.s.h.l.XMLLoader xsltCacheLifetimeSeconds=60
   [junit4]   2> 597670 INFO  (coreLoadExecutor-1161-thread-1-processing-n:127.0.0.1:33680_) [n:127.0.0.1:33680_ c:control_collection s:shard1 r:core_node1 x:collection1] o.a.s.h.l.XMLLoader xsltCacheLifetimeSeconds=60
   [junit4]   2> 597672 INFO  (coreLoadExecutor-1161-thread-1-processing-n:127.0.0.1:33680_) [n:127.0.0.1:33680_ c:control_collection s:shard1 r:core_node1 x:collection1] o.a.s.h.l.XMLLoader xsltCacheLifetimeSeconds=60
   [junit4]   2> 597677 INFO  (coreLoadExecutor-1161-thread-1-processing-n:127.0.0.1:33680_) [n:127.0.0.1:33680_ c:control_collection s:shard1 r:core_node1 x:collection1] o.a.s.c.RequestHandlers Registered paths: /admin/mbeans,standard,/dump,/update/csv,/sql,/update/json/docs,/admin/luke,/export,/admin/segments,/get,/admin/system,/replication,/admin/properties,/config,/stream,/schema,/admin/plugins,/admin/logging,/update/json,/admin/ping,/admin/threads,/update,/admin/file
   [junit4]   2> 597677 INFO  (coreLoadExecutor-1161-thread-1-processing-n:127.0.0.1:33680_) [n:127.0.0.1:33680_ c:control_collection s:shard1 r:core_node1 x:collection1] o.a.s.c.SolrCore Using default statsCache cache: org.apache.solr.search.stats.LocalStatsCache
   [junit4]   2> 597677 INFO  (coreLoadExecutor-1161-thread-1-processing-n:127.0.0.1:33680_) [n:127.0.0.1:33680_ c:control_collection s:shard1 r:core_node1 x:collection1] o.a.s.u.UpdateHandler Using UpdateLog implementation: org.apache.solr.update.UpdateLog
   [junit4]   2> 597678 INFO  (coreLoadExecutor-1161-thread-1-processing-n:127.0.0.1:33680_) [n:127.0.0.1:33680_ c:control_collection s:shard1 r:core_node1 x:collection1] o.a.s.u.UpdateLog Initializing UpdateLog: dataDir= defaultSyncLevel=FLUSH numRecordsToKeep=100 maxNumLogsToKeep=10 numVersionBuckets=65536
   [junit4]   2> 597679 INFO  (coreLoadExecutor-1161-thread-1-processing-n:127.0.0.1:33680_) [n:127.0.0.1:33680_ c:control_collection s:shard1 r:core_node1 x:collection1] o.a.s.u.CommitTracker Hard AutoCommit: disabled
   [junit4]   2> 597679 INFO  (coreLoadExecutor-1161-thread-1-processing-n:127.0.0.1:33680_) [n:127.0.0.1:33680_ c:control_collection s:shard1 r:core_node1 x:collection1] o.a.s.u.CommitTracker Soft AutoCommit: disabled
   [junit4]   2> 597679 INFO  (coreLoadExecutor-1161-thread-1-processing-n:127.0.0.1:33680_) [n:127.0.0.1:33680_ c:control_collection s:shard1 r:core_node1 x:collection1] o.a.s.u.RandomMergePolicy RandomMergePolicy wrapping class org.apache.lucene.index.TieredMergePolicy: [TieredMergePolicy: maxMergeAtOnce=48, maxMergeAtOnceExplicit=27, maxMergedSegmentMB=94.2880859375, floorSegmentMB=0.3359375, forceMergeDeletesPctAllowed=15.947713286972219, segmentsPerTier=50.0, maxCFSSegmentSizeMB=8.796093022207999E12, noCFSRatio=0.0
   [junit4]   2> 597680 INFO  (coreLoadExecutor-1161-thread-1-processing-n:127.0.0.1:33680_) [n:127.0.0.1:33680_ c:control_collection s:shard1 r:core_node1 x:collection1] o.a.s.c.SolrDeletionPolicy SolrDeletionPolicy.onInit: commits: num=1
   [junit4]   2> 	commit{dir=MockDirectoryWrapper(RAMDirectory@72884a95 lockFactory=org.apache.lucene.store.SingleInstanceLockFactory@12f5ca54),segFN=segments_1,generation=1}
   [junit4]   2> 597680 INFO  (coreLoadExecutor-1161-thread-1-processing-n:127.0.0.1:33680_) [n:127.0.0.1:33680_ c:control_collection s:shard1 r:core_node1 x:collection1] o.a.s.c.SolrDeletionPolicy newest commit generation = 1
   [junit4]   2> 597680 INFO  (coreLoadExecutor-1161-thread-1-processing-n:127.0.0.1:33680_) [n:127.0.0.1:33680_ c:control_collection s:shard1 r:core_node1 x:collection1] o.a.s.s.SolrIndexSearcher Opening [Searcher@6ad6ca2b[collection1] main]
   [junit4]   2> 597680 INFO  (coreLoadExecutor-1161-thread-1-processing-n:127.0.0.1:33680_) [n:127.0.0.1:33680_ c:control_collection s:shard1 r:core_node1 x:collection1] o.a.s.c.c.ZkStateReader Load collection config from: [/collections/control_collection]
   [junit4]   2> 597685 INFO  (coreLoadExecutor-1161-thread-1-processing-n:127.0.0.1:33680_) [n:127.0.0.1:33680_ c:control_collection s:shard1 r:core_node1 x:collection1] o.a.s.c.c.ZkStateReader path=[/collections/control_collection] [configName]=[conf1] specified config exists in ZooKeeper
   [junit4]   2> 597685 INFO  (coreLoadExecutor-1161-thread-1-processing-n:127.0.0.1:33680_) [n:127.0.0.1:33680_ c:control_collection s:shard1 r:core_node1 x:collection1] o.a.s.r.ManagedResourceStorage Setting up ZooKeeper-based storage for the RestManager with znodeBase: /configs/conf1
   [junit4]   2> 597686 INFO  (coreLoadExecutor-1161-thread-1-processing-n:127.0.0.1:33680_) [n:127.0.0.1:33680_ c:control_collection s:shard1 r:core_node1 x:collection1] o.a.s.r.ManagedResourceStorage Configured ZooKeeperStorageIO with znodeBase: /configs/conf1
   [junit4]   2> 597686 INFO  (coreLoadExecutor-1161-thread-1-processing-n:127.0.0.1:33680_) [n:127.0.0.1:33680_ c:control_collection s:shard1 r:core_node1 x:collection1] o.a.s.r.RestManager Initializing RestManager with initArgs: {}
   [junit4]   2> 597686 INFO  (coreLoadExecutor-1161-thread-1-processing-n:127.0.0.1:33680_) [n:127.0.0.1:33680_ c:control_collection s:shard1 r:core_node1 x:collection1] o.a.s.r.ManagedResourceStorage Reading _rest_managed.json using ZooKeeperStorageIO:path=/configs/conf1
   [junit4]   2> 597686 INFO  (coreLoadExecutor-1161-thread-1-processing-n:127.0.0.1:33680_) [n:127.0.0.1:33680_ c:control_collection s:shard1 r:core_node1 x:collection1] o.a.s.r.ManagedResourceStorage No data found for znode /configs/conf1/_rest_managed.json
   [junit4]   2> 597686 INFO  (coreLoadExecutor-1161-thread-1-processing-n:127.0.0.1:33680_) [n:127.0.0.1:33680_ c:control_collection s:shard1 r:core_node1 x:collection1] o.a.s.r.ManagedResourceStorage Loaded null at path _rest_managed.json using ZooKeeperStorageIO:path=/configs/conf1
   [junit4]   2> 597687 INFO  (coreLoadExecutor-1161-thread-1-processing-n:127.0.0.1:33680_) [n:127.0.0.1:33680_ c:control_collection s:shard1 r:core_node1 x:collection1] o.a.s.r.RestManager Initializing 0 registered ManagedResources
   [junit4]   2> 597687 INFO  (coreLoadExecutor-1161-thread-1-processing-n:127.0.0.1:33680_) [n:127.0.0.1:33680_ c:control_collection s:shard1 r:core_node1 x:collection1] o.a.s.h.ReplicationHandler Commits will be reserved for  10000
   [junit4]   2> 597688 INFO  (searcherExecutor-1162-thread-1-processing-n:127.0.0.1:33680_ x:collection1 s:shard1 c:control_collection r:core_node1) [n:127.0.0.1:33680_ c:control_collection s:shard1 r:core_node1 x:collection1] o.a.s.c.SolrCore [collection1] Registered new searcher Searcher@6ad6ca2b[collection1] main{ExitableDirectoryReader(UninvertingDirectoryReader())}
   [junit4]   2> 597688 INFO  (coreLoadExecutor-1161-thread-1-processing-n:127.0.0.1:33680_) [n:127.0.0.1:33680_ c:control_collection s:shard1 r:core_node1 x:collection1] o.a.s.u.UpdateLog Looking up max value of version field to seed version buckets
   [junit4]   2> 597688 INFO  (coreLoadExecutor-1161-thread-1-processing-n:127.0.0.1:33680_) [n:127.0.0.1:33680_ c:control_collection s:shard1 r:core_node1 x:collection1] o.a.s.u.VersionInfo Refreshing highest value of _version_ for 65536 version buckets from index
   [junit4]   2> 597688 INFO  (coreLoadExecutor-1161-thread-1-processing-n:127.0.0.1:33680_) [n:127.0.0.1:33680_ c:control_collection s:shard1 r:core_node1 x:collection1] o.a.s.u.VersionInfo No terms found for _version_, cannot seed version bucket highest value from index
   [junit4]   2> 597688 INFO  (coreLoadExecutor-1161-thread-1-processing-n:127.0.0.1:33680_) [n:127.0.0.1:33680_ c:control_collection s:shard1 r:core_node1 x:collection1] o.a.s.u.UpdateLog Could not find max version in index or recent updates, using new clock 1529011953042718720
   [junit4]   2> 597690 INFO  (coreLoadExecutor-1161-thread-1-processing-n:127.0.0.1:33680_) [n:127.0.0.1:33680_ c:control_collection s:shard1 r:core_node1 x:collection1] o.a.s.u.UpdateLog Took 2.0ms to seed version buckets with highest version 1529011953042718720
   [junit4]   2> 597690 INFO  (coreLoadExecutor-1161-thread-1-processing-n:127.0.0.1:33680_) [n:127.0.0.1:33680_ c:control_collection s:shard1 r:core_node1 x:collection1] o.a.s.c.ZkController watch zkdir /configs/conf1
   [junit4]   2> 597691 INFO  (coreLoadExecutor-1161-thread-1-processing-n:127.0.0.1:33680_) [n:127.0.0.1:33680_ c:control_collection s:shard1 r:core_node1 x:collection1] o.a.s.c.CoreContainer registering core: collection1
   [junit4]   2> 597692 INFO  (coreZkRegister-1155-thread-1-processing-n:127.0.0.1:33680_ x:collection1 s:shard1 c:control_collection r:core_node1) [n:127.0.0.1:33680_ c:control_collection s:shard1 r:core_node1 x:collection1] o.a.s.c.ZkController Register replica - core:collection1 address:http://127.0.0.1:33680 collection:control_collection shard:shard1
   [junit4]   2> 597693 INFO  (coreZkRegister-1155-thread-1-processing-n:127.0.0.1:33680_ x:collection1 s:shard1 c:control_collection r:core_node1) [n:127.0.0.1:33680_ c:control_collection s:shard1 r:core_node1 x:collection1] o.a.s.c.c.SolrZkClient makePath: /collections/control_collection/leader_elect/shard1/election
   [junit4]   2> 597699 INFO  (coreZkRegister-1155-thread-1-processing-n:127.0.0.1:33680_ x:collection1 s:shard1 c:control_collection r:core_node1) [n:127.0.0.1:33680_ c:control_collection s:shard1 r:core_node1 x:collection1] o.a.s.c.LeaderElector Joined leadership election with path: /collections/control_collection/leader_elect/shard1/election/95563246941831172-core_node1-n_0000000000
   [junit4]   2> 597699 INFO  (coreZkRegister-1155-thread-1-processing-n:127.0.0.1:33680_ x:collection1 s:shard1 c:control_collection r:core_node1) [n:127.0.0.1:33680_ c:control_collection s:shard1 r:core_node1 x:collection1] o.a.s.c.ShardLeaderElectionContext Running the leader process for shard=shard1 and weAreReplacement=false and leaderVoteWait=10000
   [junit4]   2> 597702 INFO  (coreZkRegister-1155-thread-1-processing-n:127.0.0.1:33680_ x:collection1 s:shard1 c:control_collection r:core_node1) [n:127.0.0.1:33680_ c:control_collection s:shard1 r:core_node1 x:collection1] o.a.s.c.ShardLeaderElectionContext Enough replicas found to continue.
   [junit4]   2> 597703 INFO  (coreZkRegister-1155-thread-1-processing-n:127.0.0.1:33680_ x:collection1 s:shard1 c:control_collection r:core_node1) [n:127.0.0.1:33680_ c:control_collection s:shard1 r:core_node1 x:collection1] o.a.s.c.ShardLeaderElectionContext I may be the new leader - try and sync
   [junit4]   2> 597703 INFO  (coreZkRegister-1155-thread-1-processing-n:127.0.0.1:33680_ x:collection1 s:shard1 c:control_collection r:core_node1) [n:127.0.0.1:33680_ c:control_collection s:shard1 r:core_node1 x:collection1] o.a.s.c.SyncStrategy Sync replicas to http://127.0.0.1:33680/collection1/
   [junit4]   2> 597703 INFO  (OverseerStateUpdate-95563246941831172-127.0.0.1:33680_-n_0000000000) [n:127.0.0.1:33680_    ] o.a.s.c.Overseer processMessage: queueSize: 1, message = {
   [junit4]   2>   "operation":"leader",
   [junit4]   2>   "shard":"shard1",
   [junit4]   2>   "collection":"control_collection"} current state version: 1
   [junit4]   2> 597703 INFO  (coreZkRegister-1155-thread-1-processing-n:127.0.0.1:33680_ x:collection1 s:shard1 c:control_collection r:core_node1) [n:127.0.0.1:33680_ c:control_collection s:shard1 r:core_node1 x:collection1] o.a.s.c.SyncStrategy Sync Success - now sync replicas to me
   [junit4]   2> 597703 INFO  (coreZkRegister-1155-thread-1-processing-n:127.0.0.1:33680_ x:collection1 s:shard1 c:control_collection r:core_node1) [n:127.0.0.1:33680_ c:control_collection s:shard1 r:core_node1 x:collection1] o.a.s.c.SyncStrategy http://127.0.0.1:33680/collection1/ has no replicas
   [junit4]   2> 597704 INFO  (coreZkRegister-1155-thread-1-processing-n:127.0.0.1:33680_ x:collection1 s:shard1 c:control_collection r:core_node1) [n:127.0.0.1:33680_ c:control_collection s:shard1 r:core_node1 x:collection1] o.a.s.c.c.SolrZkClient makePath: /collections/control_collection/leaders/shard1
   [junit4]   2> 597709 INFO  (coreZkRegister-1155-thread-1-processing-n:127.0.0.1:33680_ x:collection1 s:shard1 c:control_collection r:core_node1) [n:127.0.0.1:33680_ c:control_collection s:shard1 r:core_node1 x:collection1] o.a.s.c.ShardLeaderElectionContextBase Creating leader registration node /collections/control_collection/leaders/shard1/leader after winning as /collections/control_collection/leader_elect/shard1/election/95563246941831172-core_node1-n_0000000000
   [junit4]   2> 597712 INFO  (coreZkRegister-1155-thread-1-processing-n:127.0.0.1:33680_ x:collection1 s:shard1 c:control_collection r:core_node1) [n:127.0.0.1:33680_ c:control_collection s:shard1 r:core_node1 x:collection1] o.a.s.c.ShardLeaderElectionContext I am the new leader: http://127.0.0.1:33680/collection1/ shard1
   [junit4]   2> 597713 INFO  (OverseerStateUpdate-95563246941831172-127.0.0.1:33680_-n_0000000000) [n:127.0.0.1:33680_    ] o.a.s.c.Overseer processMessage: queueSize: 1, message = {
   [junit4]   2>   "operation":"leader",
   [junit4]   2>   "shard":"shard1",
   [junit4]   2>   "collection":"control_collection",
   [junit4]   2>   "base_url":"http://127.0.0.1:33680",
   [junit4]   2>   "core":"collection1",
   [junit4]   2>   "state":"active"} current state version: 1
   [junit4]   2> 597817 INFO  (zkCallback-449-thread-1-processing-n:127.0.0.1:33680_) [n:127.0.0.1:33680_    ] o.a.s.c.c.ZkStateReader A cluster state change: [WatchedEvent state:SyncConnected type:NodeDataChanged path:/clusterstate.json], has occurred - updating... (live nodes size: [1])
   [junit4]   2> 597866 INFO  (coreZkRegister-1155-thread-1-processing-n:127.0.0.1:33680_ x:collection1 s:shard1 c:control_collection r:core_node1) [n:127.0.0.1:33680_ c:control_collection s:shard1 r:core_node1 x:collection1] o.a.s.c.ZkController We are http://127.0.0.1:33680/collection1/ and leader is http://127.0.0.1:33680/collection1/
   [junit4]   2> 597866 INFO  (coreZkRegister-1155-thread-1-processing-n:127.0.0.1:33680_ x:collection1 s:shard1 c:control_collection r:core_node1) [n:127.0.0.1:33680_ c:control_collection s:shard1 r:core_node1 x:collection1] o.a.s.c.ZkController No LogReplay needed for core=collection1 baseURL=http://127.0.0.1:33680
   [junit4]   2> 597866 INFO  (coreZkRegister-1155-thread-1-processing-n:127.0.0.1:33680_ x:collection1 s:shard1 c:control_collection r:core_node1) [n:127.0.0.1:33680_ c:control_collection s:shard1 r:core_node1 x:collection1] o.a.s.c.ZkController I am the leader, no recovery necessary
   [junit4]   2> 597866 INFO  (coreZkRegister-1155-thread-1-processing-n:127.0.0.1:33680_ x:collection1 s:shard1 c:control_collection r:core_node1) [n:127.0.0.1:33680_ c:control_collection s:shard1 r:core_node1 x:collection1] o.a.s.c.ZkController publishing state=active
   [junit4]   2> 597866 INFO  (coreZkRegister-1155-thread-1-processing-n:127.0.0.1:33680_ x:collection1 s:shard1 c:control_collection r:core_node1) [n:127.0.0.1:33680_ c:control_collection s:shard1 r:core_node1 x:collection1] o.a.s.c.ZkController numShards not found on descriptor - reading it from system property
   [junit4]   2> 597886 INFO  (OverseerStateUpdate-95563246941831172-127.0.0.1:33680_-n_0000000000) [n:127.0.0.1:33680_    ] o.a.s.c.Overseer processMessage: queueSize: 1, message = {
   [junit4]   2>   "core":"collection1",
   [junit4]   2>   "core_node_name":"core_node1",
   [junit4]   2>   "roles":null,
   [junit4]   2>   "base_url":"http://127.0.0.1:33680",
   [junit4]   2>   "node_name":"127.0.0.1:33680_",
   [junit4]   2>   "numShards":"1",
   [junit4]   2>   "state":"active",
   [junit4]   2>   "shard":"shard1",
   [junit4]   2>   "collection":"control_collection",
   [junit4]   2>   "operation":"state"} current state version: 2
   [junit4]   2> 597889 INFO  (OverseerStateUpdate-95563246941831172-127.0.0.1:33680_-n_0000000000) [n:127.0.0.1:33680_    ] o.a.s.c.o.ReplicaMutator Update state numShards=1 message={
   [junit4]   2>   "core":"collection1",
   [junit4]   2>   "core_node_name":"core_node1",
   [junit4]   2>   "roles":null,
   [junit4]   2>   "base_url":"http://127.0.0.1:33680",
   [junit4]   2>   "node_name":"127.0.0.1:33680_",
   [junit4]   2>   "numShards":"1",
   [junit4]   2>   "state":"active",
   [junit4]   2>   "shard":"shard1",
   [junit4]   2>   "collection":"control_collection",
   [junit4]   2>   "operation":"state"}
   [junit4]   2> 597925 INFO  (TEST-TestReqParamsAPI.test-seed#[58D147216C216495]) [    ] o.a.s.c.c.SolrZkClient Using default ZkCredentialsProvider
   [junit4]   2> 597925 INFO  (TEST-TestReqParamsAPI.test-seed#[58D147216C216495]) [    ] o.a.s.c.c.ConnectionManager Waiting for client to connect to ZooKeeper
   [junit4]   2> 597929 INFO  (zkCallback-451-thread-1) [    ] o.a.s.c.c.ConnectionManager Watcher org.apache.solr.common.cloud.ConnectionManager@5045a75 name:ZooKeeperConnection Watcher:127.0.0.1:41609/solr got event WatchedEvent state:SyncConnected type:None path:null path:null type:None
   [junit4]   2> 597929 INFO  (TEST-TestReqParamsAPI.test-seed#[58D147216C216495]) [    ] o.a.s.c.c.ConnectionManager Client is connected to ZooKeeper
   [junit4]   2> 597929 INFO  (TEST-TestReqParamsAPI.test-seed#[58D147216C216495]) [    ] o.a.s.c.c.SolrZkClient Using default ZkACLProvider
   [junit4]   2> 597929 INFO  (TEST-TestReqParamsAPI.test-seed#[58D147216C216495]) [    ] o.a.s.c.c.ZkStateReader Updating cluster state from ZooKeeper... 
   [junit4]   2> 597937 INFO  (TEST-TestReqParamsAPI.test-seed#[58D147216C216495]) [    ] o.a.s.c.c.ZkStateReader Updated live nodes from ZooKeeper... (0) -> (1)
   [junit4]   2> 597938 INFO  (TEST-TestReqParamsAPI.test-seed#[58D147216C216495]) [    ] o.a.s.c.ChaosMonkey monkey: init - expire sessions:false cause connection loss:false
   [junit4]   2> 597938 INFO  (TEST-TestReqParamsAPI.test-seed#[58D147216C216495]) [    ] o.a.s.c.AbstractFullDistribZkTestBase Creating collection1 with stateFormat=2
   [junit4]   2> 597938 INFO  (TEST-TestReqParamsAPI.test-seed#[58D147216C216495]) [    ] o.a.s.c.c.SolrZkClient Using default ZkCredentialsProvider
   [junit4]   2> 597939 INFO  (TEST-TestReqParamsAPI.test-seed#[58D147216C216495]) [    ] o.a.s.c.c.ConnectionManager Waiting for client to connect to ZooKeeper
   [junit4]   2> 597942 INFO  (zkCallback-452-thread-1) [    ] o.a.s.c.c.ConnectionManager Watcher org.apache.solr.common.cloud.ConnectionManager@5c14a10f name:ZooKeeperConnection Watcher:127.0.0.1:41609/solr got event WatchedEvent state:SyncConnected type:None path:null path:null type:None
   [junit4]   2> 597942 INFO  (TEST-TestReqParamsAPI.test-seed#[58D147216C216495]) [    ] o.a.s.c.c.ConnectionManager Client is connected to ZooKeeper
   [junit4]   2> 597942 INFO  (TEST-TestReqParamsAPI.test-seed#[58D147216C216495]) [    ] o.a.s.c.c.SolrZkClient Using default ZkACLProvider
   [junit4]   2> 597948 INFO  (OverseerStateUpdate-95563246941831172-127.0.0.1:33680_-n_0000000000) [n:127.0.0.1:33680_    ] o.a.s.c.Overseer processMessage: queueSize: 1, message = {
   [junit4]   2>   "operation":"create",
   [junit4]   2>   "name":"collection1",
   [junit4]   2>   "numShards":"2",
   [junit4]   2>   "stateFormat":"2"} current state version: 2
   [junit4]   2> 597948 INFO  (OverseerStateUpdate-95563246941831172-127.0.0.1:33680_-n_0000000000) [n:127.0.0.1:33680_    ] o.a.s.c.o.ClusterStateMutator building a new cName: collection1
   [junit4]   2> 597949 INFO  (zkCallback-449-thread-1-processing-n:127.0.0.1:33680_) [n:127.0.0.1:33680_    ] o.a.s.c.c.ZkStateReader A cluster state change: [WatchedEvent state:SyncConnected type:NodeDataChanged path:/clusterstate.json], has occurred - updating... (live nodes size: [1])
   [junit4]   2> 597951 INFO  (zkCallback-451-thread-1) [    ] o.a.s.c.c.ZkStateReader A cluster state change: [WatchedEvent state:SyncConnected type:NodeDataChanged path:/clusterstate.json], has occurred - updating... (live nodes size: [1])
   [junit4]   2> 598056 INFO  (OverseerStateUpdate-95563246941831172-127.0.0.1:33680_-n_0000000000) [n:127.0.0.1:33680_    ] o.a.s.c.o.ZkStateWriter going to create_collection /collections/collection1/state.json
   [junit4]   2> 598149 INFO  (TEST-TestReqParamsAPI.test-seed#[58D147216C216495]) [    ] o.a.s.SolrTestCaseJ4 Writing core.properties file to /export/home/jenkins/workspace/Lucene-Solr-6.x-Solaris/solr/build/solr-core/test/J1/temp/solr.handler.TestReqParamsAPI_58D147216C216495-001/shard-1-001/cores/collection1
   [junit4]   2> 598150 INFO  (TEST-TestReqParamsAPI.test-seed#[58D147216C216495]) [    ] o.a.s.c.AbstractFullDistribZkTestBase create jetty 1 in directory /export/home/jenkins/workspace/Lucene-Solr-6.x-Solaris/solr/build/solr-core/test/J1/temp/solr.handler.TestReqParamsAPI_58D147216C216495-001/shard-1-001
   [junit4]   2> 598151 INFO  (TEST-TestReqParamsAPI.test-seed#[58D147216C216495]) [    ] o.e.j.s.Server jetty-9.3.6.v20151106
   [junit4]   2> 598154 INFO  (TEST-TestReqParamsAPI.test-seed#[58D147216C216495]) [    ] o.e.j.s.h.ContextHandler Started o.e.j.s.ServletContextHandler@664cc42a{/,null,AVAILABLE}
   [junit4]   2> 598155 INFO  (TEST-TestReqParamsAPI.test-seed#[58D147216C216495]) [    ] o.e.j.s.ServerConnector Started ServerConnector@4fa24b24{HTTP/1.1,[http/1.1]}{127.0.0.1:44864}
   [junit4]   2> 598155 INFO  (TEST-TestReqParamsAPI.test-seed#[58D147216C216495]) [    ] o.e.j.s.Server Started @600886ms
   [junit4]   2> 598155 INFO  (TEST-TestReqParamsAPI.test-seed#[58D147216C216495]) [    ] o.a.s.c.s.e.JettySolrRunner Jetty properties: {solr.data.dir=/export/home/jenkins/workspace/Lucene-Solr-6.x-Solaris/solr/build/solr-core/test/J1/temp/solr.handler.TestReqParamsAPI_58D147216C216495-001/tempDir-001/jetty1, solrconfig=solrconfig.xml, hostContext=/, hostPort=44864, coreRootDirectory=/export/home/jenkins/workspace/Lucene-Solr-6.x-Solaris/solr/build/solr-core/test/J1/temp/solr.handler.TestReqParamsAPI_58D147216C216495-001/shard-1-001/cores}
   [junit4]   2> 598155 INFO  (TEST-TestReqParamsAPI.test-seed#[58D147216C216495]) [    ] o.a.s.s.SolrDispatchFilter SolrDispatchFilter.init(): sun.misc.Launcher$AppClassLoader@6d06d69c
   [junit4]   2> 598155 INFO  (TEST-TestReqParamsAPI.test-seed#[58D147216C216495]) [    ] o.a.s.c.SolrResourceLoader new SolrResourceLoader for directory: '/export/home/jenkins/workspace/Lucene-Solr-6.x-Solaris/solr/build/solr-core/test/J1/temp/solr.handler.TestReqParamsAPI_58D147216C216495-001/shard-1-001'
   [junit4]   2> 598156 INFO  (TEST-TestReqParamsAPI.test-seed#[58D147216C216495]) [    ] o.a.s.c.SolrResourceLoader JNDI not configured for solr (NoInitialContextEx)
   [junit4]   2> 598156 INFO  (TEST-TestReqParamsAPI.test-seed#[58D147216C216495]) [    ] o.a.s.c.SolrResourceLoader solr home defaulted to 'solr/' (could not find system property or JNDI)
   [junit4]   2> 598156 INFO  (TEST-TestReqParamsAPI.test-seed#[58D147216C216495]) [    ] o.a.s.c.c.SolrZkClient Using default ZkCredentialsProvider
   [junit4]   2> 598157 INFO  (TEST-TestReqParamsAPI.test-seed#[58D147216C216495]) [    ] o.a.s.c.c.ConnectionManager Waiting for client to connect to ZooKeeper
   [junit4]   2> 598160 INFO  (zkCallback-453-thread-1) [    ] o.a.s.c.c.ConnectionManager Watcher org.apache.solr.common.cloud.ConnectionManager@7ba46563 name:ZooKeeperConnection Watcher:127.0.0.1:41609/solr got event WatchedEvent state:SyncConnected type:None path:null path:null type:None
   [junit4]   2> 598160 INFO  (TEST-TestReqParamsAPI.test-seed#[58D147216C216495]) [    ] o.a.s.c.c.ConnectionManager Client is connected to ZooKeeper
   [junit4]   2> 598161 INFO  (TEST-TestReqParamsAPI.test-seed#[58D147216C216495]) [    ] o.a.s.c.c.SolrZkClient Using default ZkACLProvider
   [junit4]   2> 598163 INFO  (TEST-TestReqParamsAPI.test-seed#[58D147216C216495]) [    ] o.a.s.s.SolrDispatchFilter Loading solr.xml from SolrHome (not found in ZooKeeper)
   [junit4]   2> 598163 INFO  (TEST-TestReqParamsAPI.test-seed#[58D147216C216495]) [    ] o.a.s.c.SolrXmlConfig Loading container configuration from /export/home/jenkins/workspace/Lucene-Solr-6.x-Solaris/solr/build/solr-core/test/J1/temp/solr.handler.TestReqParamsAPI_58D147216C216495-001/shard-1-001/solr.xml
   [junit4]   2> 598168 INFO  (TEST-TestReqParamsAPI.test-seed#[58D147216C216495]) [    ] o.a.s.c.CorePropertiesLocator Config-defined core root directory: /export/home/jenkins/workspace/Lucene-Solr-6.x-Solaris/solr/build/solr-core/test/J1/temp/solr.handler.TestReqParamsAPI_58D147216C216495-001/shard-1-001/cores
   [junit4]   2> 598168 INFO  (TEST-TestReqParamsAPI.test-seed#[58D147216C216495]) [    ] o.a.s.c.CoreContainer New CoreContainer 518884887
   [junit4]   2> 598168 INFO  (TEST-TestReqParamsAPI.test-seed#[58D147216C216495]) [    ] o.a.s.c.CoreContainer Loading cores into CoreContainer [instanceDir=/export/home/jenkins/workspace/Lucene-Solr-6.x-Solaris/solr/build/solr-core/test/J1/temp/solr.handler.TestReqParamsAPI_58D147216C216495-001/shard-1-001]
   [junit4]   2> 598169 WARN  (TEST-TestReqParamsAPI.test-seed#[58D147216C216495]) [    ] o.a.s.c.CoreContainer Couldn't add files from /export/home/jenkins/workspace/Lucene-Solr-6.x-Solaris/solr/build/solr-core/test/J1/temp/solr.handler.TestReqParamsAPI_58D147216C216495-001/shard-1-001/lib to classpath: /export/home/jenkins/workspace/Lucene-Solr-6.x-Solaris/solr/build/solr-core/test/J1/temp/solr.handler.TestReqParamsAPI_58D147216C216495-001/shard-1-001/lib
   [junit4]   2> 598169 INFO  (TEST-TestReqParamsAPI.test-seed#[58D147216C216495]) [    ] o.a.s.h.c.HttpShardHandlerFactory created with socketTimeout : 90000,urlScheme : ,connTimeout : 15000,maxConnectionsPerHost : 20,maxConnections : 10000,corePoolSize : 0,maximumPoolSize : 2147483647,maxThreadIdleTime : 5,sizeOfQueue : -1,fairnessPolicy : false,useRetries : false,
   [junit4]   2> 598170 INFO  (TEST-TestReqParamsAPI.test-seed#[58D147216C216495]) [    ] o.a.s.u.UpdateShardHandler Creating UpdateShardHandler HTTP client with params: socketTimeout=340000&connTimeout=45000&retry=true
   [junit4]   2> 598170 INFO  (TEST-TestReqParamsAPI.test-seed#[58D147216C216495]) [    ] o.a.s.l.LogWatcher SLF4J impl is org.slf4j.impl.Log4jLoggerFactory
   [junit4]   2> 598170 INFO  (TEST-TestReqParamsAPI.test-seed#[58D147216C216495]) [    ] o.a.s.l.LogWatcher Registering Log Listener [Log4j (org.slf4j.impl.Log4jLoggerFactory)]
   [junit4]   2> 598170 INFO  (TEST-TestReqParamsAPI.test-seed#[58D147216C216495]) [    ] o.a.s.c.ZkContainer Zookeeper client=127.0.0.1:41609/solr
   [junit4]   2> 598170 INFO  (TEST-TestReqParamsAPI.test-seed#[58D147216C216495]) [    ] o.a.s.c.ZkController zkHost includes chroot
   [junit4]   2> 598170 INFO  (TEST-TestReqParamsAPI.test-seed#[58D147216C216495]) [    ] o.a.s.c.c.SolrZkClient Using default ZkCredentialsProvider
   [junit4]   2> 598171 INFO  (TEST-TestReqParamsAPI.test-seed#[58D147216C216495]) [    ] o.a.s.c.c.ConnectionManager Waiting for client to connect to ZooKeeper
   [junit4]   2> 598174 INFO  (zkCallback-456-thread-1) [    ] o.a.s.c.c.ConnectionManager Watcher org.apache.solr.common.cloud.ConnectionManager@6fe600a4 name:ZooKeeperConnection Watcher:127.0.0.1:41609 got event WatchedEvent state:SyncConnected type:None path:null path:null type:None
   [junit4]   2> 598176 INFO  (TEST-TestReqParamsAPI.test-seed#[58D147216C216495]) [    ] o.a.s.c.c.ConnectionManager Client is connected to ZooKeeper
   [junit4]   2> 598176 INFO  (TEST-TestReqParamsAPI.test-seed#[58D147216C216495]) [    ] o.a.s.c.c.SolrZkClient Using default ZkACLProvider
   [junit4]   2> 598178 INFO  (TEST-TestReqParamsAPI.test-seed#[58D147216C216495]) [n:127.0.0.1:44864_    ] o.a.s.c.c.ConnectionManager Waiting for client to connect to ZooKeeper
   [junit4]   2> 598181 INFO  (zkCallback-457-thread-1-processing-n:127.0.0.1:44864_) [n:127.0.0.1:44864_    ] o.a.s.c.c.ConnectionManager Watcher org.apache.solr.common.cloud.ConnectionManager@ef79c71 name:ZooKeeperConnection Watcher:127.0.0.1:41609/solr got event WatchedEvent state:SyncConnected type:None path:null path:null type:None
   [junit4]   2> 598181 INFO  (TEST-TestReqParamsAPI.test-seed#[58D147216C216495]) [n:127.0.0.1:44864_    ] o.a.s.c.c.ConnectionManager Client is connected to ZooKeeper
   [junit4]   2> 598196 INFO  (TEST-TestReqParamsAPI.test-seed#[58D147216C216495]) [n:127.0.0.1:44864_    ] o.a.s.c.c.ZkStateReader Updating cluster state from ZooKeeper... 
   [junit4]   2> 598200 INFO  (TEST-TestReqParamsAPI.test-seed#[58D147216C216495]) [n:127.0.0.1:44864_    ] o.a.s.c.c.ZkStateReader Updated live nodes from ZooKeeper... (0) -> (1)
   [junit4]   2> 598205 INFO  (TEST-TestReqParamsAPI.test-seed#[58D147216C216495]) [n:127.0.0.1:44864_    ] o.a.s.c.Overseer Overseer (id=null) closing
   [junit4]   2> 598206 INFO  (TEST-TestReqParamsAPI.test-seed#[58D147216C216495]) [n:127.0.0.1:44864_    ] o.a.s.c.LeaderElector Joined leadership election with path: /overseer_elect/election/95563246941831177-127.0.0.1:44864_-n_0000000001
   [junit4]   2> 598209 INFO  (TEST-TestReqParamsAPI.test-seed#[58D147216C216495]) [n:127.0.0.1:44864_    ] o.a.s.c.LeaderElector Watching path /overseer_elect/election/95563246941831172-127.0.0.1:33680_-n_0000000000 to know if I could be the leader
   [junit4]   2> 598210 INFO  (TEST-TestReqParamsAPI.test-seed#[58D147216C216495]) [n:127.0.0.1:44864_    ] o.a.s.c.ZkController Publish node=127.0.0.1:44864_ as DOWN
   [junit4]   2> 598214 INFO  (OverseerStateUpdate-95563246941831172-127.0.0.1:33680_-n_0000000000) [n:127.0.0.1:33680_    ] o.a.s.c.Overseer processMessage: queueSize: 1, message = {
   [junit4]   2>   "operation":"downnode",
   [junit4]   2>   "node_name":"127.0.0.1:44864_"} current state version: 3
   [junit4]   2> 598214 INFO  (OverseerStateUpdate-95563246941831172-127.0.0.1:33680_-n_0000000000) [n:127.0.0.1:33680_    ] o.a.s.c.o.NodeMutator DownNode state invoked for node: 127.0.0.1:44864_
   [junit4]   2> 598215 INFO  (OverseerStateUpdate-95563246941831172-127.0.0.1:33680_-n_0000000000) [n:127.0.0.1:33680_    ] o.a.s.c.o.ZkStateWriter going to update_collection /collections/collection1/state.json version: 0
   [junit4]   2> 598328 INFO  (zkCallback-451-thread-1) [    ] o.a.s.c.c.ZkStateReader A cluster state change: [WatchedEvent state:SyncConnected type:NodeDataChanged path:/clusterstate.json], has occurred - updating... (live nodes size: [1])
   [junit4]   2> 598328 INFO  (zkCallback-457-thread-1-processing-n:127.0.0.1:44864_) [n:127.0.0.1:44864_    ] o.a.s.c.c.ZkStateReader A cluster state change: [WatchedEvent state:SyncConnected type:NodeDataChanged path:/clusterstate.json], has occurred - updating... (live nodes size: [1])
   [junit4]   2> 598328 INFO  (zkCallback-449-thread-1-processing-n:127.0.0.1:33680_) [n:127.0.0.1:33680_    ] o.a.s.c.c.ZkStateReader A cluster state change: [WatchedEvent state:SyncConnected type:NodeDataChanged path:/clusterstate.json], has occurred - updating... (live nodes size: [1])
   [junit4]   2> 599216 INFO  (TEST-TestReqParamsAPI.test-seed#[58D147216C216495]) [n:127.0.0.1:44864_    ] o.a.s.c.ZkController Register node as live in ZooKeeper:/live_nodes/127.0.0.1:44864_
   [junit4]   2> 599218 INFO  (TEST-TestReqParamsAPI.test-seed#[58D147216C216495]) [n:127.0.0.1:44864_    ] o.a.s.c.c.SolrZkClient makePath: /live_nodes/127.0.0.1:44864_
   [junit4]   2> 599220 INFO  (zkCallback-449-thread-1-processing-n:127.0.0.1:33680_) [n:127.0.0.1:33680_    ] o.a.s.c.c.ZkStateReader A live node change: [WatchedEvent state:SyncConnected type:NodeChildrenChanged path:/live_nodes], has occurred - updating... (live nodes size: [1])
   [junit4]   2> 599221 INFO  (zkCallback-449-thread-1-processing-n:127.0.0.1:33680_) [n:127.0.0.1:33680_    ] o.a.s.c.c.ZkStateReader Updated live nodes from ZooKeeper... (1) -> (2)
   [junit4]   2> 599221 INFO  (zkCallback-457-thread-1-processing-n:127.0.0.1:44864_) [n:127.0.0.1:44864_    ] o.a.s.c.c.ZkStateReader A live node change: [WatchedEvent state:SyncConnected type:NodeChildrenChanged path:/live_nodes], has occurred - updating... (live nodes size: [1])
   [junit4]   2> 599221 INFO  (zkCallback-451-thread-1) [    ] o.a.s.c.c.ZkStateReader A live node change: [WatchedEvent state:SyncConnected type:NodeChildrenChanged path:/live_nodes], has occurred - updating... (live nodes size: [1])
   [junit4]   2> 599223 INFO  (zkCallback-451-thread-1) [    ] o.a.s.c.c.ZkStateReader Updated live nodes from ZooKeeper... (1) -> (2)
   [junit4]   2> 599223 INFO  (zkCallback-457-thread-1-processing-n:127.0.0.1:44864_) [n:127.0.0.1:44864_    ] o.a.s.c.c.ZkStateReader Updated live nodes from ZooKeeper... (1) -> (2)
   [junit4]   2> 599283 INFO  (TEST-TestReqParamsAPI.test-seed#[58D147216C216495]) [n:127.0.0.1:44864_    ] o.a.s.c.CoreContainer Security conf doesn't exist. Skipping setup for authorization module.
   [junit4]   2> 599283 INFO  (TEST-TestReqParamsAPI.test-seed#[58D147216C216495]) [n:127.0.0.1:44864_    ] o.a.s.c.CoreContainer No authentication plugin used.
   [junit4]   2> 599284 INFO  (TEST-TestReqParamsAPI.test-seed#[58D147216C216495]) [n:127.0.0.1:44864_    ] o.a.s.c.CorePropertiesLocator Looking for core definitions underneath /export/home/jenkins/workspace/Lucene-Solr-6.x-Solaris/solr/build/solr-core/test/J1/temp/solr.handler.TestReqParamsAPI_58D147216C216495-001/shard-1-001/cores
   [junit4]   2> 599285 INFO  (TEST-TestReqParamsAPI.test-seed#[58D147216C216495]) [n:127.0.0.1:44864_    ] o.a.s.c.CoreDescriptor Created CoreDescriptor: {name=collection1, config=solrconfig.xml, transient=false, schema=schema.xml, loadOnStartup=true, configSetProperties=configsetprops.json, collection=collection1, coreNodeName=, dataDir=data/, shard=}
   [junit4]   2> 599285 INFO  (TEST-TestReqParamsAPI.test-seed#[58D147216C216495]) [n:127.0.0.1:44864_    ] o.a.s.c.CorePropertiesLocator Found core collection1 in /export/home/jenkins/workspace/Lucene-Solr-6.x-Solaris/solr/build/solr-core/test/J1/temp/solr.handler.TestReqParamsAPI_58D147216C216495-001/shard-1-001/cores/collection1
   [junit4]   2> 599286 INFO  (TEST-TestReqParamsAPI.test-seed#[58D147216C216495]) [n:127.0.0.1:44864_    ] o.a.s.c.CorePropertiesLocator Found 1 core definitions
   [junit4]   2> 599290 INFO  (coreLoadExecutor-1172-thread-1-processing-n:127.0.0.1:44864_) [n:127.0.0.1:44864_ c:collection1   x:collection1] o.a.s.c.ZkController publishing state=down
   [junit4]   2> 599290 INFO  (coreLoadExecutor-1172-thread-1-processing-n:127.0.0.1:44864_) [n:127.0.0.1:44864_ c:collection1   x:collection1] o.a.s.c.ZkController numShards not found on descriptor - reading it from system property
   [junit4]   2> 599293 INFO  (TEST-TestReqParamsAPI.test-seed#[58D147216C216495]) [n:127.0.0.1:44864_    ] o.a.s.s.SolrDispatchFilter user.dir=/export/home/jenkins/workspace/Lucene-Solr-6.x-Solaris/solr/build/solr-core/test/J1
   [junit4]   2> 599293 INFO  (TEST-TestReqParamsAPI.test-seed#[58D147216C216495]) [n:127.0.0.1:44864_    ] o.a.s.s.SolrDispatchFilter SolrDispatchFilter.init() done
   [junit4]   2> 599298 INFO  (OverseerStateUpdate-95563246941831172-127.0.0.1:33680_-n_0000000000) [n:127.0.0.1:33680_    ] o.a.s.c.Overseer processMessage: queueSize: 1, message = {
   [junit4]   2>   "core":"collection1",
   [junit4]   2>   "roles":null,
   [junit4]   2>   "base_url":"http://127.0.0.1:44864",
   [junit4]   2>   "node_name":"127.0.0.1:44864_",
   [junit4]   2>   "numShards":"2",
   [junit4]   2>   "state":"down",
   [junit4]   2>   "shard":null,
   [junit4]   2>   "collection":"collection1",
   [junit4]   2>   "operation":"state"} current state version: 4
   [junit4]   2> 599299 INFO  (coreLoadExecutor-1172-thread-1-processing-n:127.0.0.1:44864_) [n:127.0.0.1:44864_ c:collection1   x:collection1] o.a.s.c.ZkController Registering watch for collection collection1
   [junit4]   2> 599299 INFO  (coreLoadExecutor-1172-thread-1-processing-n:127.0.0.1:44864_) [n:127.0.0.1:44864_ c:collection1   x:collection1] o.a.s.c.c.ZkStateReader addZkWatch [collection1]
   [junit4]   2> 599300 INFO  (OverseerStateUpdate-95563246941831172-127.0.0.1:33680_-n_0000000000) [n:127.0.0.1:33680_    ] o.a.s.c.o.ReplicaMutator Update state numShards=2 message={
   [junit4]   2>   "core":"collection1",
   [junit4]   2>   "roles":null,
   [junit4]   2>   "base_url":"http://127.0.0.1:44864",
   [junit4]   2>   "node_name":"127.0.0.1:44864_",
   [junit4]   2>   "numShards":"2",
   [junit4]   2>   "state":"down",
   [junit4]   2>   "shard":null,
   [junit4]   2>   "collection":"collection1",
   [junit4]   2>   "operation":"state"}
   [junit4]   2> 599300 INFO  (OverseerStateUpdate-95563246941831172-127.0.0.1:33680_-n_0000000000) [n:127.0.0.1:33680_    ] o.a.s.c.o.ReplicaMutator Collection already exists with numShards=2
   [junit4]   2> 599300 INFO  (OverseerStateUpdate-95563246941831172-127.0.0.1:33680_-n_0000000000) [n:127.0.0.1:33680_    ] o.a.s.c.o.ReplicaMutator Assigning new node to shard shard=shard2
   [junit4]   2> 599301 INFO  (coreLoadExecutor-1172-thread-1-processing-n:127.0.0.1:44864_) [n:127.0.0.1:44864_ c:collection1   x:collection1] o.a.s.c.c.ZkStateReader Add data for [collection1] ver [1]
   [junit4]   2> 599301 INFO  (coreLoadExecutor-1172-thread-1-processing-n:127.0.0.1:44864_) [n:127.0.0.1:44864_ c:collection1   x:collection1] o.a.s.c.ZkController look for our core node name
   [junit4]   2> 599414 INFO  (OverseerStateUpdate-95563246941831172-127.0.0.1:33680_-n_0000000000) [n:127.0.0.1:33680_    ] o.a.s.c.o.ZkStateWriter going to update_collection /collections/collection1/state.json version: 1
   [junit4]   2> 599422 INFO  (zkCallback-457-thread-1-processing-n:127.0.0.1:44864_) [n:127.0.0.1:44864_    ] o.a.s.c.c.ZkStateReader A cluster state change: [WatchedEvent state:SyncConnected type:NodeDataChanged path:/collections/collection1/state.json] for collection [collection1] has occurred - updating... (live nodes size: [2])
   [junit4]   2> 599424 INFO  (zkCallback-457-thread-1-processing-n:127.0.0.1:44864_) [n:127.0.0.1:44864_    ] o.a.s.c.c.ZkStateReader Updating data for [collection1] from [1] to [2]
   [junit4]   2> 600302 INFO  (coreLoadExecutor-1172-thread-1-processing-n:127.0.0.1:44864_) [n:127.0.0.1:44864_ c:collection1   x:collection1] o.a.s.c.ZkController waiting to find shard id in clusterstate for collection1
   [junit4]   2> 600302 INFO  (coreLoadExecutor-1172-thread-1-processing-n:127.0.0.1:44864_) [n:127.0.0.1:44864_ c:collection1   x:collection1] o.a.s.c.ZkController Check for collection zkNode:collection1
   [junit4]   2> 600303 INFO  (coreLoadExecutor-1172-thread-1-processing-n:127.0.0.1:44864_) [n:127.0.0.1:44864_ c:collection1   x:collection1] o.a.s.c.ZkController Collection zkNode exists
   [junit4]   2> 600303 INFO  (coreLoadExecutor-1172-thread-1-processing-n:127.0.0.1:44864_) [n:127.0.0.1:44864_ c:collection1   x:collection1] o.a.s.c.c.ZkStateReader Load collection config from: [/collections/collection1]
   [junit4]   2> 600305 INFO  (coreLoadExecutor-1172-thread-1-processing-n:127.0.0.1:44864_) [n:127.0.0.1:44864_ c:collection1   x:collection1] o.a.s.c.c.ZkStateReader path=[/collections/collection1] [configName]=[conf1] specified config exists in ZooKeeper
   [junit4]   2> 600305 INFO  (coreLoadExecutor-1172-thread-1-processing-n:127.0.0.1:44864_) [n:127.0.0.1:44864_ c:collection1   x:collection1] o.a.s.c.SolrResourceLoader new SolrResourceLoader for directory: '/export/home/jenkins/workspace/Lucene-Solr-6.x-Solaris/solr/build/solr-core/test/J1/temp/solr.handler.TestReqParamsAPI_58D147216C216495-001/shard-1-001/cores/collection1'
   [junit4]   2> 600305 INFO  (coreLoadExecutor-1172-thread-1-processing-n:127.0.0.1:44864_) [n:127.0.0.1:44864_ c:collection1   x:collection1] o.a.s.c.SolrResourceLoader JNDI not configured for solr (NoInitialContextEx)
   [junit4]   2> 600305 INFO  (coreLoadExecutor-1172-thread-1-processing-n:127.0.0.1:44864_) [n:127.0.0.1:44864_ c:collection1   x:collection1] o.a.s.c.SolrResourceLoader solr home defaulted to 'solr/' (could not find system property or JNDI)
   [junit4]   2> 600308 INFO  (coreLoadExecutor-1172-thread-1-processing-n:127.0.0.1:44864_) [n:127.0.0.1:44864_ c:collection1   x:collection1] o.a.s.c.Config loaded config solrconfig.xml with version 0 
   [junit4]   2> 600318 INFO  (coreLoadExecutor-1172-thread-1-processing-n:127.0.0.1:44864_) [n:127.0.0.1:44864_ c:collection1   x:collection1] o.a.s.c.SolrConfig current version of requestparams : -1
   [junit4]   2> 600323 INFO  (coreLoadExecutor-1172-thread-1-processing-n:127.0.0.1:44864_) [n:127.0.0.1:44864_ c:collection1   x:collection1] o.a.s.c.SolrConfig Using Lucene MatchVersion: 6.1.0
   [junit4]   2> 600333 INFO  (coreLoadExecutor-1172-thread-1-processing-n:127.0.0.1:44864_) [n:127.0.0.1:44864_ c:collection1   x:collection1] o.a.s.c.SolrConfig Loaded SolrConfig: solrconfig.xml
   [junit4]   2> 600352 INFO  (coreLoadExecutor-1172-thread-1-processing-n:127.0.0.1:44864_) [n:127.0.0.1:44864_ c:collection1   x:collection1] o.a.s.s.IndexSchema [collection1] Schema name=test
   [junit4]   2> 600520 INFO  (coreLoadExecutor-1172-thread-1-processing-n:127.0.0.1:44864_) [n:127.0.0.1:44864_ c:collection1   x:collection1] o.a.s.s.OpenExchangeRatesOrgProvider Initialized with rates=open-exchange-rates.json, refreshInterval=1440.
   [junit4]   2> 600528 INFO  (coreLoadExecutor-1172-thread-1-processing-n:127.0.0.1:44864_) [n:127.0.0.1:44864_ c:collection1   x:collection1] o.a.s.s.IndexSchema default search field in schema is text
   [junit4]   2> 600529 INFO  (coreLoadExecutor-1172-thread-1-processing-n:127.0.0.1:44864_) [n:127.0.0.1:44864_ c:collection1   x:collection1] o.a.s.s.IndexSchema unique key field: id
   [junit4]   2> 600544 INFO  (coreLoadExecutor-1172-thread-1-processing-n:127.0.0.1:44864_) [n:127.0.0.1:44864_ c:collection1   x:collection1] o.a.s.s.FileExchangeRateProvider Reloading exchange rates from file currency.xml
   [junit4]   2> 600547 INFO  (coreLoadExecutor-1172-thread-1-processing-n:127.0.0.1:44864_) [n:127.0.0.1:44864_ c:collection1   x:collection1] o.a.s.s.FileExchangeRateProvider Reloading exchange rates from file currency.xml
   [junit4]   2> 600549 INFO  (coreLoadExecutor-1172-thread-1-processing-n:127.0.0.1:44864_) [n:127.0.0.1:44864_ c:collection1   x:collection1] o.a.s.s.OpenExchangeRatesOrgProvider Reloading exchange rates from open-exchange-rates.json
   [junit4]   2> 600551 INFO  (coreLoadExecutor-1172-thread-1-processing-n:127.0.0.1:44864_) [n:127.0.0.1:44864_ c:collection1   x:collection1] o.a.s.s.OpenExchangeRatesOrgProvider Reloading exchange rates from open-exchange-rates.json
   [junit4]   2> 600554 INFO  (coreLoadExecutor-1172-thread-1-processing-n:127.0.0.1:44864_) [n:127.0.0.1:44864_ c:collection1   x:collection1] o.a.s.c.ConfigSetProperties Did not find ConfigSet properties, assuming default properties: Can't find resource 'configsetprops.json' in classpath or '/configs/conf1', cwd=/export/home/jenkins/workspace/Lucene-Solr-6.x-Solaris/solr/build/solr-core/test/J1
   [junit4]   2> 600554 INFO  (coreLoadExecutor-1172-thread-1-processing-n:127.0.0.1:44864_) [n:127.0.0.1:44864_ c:collection1   x:collection1] o.a.s.c.CoreContainer Creating SolrCore 'collection1' using configuration from collection collection1
   [junit4]   2> 600554 INFO  (coreLoadExecutor-1172-thread-1-processing-n:127.0.0.1:44864_) [n:127.0.0.1:44864_ c:collection1 s:shard2 r:core_node1 x:collection1] o.a.s.c.SolrCore org.apache.solr.core.MockDirectoryFactory
   [junit4]   2> 600555 INFO  (coreLoadExecutor-1172-thread-1-processing-n:127.0.0.1:44864_) [n:127.0.0.1:44864_ c:collection1 s:shard2 r:core_node1 x:collection1] o.a.s.c.SolrCore [[collection1] ] Opening new SolrCore at [/export/home/jenkins/workspace/Lucene-Solr-6.x-Solaris/solr/build/solr-core/test/J1/temp/solr.handler.TestReqParamsAPI_58D147216C216495-001/shard-1-001/cores/collection1], dataDir=[/export/home/jenkins/workspace/Lucene-Solr-6.x-Solaris/solr/build/solr-core/test/J1/temp/solr.handler.TestReqParamsAPI_58D147216C216495-001/shard-1-001/cores/collection1/data/]
   [junit4]   2> 600555 INFO  (coreLoadExecutor-1172-thread-1-processing-n:127.0.0.1:44864_) [n:127.0.0.1:44864_ c:collection1 s:shard2 r:core_node1 x:collection1] o.a.s.c.JmxMonitoredMap JMX monitoring is enabled. Adding Solr mbeans to JMX Server: com.sun.jmx.mbeanserver.JmxMBeanServer@4456e8a5
   [junit4]   2> 600555 INFO  (coreLoadExecutor-1172-thread-1-processing-n:127.0.0.1:44864_) [n:127.0.0.1:44864_ c:collection1 s:shard2 r:core_node1 x:collection1] o.a.s.c.CachingDirectoryFactory return new directory for /export/home/jenkins/workspace/Lucene-Solr-6.x-Solaris/solr/build/solr-core/test/J1/temp/solr.handler.TestReqParamsAPI_58D147216C216495-001/shard-1-001/cores/collection1/data
   [junit4]   2> 600555 INFO  (coreLoadExecutor-1172-thread-1-processing-n:127.0.0.1:44864_) [n:127.0.0.1:44864_ c:collection1 s:shard2 r:core_node1 x:collection1] o.a.s.c.SolrCore New index directory detected: old=null new=/export/home/jenkins/workspace/Lucene-Solr-6.x-Solaris/solr/build/solr-core/test/J1/temp/solr.handler.TestReqParamsAPI_58D147216C216495-001/shard-1-001/cores/collection1/data/index/
   [junit4]   2> 600555 WARN  (coreLoadExecutor-1172-thread-1-processing-n:127.0.0.1:44864_) [n:127.0.0.1:44864_ c:collection1 s:shard2 r:core_node1 x:collection1] o.a.s.c.SolrCore [collection1] Solr index directory '/export/home/jenkins/workspace/Lucene-Solr-6.x-Solaris/solr/build/solr-core/test/J1/temp/solr.handler.TestReqParamsAPI_58D147216C216495-001/shard-1-001/cores/collection1/data/index' doesn't exist. Creating new index...
   [junit4]   2> 600556 INFO  (coreLoadExecutor-1172-thread-1-processing-n:127.0.0.1:44864_) [n:127.0.0.1:44864_ c:collection1 s:shard2 r:core_node1 x:collection1] o.a.s.c.CachingDirectoryFactory return new directory for /export/home/jenkins/workspace/Lucene-Solr-6.x-Solaris/solr/

[...truncated too long message...]

eCloseExecutor-1290-thread-1) [n:127.0.0.1:43245_ c:collection1 s:shard1 r:core_node4 x:collection1] o.a.s.c.CachingDirectoryFactory looking to close /export/home/jenkins/workspace/Lucene-Solr-6.x-Solaris/solr/build/solr-core/test/J1/../../../../../../../../../../export/home/jenkins/workspace/Lucene-Solr-6.x-Solaris/solr/build/solr-core/test/J1/temp/solr.handler.TestReqParamsAPI_58D147216C216495-001/shard-4-001/cores/collection1/data [CachedDir<<refCount=0;path=/export/home/jenkins/workspace/Lucene-Solr-6.x-Solaris/solr/build/solr-core/test/J1/../../../../../../../../../../export/home/jenkins/workspace/Lucene-Solr-6.x-Solaris/solr/build/solr-core/test/J1/temp/solr.handler.TestReqParamsAPI_58D147216C216495-001/shard-4-001/cores/collection1/data;done=false>>]
   [junit4]   2> 628035 INFO  (coreCloseExecutor-1290-thread-1) [n:127.0.0.1:43245_ c:collection1 s:shard1 r:core_node4 x:collection1] o.a.s.c.CachingDirectoryFactory Closing directory: /export/home/jenkins/workspace/Lucene-Solr-6.x-Solaris/solr/build/solr-core/test/J1/../../../../../../../../../../export/home/jenkins/workspace/Lucene-Solr-6.x-Solaris/solr/build/solr-core/test/J1/temp/solr.handler.TestReqParamsAPI_58D147216C216495-001/shard-4-001/cores/collection1/data
   [junit4]   2> 628035 INFO  (OverseerStateUpdate-95563246941831186-127.0.0.1:43245_-n_0000000004) [n:127.0.0.1:43245_    ] o.a.s.c.o.ZkStateWriter going to update_collection /collections/collection1/state.json version: 27
   [junit4]   2> 628037 INFO  (TEST-TestReqParamsAPI.test-seed#[58D147216C216495]) [    ] o.a.s.c.Overseer Overseer (id=95563246941831186-127.0.0.1:43245_-n_0000000004) closing
   [junit4]   2> 628037 INFO  (zkCallback-473-thread-1-processing-n:127.0.0.1:43245_) [n:127.0.0.1:43245_    ] o.a.s.c.c.ZkStateReader A cluster state change: [WatchedEvent state:SyncConnected type:NodeDataChanged path:/collections/collection1/state.json] for collection [collection1] has occurred - updating... (live nodes size: [1])
   [junit4]   2> 628037 INFO  (OverseerStateUpdate-95563246941831186-127.0.0.1:43245_-n_0000000004) [n:127.0.0.1:43245_    ] o.a.s.c.Overseer Overseer Loop exiting : 127.0.0.1:43245_
   [junit4]   2> 628040 ERROR (TEST-TestReqParamsAPI.test-seed#[58D147216C216495]-EventThread) [n:127.0.0.1:43245_    ] o.a.z.ClientCnxn Error while calling watcher 
   [junit4]   2> java.util.concurrent.RejectedExecutionException: Task org.apache.solr.common.util.ExecutorUtil$MDCAwareThreadPoolExecutor$$Lambda$6/1575377601@3da0344e rejected from org.apache.solr.common.util.ExecutorUtil$MDCAwareThreadPoolExecutor@12ea2b8[Shutting down, pool size = 2, active threads = 1, queued tasks = 0, completed tasks = 48]
   [junit4]   2> 	at java.util.concurrent.ThreadPoolExecutor$AbortPolicy.rejectedExecution(ThreadPoolExecutor.java:2047)
   [junit4]   2> 	at java.util.concurrent.ThreadPoolExecutor.reject(ThreadPoolExecutor.java:823)
   [junit4]   2> 	at java.util.concurrent.ThreadPoolExecutor.execute(ThreadPoolExecutor.java:1369)
   [junit4]   2> 	at org.apache.solr.common.util.ExecutorUtil$MDCAwareThreadPoolExecutor.execute(ExecutorUtil.java:214)
   [junit4]   2> 	at java.util.concurrent.AbstractExecutorService.submit(AbstractExecutorService.java:112)
   [junit4]   2> 	at org.apache.solr.common.cloud.SolrZkClient$3.process(SolrZkClient.java:266)
   [junit4]   2> 	at org.apache.zookeeper.ClientCnxn$EventThread.processEvent(ClientCnxn.java:522)
   [junit4]   2> 	at org.apache.zookeeper.ClientCnxn$EventThread.run(ClientCnxn.java:498)
   [junit4]   2> 629538 WARN  (zkCallback-473-thread-1-processing-n:127.0.0.1:43245_) [n:127.0.0.1:43245_    ] o.a.s.c.c.ZkStateReader ZooKeeper watch triggered, but Solr cannot talk to ZK: [KeeperErrorCode = Session expired for /collections/collection1/state.json]
   [junit4]   2> 629540 INFO  (TEST-TestReqParamsAPI.test-seed#[58D147216C216495]) [    ] o.e.j.s.ServerConnector Stopped ServerConnector@7f5d7a06{HTTP/1.1,[http/1.1]}{127.0.0.1:0}
   [junit4]   2> 629541 INFO  (TEST-TestReqParamsAPI.test-seed#[58D147216C216495]) [    ] o.e.j.s.h.ContextHandler Stopped o.e.j.s.ServletContextHandler@286a8e94{/,null,UNAVAILABLE}
   [junit4]   2> 629545 INFO  (TEST-TestReqParamsAPI.test-seed#[58D147216C216495]) [    ] o.a.s.c.ZkTestServer connecting to 127.0.0.1:41609 41609
   [junit4]   2> 629562 INFO  (Thread-1049) [    ] o.a.s.c.ZkTestServer connecting to 127.0.0.1:41609 41609
   [junit4]   2> 629564 WARN  (Thread-1049) [    ] o.a.s.c.ZkTestServer Watch limit violations: 
   [junit4]   2> Maximum concurrent create/delete watches above limit:
   [junit4]   2> 
   [junit4]   2> 	40	/solr/configs/conf1
   [junit4]   2> 	6	/solr/aliases.json
   [junit4]   2> 	5	/solr/security.json
   [junit4]   2> 
   [junit4]   2> Maximum concurrent data watches above limit:
   [junit4]   2> 
   [junit4]   2> 	6	/solr/clusterstate.json
   [junit4]   2> 	4	/solr/collections/collection1/state.json
   [junit4]   2> 
   [junit4]   2> Maximum concurrent children watches above limit:
   [junit4]   2> 
   [junit4]   2> 	6	/solr/live_nodes
   [junit4]   2> 	6	/solr/collections
   [junit4]   2> 	5	/solr/overseer/collection-queue-work
   [junit4]   2> 	3	/solr/overseer/queue
   [junit4]   2> 
   [junit4]   2> NOTE: reproduce with: ant test  -Dtestcase=TestReqParamsAPI -Dtests.method=test -Dtests.seed=58D147216C216495 -Dtests.slow=true -Dtests.locale=ar-SY -Dtests.timezone=Pacific/Pohnpei -Dtests.asserts=true -Dtests.file.encoding=ISO-8859-1
   [junit4] FAILURE 33.8s J1 | TestReqParamsAPI.test <<<
   [junit4]    > Throwable #1: java.lang.AssertionError: Could not get expected value  'first' for path 'response/params/x/_appends_/add' full output: {
   [junit4]    >   "responseHeader":{
   [junit4]    >     "status":0,
   [junit4]    >     "QTime":0},
   [junit4]    >   "response":{
   [junit4]    >     "znodeVersion":3,
   [junit4]    >     "params":{
   [junit4]    >       "x":{
   [junit4]    >         "a":"A val",
   [junit4]    >         "b":"B val",
   [junit4]    >         "":{"v":0}},
   [junit4]    >       "y":{
   [junit4]    >         "p":"P val",
   [junit4]    >         "q":"Q val",
   [junit4]    >         "":{"v":2}}}}}
   [junit4]    > 	at __randomizedtesting.SeedInfo.seed([58D147216C216495:D08578FBC2DD096D]:0)
   [junit4]    > 	at org.apache.solr.core.TestSolrConfigHandler.testForResponseElement(TestSolrConfigHandler.java:458)
   [junit4]    > 	at org.apache.solr.handler.TestReqParamsAPI.testReqParams(TestReqParamsAPI.java:236)
   [junit4]    > 	at org.apache.solr.handler.TestReqParamsAPI.test(TestReqParamsAPI.java:67)
   [junit4]    > 	at org.apache.solr.BaseDistributedSearchTestCase$ShardsRepeatRule$ShardsFixedStatement.callStatement(BaseDistributedSearchTestCase.java:996)
   [junit4]    > 	at org.apache.solr.BaseDistributedSearchTestCase$ShardsRepeatRule$ShardsStatement.evaluate(BaseDistributedSearchTestCase.java:971)
   [junit4]    > 	at java.lang.Thread.run(Thread.java:745)
   [junit4]   2> 629568 INFO  (SUITE-TestReqParamsAPI-seed#[58D147216C216495]-worker) [    ] o.a.s.SolrTestCaseJ4 ###deleteCore
   [junit4]   2> NOTE: leaving temporary files on disk at: /export/home/jenkins/workspace/Lucene-Solr-6.x-Solaris/solr/build/solr-core/test/J1/temp/solr.handler.TestReqParamsAPI_58D147216C216495-001
   [junit4]   2> Mar 17, 2016 1:51:00 AM com.carrotsearch.randomizedtesting.ThreadLeakControl checkThreadLeaks
   [junit4]   2> WARNING: Will linger awaiting termination of 1 leaked thread(s).
   [junit4]   2> NOTE: test params are: codec=Asserting(Lucene60): {}, docValues:{}, maxPointsInLeafNode=775, maxMBSortInHeap=4.794185752939428, sim=RandomSimilarity(queryNorm=true,coord=no): {}, locale=ar-SY, timezone=Pacific/Pohnpei
   [junit4]   2> NOTE: SunOS 5.11 amd64/Oracle Corporation 1.8.0_72 (64-bit)/cpus=3,threads=1,free=62801632,total=375390208
   [junit4]   2> NOTE: All tests run in this JVM: [DirectSolrConnectionTest, TestCloudManagedSchema, TriLevelCompositeIdRoutingTest, RequestLoggingTest, DefaultValueUpdateProcessorTest, ExplicitHLLTest, CopyFieldTest, HttpPartitionTest, TestAnalyzeInfixSuggestions, TestCrossCoreJoin, HdfsCollectionsAPIDistributedZkTest, HdfsBasicDistributedZk2Test, TestManagedSynonymFilterFactory, TestCloudSchemaless, InfoHandlerTest, ZkStateReaderTest, CollectionTooManyReplicasTest, TestUniqueKeyFieldResource, CdcrVersionReplicationTest, MigrateRouteKeyTest, ShowFileRequestHandlerTest, TestAuthorizationFramework, LoggingHandlerTest, BinaryUpdateRequestHandlerTest, AnalyticsMergeStrategyTest, TestConfigReload, SpellCheckComponentTest, TestUtils, TestOverriddenPrefixQueryForCustomFieldType, TestReqParamsAPI]
   [junit4] Completed [70/581 (1!)] on J1 in 34.06s, 1 test, 1 failure <<< FAILURES!

[...truncated 1660 lines...]
BUILD FAILED
/export/home/jenkins/workspace/Lucene-Solr-6.x-Solaris/build.xml:740: The following error occurred while executing this line:
/export/home/jenkins/workspace/Lucene-Solr-6.x-Solaris/build.xml:684: The following error occurred while executing this line:
/export/home/jenkins/workspace/Lucene-Solr-6.x-Solaris/build.xml:59: The following error occurred while executing this line:
/export/home/jenkins/workspace/Lucene-Solr-6.x-Solaris/solr/build.xml:233: The following error occurred while executing this line:
/export/home/jenkins/workspace/Lucene-Solr-6.x-Solaris/solr/common-build.xml:526: The following error occurred while executing this line:
/export/home/jenkins/workspace/Lucene-Solr-6.x-Solaris/lucene/common-build.xml:1457: The following error occurred while executing this line:
/export/home/jenkins/workspace/Lucene-Solr-6.x-Solaris/lucene/common-build.xml:1014: There were test failures: 581 suites (10 ignored), 2325 tests, 1 failure, 86 ignored (70 assumptions) [seed: 58D147216C216495]

Total time: 73 minutes 53 seconds
Build step 'Invoke Ant' marked build as failure
Archiving artifacts
[WARNINGS] Skipping publisher since build result is FAILURE
Recording test results
Email was triggered for: Failure - Any
Sending email for trigger: Failure - Any



Mime
View raw message