lucene-dev mailing list archives

Site index · List index
Message view « Date » · « Thread »
Top « Date » · « Thread »
From Policeman Jenkins Server <jenk...@thetaphi.de>
Subject [JENKINS] Lucene-Solr-master-Linux (64bit/jdk1.8.0_72) - Build # 16157 - Still Failing!
Date Wed, 09 Mar 2016 20:18:43 GMT
Build: http://jenkins.thetaphi.de/job/Lucene-Solr-master-Linux/16157/
Java: 64bit/jdk1.8.0_72 -XX:-UseCompressedOops -XX:+UseG1GC

3 tests failed.
FAILED:  org.apache.solr.cloud.TestCollectionAPI.test

Error Message:
No live SolrServers available to handle this request:[https://127.0.0.1:46150/_kvu/zh, https://127.0.0.1:38637/_kvu/zh, https://127.0.0.1:54669/_kvu/zh]

Stack Trace:
org.apache.solr.client.solrj.SolrServerException: No live SolrServers available to handle this request:[https://127.0.0.1:46150/_kvu/zh, https://127.0.0.1:38637/_kvu/zh, https://127.0.0.1:54669/_kvu/zh]
	at __randomizedtesting.SeedInfo.seed([29AC623EA1484E7:8ACEF9F944E8E91F]:0)
	at org.apache.solr.client.solrj.impl.LBHttpSolrClient.request(LBHttpSolrClient.java:352)
	at org.apache.solr.client.solrj.impl.CloudSolrClient.sendRequest(CloudSolrClient.java:1100)
	at org.apache.solr.client.solrj.impl.CloudSolrClient.requestWithRetryOnStaleState(CloudSolrClient.java:870)
	at org.apache.solr.client.solrj.impl.CloudSolrClient.request(CloudSolrClient.java:806)
	at org.apache.solr.client.solrj.SolrClient.request(SolrClient.java:1219)
	at org.apache.solr.cloud.TestCollectionAPI.testCollectionCreationCollectionNameValidation(TestCollectionAPI.java:646)
	at org.apache.solr.cloud.TestCollectionAPI.test(TestCollectionAPI.java:83)
	at sun.reflect.NativeMethodAccessorImpl.invoke0(Native Method)
	at sun.reflect.NativeMethodAccessorImpl.invoke(NativeMethodAccessorImpl.java:62)
	at sun.reflect.DelegatingMethodAccessorImpl.invoke(DelegatingMethodAccessorImpl.java:43)
	at java.lang.reflect.Method.invoke(Method.java:498)
	at com.carrotsearch.randomizedtesting.RandomizedRunner.invoke(RandomizedRunner.java:1764)
	at com.carrotsearch.randomizedtesting.RandomizedRunner$8.evaluate(RandomizedRunner.java:871)
	at com.carrotsearch.randomizedtesting.RandomizedRunner$9.evaluate(RandomizedRunner.java:907)
	at com.carrotsearch.randomizedtesting.RandomizedRunner$10.evaluate(RandomizedRunner.java:921)
	at org.apache.solr.BaseDistributedSearchTestCase$ShardsRepeatRule$ShardsFixedStatement.callStatement(BaseDistributedSearchTestCase.java:996)
	at org.apache.solr.BaseDistributedSearchTestCase$ShardsRepeatRule$ShardsStatement.evaluate(BaseDistributedSearchTestCase.java:971)
	at com.carrotsearch.randomizedtesting.rules.SystemPropertiesRestoreRule$1.evaluate(SystemPropertiesRestoreRule.java:57)
	at org.apache.lucene.util.TestRuleSetupTeardownChained$1.evaluate(TestRuleSetupTeardownChained.java:49)
	at org.apache.lucene.util.AbstractBeforeAfterRule$1.evaluate(AbstractBeforeAfterRule.java:45)
	at org.apache.lucene.util.TestRuleThreadAndTestName$1.evaluate(TestRuleThreadAndTestName.java:48)
	at org.apache.lucene.util.TestRuleIgnoreAfterMaxFailures$1.evaluate(TestRuleIgnoreAfterMaxFailures.java:64)
	at org.apache.lucene.util.TestRuleMarkFailure$1.evaluate(TestRuleMarkFailure.java:47)
	at com.carrotsearch.randomizedtesting.rules.StatementAdapter.evaluate(StatementAdapter.java:36)
	at com.carrotsearch.randomizedtesting.ThreadLeakControl$StatementRunner.run(ThreadLeakControl.java:367)
	at com.carrotsearch.randomizedtesting.ThreadLeakControl.forkTimeoutingTask(ThreadLeakControl.java:809)
	at com.carrotsearch.randomizedtesting.ThreadLeakControl$3.evaluate(ThreadLeakControl.java:460)
	at com.carrotsearch.randomizedtesting.RandomizedRunner.runSingleTest(RandomizedRunner.java:880)
	at com.carrotsearch.randomizedtesting.RandomizedRunner$5.evaluate(RandomizedRunner.java:781)
	at com.carrotsearch.randomizedtesting.RandomizedRunner$6.evaluate(RandomizedRunner.java:816)
	at com.carrotsearch.randomizedtesting.RandomizedRunner$7.evaluate(RandomizedRunner.java:827)
	at com.carrotsearch.randomizedtesting.rules.StatementAdapter.evaluate(StatementAdapter.java:36)
	at com.carrotsearch.randomizedtesting.rules.SystemPropertiesRestoreRule$1.evaluate(SystemPropertiesRestoreRule.java:57)
	at org.apache.lucene.util.AbstractBeforeAfterRule$1.evaluate(AbstractBeforeAfterRule.java:45)
	at com.carrotsearch.randomizedtesting.rules.StatementAdapter.evaluate(StatementAdapter.java:36)
	at org.apache.lucene.util.TestRuleStoreClassName$1.evaluate(TestRuleStoreClassName.java:41)
	at com.carrotsearch.randomizedtesting.rules.NoShadowingOrOverridesOnMethodsRule$1.evaluate(NoShadowingOrOverridesOnMethodsRule.java:40)
	at com.carrotsearch.randomizedtesting.rules.NoShadowingOrOverridesOnMethodsRule$1.evaluate(NoShadowingOrOverridesOnMethodsRule.java:40)
	at com.carrotsearch.randomizedtesting.rules.StatementAdapter.evaluate(StatementAdapter.java:36)
	at com.carrotsearch.randomizedtesting.rules.StatementAdapter.evaluate(StatementAdapter.java:36)
	at com.carrotsearch.randomizedtesting.rules.StatementAdapter.evaluate(StatementAdapter.java:36)
	at org.apache.lucene.util.TestRuleAssertionsRequired$1.evaluate(TestRuleAssertionsRequired.java:53)
	at org.apache.lucene.util.TestRuleMarkFailure$1.evaluate(TestRuleMarkFailure.java:47)
	at org.apache.lucene.util.TestRuleIgnoreAfterMaxFailures$1.evaluate(TestRuleIgnoreAfterMaxFailures.java:64)
	at org.apache.lucene.util.TestRuleIgnoreTestSuites$1.evaluate(TestRuleIgnoreTestSuites.java:54)
	at com.carrotsearch.randomizedtesting.rules.StatementAdapter.evaluate(StatementAdapter.java:36)
	at com.carrotsearch.randomizedtesting.ThreadLeakControl$StatementRunner.run(ThreadLeakControl.java:367)
	at java.lang.Thread.run(Thread.java:745)
Caused by: org.apache.solr.client.solrj.impl.HttpSolrClient$RemoteSolrException: Error from server at https://127.0.0.1:38637/_kvu/zh: Invalid collection: invalid@name#with$weird%characters. collection names must consist entirely of periods, underscores, hyphens, and alphanumerics
	at org.apache.solr.client.solrj.impl.HttpSolrClient.executeMethod(HttpSolrClient.java:577)
	at org.apache.solr.client.solrj.impl.HttpSolrClient.request(HttpSolrClient.java:241)
	at org.apache.solr.client.solrj.impl.HttpSolrClient.request(HttpSolrClient.java:230)
	at org.apache.solr.client.solrj.impl.LBHttpSolrClient.doRequest(LBHttpSolrClient.java:372)
	at org.apache.solr.client.solrj.impl.LBHttpSolrClient.request(LBHttpSolrClient.java:325)
	... 47 more


FAILED:  org.apache.solr.cloud.UnloadDistributedZkTest.test

Error Message:
Captured an uncaught exception in thread: Thread[id=7920, name=testExecutor-4359-thread-11, state=RUNNABLE, group=TGRP-UnloadDistributedZkTest]

Stack Trace:
com.carrotsearch.randomizedtesting.UncaughtExceptionError: Captured an uncaught exception in thread: Thread[id=7920, name=testExecutor-4359-thread-11, state=RUNNABLE, group=TGRP-UnloadDistributedZkTest]
	at __randomizedtesting.SeedInfo.seed([29AC623EA1484E7:8ACEF9F944E8E91F]:0)
Caused by: java.lang.RuntimeException: org.apache.solr.client.solrj.SolrServerException: Timeout occured while waiting response from server at: http://127.0.0.1:53736/u_v/d
	at __randomizedtesting.SeedInfo.seed([29AC623EA1484E7]:0)
	at org.apache.solr.cloud.BasicDistributedZkTest.lambda$createCores$0(BasicDistributedZkTest.java:583)
	at org.apache.solr.common.util.ExecutorUtil$MDCAwareThreadPoolExecutor.lambda$execute$0(ExecutorUtil.java:229)
	at java.util.concurrent.ThreadPoolExecutor.runWorker(ThreadPoolExecutor.java:1142)
	at java.util.concurrent.ThreadPoolExecutor$Worker.run(ThreadPoolExecutor.java:617)
	at java.lang.Thread.run(Thread.java:745)
Caused by: org.apache.solr.client.solrj.SolrServerException: Timeout occured while waiting response from server at: http://127.0.0.1:53736/u_v/d
	at org.apache.solr.client.solrj.impl.HttpSolrClient.executeMethod(HttpSolrClient.java:588)
	at org.apache.solr.client.solrj.impl.HttpSolrClient.request(HttpSolrClient.java:241)
	at org.apache.solr.client.solrj.impl.HttpSolrClient.request(HttpSolrClient.java:230)
	at org.apache.solr.client.solrj.SolrClient.request(SolrClient.java:1219)
	at org.apache.solr.cloud.BasicDistributedZkTest.lambda$createCores$0(BasicDistributedZkTest.java:581)
	... 4 more
Caused by: java.net.SocketTimeoutException: Read timed out
	at java.net.SocketInputStream.socketRead0(Native Method)
	at java.net.SocketInputStream.socketRead(SocketInputStream.java:116)
	at java.net.SocketInputStream.read(SocketInputStream.java:170)
	at java.net.SocketInputStream.read(SocketInputStream.java:141)
	at org.apache.http.impl.io.AbstractSessionInputBuffer.fillBuffer(AbstractSessionInputBuffer.java:160)
	at org.apache.http.impl.io.SocketInputBuffer.fillBuffer(SocketInputBuffer.java:84)
	at org.apache.http.impl.io.AbstractSessionInputBuffer.readLine(AbstractSessionInputBuffer.java:273)
	at org.apache.http.impl.conn.DefaultHttpResponseParser.parseHead(DefaultHttpResponseParser.java:140)
	at org.apache.http.impl.conn.DefaultHttpResponseParser.parseHead(DefaultHttpResponseParser.java:57)
	at org.apache.http.impl.io.AbstractMessageParser.parse(AbstractMessageParser.java:261)
	at org.apache.http.impl.AbstractHttpClientConnection.receiveResponseHeader(AbstractHttpClientConnection.java:283)
	at org.apache.http.impl.conn.DefaultClientConnection.receiveResponseHeader(DefaultClientConnection.java:251)
	at org.apache.http.impl.conn.ManagedClientConnectionImpl.receiveResponseHeader(ManagedClientConnectionImpl.java:197)
	at org.apache.http.protocol.HttpRequestExecutor.doReceiveResponse(HttpRequestExecutor.java:272)
	at org.apache.http.protocol.HttpRequestExecutor.execute(HttpRequestExecutor.java:124)
	at org.apache.http.impl.client.DefaultRequestDirector.tryExecute(DefaultRequestDirector.java:685)
	at org.apache.http.impl.client.DefaultRequestDirector.execute(DefaultRequestDirector.java:487)
	at org.apache.http.impl.client.AbstractHttpClient.doExecute(AbstractHttpClient.java:882)
	at org.apache.http.impl.client.CloseableHttpClient.execute(CloseableHttpClient.java:82)
	at org.apache.http.impl.client.CloseableHttpClient.execute(CloseableHttpClient.java:107)
	at org.apache.http.impl.client.CloseableHttpClient.execute(CloseableHttpClient.java:55)
	at org.apache.solr.client.solrj.impl.HttpSolrClient.executeMethod(HttpSolrClient.java:482)
	... 8 more


FAILED:  org.apache.solr.handler.admin.CoreAdminHandlerTest.testCoreAdminHandler

Error Message:
Invalid core: bad$name. core names must consist entirely of periods, underscores, hyphens, and alphanumerics

Stack Trace:
java.lang.IllegalArgumentException: Invalid core: bad$name. core names must consist entirely of periods, underscores, hyphens, and alphanumerics
	at __randomizedtesting.SeedInfo.seed([29AC623EA1484E7:835AFB1B859A8919]:0)
	at org.apache.solr.client.solrj.util.SolrIdentifierValidator.validateName(SolrIdentifierValidator.java:37)
	at org.apache.solr.client.solrj.util.SolrIdentifierValidator.validateCoreName(SolrIdentifierValidator.java:54)
	at org.apache.solr.core.CoreContainer.rename(CoreContainer.java:1010)
	at org.apache.solr.handler.admin.CoreAdminOperation$6.call(CoreAdminOperation.java:227)
	at org.apache.solr.handler.admin.CoreAdminHandler$CallInfo.call(CoreAdminHandler.java:351)
	at org.apache.solr.handler.admin.CoreAdminHandler.handleRequestBody(CoreAdminHandler.java:153)
	at org.apache.solr.handler.admin.CoreAdminHandlerTest.testCoreAdminHandler(CoreAdminHandlerTest.java:225)
	at sun.reflect.NativeMethodAccessorImpl.invoke0(Native Method)
	at sun.reflect.NativeMethodAccessorImpl.invoke(NativeMethodAccessorImpl.java:62)
	at sun.reflect.DelegatingMethodAccessorImpl.invoke(DelegatingMethodAccessorImpl.java:43)
	at java.lang.reflect.Method.invoke(Method.java:498)
	at com.carrotsearch.randomizedtesting.RandomizedRunner.invoke(RandomizedRunner.java:1764)
	at com.carrotsearch.randomizedtesting.RandomizedRunner$8.evaluate(RandomizedRunner.java:871)
	at com.carrotsearch.randomizedtesting.RandomizedRunner$9.evaluate(RandomizedRunner.java:907)
	at com.carrotsearch.randomizedtesting.RandomizedRunner$10.evaluate(RandomizedRunner.java:921)
	at com.carrotsearch.randomizedtesting.rules.SystemPropertiesRestoreRule$1.evaluate(SystemPropertiesRestoreRule.java:57)
	at org.apache.lucene.util.TestRuleSetupTeardownChained$1.evaluate(TestRuleSetupTeardownChained.java:49)
	at org.apache.lucene.util.AbstractBeforeAfterRule$1.evaluate(AbstractBeforeAfterRule.java:45)
	at org.apache.lucene.util.TestRuleThreadAndTestName$1.evaluate(TestRuleThreadAndTestName.java:48)
	at org.apache.lucene.util.TestRuleIgnoreAfterMaxFailures$1.evaluate(TestRuleIgnoreAfterMaxFailures.java:64)
	at org.apache.lucene.util.TestRuleMarkFailure$1.evaluate(TestRuleMarkFailure.java:47)
	at com.carrotsearch.randomizedtesting.rules.StatementAdapter.evaluate(StatementAdapter.java:36)
	at com.carrotsearch.randomizedtesting.ThreadLeakControl$StatementRunner.run(ThreadLeakControl.java:367)
	at com.carrotsearch.randomizedtesting.ThreadLeakControl.forkTimeoutingTask(ThreadLeakControl.java:809)
	at com.carrotsearch.randomizedtesting.ThreadLeakControl$3.evaluate(ThreadLeakControl.java:460)
	at com.carrotsearch.randomizedtesting.RandomizedRunner.runSingleTest(RandomizedRunner.java:880)
	at com.carrotsearch.randomizedtesting.RandomizedRunner$5.evaluate(RandomizedRunner.java:781)
	at com.carrotsearch.randomizedtesting.RandomizedRunner$6.evaluate(RandomizedRunner.java:816)
	at com.carrotsearch.randomizedtesting.RandomizedRunner$7.evaluate(RandomizedRunner.java:827)
	at com.carrotsearch.randomizedtesting.rules.StatementAdapter.evaluate(StatementAdapter.java:36)
	at com.carrotsearch.randomizedtesting.rules.SystemPropertiesRestoreRule$1.evaluate(SystemPropertiesRestoreRule.java:57)
	at org.apache.lucene.util.AbstractBeforeAfterRule$1.evaluate(AbstractBeforeAfterRule.java:45)
	at com.carrotsearch.randomizedtesting.rules.StatementAdapter.evaluate(StatementAdapter.java:36)
	at org.apache.lucene.util.TestRuleStoreClassName$1.evaluate(TestRuleStoreClassName.java:41)
	at com.carrotsearch.randomizedtesting.rules.NoShadowingOrOverridesOnMethodsRule$1.evaluate(NoShadowingOrOverridesOnMethodsRule.java:40)
	at com.carrotsearch.randomizedtesting.rules.NoShadowingOrOverridesOnMethodsRule$1.evaluate(NoShadowingOrOverridesOnMethodsRule.java:40)
	at com.carrotsearch.randomizedtesting.rules.StatementAdapter.evaluate(StatementAdapter.java:36)
	at com.carrotsearch.randomizedtesting.rules.StatementAdapter.evaluate(StatementAdapter.java:36)
	at com.carrotsearch.randomizedtesting.rules.StatementAdapter.evaluate(StatementAdapter.java:36)
	at org.apache.lucene.util.TestRuleAssertionsRequired$1.evaluate(TestRuleAssertionsRequired.java:53)
	at org.apache.lucene.util.TestRuleMarkFailure$1.evaluate(TestRuleMarkFailure.java:47)
	at org.apache.lucene.util.TestRuleIgnoreAfterMaxFailures$1.evaluate(TestRuleIgnoreAfterMaxFailures.java:64)
	at org.apache.lucene.util.TestRuleIgnoreTestSuites$1.evaluate(TestRuleIgnoreTestSuites.java:54)
	at com.carrotsearch.randomizedtesting.rules.StatementAdapter.evaluate(StatementAdapter.java:36)
	at com.carrotsearch.randomizedtesting.ThreadLeakControl$StatementRunner.run(ThreadLeakControl.java:367)
	at java.lang.Thread.run(Thread.java:745)




Build Log:
[...truncated 11269 lines...]
   [junit4] Suite: org.apache.solr.cloud.UnloadDistributedZkTest
   [junit4]   2> Creating dataDir: /home/jenkins/workspace/Lucene-Solr-master-Linux/solr/build/solr-core/test/J2/temp/solr.cloud.UnloadDistributedZkTest_29AC623EA1484E7-001/init-core-data-001
   [junit4]   2> 706348 INFO  (SUITE-UnloadDistributedZkTest-seed#[29AC623EA1484E7]-worker) [    ] o.a.s.BaseDistributedSearchTestCase Setting hostContext system property: /u_v/d
   [junit4]   2> 706350 INFO  (TEST-UnloadDistributedZkTest.test-seed#[29AC623EA1484E7]) [    ] o.a.s.c.ZkTestServer STARTING ZK TEST SERVER
   [junit4]   2> 706350 INFO  (Thread-2930) [    ] o.a.s.c.ZkTestServer client port:0.0.0.0/0.0.0.0:0
   [junit4]   2> 706350 INFO  (Thread-2930) [    ] o.a.s.c.ZkTestServer Starting server
   [junit4]   2> 706450 INFO  (TEST-UnloadDistributedZkTest.test-seed#[29AC623EA1484E7]) [    ] o.a.s.c.ZkTestServer start zk server on port:57984
   [junit4]   2> 706451 INFO  (TEST-UnloadDistributedZkTest.test-seed#[29AC623EA1484E7]) [    ] o.a.s.c.c.SolrZkClient Using default ZkCredentialsProvider
   [junit4]   2> 706451 INFO  (TEST-UnloadDistributedZkTest.test-seed#[29AC623EA1484E7]) [    ] o.a.s.c.c.ConnectionManager Waiting for client to connect to ZooKeeper
   [junit4]   2> 706453 INFO  (zkCallback-1218-thread-1) [    ] o.a.s.c.c.ConnectionManager Watcher org.apache.solr.common.cloud.ConnectionManager@f4a031a name:ZooKeeperConnection Watcher:127.0.0.1:57984 got event WatchedEvent state:SyncConnected type:None path:null path:null type:None
   [junit4]   2> 706453 INFO  (TEST-UnloadDistributedZkTest.test-seed#[29AC623EA1484E7]) [    ] o.a.s.c.c.ConnectionManager Client is connected to ZooKeeper
   [junit4]   2> 706453 INFO  (TEST-UnloadDistributedZkTest.test-seed#[29AC623EA1484E7]) [    ] o.a.s.c.c.SolrZkClient Using default ZkACLProvider
   [junit4]   2> 706453 INFO  (TEST-UnloadDistributedZkTest.test-seed#[29AC623EA1484E7]) [    ] o.a.s.c.c.SolrZkClient makePath: /solr
   [junit4]   2> 706455 INFO  (TEST-UnloadDistributedZkTest.test-seed#[29AC623EA1484E7]) [    ] o.a.s.c.c.SolrZkClient Using default ZkCredentialsProvider
   [junit4]   2> 706455 INFO  (TEST-UnloadDistributedZkTest.test-seed#[29AC623EA1484E7]) [    ] o.a.s.c.c.ConnectionManager Waiting for client to connect to ZooKeeper
   [junit4]   2> 706455 INFO  (zkCallback-1219-thread-1) [    ] o.a.s.c.c.ConnectionManager Watcher org.apache.solr.common.cloud.ConnectionManager@105f2b51 name:ZooKeeperConnection Watcher:127.0.0.1:57984/solr got event WatchedEvent state:SyncConnected type:None path:null path:null type:None
   [junit4]   2> 706455 INFO  (TEST-UnloadDistributedZkTest.test-seed#[29AC623EA1484E7]) [    ] o.a.s.c.c.ConnectionManager Client is connected to ZooKeeper
   [junit4]   2> 706456 INFO  (TEST-UnloadDistributedZkTest.test-seed#[29AC623EA1484E7]) [    ] o.a.s.c.c.SolrZkClient Using default ZkACLProvider
   [junit4]   2> 706456 INFO  (TEST-UnloadDistributedZkTest.test-seed#[29AC623EA1484E7]) [    ] o.a.s.c.c.SolrZkClient makePath: /collections/collection1
   [junit4]   2> 706456 INFO  (TEST-UnloadDistributedZkTest.test-seed#[29AC623EA1484E7]) [    ] o.a.s.c.c.SolrZkClient makePath: /collections/collection1/shards
   [junit4]   2> 706457 INFO  (TEST-UnloadDistributedZkTest.test-seed#[29AC623EA1484E7]) [    ] o.a.s.c.c.SolrZkClient makePath: /collections/control_collection
   [junit4]   2> 706457 INFO  (TEST-UnloadDistributedZkTest.test-seed#[29AC623EA1484E7]) [    ] o.a.s.c.c.SolrZkClient makePath: /collections/control_collection/shards
   [junit4]   2> 706457 INFO  (TEST-UnloadDistributedZkTest.test-seed#[29AC623EA1484E7]) [    ] o.a.s.c.AbstractZkTestCase put /home/jenkins/workspace/Lucene-Solr-master-Linux/solr/core/src/test-files/solr/collection1/conf/solrconfig-tlog.xml to /configs/conf1/solrconfig.xml
   [junit4]   2> 706458 INFO  (TEST-UnloadDistributedZkTest.test-seed#[29AC623EA1484E7]) [    ] o.a.s.c.c.SolrZkClient makePath: /configs/conf1/solrconfig.xml
   [junit4]   2> 706458 INFO  (TEST-UnloadDistributedZkTest.test-seed#[29AC623EA1484E7]) [    ] o.a.s.c.AbstractZkTestCase put /home/jenkins/workspace/Lucene-Solr-master-Linux/solr/core/src/test-files/solr/collection1/conf/schema.xml to /configs/conf1/schema.xml
   [junit4]   2> 706458 INFO  (TEST-UnloadDistributedZkTest.test-seed#[29AC623EA1484E7]) [    ] o.a.s.c.c.SolrZkClient makePath: /configs/conf1/schema.xml
   [junit4]   2> 706459 INFO  (TEST-UnloadDistributedZkTest.test-seed#[29AC623EA1484E7]) [    ] o.a.s.c.AbstractZkTestCase put /home/jenkins/workspace/Lucene-Solr-master-Linux/solr/core/src/test-files/solr/collection1/conf/solrconfig.snippet.randomindexconfig.xml to /configs/conf1/solrconfig.snippet.randomindexconfig.xml
   [junit4]   2> 706459 INFO  (TEST-UnloadDistributedZkTest.test-seed#[29AC623EA1484E7]) [    ] o.a.s.c.c.SolrZkClient makePath: /configs/conf1/solrconfig.snippet.randomindexconfig.xml
   [junit4]   2> 706459 INFO  (TEST-UnloadDistributedZkTest.test-seed#[29AC623EA1484E7]) [    ] o.a.s.c.AbstractZkTestCase put /home/jenkins/workspace/Lucene-Solr-master-Linux/solr/core/src/test-files/solr/collection1/conf/stopwords.txt to /configs/conf1/stopwords.txt
   [junit4]   2> 706459 INFO  (TEST-UnloadDistributedZkTest.test-seed#[29AC623EA1484E7]) [    ] o.a.s.c.c.SolrZkClient makePath: /configs/conf1/stopwords.txt
   [junit4]   2> 706460 INFO  (TEST-UnloadDistributedZkTest.test-seed#[29AC623EA1484E7]) [    ] o.a.s.c.AbstractZkTestCase put /home/jenkins/workspace/Lucene-Solr-master-Linux/solr/core/src/test-files/solr/collection1/conf/protwords.txt to /configs/conf1/protwords.txt
   [junit4]   2> 706460 INFO  (TEST-UnloadDistributedZkTest.test-seed#[29AC623EA1484E7]) [    ] o.a.s.c.c.SolrZkClient makePath: /configs/conf1/protwords.txt
   [junit4]   2> 706460 INFO  (TEST-UnloadDistributedZkTest.test-seed#[29AC623EA1484E7]) [    ] o.a.s.c.AbstractZkTestCase put /home/jenkins/workspace/Lucene-Solr-master-Linux/solr/core/src/test-files/solr/collection1/conf/currency.xml to /configs/conf1/currency.xml
   [junit4]   2> 706460 INFO  (TEST-UnloadDistributedZkTest.test-seed#[29AC623EA1484E7]) [    ] o.a.s.c.c.SolrZkClient makePath: /configs/conf1/currency.xml
   [junit4]   2> 706461 INFO  (TEST-UnloadDistributedZkTest.test-seed#[29AC623EA1484E7]) [    ] o.a.s.c.AbstractZkTestCase put /home/jenkins/workspace/Lucene-Solr-master-Linux/solr/core/src/test-files/solr/collection1/conf/enumsConfig.xml to /configs/conf1/enumsConfig.xml
   [junit4]   2> 706461 INFO  (TEST-UnloadDistributedZkTest.test-seed#[29AC623EA1484E7]) [    ] o.a.s.c.c.SolrZkClient makePath: /configs/conf1/enumsConfig.xml
   [junit4]   2> 706461 INFO  (TEST-UnloadDistributedZkTest.test-seed#[29AC623EA1484E7]) [    ] o.a.s.c.AbstractZkTestCase put /home/jenkins/workspace/Lucene-Solr-master-Linux/solr/core/src/test-files/solr/collection1/conf/open-exchange-rates.json to /configs/conf1/open-exchange-rates.json
   [junit4]   2> 706461 INFO  (TEST-UnloadDistributedZkTest.test-seed#[29AC623EA1484E7]) [    ] o.a.s.c.c.SolrZkClient makePath: /configs/conf1/open-exchange-rates.json
   [junit4]   2> 706462 INFO  (TEST-UnloadDistributedZkTest.test-seed#[29AC623EA1484E7]) [    ] o.a.s.c.AbstractZkTestCase put /home/jenkins/workspace/Lucene-Solr-master-Linux/solr/core/src/test-files/solr/collection1/conf/mapping-ISOLatin1Accent.txt to /configs/conf1/mapping-ISOLatin1Accent.txt
   [junit4]   2> 706462 INFO  (TEST-UnloadDistributedZkTest.test-seed#[29AC623EA1484E7]) [    ] o.a.s.c.c.SolrZkClient makePath: /configs/conf1/mapping-ISOLatin1Accent.txt
   [junit4]   2> 706462 INFO  (TEST-UnloadDistributedZkTest.test-seed#[29AC623EA1484E7]) [    ] o.a.s.c.AbstractZkTestCase put /home/jenkins/workspace/Lucene-Solr-master-Linux/solr/core/src/test-files/solr/collection1/conf/old_synonyms.txt to /configs/conf1/old_synonyms.txt
   [junit4]   2> 706462 INFO  (TEST-UnloadDistributedZkTest.test-seed#[29AC623EA1484E7]) [    ] o.a.s.c.c.SolrZkClient makePath: /configs/conf1/old_synonyms.txt
   [junit4]   2> 706463 INFO  (TEST-UnloadDistributedZkTest.test-seed#[29AC623EA1484E7]) [    ] o.a.s.c.AbstractZkTestCase put /home/jenkins/workspace/Lucene-Solr-master-Linux/solr/core/src/test-files/solr/collection1/conf/synonyms.txt to /configs/conf1/synonyms.txt
   [junit4]   2> 706463 INFO  (TEST-UnloadDistributedZkTest.test-seed#[29AC623EA1484E7]) [    ] o.a.s.c.c.SolrZkClient makePath: /configs/conf1/synonyms.txt
   [junit4]   2> 706512 INFO  (TEST-UnloadDistributedZkTest.test-seed#[29AC623EA1484E7]) [    ] o.a.s.SolrTestCaseJ4 Writing core.properties file to /home/jenkins/workspace/Lucene-Solr-master-Linux/solr/build/solr-core/test/J2/temp/solr.cloud.UnloadDistributedZkTest_29AC623EA1484E7-001/control-001/cores/collection1
   [junit4]   2> 706513 INFO  (TEST-UnloadDistributedZkTest.test-seed#[29AC623EA1484E7]) [    ] o.e.j.s.Server jetty-9.3.6.v20151106
   [junit4]   2> 706514 INFO  (TEST-UnloadDistributedZkTest.test-seed#[29AC623EA1484E7]) [    ] o.e.j.s.h.ContextHandler Started o.e.j.s.ServletContextHandler@5420bd23{/u_v/d,null,AVAILABLE}
   [junit4]   2> 706516 INFO  (TEST-UnloadDistributedZkTest.test-seed#[29AC623EA1484E7]) [    ] o.e.j.s.ServerConnector Started ServerConnector@2d0eeeac{HTTP/1.1,[http/1.1]}{127.0.0.1:59202}
   [junit4]   2> 706516 INFO  (TEST-UnloadDistributedZkTest.test-seed#[29AC623EA1484E7]) [    ] o.e.j.s.Server Started @708036ms
   [junit4]   2> 706516 INFO  (TEST-UnloadDistributedZkTest.test-seed#[29AC623EA1484E7]) [    ] o.a.s.c.s.e.JettySolrRunner Jetty properties: {solr.data.dir=/home/jenkins/workspace/Lucene-Solr-master-Linux/solr/build/solr-core/test/J2/temp/solr.cloud.UnloadDistributedZkTest_29AC623EA1484E7-001/tempDir-001/control/data, hostContext=/u_v/d, hostPort=59202, coreRootDirectory=/home/jenkins/workspace/Lucene-Solr-master-Linux/solr/build/solr-core/test/J2/../../../../../../../../../home/jenkins/workspace/Lucene-Solr-master-Linux/solr/build/solr-core/test/J2/temp/solr.cloud.UnloadDistributedZkTest_29AC623EA1484E7-001/control-001/cores}
   [junit4]   2> 706516 INFO  (TEST-UnloadDistributedZkTest.test-seed#[29AC623EA1484E7]) [    ] o.a.s.s.SolrDispatchFilter SolrDispatchFilter.init(): sun.misc.Launcher$AppClassLoader@73d16e93
   [junit4]   2> 706516 INFO  (TEST-UnloadDistributedZkTest.test-seed#[29AC623EA1484E7]) [    ] o.a.s.c.SolrResourceLoader new SolrResourceLoader for directory: '/home/jenkins/workspace/Lucene-Solr-master-Linux/solr/build/solr-core/test/J2/temp/solr.cloud.UnloadDistributedZkTest_29AC623EA1484E7-001/control-001'
   [junit4]   2> 706516 INFO  (TEST-UnloadDistributedZkTest.test-seed#[29AC623EA1484E7]) [    ] o.a.s.c.SolrResourceLoader JNDI not configured for solr (NoInitialContextEx)
   [junit4]   2> 706516 INFO  (TEST-UnloadDistributedZkTest.test-seed#[29AC623EA1484E7]) [    ] o.a.s.c.SolrResourceLoader solr home defaulted to 'solr/' (could not find system property or JNDI)
   [junit4]   2> 706516 INFO  (TEST-UnloadDistributedZkTest.test-seed#[29AC623EA1484E7]) [    ] o.a.s.c.c.SolrZkClient Using default ZkCredentialsProvider
   [junit4]   2> 706517 INFO  (TEST-UnloadDistributedZkTest.test-seed#[29AC623EA1484E7]) [    ] o.a.s.c.c.ConnectionManager Waiting for client to connect to ZooKeeper
   [junit4]   2> 706517 INFO  (zkCallback-1220-thread-1) [    ] o.a.s.c.c.ConnectionManager Watcher org.apache.solr.common.cloud.ConnectionManager@7956ba50 name:ZooKeeperConnection Watcher:127.0.0.1:57984/solr got event WatchedEvent state:SyncConnected type:None path:null path:null type:None
   [junit4]   2> 706517 INFO  (TEST-UnloadDistributedZkTest.test-seed#[29AC623EA1484E7]) [    ] o.a.s.c.c.ConnectionManager Client is connected to ZooKeeper
   [junit4]   2> 706518 INFO  (TEST-UnloadDistributedZkTest.test-seed#[29AC623EA1484E7]) [    ] o.a.s.c.c.SolrZkClient Using default ZkACLProvider
   [junit4]   2> 706518 INFO  (TEST-UnloadDistributedZkTest.test-seed#[29AC623EA1484E7]) [    ] o.a.s.s.SolrDispatchFilter Loading solr.xml from SolrHome (not found in ZooKeeper)
   [junit4]   2> 706518 INFO  (TEST-UnloadDistributedZkTest.test-seed#[29AC623EA1484E7]) [    ] o.a.s.c.SolrXmlConfig Loading container configuration from /home/jenkins/workspace/Lucene-Solr-master-Linux/solr/build/solr-core/test/J2/temp/solr.cloud.UnloadDistributedZkTest_29AC623EA1484E7-001/control-001/solr.xml
   [junit4]   2> 706521 INFO  (TEST-UnloadDistributedZkTest.test-seed#[29AC623EA1484E7]) [    ] o.a.s.c.CorePropertiesLocator Config-defined core root directory: /home/jenkins/workspace/Lucene-Solr-master-Linux/solr/build/solr-core/test/J2/../../../../../../../../../home/jenkins/workspace/Lucene-Solr-master-Linux/solr/build/solr-core/test/J2/temp/solr.cloud.UnloadDistributedZkTest_29AC623EA1484E7-001/control-001/cores
   [junit4]   2> 706522 INFO  (TEST-UnloadDistributedZkTest.test-seed#[29AC623EA1484E7]) [    ] o.a.s.c.CoreContainer New CoreContainer 1713213354
   [junit4]   2> 706522 INFO  (TEST-UnloadDistributedZkTest.test-seed#[29AC623EA1484E7]) [    ] o.a.s.c.CoreContainer Loading cores into CoreContainer [instanceDir=/home/jenkins/workspace/Lucene-Solr-master-Linux/solr/build/solr-core/test/J2/temp/solr.cloud.UnloadDistributedZkTest_29AC623EA1484E7-001/control-001]
   [junit4]   2> 706522 WARN  (TEST-UnloadDistributedZkTest.test-seed#[29AC623EA1484E7]) [    ] o.a.s.c.CoreContainer Couldn't add files from /home/jenkins/workspace/Lucene-Solr-master-Linux/solr/build/solr-core/test/J2/temp/solr.cloud.UnloadDistributedZkTest_29AC623EA1484E7-001/control-001/lib to classpath: /home/jenkins/workspace/Lucene-Solr-master-Linux/solr/build/solr-core/test/J2/temp/solr.cloud.UnloadDistributedZkTest_29AC623EA1484E7-001/control-001/lib
   [junit4]   2> 706522 INFO  (TEST-UnloadDistributedZkTest.test-seed#[29AC623EA1484E7]) [    ] o.a.s.h.c.HttpShardHandlerFactory created with socketTimeout : 90000,urlScheme : ,connTimeout : 15000,maxConnectionsPerHost : 20,maxConnections : 10000,corePoolSize : 0,maximumPoolSize : 2147483647,maxThreadIdleTime : 5,sizeOfQueue : -1,fairnessPolicy : false,useRetries : false,
   [junit4]   2> 706523 INFO  (TEST-UnloadDistributedZkTest.test-seed#[29AC623EA1484E7]) [    ] o.a.s.u.UpdateShardHandler Creating UpdateShardHandler HTTP client with params: socketTimeout=340000&connTimeout=45000&retry=true
   [junit4]   2> 706524 INFO  (TEST-UnloadDistributedZkTest.test-seed#[29AC623EA1484E7]) [    ] o.a.s.l.LogWatcher SLF4J impl is org.slf4j.impl.Log4jLoggerFactory
   [junit4]   2> 706524 INFO  (TEST-UnloadDistributedZkTest.test-seed#[29AC623EA1484E7]) [    ] o.a.s.l.LogWatcher Registering Log Listener [Log4j (org.slf4j.impl.Log4jLoggerFactory)]
   [junit4]   2> 706524 INFO  (TEST-UnloadDistributedZkTest.test-seed#[29AC623EA1484E7]) [    ] o.a.s.c.ZkContainer Zookeeper client=127.0.0.1:57984/solr
   [junit4]   2> 706524 INFO  (TEST-UnloadDistributedZkTest.test-seed#[29AC623EA1484E7]) [    ] o.a.s.c.ZkController zkHost includes chroot
   [junit4]   2> 706524 INFO  (TEST-UnloadDistributedZkTest.test-seed#[29AC623EA1484E7]) [    ] o.a.s.c.c.SolrZkClient Using default ZkCredentialsProvider
   [junit4]   2> 706524 INFO  (TEST-UnloadDistributedZkTest.test-seed#[29AC623EA1484E7]) [    ] o.a.s.c.c.ConnectionManager Waiting for client to connect to ZooKeeper
   [junit4]   2> 706525 INFO  (zkCallback-1223-thread-1) [    ] o.a.s.c.c.ConnectionManager Watcher org.apache.solr.common.cloud.ConnectionManager@634ee64 name:ZooKeeperConnection Watcher:127.0.0.1:57984 got event WatchedEvent state:SyncConnected type:None path:null path:null type:None
   [junit4]   2> 706525 INFO  (TEST-UnloadDistributedZkTest.test-seed#[29AC623EA1484E7]) [    ] o.a.s.c.c.ConnectionManager Client is connected to ZooKeeper
   [junit4]   2> 706525 INFO  (TEST-UnloadDistributedZkTest.test-seed#[29AC623EA1484E7]) [    ] o.a.s.c.c.SolrZkClient Using default ZkACLProvider
   [junit4]   2> 706526 INFO  (TEST-UnloadDistributedZkTest.test-seed#[29AC623EA1484E7]) [n:127.0.0.1:59202_u_v%2Fd    ] o.a.s.c.c.ConnectionManager Waiting for client to connect to ZooKeeper
   [junit4]   2> 706526 INFO  (zkCallback-1224-thread-1-processing-n:127.0.0.1:59202_u_v%2Fd) [n:127.0.0.1:59202_u_v%2Fd    ] o.a.s.c.c.ConnectionManager Watcher org.apache.solr.common.cloud.ConnectionManager@752b6eab name:ZooKeeperConnection Watcher:127.0.0.1:57984/solr got event WatchedEvent state:SyncConnected type:None path:null path:null type:None
   [junit4]   2> 706526 INFO  (TEST-UnloadDistributedZkTest.test-seed#[29AC623EA1484E7]) [n:127.0.0.1:59202_u_v%2Fd    ] o.a.s.c.c.ConnectionManager Client is connected to ZooKeeper
   [junit4]   2> 706527 INFO  (TEST-UnloadDistributedZkTest.test-seed#[29AC623EA1484E7]) [n:127.0.0.1:59202_u_v%2Fd    ] o.a.s.c.c.SolrZkClient makePath: /overseer/queue
   [junit4]   2> 706527 INFO  (TEST-UnloadDistributedZkTest.test-seed#[29AC623EA1484E7]) [n:127.0.0.1:59202_u_v%2Fd    ] o.a.s.c.c.SolrZkClient makePath: /overseer/collection-queue-work
   [junit4]   2> 706528 INFO  (TEST-UnloadDistributedZkTest.test-seed#[29AC623EA1484E7]) [n:127.0.0.1:59202_u_v%2Fd    ] o.a.s.c.c.SolrZkClient makePath: /overseer/collection-map-running
   [junit4]   2> 706529 INFO  (TEST-UnloadDistributedZkTest.test-seed#[29AC623EA1484E7]) [n:127.0.0.1:59202_u_v%2Fd    ] o.a.s.c.c.SolrZkClient makePath: /overseer/collection-map-completed
   [junit4]   2> 706529 INFO  (TEST-UnloadDistributedZkTest.test-seed#[29AC623EA1484E7]) [n:127.0.0.1:59202_u_v%2Fd    ] o.a.s.c.c.SolrZkClient makePath: /overseer/collection-map-failure
   [junit4]   2> 706530 INFO  (TEST-UnloadDistributedZkTest.test-seed#[29AC623EA1484E7]) [n:127.0.0.1:59202_u_v%2Fd    ] o.a.s.c.c.SolrZkClient makePath: /live_nodes
   [junit4]   2> 706530 INFO  (TEST-UnloadDistributedZkTest.test-seed#[29AC623EA1484E7]) [n:127.0.0.1:59202_u_v%2Fd    ] o.a.s.c.c.SolrZkClient makePath: /aliases.json
   [junit4]   2> 706531 INFO  (TEST-UnloadDistributedZkTest.test-seed#[29AC623EA1484E7]) [n:127.0.0.1:59202_u_v%2Fd    ] o.a.s.c.c.SolrZkClient makePath: /clusterstate.json
   [junit4]   2> 706531 INFO  (TEST-UnloadDistributedZkTest.test-seed#[29AC623EA1484E7]) [n:127.0.0.1:59202_u_v%2Fd    ] o.a.s.c.c.SolrZkClient makePath: /security.json
   [junit4]   2> 706531 INFO  (TEST-UnloadDistributedZkTest.test-seed#[29AC623EA1484E7]) [n:127.0.0.1:59202_u_v%2Fd    ] o.a.s.c.c.ZkStateReader Updating cluster state from ZooKeeper... 
   [junit4]   2> 706532 INFO  (TEST-UnloadDistributedZkTest.test-seed#[29AC623EA1484E7]) [n:127.0.0.1:59202_u_v%2Fd    ] o.a.s.c.c.ZkStateReader Updated live nodes from ZooKeeper... (0) -> (0)
   [junit4]   2> 706532 INFO  (TEST-UnloadDistributedZkTest.test-seed#[29AC623EA1484E7]) [n:127.0.0.1:59202_u_v%2Fd    ] o.a.s.c.c.SolrZkClient makePath: /overseer_elect
   [junit4]   2> 706533 INFO  (TEST-UnloadDistributedZkTest.test-seed#[29AC623EA1484E7]) [n:127.0.0.1:59202_u_v%2Fd    ] o.a.s.c.c.SolrZkClient makePath: /overseer_elect/election
   [junit4]   2> 706533 INFO  (TEST-UnloadDistributedZkTest.test-seed#[29AC623EA1484E7]) [n:127.0.0.1:59202_u_v%2Fd    ] o.a.s.c.Overseer Overseer (id=null) closing
   [junit4]   2> 706533 INFO  (TEST-UnloadDistributedZkTest.test-seed#[29AC623EA1484E7]) [n:127.0.0.1:59202_u_v%2Fd    ] o.a.s.c.LeaderElector Joined leadership election with path: /overseer_elect/election/95522233208668164-127.0.0.1:59202_u_v%2Fd-n_0000000000
   [junit4]   2> 706533 INFO  (TEST-UnloadDistributedZkTest.test-seed#[29AC623EA1484E7]) [n:127.0.0.1:59202_u_v%2Fd    ] o.a.s.c.OverseerElectionContext I am going to be the leader 127.0.0.1:59202_u_v%2Fd
   [junit4]   2> 706533 INFO  (TEST-UnloadDistributedZkTest.test-seed#[29AC623EA1484E7]) [n:127.0.0.1:59202_u_v%2Fd    ] o.a.s.c.c.SolrZkClient makePath: /overseer_elect/leader
   [junit4]   2> 706534 INFO  (TEST-UnloadDistributedZkTest.test-seed#[29AC623EA1484E7]) [n:127.0.0.1:59202_u_v%2Fd    ] o.a.s.c.Overseer Overseer (id=95522233208668164-127.0.0.1:59202_u_v%2Fd-n_0000000000) starting
   [junit4]   2> 706534 INFO  (TEST-UnloadDistributedZkTest.test-seed#[29AC623EA1484E7]) [n:127.0.0.1:59202_u_v%2Fd    ] o.a.s.c.c.SolrZkClient makePath: /overseer/queue-work
   [junit4]   2> 706536 INFO  (TEST-UnloadDistributedZkTest.test-seed#[29AC623EA1484E7]) [n:127.0.0.1:59202_u_v%2Fd    ] o.a.s.c.OverseerAutoReplicaFailoverThread Starting OverseerAutoReplicaFailoverThread autoReplicaFailoverWorkLoopDelay=10000 autoReplicaFailoverWaitAfterExpiration=10000 autoReplicaFailoverBadNodeExpiration=60000
   [junit4]   2> 706536 INFO  (OverseerCollectionConfigSetProcessor-95522233208668164-127.0.0.1:59202_u_v%2Fd-n_0000000000) [n:127.0.0.1:59202_u_v%2Fd    ] o.a.s.c.OverseerTaskProcessor Process current queue of overseer operations
   [junit4]   2> 706536 INFO  (TEST-UnloadDistributedZkTest.test-seed#[29AC623EA1484E7]) [n:127.0.0.1:59202_u_v%2Fd    ] o.a.s.c.ZkController Register node as live in ZooKeeper:/live_nodes/127.0.0.1:59202_u_v%2Fd
   [junit4]   2> 706536 INFO  (OverseerStateUpdate-95522233208668164-127.0.0.1:59202_u_v%2Fd-n_0000000000) [n:127.0.0.1:59202_u_v%2Fd    ] o.a.s.c.Overseer Starting to work on the main queue
   [junit4]   2> 706536 INFO  (TEST-UnloadDistributedZkTest.test-seed#[29AC623EA1484E7]) [n:127.0.0.1:59202_u_v%2Fd    ] o.a.s.c.c.SolrZkClient makePath: /live_nodes/127.0.0.1:59202_u_v%2Fd
   [junit4]   2> 706537 INFO  (OverseerStateUpdate-95522233208668164-127.0.0.1:59202_u_v%2Fd-n_0000000000) [n:127.0.0.1:59202_u_v%2Fd    ] o.a.s.c.c.ZkStateReader Updated live nodes from ZooKeeper... (0) -> (0)
   [junit4]   2> 706537 INFO  (zkCallback-1224-thread-1-processing-n:127.0.0.1:59202_u_v%2Fd) [n:127.0.0.1:59202_u_v%2Fd    ] o.a.s.c.c.ZkStateReader A live node change: [WatchedEvent state:SyncConnected type:NodeChildrenChanged path:/live_nodes], has occurred - updating... (live nodes size: [0])
   [junit4]   2> 706538 INFO  (zkCallback-1224-thread-1-processing-n:127.0.0.1:59202_u_v%2Fd) [n:127.0.0.1:59202_u_v%2Fd    ] o.a.s.c.c.ZkStateReader Updated live nodes from ZooKeeper... (0) -> (1)
   [junit4]   2> 706547 INFO  (TEST-UnloadDistributedZkTest.test-seed#[29AC623EA1484E7]) [n:127.0.0.1:59202_u_v%2Fd    ] o.a.s.c.CoreContainer Security conf doesn't exist. Skipping setup for authorization module.
   [junit4]   2> 706548 INFO  (TEST-UnloadDistributedZkTest.test-seed#[29AC623EA1484E7]) [n:127.0.0.1:59202_u_v%2Fd    ] o.a.s.c.CoreContainer No authentication plugin used.
   [junit4]   2> 706548 INFO  (TEST-UnloadDistributedZkTest.test-seed#[29AC623EA1484E7]) [n:127.0.0.1:59202_u_v%2Fd    ] o.a.s.c.CorePropertiesLocator Looking for core definitions underneath /home/jenkins/workspace/Lucene-Solr-master-Linux/solr/build/solr-core/test/J2/../../../../../../../../../home/jenkins/workspace/Lucene-Solr-master-Linux/solr/build/solr-core/test/J2/temp/solr.cloud.UnloadDistributedZkTest_29AC623EA1484E7-001/control-001/cores
   [junit4]   2> 706549 INFO  (TEST-UnloadDistributedZkTest.test-seed#[29AC623EA1484E7]) [n:127.0.0.1:59202_u_v%2Fd    ] o.a.s.c.CoreDescriptor Created CoreDescriptor: {name=collection1, config=solrconfig.xml, transient=false, schema=schema.xml, loadOnStartup=true, configSetProperties=configsetprops.json, collection=control_collection, coreNodeName=, dataDir=data/, shard=}
   [junit4]   2> 706549 INFO  (TEST-UnloadDistributedZkTest.test-seed#[29AC623EA1484E7]) [n:127.0.0.1:59202_u_v%2Fd    ] o.a.s.c.CorePropertiesLocator Found core collection1 in /home/jenkins/workspace/Lucene-Solr-master-Linux/solr/build/solr-core/test/J2/../../../../../../../../../home/jenkins/workspace/Lucene-Solr-master-Linux/solr/build/solr-core/test/J2/temp/solr.cloud.UnloadDistributedZkTest_29AC623EA1484E7-001/control-001/cores/collection1
   [junit4]   2> 706549 INFO  (TEST-UnloadDistributedZkTest.test-seed#[29AC623EA1484E7]) [n:127.0.0.1:59202_u_v%2Fd    ] o.a.s.c.CorePropertiesLocator Found 1 core definitions
   [junit4]   2> 706549 INFO  (TEST-UnloadDistributedZkTest.test-seed#[29AC623EA1484E7]) [n:127.0.0.1:59202_u_v%2Fd    ] o.a.s.s.SolrDispatchFilter user.dir=/home/jenkins/workspace/Lucene-Solr-master-Linux/solr/build/solr-core/test/J2
   [junit4]   2> 706549 INFO  (TEST-UnloadDistributedZkTest.test-seed#[29AC623EA1484E7]) [n:127.0.0.1:59202_u_v%2Fd    ] o.a.s.s.SolrDispatchFilter SolrDispatchFilter.init() done
   [junit4]   2> 706549 INFO  (coreLoadExecutor-4281-thread-1-processing-n:127.0.0.1:59202_u_v%2Fd) [n:127.0.0.1:59202_u_v%2Fd c:control_collection   x:collection1] o.a.s.c.ZkController publishing state=down
   [junit4]   2> 706549 INFO  (coreLoadExecutor-4281-thread-1-processing-n:127.0.0.1:59202_u_v%2Fd) [n:127.0.0.1:59202_u_v%2Fd c:control_collection   x:collection1] o.a.s.c.ZkController numShards not found on descriptor - reading it from system property
   [junit4]   2> 706550 INFO  (OverseerStateUpdate-95522233208668164-127.0.0.1:59202_u_v%2Fd-n_0000000000) [n:127.0.0.1:59202_u_v%2Fd    ] o.a.s.c.Overseer processMessage: queueSize: 1, message = {
   [junit4]   2>   "core":"collection1",
   [junit4]   2>   "roles":null,
   [junit4]   2>   "base_url":"http://127.0.0.1:59202/u_v/d",
   [junit4]   2>   "node_name":"127.0.0.1:59202_u_v%2Fd",
   [junit4]   2>   "numShards":"1",
   [junit4]   2>   "state":"down",
   [junit4]   2>   "shard":null,
   [junit4]   2>   "collection":"control_collection",
   [junit4]   2>   "operation":"state"} current state version: 0
   [junit4]   2> 706550 INFO  (coreLoadExecutor-4281-thread-1-processing-n:127.0.0.1:59202_u_v%2Fd) [n:127.0.0.1:59202_u_v%2Fd c:control_collection   x:collection1] o.a.s.c.ZkController look for our core node name
   [junit4]   2> 706550 INFO  (OverseerStateUpdate-95522233208668164-127.0.0.1:59202_u_v%2Fd-n_0000000000) [n:127.0.0.1:59202_u_v%2Fd    ] o.a.s.c.o.ReplicaMutator Update state numShards=1 message={
   [junit4]   2>   "core":"collection1",
   [junit4]   2>   "roles":null,
   [junit4]   2>   "base_url":"http://127.0.0.1:59202/u_v/d",
   [junit4]   2>   "node_name":"127.0.0.1:59202_u_v%2Fd",
   [junit4]   2>   "numShards":"1",
   [junit4]   2>   "state":"down",
   [junit4]   2>   "shard":null,
   [junit4]   2>   "collection":"control_collection",
   [junit4]   2>   "operation":"state"}
   [junit4]   2> 706550 INFO  (OverseerStateUpdate-95522233208668164-127.0.0.1:59202_u_v%2Fd-n_0000000000) [n:127.0.0.1:59202_u_v%2Fd    ] o.a.s.c.o.ClusterStateMutator building a new cName: control_collection
   [junit4]   2> 706551 INFO  (OverseerStateUpdate-95522233208668164-127.0.0.1:59202_u_v%2Fd-n_0000000000) [n:127.0.0.1:59202_u_v%2Fd    ] o.a.s.c.o.ReplicaMutator Assigning new node to shard shard=shard1
   [junit4]   2> 706551 INFO  (zkCallback-1224-thread-1-processing-n:127.0.0.1:59202_u_v%2Fd) [n:127.0.0.1:59202_u_v%2Fd    ] o.a.s.c.c.ZkStateReader A cluster state change: [WatchedEvent state:SyncConnected type:NodeDataChanged path:/clusterstate.json], has occurred - updating... (live nodes size: [1])
   [junit4]   2> 707550 INFO  (coreLoadExecutor-4281-thread-1-processing-n:127.0.0.1:59202_u_v%2Fd) [n:127.0.0.1:59202_u_v%2Fd c:control_collection   x:collection1] o.a.s.c.ZkController waiting to find shard id in clusterstate for collection1
   [junit4]   2> 707550 INFO  (coreLoadExecutor-4281-thread-1-processing-n:127.0.0.1:59202_u_v%2Fd) [n:127.0.0.1:59202_u_v%2Fd c:control_collection   x:collection1] o.a.s.c.ZkController Check for collection zkNode:control_collection
   [junit4]   2> 707551 INFO  (coreLoadExecutor-4281-thread-1-processing-n:127.0.0.1:59202_u_v%2Fd) [n:127.0.0.1:59202_u_v%2Fd c:control_collection   x:collection1] o.a.s.c.ZkController Collection zkNode exists
   [junit4]   2> 707551 INFO  (coreLoadExecutor-4281-thread-1-processing-n:127.0.0.1:59202_u_v%2Fd) [n:127.0.0.1:59202_u_v%2Fd c:control_collection   x:collection1] o.a.s.c.c.ZkStateReader Load collection config from: [/collections/control_collection]
   [junit4]   2> 707551 INFO  (coreLoadExecutor-4281-thread-1-processing-n:127.0.0.1:59202_u_v%2Fd) [n:127.0.0.1:59202_u_v%2Fd c:control_collection   x:collection1] o.a.s.c.c.ZkStateReader path=[/collections/control_collection] [configName]=[conf1] specified config exists in ZooKeeper
   [junit4]   2> 707551 INFO  (coreLoadExecutor-4281-thread-1-processing-n:127.0.0.1:59202_u_v%2Fd) [n:127.0.0.1:59202_u_v%2Fd c:control_collection   x:collection1] o.a.s.c.SolrResourceLoader new SolrResourceLoader for directory: '/home/jenkins/workspace/Lucene-Solr-master-Linux/solr/build/solr-core/test/J2/temp/solr.cloud.UnloadDistributedZkTest_29AC623EA1484E7-001/control-001/cores/collection1'
   [junit4]   2> 707551 INFO  (coreLoadExecutor-4281-thread-1-processing-n:127.0.0.1:59202_u_v%2Fd) [n:127.0.0.1:59202_u_v%2Fd c:control_collection   x:collection1] o.a.s.c.SolrResourceLoader JNDI not configured for solr (NoInitialContextEx)
   [junit4]   2> 707551 INFO  (coreLoadExecutor-4281-thread-1-processing-n:127.0.0.1:59202_u_v%2Fd) [n:127.0.0.1:59202_u_v%2Fd c:control_collection   x:collection1] o.a.s.c.SolrResourceLoader solr home defaulted to 'solr/' (could not find system property or JNDI)
   [junit4]   2> 707552 INFO  (coreLoadExecutor-4281-thread-1-processing-n:127.0.0.1:59202_u_v%2Fd) [n:127.0.0.1:59202_u_v%2Fd c:control_collection   x:collection1] o.a.s.c.Config loaded config solrconfig.xml with version 0 
   [junit4]   2> 707555 INFO  (coreLoadExecutor-4281-thread-1-processing-n:127.0.0.1:59202_u_v%2Fd) [n:127.0.0.1:59202_u_v%2Fd c:control_collection   x:collection1] o.a.s.c.SolrConfig current version of requestparams : -1
   [junit4]   2> 707558 WARN  (coreLoadExecutor-4281-thread-1-processing-n:127.0.0.1:59202_u_v%2Fd) [n:127.0.0.1:59202_u_v%2Fd c:control_collection   x:collection1] o.a.s.c.Config Beginning with Solr 5.5, <mergePolicy> is deprecated, use <mergePolicyFactory> instead.
   [junit4]   2> 707559 INFO  (coreLoadExecutor-4281-thread-1-processing-n:127.0.0.1:59202_u_v%2Fd) [n:127.0.0.1:59202_u_v%2Fd c:control_collection   x:collection1] o.a.s.c.SolrConfig Using Lucene MatchVersion: 7.0.0
   [junit4]   2> 707565 INFO  (coreLoadExecutor-4281-thread-1-processing-n:127.0.0.1:59202_u_v%2Fd) [n:127.0.0.1:59202_u_v%2Fd c:control_collection   x:collection1] o.a.s.c.SolrConfig Loaded SolrConfig: solrconfig.xml
   [junit4]   2> 707569 INFO  (coreLoadExecutor-4281-thread-1-processing-n:127.0.0.1:59202_u_v%2Fd) [n:127.0.0.1:59202_u_v%2Fd c:control_collection   x:collection1] o.a.s.s.IndexSchema [collection1] Schema name=test
   [junit4]   2> 707626 INFO  (coreLoadExecutor-4281-thread-1-processing-n:127.0.0.1:59202_u_v%2Fd) [n:127.0.0.1:59202_u_v%2Fd c:control_collection   x:collection1] o.a.s.s.OpenExchangeRatesOrgProvider Initialized with rates=open-exchange-rates.json, refreshInterval=1440.
   [junit4]   2> 707630 INFO  (coreLoadExecutor-4281-thread-1-processing-n:127.0.0.1:59202_u_v%2Fd) [n:127.0.0.1:59202_u_v%2Fd c:control_collection   x:collection1] o.a.s.s.IndexSchema default search field in schema is text
   [junit4]   2> 707631 INFO  (coreLoadExecutor-4281-thread-1-processing-n:127.0.0.1:59202_u_v%2Fd) [n:127.0.0.1:59202_u_v%2Fd c:control_collection   x:collection1] o.a.s.s.IndexSchema unique key field: id
   [junit4]   2> 707634 INFO  (coreLoadExecutor-4281-thread-1-processing-n:127.0.0.1:59202_u_v%2Fd) [n:127.0.0.1:59202_u_v%2Fd c:control_collection   x:collection1] o.a.s.s.FileExchangeRateProvider Reloading exchange rates from file currency.xml
   [junit4]   2> 707635 INFO  (coreLoadExecutor-4281-thread-1-processing-n:127.0.0.1:59202_u_v%2Fd) [n:127.0.0.1:59202_u_v%2Fd c:control_collection   x:collection1] o.a.s.s.FileExchangeRateProvider Reloading exchange rates from file currency.xml
   [junit4]   2> 707636 INFO  (coreLoadExecutor-4281-thread-1-processing-n:127.0.0.1:59202_u_v%2Fd) [n:127.0.0.1:59202_u_v%2Fd c:control_collection   x:collection1] o.a.s.s.OpenExchangeRatesOrgProvider Reloading exchange rates from open-exchange-rates.json
   [junit4]   2> 707636 INFO  (coreLoadExecutor-4281-thread-1-processing-n:127.0.0.1:59202_u_v%2Fd) [n:127.0.0.1:59202_u_v%2Fd c:control_collection   x:collection1] o.a.s.s.OpenExchangeRatesOrgProvider Reloading exchange rates from open-exchange-rates.json
   [junit4]   2> 707636 INFO  (coreLoadExecutor-4281-thread-1-processing-n:127.0.0.1:59202_u_v%2Fd) [n:127.0.0.1:59202_u_v%2Fd c:control_collection   x:collection1] o.a.s.c.ConfigSetProperties Did not find ConfigSet properties, assuming default properties: Can't find resource 'configsetprops.json' in classpath or '/configs/conf1', cwd=/home/jenkins/workspace/Lucene-Solr-master-Linux/solr/build/solr-core/test/J2
   [junit4]   2> 707637 INFO  (coreLoadExecutor-4281-thread-1-processing-n:127.0.0.1:59202_u_v%2Fd) [n:127.0.0.1:59202_u_v%2Fd c:control_collection   x:collection1] o.a.s.c.CoreContainer Creating SolrCore 'collection1' using configuration from collection control_collection
   [junit4]   2> 707637 INFO  (coreLoadExecutor-4281-thread-1-processing-n:127.0.0.1:59202_u_v%2Fd) [n:127.0.0.1:59202_u_v%2Fd c:control_collection s:shard1 r:core_node1 x:collection1] o.a.s.c.SolrCore org.apache.solr.core.MockDirectoryFactory
   [junit4]   2> 707637 INFO  (coreLoadExecutor-4281-thread-1-processing-n:127.0.0.1:59202_u_v%2Fd) [n:127.0.0.1:59202_u_v%2Fd c:control_collection s:shard1 r:core_node1 x:collection1] o.a.s.c.SolrCore [[collection1] ] Opening new SolrCore at [/home/jenkins/workspace/Lucene-Solr-master-Linux/solr/build/solr-core/test/J2/temp/solr.cloud.UnloadDistributedZkTest_29AC623EA1484E7-001/control-001/cores/collection1], dataDir=[/home/jenkins/workspace/Lucene-Solr-master-Linux/solr/build/solr-core/test/J2/../../../../../../../../../home/jenkins/workspace/Lucene-Solr-master-Linux/solr/build/solr-core/test/J2/temp/solr.cloud.UnloadDistributedZkTest_29AC623EA1484E7-001/control-001/cores/collection1/data/]
   [junit4]   2> 707637 INFO  (coreLoadExecutor-4281-thread-1-processing-n:127.0.0.1:59202_u_v%2Fd) [n:127.0.0.1:59202_u_v%2Fd c:control_collection s:shard1 r:core_node1 x:collection1] o.a.s.c.JmxMonitoredMap JMX monitoring is enabled. Adding Solr mbeans to JMX Server: com.sun.jmx.mbeanserver.JmxMBeanServer@68ccb6d3
   [junit4]   2> 707637 INFO  (coreLoadExecutor-4281-thread-1-processing-n:127.0.0.1:59202_u_v%2Fd) [n:127.0.0.1:59202_u_v%2Fd c:control_collection s:shard1 r:core_node1 x:collection1] o.a.s.c.CachingDirectoryFactory return new directory for /home/jenkins/workspace/Lucene-Solr-master-Linux/solr/build/solr-core/test/J2/../../../../../../../../../home/jenkins/workspace/Lucene-Solr-master-Linux/solr/build/solr-core/test/J2/temp/solr.cloud.UnloadDistributedZkTest_29AC623EA1484E7-001/control-001/cores/collection1/data
   [junit4]   2> 707637 INFO  (coreLoadExecutor-4281-thread-1-processing-n:127.0.0.1:59202_u_v%2Fd) [n:127.0.0.1:59202_u_v%2Fd c:control_collection s:shard1 r:core_node1 x:collection1] o.a.s.c.SolrCore New index directory detected: old=null new=/home/jenkins/workspace/Lucene-Solr-master-Linux/solr/build/solr-core/test/J2/../../../../../../../../../home/jenkins/workspace/Lucene-Solr-master-Linux/solr/build/solr-core/test/J2/temp/solr.cloud.UnloadDistributedZkTest_29AC623EA1484E7-001/control-001/cores/collection1/data/index/
   [junit4]   2> 707637 WARN  (coreLoadExecutor-4281-thread-1-processing-n:127.0.0.1:59202_u_v%2Fd) [n:127.0.0.1:59202_u_v%2Fd c:control_collection s:shard1 r:core_node1 x:collection1] o.a.s.c.SolrCore [collection1] Solr index directory '/home/jenkins/workspace/Lucene-Solr-master-Linux/solr/build/solr-core/test/J2/../../../../../../../../../home/jenkins/workspace/Lucene-Solr-master-Linux/solr/build/solr-core/test/J2/temp/solr.cloud.UnloadDistributedZkTest_29AC623EA1484E7-001/control-001/cores/collection1/data/index' doesn't exist. Creating new index...
   [junit4]   2> 707637 INFO  (coreLoadExecutor-4281-thread-1-processing-n:127.0.0.1:59202_u_v%2Fd) [n:127.0.0.1:59202_u_v%2Fd c:control_collection s:shard1 r:core_node1 x:collection1] o.a.s.c.CachingDirectoryFactory return new directory for /home/jenkins/workspace/Lucene-Solr-master-Linux/solr/build/solr-core/test/J2/../../../../../../../../../home/jenkins/workspace/Lucene-Solr-master-Linux/solr/build/solr-core/test/J2/temp/solr.cloud.UnloadDistributedZkTest_29AC623EA1484E7-001/control-001/cores/collection1/data/index
   [junit4]   2> 707638 INFO  (coreLoadExecutor-4281-thread-1-processing-n:127.0.0.1:59202_u_v%2Fd) [n:127.0.0.1:59202_u_v%2Fd c:control_collection s:shard1 r:core_node1 x:collection1] o.a.s.u.RandomMergePolicy RandomMergePolicy wrapping class org.apache.lucene.index.TieredMergePolicy: [TieredMergePolicy: maxMergeAtOnce=33, maxMergeAtOnceExplicit=33, maxMergedSegmentMB=15.6533203125, floorSegmentMB=0.921875, forceMergeDeletesPctAllowed=18.909965672536337, segmentsPerTier=46.0, maxCFSSegmentSizeMB=8.796093022207999E12, noCFSRatio=1.0
   [junit4]   2> 707638 INFO  (coreLoadExecutor-4281-thread-1-processing-n:127.0.0.1:59202_u_v%2Fd) [n:127.0.0.1:59202_u_v%2Fd c:control_collection s:shard1 r:core_node1 x:collection1] o.a.s.c.SolrDeletionPolicy SolrDeletionPolicy.onCommit: commits: num=1
   [junit4]   2> 	commit{dir=MockDirectoryWrapper(RAMDirectory@4ad0ee4f lockFactory=org.apache.lucene.store.SingleInstanceLockFactory@77a51825),segFN=segments_1,generation=1}
   [junit4]   2> 707638 INFO  (coreLoadExecutor-4281-thread-1-processing-n:127.0.0.1:59202_u_v%2Fd) [n:127.0.0.1:59202_u_v%2Fd c:control_collection s:shard1 r:core_node1 x:collection1] o.a.s.c.SolrDeletionPolicy newest commit generation = 1
   [junit4]   2> 707639 INFO  (OldIndexDirectoryCleanupThreadForCore-collection1) [n:127.0.0.1:59202_u_v%2Fd c:control_collection s:shard1 r:core_node1 x:collection1] o.a.s.c.SolrCore Looking for old index directories to cleanup for core collection1 in /home/jenkins/workspace/Lucene-Solr-master-Linux/solr/build/solr-core/test/J2/../../../../../../../../../home/jenkins/workspace/Lucene-Solr-master-Linux/solr/build/solr-core/test/J2/temp/solr.cloud.UnloadDistributedZkTest_29AC623EA1484E7-001/control-001/cores/collection1/data/
   [junit4]   2> 707639 WARN  (OldIndexDirectoryCleanupThreadForCore-collection1) [n:127.0.0.1:59202_u_v%2Fd c:control_collection s:shard1 r:core_node1 x:collection1] o.a.s.c.DirectoryFactory /home/jenkins/workspace/Lucene-Solr-master-Linux/solr/build/solr-core/test/J2/../../../../../../../../../home/jenkins/workspace/Lucene-Solr-master-Linux/solr/build/solr-core/test/J2/temp/solr.cloud.UnloadDistributedZkTest_29AC623EA1484E7-001/control-001/cores/collection1/data/ does not point to a valid data directory; skipping clean-up of old index directories.
   [junit4]   2> 707640 INFO  (coreLoadExecutor-4281-thread-1-processing-n:127.0.0.1:59202_u_v%2Fd) [n:127.0.0.1:59202_u_v%2Fd c:control_collection s:shard1 r:core_node1 x:collection1] o.a.s.u.p.UpdateRequestProcessorChain creating updateRequestProcessorChain "nodistrib"
   [junit4]   2> 707640 INFO  (coreLoadExecutor-4281-thread-1-processing-n:127.0.0.1:59202_u_v%2Fd) [n:127.0.0.1:59202_u_v%2Fd c:control_collection s:shard1 r:core_node1 x:collection1] o.a.s.u.p.UpdateRequestProcessorChain creating updateRequestProcessorChain "dedupe"
   [junit4]   2> 707640 INFO  (coreLoadExecutor-4281-thread-1-processing-n:127.0.0.1:59202_u_v%2Fd) [n:127.0.0.1:59202_u_v%2Fd c:control_collection s:shard1 r:core_node1 x:collection1] o.a.s.u.p.UpdateRequestProcessorChain inserting DistributedUpdateProcessorFactory into updateRequestProcessorChain "dedupe"
   [junit4]   2> 707640 INFO  (coreLoadExecutor-4281-thread-1-processing-n:127.0.0.1:59202_u_v%2Fd) [n:127.0.0.1:59202_u_v%2Fd c:control_collection s:shard1 r:core_node1 x:collection1] o.a.s.u.p.UpdateRequestProcessorChain creating updateRequestProcessorChain "stored_sig"
   [junit4]   2> 707640 INFO  (coreLoadExecutor-4281-thread-1-processing-n:127.0.0.1:59202_u_v%2Fd) [n:127.0.0.1:59202_u_v%2Fd c:control_collection s:shard1 r:core_node1 x:collection1] o.a.s.u.p.UpdateRequestProcessorChain inserting DistributedUpdateProcessorFactory into updateRequestProcessorChain "stored_sig"
   [junit4]   2> 707640 INFO  (coreLoadExecutor-4281-thread-1-processing-n:127.0.0.1:59202_u_v%2Fd) [n:127.0.0.1:59202_u_v%2Fd c:control_collection s:shard1 r:core_node1 x:collection1] o.a.s.u.p.UpdateRequestProcessorChain creating updateRequestProcessorChain "distrib-dup-test-chain-explicit"
   [junit4]   2> 707640 INFO  (coreLoadExecutor-4281-thread-1-processing-n:127.0.0.1:59202_u_v%2Fd) [n:127.0.0.1:59202_u_v%2Fd c:control_collection s:shard1 r:core_node1 x:collection1] o.a.s.u.p.UpdateRequestProcessorChain creating updateRequestProcessorChain "distrib-dup-test-chain-implicit"
   [junit4]   2> 707640 INFO  (coreLoadExecutor-4281-thread-1-processing-n:127.0.0.1:59202_u_v%2Fd) [n:127.0.0.1:59202_u_v%2Fd c:control_collection s:shard1 r:core_node1 x:collection1] o.a.s.u.p.UpdateRequestProcessorChain inserting DistributedUpdateProcessorFactory into updateRequestProcessorChain "distrib-dup-test-chain-implicit"
   [junit4]   2> 707640 INFO  (coreLoadExecutor-4281-thread-1-processing-n:127.0.0.1:59202_u_v%2Fd) [n:127.0.0.1:59202_u_v%2Fd c:control_collection s:shard1 r:core_node1 x:collection1] o.a.s.c.SolrCore no updateRequestProcessorChain defined as default, creating implicit default
   [junit4]   2> 707640 WARN  (coreLoadExecutor-4281-thread-1-processing-n:127.0.0.1:59202_u_v%2Fd) [n:127.0.0.1:59202_u_v%2Fd c:control_collection s:shard1 r:core_node1 x:collection1] o.a.s.c.RequestHandlers INVALID paramSet a in requestHandler {type = requestHandler,name = /dump,class = DumpRequestHandler,args = {defaults={a=A,b=B}}}
   [junit4]   2> 707641 INFO  (coreLoadExecutor-4281-thread-1-processing-n:127.0.0.1:59202_u_v%2Fd) [n:127.0.0.1:59202_u_v%2Fd c:control_collection s:shard1 r:core_node1 x:collection1] o.a.s.h.l.XMLLoader xsltCacheLifetimeSeconds=60
   [junit4]   2> 707642 INFO  (coreLoadExecutor-4281-thread-1-processing-n:127.0.0.1:59202_u_v%2Fd) [n:127.0.0.1:59202_u_v%2Fd c:control_collection s:shard1 r:core_node1 x:collection1] o.a.s.h.l.XMLLoader xsltCacheLifetimeSeconds=60
   [junit4]   2> 707643 INFO  (coreLoadExecutor-4281-thread-1-processing-n:127.0.0.1:59202_u_v%2Fd) [n:127.0.0.1:59202_u_v%2Fd c:control_collection s:shard1 r:core_node1 x:collection1] o.a.s.h.l.XMLLoader xsltCacheLifetimeSeconds=60
   [junit4]   2> 707643 INFO  (coreLoadExecutor-4281-thread-1-processing-n:127.0.0.1:59202_u_v%2Fd) [n:127.0.0.1:59202_u_v%2Fd c:control_collection s:shard1 r:core_node1 x:collection1] o.a.s.h.l.XMLLoader xsltCacheLifetimeSeconds=60
   [junit4]   2> 707645 INFO  (coreLoadExecutor-4281-thread-1-processing-n:127.0.0.1:59202_u_v%2Fd) [n:127.0.0.1:59202_u_v%2Fd c:control_collection s:shard1 r:core_node1 x:collection1] o.a.s.c.RequestHandlers Registered paths: /admin/mbeans,standard,/dump,/update/csv,/sql,/update/json/docs,/admin/luke,/export,/admin/segments,/get,/admin/system,/replication,/admin/properties,/config,/stream,/schema,/admin/plugins,/admin/logging,/update/json,/admin/ping,/admin/threads,/update,/admin/file
   [junit4]   2> 707645 INFO  (coreLoadExecutor-4281-thread-1-processing-n:127.0.0.1:59202_u_v%2Fd) [n:127.0.0.1:59202_u_v%2Fd c:control_collection s:shard1 r:core_node1 x:collection1] o.a.s.c.SolrCore Using default statsCache cache: org.apache.solr.search.stats.LocalStatsCache
   [junit4]   2> 707645 INFO  (coreLoadExecutor-4281-thread-1-processing-n:127.0.0.1:59202_u_v%2Fd) [n:127.0.0.1:59202_u_v%2Fd c:control_collection s:shard1 r:core_node1 x:collection1] o.a.s.u.UpdateHandler Using UpdateLog implementation: org.apache.solr.update.UpdateLog
   [junit4]   2> 707645 INFO  (coreLoadExecutor-4281-thread-1-processing-n:127.0.0.1:59202_u_v%2Fd) [n:127.0.0.1:59202_u_v%2Fd c:control_collection s:shard1 r:core_node1 x:collection1] o.a.s.u.UpdateLog Initializing UpdateLog: dataDir= defaultSyncLevel=FLUSH numRecordsToKeep=100 maxNumLogsToKeep=10 numVersionBuckets=65536
   [junit4]   2> 707647 INFO  (coreLoadExecutor-4281-thread-1-processing-n:127.0.0.1:59202_u_v%2Fd) [n:127.0.0.1:59202_u_v%2Fd c:control_collection s:shard1 r:core_node1 x:collection1] o.a.s.u.CommitTracker Hard AutoCommit: disabled
   [junit4]   2> 707647 INFO  (coreLoadExecutor-4281-thread-1-processing-n:127.0.0.1:59202_u_v%2Fd) [n:127.0.0.1:59202_u_v%2Fd c:control_collection s:shard1 r:core_node1 x:collection1] o.a.s.u.CommitTracker Soft AutoCommit: disabled
   [junit4]   2> 707647 INFO  (coreLoadExecutor-4281-thread-1-processing-n:127.0.0.1:59202_u_v%2Fd) [n:127.0.0.1:59202_u_v%2Fd c:control_collection s:shard1 r:core_node1 x:collection1] o.a.s.u.RandomMergePolicy RandomMergePolicy wrapping class org.apache.lucene.index.TieredMergePolicy: [TieredMergePolicy: maxMergeAtOnce=14, maxMergeAtOnceExplicit=28, maxMergedSegmentMB=81.4814453125, floorSegmentMB=0.314453125, forceMergeDeletesPctAllowed=8.000439516066006, segmentsPerTier=25.0, maxCFSSegmentSizeMB=0.6640625, noCFSRatio=0.0
   [junit4]   2> 707647 INFO  (coreLoadExecutor-4281-thread-1-processing-n:127.0.0.1:59202_u_v%2Fd) [n:127.0.0.1:59202_u_v%2Fd c:control_collection s:shard1 r:core_node1 x:collection1] o.a.s.c.SolrDeletionPolicy SolrDeletionPolicy.onInit: commits: num=1
   [junit4]   2> 	commit{dir=MockDirectoryWrapper(RAMDirectory@4ad0ee4f lockFactory=org.apache.lucene.store.SingleInstanceLockFactory@77a51825),segFN=segments_1,generation=1}
   [junit4]   2> 707647 INFO  (coreLoadExecutor-4281-thread-1-processing-n:127.0.0.1:59202_u_v%2Fd) [n:127.0.0.1:59202_u_v%2Fd c:control_collection s:shard1 r:core_node1 x:collection1] o.a.s.c.SolrDeletionPolicy newest commit generation = 1
   [junit4]   2> 707647 INFO  (coreLoadExecutor-4281-thread-1-processing-n:127.0.0.1:59202_u_v%2Fd) [n:127.0.0.1:59202_u_v%2Fd c:control_collection s:shard1 r:core_node1 x:collection1] o.a.s.s.SolrIndexSearcher Opening [Searcher@254ae600[collection1] main]
   [junit4]   2> 707647 INFO  (coreLoadExecutor-4281-thread-1-processing-n:127.0.0.1:59202_u_v%2Fd) [n:127.0.0.1:59202_u_v%2Fd c:control_collection s:shard1 r:core_node1 x:collection1] o.a.s.c.c.ZkStateReader Load collection config from: [/collections/control_collection]
   [junit4]   2> 707648 INFO  (coreLoadExecutor-4281-thread-1-processing-n:127.0.0.1:59202_u_v%2Fd) [n:127.0.0.1:59202_u_v%2Fd c:control_collection s:shard1 r:core_node1 x:collection1] o.a.s.c.c.ZkStateReader path=[/collections/control_collection] [configName]=[conf1] specified config exists in ZooKeeper
   [junit4]   2> 707648 INFO  (coreLoadExecutor-4281-thread-1-processing-n:127.0.0.1:59202_u_v%2Fd) [n:127.0.0.1:59202_u_v%2Fd c:control_collection s:shard1 r:core_node1 x:collection1] o.a.s.r.ManagedResourceStorage Setting up ZooKeeper-based storage for the RestManager with znodeBase: /configs/conf1
   [junit4]   2> 707648 INFO  (coreLoadExecutor-4281-thread-1-processing-n:127.0.0.1:59202_u_v%2Fd) [n:127.0.0.1:59202_u_v%2Fd c:control_collection s:shard1 r:core_node1 x:collection1] o.a.s.r.ManagedResourceStorage Configured ZooKeeperStorageIO with znodeBase: /configs/conf1
   [junit4]   2> 707648 INFO  (coreLoadExecutor-4281-thread-1-processing-n:127.0.0.1:59202_u_v%2Fd) [n:127.0.0.1:59202_u_v%2Fd c:control_collection s:shard1 r:core_node1 x:collection1] o.a.s.r.RestManager Initializing RestManager with initArgs: {}
   [junit4]   2> 707648 INFO  (coreLoadExecutor-4281-thread-1-processing-n:127.0.0.1:59202_u_v%2Fd) [n:127.0.0.1:59202_u_v%2Fd c:control_collection s:shard1 r:core_node1 x:collection1] o.a.s.r.ManagedResourceStorage Reading _rest_managed.json using ZooKeeperStorageIO:path=/configs/conf1
   [junit4]   2> 707648 INFO  (coreLoadExecutor-4281-thread-1-processing-n:127.0.0.1:59202_u_v%2Fd) [n:127.0.0.1:59202_u_v%2Fd c:control_collection s:shard1 r:core_node1 x:collection1] o.a.s.r.ManagedResourceStorage No data found for znode /configs/conf1/_rest_managed.json
   [junit4]   2> 707648 INFO  (coreLoadExecutor-4281-thread-1-processing-n:127.0.0.1:59202_u_v%2Fd) [n:127.0.0.1:59202_u_v%2Fd c:control_collection s:shard1 r:core_node1 x:collection1] o.a.s.r.ManagedResourceStorage Loaded null at path _rest_managed.json using ZooKeeperStorageIO:path=/configs/conf1
   [junit4]   2> 707648 INFO  (coreLoadExecutor-4281-thread-1-processing-n:127.0.0.1:59202_u_v%2Fd) [n:127.0.0.1:59202_u_v%2Fd c:control_collection s:shard1 r:core_node1 x:collection1] o.a.s.r.RestManager Initializing 0 registered ManagedResources
   [junit4]   2> 707648 INFO  (coreLoadExecutor-4281-thread-1-processing-n:127.0.0.1:59202_u_v%2Fd) [n:127.0.0.1:59202_u_v%2Fd c:control_collection s:shard1 r:core_node1 x:collection1] o.a.s.h.ReplicationHandler Commits will be reserved for  10000
   [junit4]   2> 707649 INFO  (searcherExecutor-4282-thread-1-processing-n:127.0.0.1:59202_u_v%2Fd x:collection1 s:shard1 c:control_collection r:core_node1) [n:127.0.0.1:59202_u_v%2Fd c:control_collection s:shard1 r:core_node1 x:collection1] o.a.s.c.SolrCore [collection1] Registered new searcher Searcher@254ae600[collection1] main{ExitableDirectoryReader(UninvertingDirectoryReader())}
   [junit4]   2> 707649 INFO  (coreLoadExecutor-4281-thread-1-processing-n:127.0.0.1:59202_u_v%2Fd) [n:127.0.0.1:59202_u_v%2Fd c:control_collection s:shard1 r:core_node1 x:collection1] o.a.s.u.UpdateLog Looking up max value of version field to seed version buckets
   [junit4]   2> 707649 INFO  (coreLoadExecutor-4281-thread-1-processing-n:127.0.0.1:59202_u_v%2Fd) [n:127.0.0.1:59202_u_v%2Fd c:control_collection s:shard1 r:core_node1 x:collection1] o.a.s.u.VersionInfo Refreshing highest value of _version_ for 65536 version buckets from index
   [junit4]   2> 707649 INFO  (coreLoadExecutor-4281-thread-1-processing-n:127.0.0.1:59202_u_v%2Fd) [n:127.0.0.1:59202_u_v%2Fd c:control_collection s:shard1 r:core_node1 x:collection1] o.a.s.u.VersionInfo No terms found for _version_, cannot seed version bucket highest value from index
   [junit4]   2> 707649 INFO  (coreLoadExecutor-4281-thread-1-processing-n:127.0.0.1:59202_u_v%2Fd) [n:127.0.0.1:59202_u_v%2Fd c:control_collection s:shard1 r:core_node1 x:collection1] o.a.s.u.UpdateLog Could not find max version in index or recent updates, using new clock 1528355732692402176
   [junit4]   2> 707651 INFO  (coreLoadExecutor-4281-thread-1-processing-n:127.0.0.1:59202_u_v%2Fd) [n:127.0.0.1:59202_u_v%2Fd c:control_collection s:shard1 r:core_node1 x:collection1] o.a.s.u.UpdateLog Took 2.0ms to seed version buckets with highest version 1528355732692402176
   [junit4]   2> 707651 INFO  (coreLoadExecutor-4281-thread-1-processing-n:127.0.0.1:59202_u_v%2Fd) [n:127.0.0.1:59202_u_v%2Fd c:control_collection s:shard1 r:core_node1 x:collection1] o.a.s.c.ZkController watch zkdir /configs/conf1
   [junit4]   2> 707651 INFO  (coreLoadExecutor-4281-thread-1-processing-n:127.0.0.1:59202_u_v%2Fd) [n:127.0.0.1:59202_u_v%2Fd c:control_collection s:shard1 r:core_node1 x:collection1] o.a.s.c.CoreContainer registering core: collection1
   [junit4]   2> 707651 INFO  (coreZkRegister-4275-thread-1-processing-n:127.0.0.1:59202_u_v%2Fd x:collection1 s:shard1 c:control_collection r:core_node1) [n:127.0.0.1:59202_u_v%2Fd c:control_collection s:shard1 r:core_node1 x:collection1] o.a.s.c.ZkController Register replica - core:collection1 address:http://127.0.0.1:59202/u_v/d collection:control_collection shard:shard1
   [junit4]   2> 707652 INFO  (coreZkRegister-4275-thread-1-processing-n:127.0.0.1:59202_u_v%2Fd x:collection1 s:shard1 c:control_collection r:core_node1) [n:127.0.0.1:59202_u_v%2Fd c:control_collection s:shard1 r:core_node1 x:collection1] o.a.s.c.c.SolrZkClient makePath: /collections/control_collection/leader_elect/shard1/election
   [junit4]   2> 707653 INFO  (coreZkRegister-4275-thread-1-processing-n:127.0.0.1:59202_u_v%2Fd x:collection1 s:shard1 c:control_collection r:core_node1) [n:127.0.0.1:59202_u_v%2Fd c:control_collection s:shard1 r:core_node1 x:collection1] o.a.s.c.LeaderElector Joined leadership election with path: /collections/control_collection/leader_elect/shard1/election/95522233208668164-core_node1-n_0000000000
   [junit4]   2> 707653 INFO  (coreZkRegister-4275-thread-1-processing-n:127.0.0.1:59202_u_v%2Fd x:collection1 s:shard1 c:control_collection r:core_node1) [n:127.0.0.1:59202_u_v%2Fd c:control_collection s:shard1 r:core_node1 x:collection1] o.a.s.c.ShardLeaderElectionContext Running the leader process for shard=shard1 and weAreReplacement=false and leaderVoteWait=180000
   [junit4]   2> 707653 INFO  (coreZkRegister-4275-thread-1-processing-n:127.0.0.1:59202_u_v%2Fd x:collection1 s:shard1 c:control_collection r:core_node1) [n:127.0.0.1:59202_u_v%2Fd c:control_collection s:shard1 r:core_node1 x:collection1] o.a.s.c.ShardLeaderElectionContext Enough replicas found to continue.
   [junit4]   2> 707654 INFO  (coreZkRegister-4275-thread-1-processing-n:127.0.0.1:59202_u_v%2Fd x:collection1 s:shard1 c:control_collection r:core_node1) [n:127.0.0.1:59202_u_v%2Fd c:control_collection s:shard1 r:core_node1 x:collection1] o.a.s.c.ShardLeaderElectionContext I may be the new leader - try and sync
   [junit4]   2> 707654 INFO  (coreZkRegister-4275-thread-1-processing-n:127.0.0.1:59202_u_v%2Fd x:collection1 s:shard1 c:control_collection r:core_node1) [n:127.0.0.1:59202_u_v%2Fd c:control_collection s:shard1 r:core_node1 x:collection1] o.a.s.c.SyncStrategy Sync replicas to http://127.0.0.1:59202/u_v/d/collection1/
   [junit4]   2> 707654 INFO  (coreZkRegister-4275-thread-1-processing-n:127.0.0.1:59202_u_v%2Fd x:collection1 s:shard1 c:control_collection r:core_node1) [n:127.0.0.1:59202_u_v%2Fd c:control_collection s:shard1 r:core_node1 x:collection1] o.a.s.c.SyncStrategy Sync Success - now sync replicas to me
   [junit4]   2> 707654 INFO  (OverseerStateUpdate-95522233208668164-127.0.0.1:59202_u_v%2Fd-n_0000000000) [n:127.0.0.1:59202_u_v%2Fd    ] o.a.s.c.Overseer processMessage: queueSize: 1, message = {
   [junit4]   2>   "operation":"leader",
   [junit4]   2>   "shard":"shard1",
   [junit4]   2>   "collection":"control_collection"} current state version: 1
   [junit4]   2> 707654 INFO  (coreZkRegister-4275-thread-1-processing-n:127.0.0.1:59202_u_v%2Fd x:collection1 s:shard1 c:control_collection r:core_node1) [n:127.0.0.1:59202_u_v%2Fd c:control_collection s:shard1 r:core_node1 x:collection1] o.a.s.c.SyncStrategy http://127.0.0.1:59202/u_v/d/collection1/ has no replicas
   [junit4]   2> 707654 INFO  (coreZkRegister-4275-thread-1-processing-n:127.0.0.1:59202_u_v%2Fd x:collection1 s:shard1 c:control_collection r:core_node1) [n:127.0.0.1:59202_u_v%2Fd c:control_collection s:shard1 r:core_node1 x:collection1] o.a.s.c.c.SolrZkClient makePath: /collections/control_collection/leaders/shard1
   [junit4]   2> 707655 INFO  (coreZkRegister-4275-thread-1-processing-n:127.0.0.1:59202_u_v%2Fd x:collection1 s:shard1 c:control_collection r:core_node1) [n:127.0.0.1:59202_u_v%2Fd c:control_collection s:shard1 r:core_node1 x:collection1] o.a.s.c.ShardLeaderElectionContextBase Creating leader registration node /collections/control_collection/leaders/shard1/leader after winning as /collections/control_collection/leader_elect/shard1/election/95522233208668164-core_node1-n_0000000000
   [junit4]   2> 707656 INFO  (coreZkRegister-4275-thread-1-processing-n:127.0.0.1:59202_u_v%2Fd x:collection1 s:shard1 c:control_collection r:core_node1) [n:127.0.0.1:59202_u_v%2Fd c:control_collection s:shard1 r:core_node1 x:collection1] o.a.s.c.ShardLeaderElectionContext I am the new leader: http://127.0.0.1:59202/u_v/d/collection1/ shard1
   [junit4]   2> 707657 INFO  (OverseerStateUpdate-95522233208668164-127.0.0.1:59202_u_v%2Fd-n_0000000000) [n:127.0.0.1:59202_u_v%2Fd    ] o.a.s.c.Overseer processMessage: queueSize: 1, message = {
   [junit4]   2>   "operation":"leader",
   [junit4]   2>   "shard":"shard1",
   [junit4]   2>   "collection":"control_collection",
   [junit4]   2>   "base_url":"http://127.0.0.1:59202/u_v/d",
   [junit4]   2>   "core":"collection1",
   [junit4]   2>   "state":"active"} current state version: 1
   [junit4]   2> 707758 INFO  (zkCallback-1224-thread-1-processing-n:127.0.0.1:59202_u_v%2Fd) [n:127.0.0.1:59202_u_v%2Fd    ] o.a.s.c.c.ZkStateReader A cluster state change: [WatchedEvent state:SyncConnected type:NodeDataChanged path:/clusterstate.json], has occurred - updating... (live nodes size: [1])
   [junit4]   2> 707807 INFO  (coreZkRegister-4275-thread-1-processing-n:127.0.0.1:59202_u_v%2Fd x:collection1 s:shard1 c:control_collection r:core_node1) [n:127.0.0.1:59202_u_v%2Fd c:control_collection s:shard1 r:core_node1 x:collection1] o.a.s.c.ZkController We are http://127.0.0.1:59202/u_v/d/collection1/ and leader is http://127.0.0.1:59202/u_v/d/collection1/
   [junit4]   2> 707807 INFO  (coreZkRegister-4275-thread-1-processing-n:127.0.0.1:59202_u_v%2Fd x:collection1 s:shard1 c:control_collection r:core_node1) [n:127.0.0.1:59202_u_v%2Fd c:control_collection s:shard1 r:core_node1 x:collection1] o.a.s.c.ZkController No LogReplay needed for core=collection1 baseURL=http://127.0.0.1:59202/u_v/d
   [junit4]   2> 707807 INFO  (coreZkRegister-4275-thread-1-processing-n:127.0.0.1:59202_u_v%2Fd x:collection1 s:shard1 c:control_collection r:core_node1) [n:127.0.0.1:59202_u_v%2Fd c:control_collection s:shard1 r:core_node1 x:collection1] o.a.s.c.ZkController I am the leader, no recovery necessary
   [junit4]   2> 707807 INFO  (coreZkRegister-4275-thread-1-processing-n:127.0.0.1:59202_u_v%2Fd x:collection1 s:shard1 c:control_collection r:core_node1) [n:127.0.0.1:59202_u_v%2Fd c:control_collection s:shard1 r:core_node1 x:collection1] o.a.s.c.ZkController publishing state=active
   [junit4]   2> 707807 INFO  (coreZkRegister-4275-thread-1-processing-n:127.0.0.1:59202_u_v%2Fd x:collection1 s:shard1 c:control_collection r:core_node1) [n:127.0.0.1:59202_u_v%2Fd c:control_collection s:shard1 r:core_node1 x:collection1] o.a.s.c.ZkController numShards not found on descriptor - reading it from system property
   [junit4]   2> 707808 INFO  (OverseerStateUpdate-95522233208668164-127.0.0.1:59202_u_v%2Fd-n_0000000000) [n:127.0.0.1:59202_u_v%2Fd    ] o.a.s.c.Overseer processMessage: queueSize: 1, message = {
   [junit4]   2>   "core":"collection1",
   [junit4]   2>   "core_node_name":"core_node1",
   [junit4]   2>   "roles":null,
   [junit4]   2>   "base_url":"http://127.0.0.1:59202/u_v/d",
   [junit4]   2>   "node_name":"127.0.0.1:59202_u_v%2Fd",
   [junit4]   2>   "numShards":"1",
   [junit4]   2>   "state":"active",
   [junit4]   2>   "shard":"shard1",
   [junit4]   2>   "collection":"control_collection",
   [junit4]   2>   "operation":"state"} current state version: 2
   [junit4]   2> 707808 INFO  (OverseerStateUpdate-95522233208668164-127.0.0.1:59202_u_v%2Fd-n_0000000000) [n:127.0.0.1:59202_u_v%2Fd    ] o.a.s.c.o.ReplicaMutator Update state numShards=1 message={
   [junit4]   2>   "core":"collection1",
   [junit4]   2>   "core_node_name":"core_node1",
   [junit4]   2>   "roles":null,
   [junit4]   2>   "base_url":"http://127.0.0.1:59202/u_v/d",
   [junit4]   2>   "node_name":"127.0.0.1:59202_u_v%2Fd",
   [junit4]   2>   "numShards":"1",
   [junit4]   2>   "state":"active",
   [junit4]   2>   "shard":"shard1",
   [junit4]   2>   "collection":"control_collection",
   [junit4]   2>   "operation":"state"}
   [junit4]   2> 707909 INFO  (zkCallback-1224-thread-1-processing-n:127.0.0.1:59202_u_v%2Fd) [n:127.0.0.1:59202_u_v%2Fd    ] o.a.s.c.c.ZkStateReader A cluster state change: [WatchedEvent state:SyncConnected type:NodeDataChanged path:/clusterstate.json], has occurred - updating... (live nodes size: [1])
   [junit4]   2> 708050 INFO  (TEST-UnloadDistributedZkTest.test-seed#[29AC623EA1484E7]) [    ] o.a.s.c.c.SolrZkClient Using default ZkCredentialsProvider
   [junit4]   2> 708051 INFO  (TEST-UnloadDistributedZkTest.test-seed#[29AC623EA1484E7]) [    ] o.a.s.c.c.ConnectionManager Waiting for client to connect to ZooKeeper
   [junit4]   2> 708051 INFO  (zkCallback-1226-thread-1) [    ] o.a.s.c.c.ConnectionManager Watcher org.apache.solr.common.cloud.ConnectionManager@389463ec name:ZooKeeperConnection Watcher:127.0.0.1:57984/solr got event WatchedEvent state:SyncConnected type:None path:null path:null type:None
   [junit4]   2> 708051 INFO  (TEST-UnloadDistributedZkTest.test-seed#[29AC623EA1484E7]) [    ] o.a.s.c.c.ConnectionManager Client is connected to ZooKeeper
   [junit4]   2> 708052 INFO  (TEST-UnloadDistributedZkTest.test-seed#[29AC623EA1484E7]) [    ] o.a.s.c.c.SolrZkClient Using default ZkACLProvider
   [junit4]   2> 708052 INFO  (TEST-UnloadDistributedZkTest.test-seed#[29AC623EA1484E7]) [    ] o.a.s.c.c.ZkStateReader Updating cluster state from ZooKeeper... 
   [junit4]   2> 708052 INFO  (TEST-UnloadDistributedZkTest.test-seed#[29AC623EA1484E7]) [    ] o.a.s.c.c.ZkStateReader Updated live nodes from ZooKeeper... (0) -> (1)
   [junit4]   2> 708052 INFO  (TEST-UnloadDistributedZkTest.test-seed#[29AC623EA1484E7]) [    ] o.a.s.c.ChaosMonkey monkey: init - expire sessions:false cause connection loss:false
   [junit4]   2> 708171 INFO  (TEST-UnloadDistributedZkTest.test-seed#[29AC623EA1484E7]) [    ] o.a.s.SolrTestCaseJ4 Writing core.properties file to /home/jenkins/workspace/Lucene-Solr-master-Linux/solr/build/solr-core/test/J2/temp/solr.cloud.UnloadDistributedZkTest_29AC623EA1484E7-001/shard-1-001/cores/collection1
   [junit4]   2> 708171 INFO  (TEST-UnloadDistributedZkTest.test-seed#[29AC623EA1484E7]) [    ] o.a.s.c.AbstractFullDistribZkTestBase create jetty 1 in directory /home/jenkins/workspace/Lucene-Solr-master-Linux/solr/build/solr-core/test/J2/temp/solr.cloud.UnloadDistributedZkTest_29AC623EA1484E7-001/shard-1-001
   [junit4]   2> 708172 INFO  (TEST-UnloadDistributedZkTest.test-seed#[29AC623EA1484E7]) [    ] o.e.j.s.Server jetty-9.3.6.v20151106
   [junit4]   2> 708173 INFO  (TEST-UnloadDistributedZkTest.test-seed#[29AC623EA1484E7]) [    ] o.e.j.s.h.ContextHandler Started o.e.j.s.ServletContextHandler@448a8ee8{/u_v/d,null,AVAILABLE}
   [junit4]   2> 708173 INFO  (TEST-UnloadDistributedZkTest.test-seed#[29AC623EA1484E7]) [    ] o.e.j.s.ServerConnector Started ServerConnector@2e4fc92e{HTTP/1.1,[http/1.1]}{127.0.0.1:50149}
   [junit4]   2> 708174 INFO  (TEST-UnloadDistributedZkTest.test-seed#[29AC623EA1484E7]) [    ] o.e.j.s.Server Started @709694ms
   [junit4]   2> 708174 INFO  (TEST-UnloadDistributedZkTest.test-seed#[29AC623EA1484E7]) [    ] o.a.s.c.s.e.JettySolrRunner Jetty properties: {solr.data.dir=/home/jenkins/workspace/Lucene-Solr-master-Linux/solr/build/solr-core/test/J2/temp/solr.cloud.UnloadDistributedZkTest_29AC623EA1484E7-001/tempDir-001/jetty1, solrconfig=solrconfig.xml, hostContext=/u_v/d, hostPort=50149, coreRootDirectory=/home/jenkins/workspace/Lucene-Solr-master-Linux/solr/build/solr-core/test/J2/../../../../../../../../../home/jenkins/workspace/Lucene-Solr-master-Linux/solr/build/solr-core/test/J2/temp/solr.cloud.UnloadDistributedZkTest_29AC623EA1484E7-001/shard-1-001/cores}
   [junit4]   2> 708174 INFO  (TEST-UnloadDistributedZkTest.test-seed#[29AC623EA1484E7]) [    ] o.a.s.s.SolrDispatchFilter SolrDispatchFilter.init(): sun.misc.Launcher$AppClassLoader@73d16e93
   [junit4]   2> 708174 INFO  (TEST-UnloadDistributedZkTest.test-seed#[29AC623EA1484E7]) [    ] o.a.s.c.SolrResourceLoader new SolrResourceLoader for directory: '/home/jenkins/workspace/Lucene-Solr-master-Linux/solr/build/solr-core/test/J2/temp/solr.cloud.UnloadDistributedZkTest_29AC623EA1484E7-001/shard-1-001'
   [junit4]   2> 708174 INFO  (TEST-UnloadDistributedZkTest.test-seed#[29AC623EA1484E7]) [    ] o.a.s.c.SolrResourceLoader JNDI not configured for solr (NoInitialContextEx)
   [junit4]   2> 708174 INFO  (TEST-UnloadDistributedZkTest.test-seed#[29AC623EA1484E7]) [    ] o.a.s.c.SolrResourceLoader solr home defaulted to 'solr/' (could not find system property or JNDI)
   [junit4]   2> 708174 INFO  (TEST-UnloadDistributedZkTest.test-seed#[29AC623EA1484E7]) [    ] o.a.s.c.c.SolrZkClient Using default ZkCredentialsProvider
   [junit4]   2> 708174 INFO  (TEST-UnloadDistributedZkTest.test-seed#[29AC623EA1484E7]) [    ] o.a.s.c.c.ConnectionManager Waiting for client to connect to ZooKeeper
   [junit4]   2> 708175 INFO  (zkCallback-1227-thread-1) [    ] o.a.s.c.c.ConnectionManager Watcher org.apache.solr.common.cloud.ConnectionManager@7aeedf4a name:ZooKeeperConnection Watcher:127.0.0.1:57984/solr got event WatchedEvent state:SyncConnected type:None path:null path:null type:None
   [junit4]   2> 708175 INFO  (TEST-UnloadDistributedZkTest.test-seed#[29AC623EA1484E7]) [    ] o.a.s.c.c.ConnectionManager Client is connected to ZooKeeper
   [junit4]   2> 708175 INFO  (TEST-UnloadDistributedZkTest.test-seed#[29AC623EA1484E7]) [    ] o.a.s.c.c.SolrZkClient Using default ZkACLProvider
   [junit4]   2> 708176 INFO  (TEST-UnloadDistributedZkTest.test-seed#[29AC623EA1484E7]) [    ] o.a.s.s.SolrDispatchFilter Loading solr.xml from SolrHome (not found in ZooKeeper)
   [junit4]   2> 708176 INFO  (TEST-UnloadDistributedZkTest.test-seed#[29AC623EA1484E7]) [    ] o.a.s.c.SolrXmlConfig Loading container configuration from /home/jenkins/workspace/Lucene-Solr-master-Linux/solr/build/solr-core/test/J2/temp/solr.cloud.UnloadDistributedZkTest_29AC623EA1484E7-001/shard-1-001/solr.xml
   [junit4]   2> 708187 INFO  (TEST-UnloadDistributedZkTest.test-seed#[29AC623EA1484E7]) [    ] o.a.s.c.CorePropertiesLocator Config-defined core root directory: /home/jenkins/workspace/Lucene-Solr-master-Linux/solr/build/solr-core/test/J2/../../../../../../../../../home/jenkins/workspace/Lucene-Solr-master-Linux/solr/build/solr-core/test/J2/temp/solr.cloud.UnloadDistributedZkTest_29AC623EA1484E7-001/shard-1-001/cores
   [junit4]   2> 708187 INFO  (TEST-UnloadDistributedZkTest.test-seed#[29AC623EA1484E7]) [    ] o.a.s.c.CoreContainer New CoreContainer 1587522128
   [junit4]   2> 708188 INFO  (TEST-UnloadDistributedZkTest.test-seed#[29AC623EA1484E7]) [    ] o.a.s.c.CoreContainer Loading cores into CoreContainer [instanceDir=/home/jenkins/workspace/Lucene-Solr-master-Linux/solr/build/solr-core/test/J2/temp/solr.cloud.UnloadDistributedZkTest_29AC623EA1484E7-001/shard-1-001]
   [junit4]   2> 708188 WARN  (TEST-UnloadDistributedZkTest.test-seed#[29AC623EA1484E7]) [    ] o.a.s.c.CoreContainer Couldn't add files from /home/jenkins/workspace/Lucene-Solr-master-Linux/solr/build/solr-core/test/J2/temp/solr.cloud.UnloadDistributedZkTest_29AC623EA1484E7-001/shard-1-001/lib to classpath: /home/jenkins/workspace/Lucene-Solr-master-Linux/solr/build/solr-core/test/J2/temp/solr.cloud.UnloadDistributedZkTest_29AC623EA1484E7-001/shard-1-001/lib
   [junit4]   2> 708188 INFO  (TEST-UnloadDistributedZkTest.test-seed#[29AC623EA1484E7]) [    ] o.a.s.h.c.HttpShardHandlerFactory created with socketTimeout : 90000,urlScheme : ,connTimeout : 15000,maxConnectionsPerHost : 20,maxConnections : 10000,corePoolSize : 0,maximumPoolSize : 2147483647,maxThreadIdleTime : 5,sizeOfQueue : -1,fairnessPolicy : false,useRetries : false,
   [junit4]   2> 708188 INFO  (TEST-UnloadDistributedZkTest.test-seed#[29AC623EA1484E7]) [    ] o.a.s.u.UpdateShardHandler Creating UpdateShardHandler HTTP client with params: socketTimeout=340000&connTimeout=45000&retry=true
   [junit4]   2> 708189 INFO  (TEST-UnloadDistributedZkTest.test-seed#[29AC623EA1484E7]) [    ] o.a.s.l.LogWatcher SLF4J impl is org.slf4j.impl.Log4jLoggerFactory
   [junit4]   2> 708189 INFO  (TEST-UnloadDistributedZkTest.test-seed#[29AC623EA1484E7]) [    ] o.a.s.l.LogWatcher Registering Log Listener [Log4j (org.slf4j.impl.Log4jLoggerFactory)]
   [junit4]   2> 708189 INFO  (TEST-UnloadDistributedZkTest.test-seed#[29AC623EA1484E7]) [    ] o.a.s.c.ZkContainer Zookeeper client=127.0.0.1:57984/solr
   [junit4]   2> 708189 INFO  (TEST-UnloadDistributedZkTest.test-seed#[29AC623EA1484E7]) [    ] o.a.s.c.ZkController zkHost includes chroot
   [junit4]   2> 708189 INFO  (TEST-UnloadDistributedZkTest.test-seed#[29AC623EA1484E7]) [    ] o.a.s.c.c.SolrZkClient Using default ZkCredentialsProvider
   [junit4]   2> 708189 INFO  (TEST-UnloadDistributedZkTest.test-seed#[29AC623EA1484E7]) [    ] o.a.s.c.c.ConnectionManager Waiting for client to connect to ZooKeeper
   [junit4]   2> 708205 INFO  (zkCallback-1230-thread-1) [    ] o.a.s.c.c.ConnectionManager Watcher org.apache.solr.common.cloud.ConnectionManager@6c2de160 name:ZooKeeperConnection Watcher:127.0.0.1:57984 got event WatchedEvent state:SyncConnected type:None path:null path:null type:None
   [junit4]   2> 708205 INFO  (TEST-UnloadDistributedZkTest.test-seed#[29AC623EA1484E7]) [    ] o.a.s.c.c.ConnectionManager Client is connected to ZooKeeper
   [junit4]   2> 708205 INFO  (TEST-UnloadDistributedZkTest.test-seed#[29AC623EA1484E7]) [    ] o.a.s.c.c.SolrZkClient Using default ZkACLProvider
   [junit4]   2> 708206 INFO  (TEST-UnloadDistributedZkTest.test-seed#[29AC623EA1484E7]) [n:127.0.0.1:50149_u_v%2Fd    ] o.a.s.c.c.ConnectionManager Waiting for client to connect to ZooKeeper
   [junit4]   2> 708206 INFO  (zkCallback-1231-thread-1-processing-n:127.0.0.1:50149_u_v%2Fd) [n:127.0.0.1:50149_u_v%2Fd    ] o.a.s.c.c.ConnectionManager Watcher org.apache.solr.common.cloud.ConnectionManager@3ed8d3b0 name:ZooKeeperConnection Watcher:127.0.0.1:57984/solr got event WatchedEvent state:SyncConnected type:None path:null path:null type:None
   [junit4]   2> 708206 INFO  (TEST-UnloadDistributedZkTest.test-seed#[29AC623EA1484E7]) [n:127.0.0.1:50149_u_v%2Fd    ] o.a.s.c.c.ConnectionManager Client is connected to ZooKeeper
   [junit4]   2> 708208 INFO  (TEST-UnloadDistributedZkTest.test-seed#[29AC623EA1484E7]) [n:127.0.0.1:50149_u_v%2Fd    ] o.a.s.c.c.ZkStateReader Updating cluster state from ZooKeeper... 
   [junit4]   2> 708209 INFO  (TEST-UnloadDistributedZkTest.test-seed#[29AC623EA1484E7]) [n:127.0.0.1:50149_u_v%2Fd    ] o.a.s.c.c.ZkStateReader Updated live nodes from ZooKeeper... (0) -> (1)
   [junit4]   2> 708209 INFO  (TEST-UnloadDistributedZkTest.test-seed#[29AC623EA1484E7]) [n:127.0.0.1:50149_u_v%2Fd    ] o.a.s.c.Overseer Overseer (id=null) closing
   [junit4]   2> 708209 INFO  (TEST-UnloadDistributedZkTest.test-seed#[29AC623EA1484E7]) [n:127.0.0.1:50149_u_v%2Fd    ] o.a.s.c.LeaderElector Joined leadership election with path: /overseer_elect/election/95522233208668168-127.0.0.1:50149_u_v%2Fd-n_0000000001
   [junit4]   2> 708210 INFO  (TEST-UnloadDistributedZkTest.test-seed#[29AC623EA1484E7]) [n:127.0.0.1:50149_u_v%2Fd    ] o.a.s.c.LeaderElector Watching path /overseer_elect/election/95522233208668164-127.0.0.1:59202_u_v%2Fd-n_0000000000 to know if I could be the leader
   [junit4]   2> 708210 INFO  (TEST-UnloadDistributedZkTest.test-seed#[29AC623EA1484E7]) [n:127.0.0.1:50149_u_v%2Fd    ] o.a.s.c.ZkController Publish node=127.0.0.1:50149_u_v%2Fd as DOWN
   [junit4]   2> 708210 INFO  (OverseerStateUpdate-95522233208668164-127.0.0.1:59202_u_v%2Fd-n_0000000000) [n:127.0.0.1:59202_u_v%2Fd    ] o.a.s.c.Overseer processMessage: queueSize: 1, message = {
   [junit4]   2>   "operation":"downnode",
   [junit4]   2>   "node_name":"127.0.0.1:50149_u_v%2Fd"} current state version: 3
   [junit4]   2> 708210 INFO  (OverseerStateUpdate-95522233208668164-127.0.0.1:59202_u_v%2Fd-n_0000000000) [n:127.0.0.1:59202_u_v%2Fd    ] o.a.s.c.o.NodeMutator DownNode state invoked for node: 127.0.0.1:50149_u_v%2Fd
   [junit4]   2> 708311 INFO  (zkCallback-1226-thread-1) [    ] o.a.s.c.c.ZkStateReader A cluster state change: [WatchedEvent state:SyncConnected type:NodeDataChanged path:/clusterstate.json], has occurred - updating... (live nodes size: [1])
   [junit4]   2> 708311 INFO  (zkCallback-1224-thread-1-processing-n:127.0.0.1:59202_u_v%2Fd) [n:127.0.0.1:59202_u_v%2Fd    ] o.a.s.c.c.ZkStateReader A cluster state change: [WatchedEvent state:SyncConnected type:NodeDataChanged path:/clusterstate.json], has occurred - updating... (live nodes size: [1])
   [junit4]   2> 708311 INFO  (zkCallback-1231-thread-1-processing-n:127.0.0.1:50149_u_v%2Fd) [n:127.0.0.1:50149_u_v%2Fd    ] o.a.s.c.c.ZkStateReader A cluster state change: [WatchedEvent state:SyncConnected type:NodeDataChanged path:/clusterstate.json], has occurred - updating... (live nodes size: [1])
   [junit4]   2> 709210 INFO  (TEST-UnloadDistributedZkTest.test-seed#[29AC623EA1484E7]) [n:127.0.0.1:50149_u_v%2Fd    ] o.a.s.c.ZkController Register node as live in ZooKeeper:/live_nodes/127.0.0.1:50149_u_v%2Fd
   [junit4]   2> 709211 INFO  (TEST-UnloadDistributedZkTest.test-seed#[29AC623EA1484E7]) [n:127.0.0.1:50149_u_v%2Fd    ] o.a.s.c.c.SolrZkClient makePath: /live_nodes/127.0.0.1:50149_u_v%2Fd
   [junit4]   2> 709211 INFO  (zkCallback-1226-thread-1) [    ] o.a.s.c.c.ZkStateReader A live node change: [WatchedEvent state:SyncConnected type:NodeChildrenChanged path:/live_nodes], has occurred - updating... (live nodes size: [1])
   [junit4]   2> 709211 INFO  (zkCallback-1224-thread-1-processing-n:127.0.0.1:59202_u_v%2Fd) [n:127.0.0.1:59202_u_v%2Fd    ] o.a.s.c.c.ZkStateReader A live node change: [WatchedEvent state:SyncConnected type:NodeChildrenChanged path:/live_nodes], has occurred - updating... (live nodes size: [1])
   [junit4]   2> 709211 INFO  (zkCallback-1231-thread-1-processing-n:127.0.0.1:50149_u_v%2Fd) [n:127.0.0.1:50149_u_v%2Fd    ] o.a.s.c.c.ZkStateReader A live node change: [WatchedEvent state:SyncConnected type:NodeChildrenChanged path:/live_nodes], has occurred - updating... (live nodes size: [1])
   [junit4]   2> 709211 INFO  (zkCallback-1226-thread-1) [    ] o.a.s.c.c.ZkStateReader Updated live nodes from ZooKeeper... (1) -> (2)
   [junit4]   2> 709211 INFO  (zkCallback-1224-thread-1-processing-n:127.0.0.1:59202_u_v%2Fd) [n:127.0.0.1:59202_u_v%2Fd    ] o.a.s.c.c.ZkStateReader Updated live nodes from ZooKeeper... (1) -> (2)
   [junit4]   2> 709211 INFO  (zkCallback-1231-thread-1-processing-n:127.0.0.1:50149_u_v%2Fd) [n:127.0.0.1:50149_u_v%2Fd    ] o.a.s.c.c.ZkStateReader Updated live nodes from ZooKeeper... (1) -> (2)
   [junit4]   2> 709220 INFO  (TEST-UnloadDistributedZkTest.test-seed#[29AC623EA1484E7]) [n:127.0.0.1:50149_u_v%2Fd    ] o.a.s.c.CoreContainer Security conf doesn't exist. Skipping setup for authorization module.
   [junit4]   2> 709220 INFO  (TEST-UnloadDistributedZkTest.test-seed#[29AC623EA1484E7]) [n:127.0.0.1:50149_u_v%2Fd    ] o.a.s.c.CoreContainer No authentication plugin used.
   [junit4]   2> 709220 INFO  (TEST-UnloadDistributedZkTest.test-seed#[29AC623EA1484E7]) [n:127.0.0.1:50149_u_v%2Fd    ] o.a.s.c.CorePropertiesLocator Looking for core definitions underneath /home/jenkins/workspace/Lucene-Solr-master-Linux/solr/build/solr-core/test/J2/../../../../../../../../../home/jenkins/workspace/Lucene-Solr-master-Linux/solr/build/solr-core/test/J2/temp/solr.cloud.UnloadDistributedZkTest_29AC623EA1484E7-001/shard-1-001/cores
   [junit4]   2> 709221 INFO  (TEST-UnloadDistributedZkTest.test-seed#[29AC623EA1484E7]) [n:127.0.0.1:50149_u_v%2Fd    ] o.a.s.c.CoreDescriptor Created CoreDescriptor: {name=collection1, config=solrconfig.xml, transient=false, schema=schema.xml, loadOnStartup=true, configSetProperties=configsetprops.json, collection=collection1, coreNodeName=, dataDir=data/, shard=}
   [junit4]   2> 709221 INFO  (TEST-UnloadDistributedZkTest.test-seed#[29AC623EA1484E7]) [n:127.0.0.1:50149_u_v%2Fd    ] o.a.s.c.CorePropertiesLocator Found core collection1 in /home/jenkins/workspace/Lucene-Solr-master-Linux/solr/build/solr-core/test/J2/../../../../../../../../../home/jenkins/workspace/Lucene-Solr-master-Linux/solr/build/solr-core/test/J2/temp/solr.cloud.UnloadDistributedZkTest_29AC623EA1484E7-001/shard-1-001/cores/collection1
   [junit4]

[...truncated too long message...]

,UNAVAILABLE}
   [junit4]   2> 1441878 INFO  (TEST-TestCollectionAPI.test-seed#[29AC623EA1484E7]) [    ] o.a.s.c.ZkTestServer connecting to 127.0.0.1:49951 49951
   [junit4]   2> 1441943 INFO  (Thread-4424) [    ] o.a.s.c.ZkTestServer connecting to 127.0.0.1:49951 49951
   [junit4]   2> 1441944 WARN  (Thread-4424) [    ] o.a.s.c.ZkTestServer Watch limit violations: 
   [junit4]   2> Maximum concurrent create/delete watches above limit:
   [junit4]   2> 
   [junit4]   2> 	16	/solr/aliases.json
   [junit4]   2> 	3	/solr/security.json
   [junit4]   2> 	3	/solr/configs/conf1
   [junit4]   2> 
   [junit4]   2> Maximum concurrent data watches above limit:
   [junit4]   2> 
   [junit4]   2> 	16	/solr/clusterstate.json
   [junit4]   2> 	2	/solr/overseer_elect/election/95522278650019852-127.0.0.1:54669__kvu%2Fzh-n_0000000002
   [junit4]   2> 	2	/solr/collections/clusterStatusZNodeVersion/state.json
   [junit4]   2> 
   [junit4]   2> Maximum concurrent children watches above limit:
   [junit4]   2> 
   [junit4]   2> 	16	/solr/live_nodes
   [junit4]   2> 	16	/solr/collections
   [junit4]   2> 	3	/solr/overseer/collection-queue-work
   [junit4]   2> 	3	/solr/overseer/queue-work
   [junit4]   2> 
   [junit4]   2> NOTE: reproduce with: ant test  -Dtestcase=TestCollectionAPI -Dtests.method=test -Dtests.seed=29AC623EA1484E7 -Dtests.multiplier=3 -Dtests.slow=true -Dtests.locale=sv -Dtests.timezone=Cuba -Dtests.asserts=true -Dtests.file.encoding=UTF-8
   [junit4] ERROR   42.2s J2 | TestCollectionAPI.test <<<
   [junit4]    > Throwable #1: org.apache.solr.client.solrj.SolrServerException: No live SolrServers available to handle this request:[https://127.0.0.1:46150/_kvu/zh, https://127.0.0.1:38637/_kvu/zh, https://127.0.0.1:54669/_kvu/zh]
   [junit4]    > 	at __randomizedtesting.SeedInfo.seed([29AC623EA1484E7:8ACEF9F944E8E91F]:0)
   [junit4]    > 	at org.apache.solr.client.solrj.impl.LBHttpSolrClient.request(LBHttpSolrClient.java:352)
   [junit4]    > 	at org.apache.solr.client.solrj.impl.CloudSolrClient.sendRequest(CloudSolrClient.java:1100)
   [junit4]    > 	at org.apache.solr.client.solrj.impl.CloudSolrClient.requestWithRetryOnStaleState(CloudSolrClient.java:870)
   [junit4]    > 	at org.apache.solr.client.solrj.impl.CloudSolrClient.request(CloudSolrClient.java:806)
   [junit4]    > 	at org.apache.solr.client.solrj.SolrClient.request(SolrClient.java:1219)
   [junit4]    > 	at org.apache.solr.cloud.TestCollectionAPI.testCollectionCreationCollectionNameValidation(TestCollectionAPI.java:646)
   [junit4]    > 	at org.apache.solr.cloud.TestCollectionAPI.test(TestCollectionAPI.java:83)
   [junit4]    > 	at org.apache.solr.BaseDistributedSearchTestCase$ShardsRepeatRule$ShardsFixedStatement.callStatement(BaseDistributedSearchTestCase.java:996)
   [junit4]    > 	at org.apache.solr.BaseDistributedSearchTestCase$ShardsRepeatRule$ShardsStatement.evaluate(BaseDistributedSearchTestCase.java:971)
   [junit4]    > 	at java.lang.Thread.run(Thread.java:745)
   [junit4]    > Caused by: org.apache.solr.client.solrj.impl.HttpSolrClient$RemoteSolrException: Error from server at https://127.0.0.1:38637/_kvu/zh: Invalid collection: invalid@name#with$weird%characters. collection names must consist entirely of periods, underscores, hyphens, and alphanumerics
   [junit4]    > 	at org.apache.solr.client.solrj.impl.HttpSolrClient.executeMethod(HttpSolrClient.java:577)
   [junit4]    > 	at org.apache.solr.client.solrj.impl.HttpSolrClient.request(HttpSolrClient.java:241)
   [junit4]    > 	at org.apache.solr.client.solrj.impl.HttpSolrClient.request(HttpSolrClient.java:230)
   [junit4]    > 	at org.apache.solr.client.solrj.impl.LBHttpSolrClient.doRequest(LBHttpSolrClient.java:372)
   [junit4]    > 	at org.apache.solr.client.solrj.impl.LBHttpSolrClient.request(LBHttpSolrClient.java:325)
   [junit4]    > 	... 47 more
   [junit4]   2> 1441958 INFO  (SUITE-TestCollectionAPI-seed#[29AC623EA1484E7]-worker) [    ] o.a.s.SolrTestCaseJ4 ###deleteCore
   [junit4]   2> NOTE: leaving temporary files on disk at: /home/jenkins/workspace/Lucene-Solr-master-Linux/solr/build/solr-core/test/J2/temp/solr.cloud.TestCollectionAPI_29AC623EA1484E7-001
   [junit4]   2> Mar 09, 2016 8:12:22 PM com.carrotsearch.randomizedtesting.ThreadLeakControl checkThreadLeaks
   [junit4]   2> WARNING: Will linger awaiting termination of 2 leaked thread(s).
   [junit4]   2> NOTE: test params are: codec=Asserting(Lucene60): {_version_=TestBloomFilteredLucenePostings(BloomFilteringPostingsFormat(Lucene50(blocksize=128))), id=PostingsFormat(name=Asserting)}, docValues:{}, maxPointsInLeafNode=1104, maxMBSortInHeap=4.0784180152389276, sim=ClassicSimilarity, locale=sv, timezone=Cuba
   [junit4]   2> NOTE: Linux 3.19.0-51-generic amd64/Oracle Corporation 1.8.0_72 (64-bit)/cpus=12,threads=1,free=229085864,total=536870912
   [junit4]   2> NOTE: All tests run in this JVM: [TestSerializedLuceneMatchVersion, TestConfigSets, HighlighterMaxOffsetTest, DirectUpdateHandlerTest, TestSchemaResource, TestSweetSpotSimilarityFactory, TestDistributedMissingSort, TestFilteredDocIdSet, TestReload, TestSort, TestJsonFacets, FacetPivotSmallTest, BasicAuthIntegrationTest, TestMacros, SliceStateTest, StatsComponentTest, SuggestComponentTest, SharedFSAutoReplicaFailoverTest, TestCoreDiscovery, HdfsChaosMonkeyNothingIsSafeTest, TestCopyFieldCollectionResource, AutoCommitTest, TestBlendedInfixSuggestions, AnalyticsMergeStrategyTest, TestSolrConfigHandlerCloud, HdfsTlogReplayBufferedWhileIndexingTest, ResponseHeaderTest, DataDrivenBlockJoinTest, TestPivotHelperCode, TestDFISimilarityFactory, TestPHPSerializedResponseWriter, TestConfigSetsAPIZkFailure, XmlUpdateRequestHandlerTest, SimpleFacetsTest, SuggesterTSTTest, TestSolrQueryParser, TestExactSharedStatsCache, TestIndexingPerformance, CollectionsAPISolrJTest, MergeStrategyTest, RegexBoostProcessorTest, BadComponentTest, TestNamedUpdateProcessors, VMParamsZkACLAndCredentialsProvidersTest, TestRestManager, TestComplexPhraseQParserPlugin, TestObjectReleaseTracker, SolrCoreCheckLockOnStartupTest, CdcrRequestHandlerTest, TestInfoStreamLogging, RequestHandlersTest, SolrCloudExampleTest, TestSortingResponseWriter, BlockJoinFacetRandomTest, FullSolrCloudDistribCmdsTest, TestZkChroot, DebugComponentTest, DocValuesMultiTest, CurrencyFieldXmlFileTest, ExitableDirectoryReaderTest, TestMaxScoreQueryParser, TestSmileRequest, TestOverriddenPrefixQueryForCustomFieldType, DistributedExpandComponentTest, OverseerTaskQueueTest, TestRequestStatusCollectionAPI, TestReloadDeadlock, TestStressUserVersions, TestLeaderInitiatedRecoveryThread, BufferStoreTest, SearchHandlerTest, TestTolerantSearch, DistributedQueryComponentCustomSortTest, TestJmxMonitoredMap, TestHighFrequencyDictionaryFactory, ClusterStateTest, TestRecovery, RecoveryZkTest, TestXIncludeConfig, TestScoreJoinQPNoScore, MultiThreadedOCPTest, CleanupOldIndexTest, TermVectorComponentDistributedTest, TestSchemaManager, TestStressRecovery, StatelessScriptUpdateProcessorFactoryTest, TestRebalanceLeaders, TestTestInjection, ZkStateWriterTest, TestDownShardTolerantSearch, DirectSolrConnectionTest, HdfsRestartWhileUpdatingTest, BasicDistributedZkTest, BasicDistributedZk2Test, UnloadDistributedZkTest, CollectionsAPIDistributedZkTest, ZkSolrClientTest, HardAutoCommitTest, SolrCoreTest, BadIndexSchemaTest, ConvertedLegacyTest, TestLazyCores, CoreAdminHandlerTest, SuggesterTest, SpatialFilterTest, TestCSVLoader, SchemaVersionSpecificBehaviorTest, TestPseudoReturnFields, DefaultValueUpdateProcessorTest, SortByFunctionTest, IndexBasedSpellCheckerTest, PrimitiveFieldTypeTest, TestValueSourceCache, TestArbitraryIndexDir, TestJmxIntegration, UniqFieldsUpdateProcessorFactoryTest, TestComponentsName, TestQuerySenderListener, TestSolrIndexConfig, SolrIndexConfigTest, TestDocSet, NumericFieldsTest, TestElisionMultitermQuery, TestFuzzyAnalyzedSuggestions, NotRequiredUniqueKeyTest, TestPhraseSuggestions, TestLMDirichletSimilarityFactory, TestBM25SimilarityFactory, TimeZoneUtilsTest, ScriptEngineTest, DateMathParserTest, TestSystemIdResolver, PrimUtilsTest, TestSuggestSpellingConverter, DateFieldTest, SpellingQueryConverterTest, DOMUtilTest, TestSolrJ, TestUtils, CircularListTest, DistributedMLTComponentTest, CursorPagingTest, AssignTest, AsyncCallRequestStatusResponseTest, BaseCdcrDistributedZkTest, CdcrReplicationDistributedZkTest, CdcrReplicationHandlerTest, CdcrVersionReplicationTest, CollectionReloadTest, CollectionsAPIAsyncDistributedZkTest, DeleteReplicaTest, DistribJoinFromCollectionTest, LeaderInitiatedRecoveryOnCommitTest, SSLMigrationTest, SaslZkACLProviderTest, TestCloudDeleteByQuery, TestCloudInspectUtil, TestCollectionAPI]
   [junit4] Completed [451/578 (3!)] on J2 in 42.49s, 1 test, 1 error <<< FAILURES!

[...truncated 436 lines...]
BUILD FAILED
/home/jenkins/workspace/Lucene-Solr-master-Linux/build.xml:740: The following error occurred while executing this line:
/home/jenkins/workspace/Lucene-Solr-master-Linux/build.xml:684: The following error occurred while executing this line:
/home/jenkins/workspace/Lucene-Solr-master-Linux/build.xml:59: The following error occurred while executing this line:
/home/jenkins/workspace/Lucene-Solr-master-Linux/solr/build.xml:233: The following error occurred while executing this line:
/home/jenkins/workspace/Lucene-Solr-master-Linux/solr/common-build.xml:524: The following error occurred while executing this line:
/home/jenkins/workspace/Lucene-Solr-master-Linux/lucene/common-build.xml:1457: The following error occurred while executing this line:
/home/jenkins/workspace/Lucene-Solr-master-Linux/lucene/common-build.xml:1014: There were test failures: 578 suites (10 ignored), 2306 tests, 3 errors, 117 ignored (71 assumptions) [seed: 29AC623EA1484E7]

Total time: 47 minutes 30 seconds
Build step 'Invoke Ant' marked build as failure
Archiving artifacts
[WARNINGS] Skipping publisher since build result is FAILURE
Recording test results
Email was triggered for: Failure - Any
Sending email for trigger: Failure - Any



Mime
View raw message