lucene-dev mailing list archives

Site index · List index
Message view « Date » · « Thread »
Top « Date » · « Thread »
From Policeman Jenkins Server <jenk...@thetaphi.de>
Subject [JENKINS] Lucene-Solr-master-Linux (32bit/jdk1.8.0_72) - Build # 16334 - Failure!
Date Sat, 26 Mar 2016 02:38:43 GMT
Build: http://jenkins.thetaphi.de/job/Lucene-Solr-master-Linux/16334/
Java: 32bit/jdk1.8.0_72 -client -XX:+UseG1GC

1 tests failed.
FAILED:  org.apache.lucene.search.spans.TestSpanCollection.testNestedNearQuery

Error Message:
Missing term field:w3

Stack Trace:
java.lang.AssertionError: Missing term field:w3
	at __randomizedtesting.SeedInfo.seed([36E2276040A58519:7413B6FB41F7215E]:0)
	at org.junit.Assert.fail(Assert.java:93)
	at org.junit.Assert.assertTrue(Assert.java:43)
	at org.apache.lucene.search.spans.TestSpanCollection.checkCollectedTerms(TestSpanCollection.java:103)
	at org.apache.lucene.search.spans.TestSpanCollection.testNestedNearQuery(TestSpanCollection.java:126)
	at sun.reflect.NativeMethodAccessorImpl.invoke0(Native Method)
	at sun.reflect.NativeMethodAccessorImpl.invoke(NativeMethodAccessorImpl.java:62)
	at sun.reflect.DelegatingMethodAccessorImpl.invoke(DelegatingMethodAccessorImpl.java:43)
	at java.lang.reflect.Method.invoke(Method.java:498)
	at com.carrotsearch.randomizedtesting.RandomizedRunner.invoke(RandomizedRunner.java:1764)
	at com.carrotsearch.randomizedtesting.RandomizedRunner$8.evaluate(RandomizedRunner.java:871)
	at com.carrotsearch.randomizedtesting.RandomizedRunner$9.evaluate(RandomizedRunner.java:907)
	at com.carrotsearch.randomizedtesting.RandomizedRunner$10.evaluate(RandomizedRunner.java:921)
	at org.apache.lucene.util.TestRuleSetupTeardownChained$1.evaluate(TestRuleSetupTeardownChained.java:49)
	at org.apache.lucene.util.AbstractBeforeAfterRule$1.evaluate(AbstractBeforeAfterRule.java:45)
	at org.apache.lucene.util.TestRuleThreadAndTestName$1.evaluate(TestRuleThreadAndTestName.java:48)
	at org.apache.lucene.util.TestRuleIgnoreAfterMaxFailures$1.evaluate(TestRuleIgnoreAfterMaxFailures.java:64)
	at org.apache.lucene.util.TestRuleMarkFailure$1.evaluate(TestRuleMarkFailure.java:47)
	at com.carrotsearch.randomizedtesting.rules.StatementAdapter.evaluate(StatementAdapter.java:36)
	at com.carrotsearch.randomizedtesting.ThreadLeakControl$StatementRunner.run(ThreadLeakControl.java:367)
	at com.carrotsearch.randomizedtesting.ThreadLeakControl.forkTimeoutingTask(ThreadLeakControl.java:809)
	at com.carrotsearch.randomizedtesting.ThreadLeakControl$3.evaluate(ThreadLeakControl.java:460)
	at com.carrotsearch.randomizedtesting.RandomizedRunner.runSingleTest(RandomizedRunner.java:880)
	at com.carrotsearch.randomizedtesting.RandomizedRunner$5.evaluate(RandomizedRunner.java:781)
	at com.carrotsearch.randomizedtesting.RandomizedRunner$6.evaluate(RandomizedRunner.java:816)
	at com.carrotsearch.randomizedtesting.RandomizedRunner$7.evaluate(RandomizedRunner.java:827)
	at org.apache.lucene.util.AbstractBeforeAfterRule$1.evaluate(AbstractBeforeAfterRule.java:45)
	at com.carrotsearch.randomizedtesting.rules.StatementAdapter.evaluate(StatementAdapter.java:36)
	at org.apache.lucene.util.TestRuleStoreClassName$1.evaluate(TestRuleStoreClassName.java:41)
	at com.carrotsearch.randomizedtesting.rules.NoShadowingOrOverridesOnMethodsRule$1.evaluate(NoShadowingOrOverridesOnMethodsRule.java:40)
	at com.carrotsearch.randomizedtesting.rules.NoShadowingOrOverridesOnMethodsRule$1.evaluate(NoShadowingOrOverridesOnMethodsRule.java:40)
	at com.carrotsearch.randomizedtesting.rules.StatementAdapter.evaluate(StatementAdapter.java:36)
	at com.carrotsearch.randomizedtesting.rules.StatementAdapter.evaluate(StatementAdapter.java:36)
	at com.carrotsearch.randomizedtesting.rules.StatementAdapter.evaluate(StatementAdapter.java:36)
	at org.apache.lucene.util.TestRuleAssertionsRequired$1.evaluate(TestRuleAssertionsRequired.java:53)
	at org.apache.lucene.util.TestRuleMarkFailure$1.evaluate(TestRuleMarkFailure.java:47)
	at org.apache.lucene.util.TestRuleIgnoreAfterMaxFailures$1.evaluate(TestRuleIgnoreAfterMaxFailures.java:64)
	at org.apache.lucene.util.TestRuleIgnoreTestSuites$1.evaluate(TestRuleIgnoreTestSuites.java:54)
	at com.carrotsearch.randomizedtesting.rules.StatementAdapter.evaluate(StatementAdapter.java:36)
	at com.carrotsearch.randomizedtesting.ThreadLeakControl$StatementRunner.run(ThreadLeakControl.java:367)
	at java.lang.Thread.run(Thread.java:745)




Build Log:
[...truncated 913 lines...]
   [junit4] Suite: org.apache.lucene.search.spans.TestSpanCollection
   [junit4]   2> NOTE: reproduce with: ant test  -Dtestcase=TestSpanCollection -Dtests.method=testNestedNearQuery
-Dtests.seed=36E2276040A58519 -Dtests.multiplier=3 -Dtests.slow=true -Dtests.locale=mk -Dtests.timezone=Etc/GMT-3
-Dtests.asserts=true -Dtests.file.encoding=ISO-8859-1
   [junit4] FAILURE 0.02s J0 | TestSpanCollection.testNestedNearQuery <<<
   [junit4]    > Throwable #1: java.lang.AssertionError: Missing term field:w3
   [junit4]    > 	at __randomizedtesting.SeedInfo.seed([36E2276040A58519:7413B6FB41F7215E]:0)
   [junit4]    > 	at org.apache.lucene.search.spans.TestSpanCollection.checkCollectedTerms(TestSpanCollection.java:103)
   [junit4]    > 	at org.apache.lucene.search.spans.TestSpanCollection.testNestedNearQuery(TestSpanCollection.java:126)
   [junit4]    > 	at java.lang.Thread.run(Thread.java:745)
   [junit4]   2> NOTE: test params are: codec=Asserting(Lucene60): {field=Lucene50(blocksize=128)},
docValues:{}, maxPointsInLeafNode=1945, maxMBSortInHeap=6.818906485988073, sim=RandomSimilarity(queryNorm=true,coord=no):
{field=DFR I(F)LZ(0.3)}, locale=mk, timezone=Etc/GMT-3
   [junit4]   2> NOTE: Linux 4.2.0-34-generic i386/Oracle Corporation 1.8.0_72 (32-bit)/cpus=12,threads=1,free=215918352,total=528482304
   [junit4]   2> NOTE: All tests run in this JVM: [TestMultiTermConstantScore, TestFieldType,
TestPhraseQuery, TestNGramPhraseQuery, TestPriorityQueue, TestOperations, TestNumericRangeQuery64,
TestFieldReuse, TestPersistentSnapshotDeletionPolicy, TestDisjunctionMaxQuery, TestConjunctionDISI,
TestSortRandom, TestBKD, TestQueryBuilder, TestUnicodeUtil, TestBinaryTerms, TestClassicSimilarity,
TestAutomatonQuery, TestIndexWriterDelete, TestForTooMuchCloning, TestRateLimiter, TestLucene50CompoundFormat,
TestNeverDelete, TestStringHelper, TestTimeLimitingCollector, TestNewestSegment, TestReaderClosed,
TestPointValues, TestIndexWriterLockRelease, TestSimpleAttributeImpl, TestAllFilesHaveChecksumFooter,
TestDeletionPolicy, TestIntArrayDocIdSet, TestSloppyPhraseQuery2, TestFilterLeafReader, TestMergeRateLimiter,
TestSingleInstanceLockFactory, TestFixedBitSet, TestTermsEnum, TestNeedsScores, TestIndexWriterWithThreads,
TestDeterminizeLexicon, TestBooleanCoord, TestCrash, TestIndexWriterMaxDocs, TestCloseableThreadLocal,
TestBlockPostingsFormat2, TestSegmentReader, TestHighCompressionMode, TestSimilarity2, TestTermScorer,
TestFixedBitDocIdSet, TestMultiPhraseQuery, TestSpanNotQuery, TestThreadedForceMerge, TestBinaryDocument,
TestNRTReaderCleanup, TestCustomNorms, TestQueryRescorer, TestDateSort, TestMultiFields, TestRecyclingByteBlockAllocator,
TestEarlyTermination, TestPagedBytes, TestSumDocFreq, TestBytesRefArray, TestManyFields, TestVirtualMethod,
TestSpanCollection]
   [junit4] Completed [219/415 (1!)] on J0 in 0.07s, 3 tests, 1 failure <<< FAILURES!

[...truncated 663 lines...]
BUILD FAILED
/home/jenkins/workspace/Lucene-Solr-master-Linux/build.xml:740: The following error occurred
while executing this line:
/home/jenkins/workspace/Lucene-Solr-master-Linux/build.xml:684: The following error occurred
while executing this line:
/home/jenkins/workspace/Lucene-Solr-master-Linux/build.xml:59: The following error occurred
while executing this line:
/home/jenkins/workspace/Lucene-Solr-master-Linux/lucene/build.xml:50: The following error
occurred while executing this line:
/home/jenkins/workspace/Lucene-Solr-master-Linux/lucene/common-build.xml:1457: The following
error occurred while executing this line:
/home/jenkins/workspace/Lucene-Solr-master-Linux/lucene/common-build.xml:1014: There were
test failures: 415 suites (1 ignored), 3468 tests, 1 failure, 66 ignored (62 assumptions)
[seed: 36E2276040A58519]

Total time: 7 minutes 38 seconds
Build step 'Invoke Ant' marked build as failure
Archiving artifacts
[WARNINGS] Skipping publisher since build result is FAILURE
Recording test results
Email was triggered for: Failure - Any
Sending email for trigger: Failure - Any



Mime
View raw message