lucene-dev mailing list archives

Site index · List index
Message view « Date » · « Thread »
Top « Date » · « Thread »
From Policeman Jenkins Server <jenk...@thetaphi.de>
Subject [JENKINS-EA] Lucene-Solr-master-Linux (32bit/jdk-9-jigsaw-ea+110) - Build # 16287 - Failure!
Date Mon, 21 Mar 2016 18:45:25 GMT
Build: http://jenkins.thetaphi.de/job/Lucene-Solr-master-Linux/16287/
Java: 32bit/jdk-9-jigsaw-ea+110 -client -XX:+UseG1GC -XX:-CompactStrings

2 tests failed.
FAILED:  junit.framework.TestSuite.org.apache.solr.client.solrj.io.stream.StreamingTest

Error Message:
Suite timeout exceeded (>= 7200000 msec).

Stack Trace:
java.lang.Exception: Suite timeout exceeded (>= 7200000 msec).
	at __randomizedtesting.SeedInfo.seed([8ABA9BB025CBE00B]:0)


FAILED:  org.apache.solr.client.solrj.io.stream.StreamingTest.streamTests

Error Message:
Test abandoned because suite timeout was reached.

Stack Trace:
java.lang.Exception: Test abandoned because suite timeout was reached.
	at __randomizedtesting.SeedInfo.seed([8ABA9BB025CBE00B]:0)




Build Log:
[...truncated 13187 lines...]
   [junit4] Suite: org.apache.solr.client.solrj.io.stream.StreamingTest
   [junit4]   2> Creating dataDir: /home/jenkins/workspace/Lucene-Solr-master-Linux/solr/build/solr-solrj/test/J0/temp/solr.client.solrj.io.stream.StreamingTest_8ABA9BB025CBE00B-001/init-core-data-001
   [junit4]   2> 286  INFO  (SUITE-StreamingTest-seed#[8ABA9BB025CBE00B]-worker) [    ] o.a.s.SolrTestCaseJ4 Randomized ssl (true) and clientAuth (false)
   [junit4]   2> 287  INFO  (SUITE-StreamingTest-seed#[8ABA9BB025CBE00B]-worker) [    ] o.a.s.BaseDistributedSearchTestCase Setting hostContext system property: /cd_j/cy
   [junit4]   2> 288  WARN  (SUITE-StreamingTest-seed#[8ABA9BB025CBE00B]-worker) [    ] o.a.s.c.AbstractZkTestCase TEST_HOME() does not exist - solrj test?
   [junit4]   2> 298  INFO  (TEST-StreamingTest.streamTests-seed#[8ABA9BB025CBE00B]) [    ] o.a.s.c.ZkTestServer STARTING ZK TEST SERVER
   [junit4]   2> 300  INFO  (Thread-1) [    ] o.a.s.c.ZkTestServer client port:0.0.0.0/0.0.0.0:0
   [junit4]   2> 300  INFO  (Thread-1) [    ] o.a.s.c.ZkTestServer Starting server
   [junit4]   2> 399  INFO  (TEST-StreamingTest.streamTests-seed#[8ABA9BB025CBE00B]) [    ] o.a.s.c.ZkTestServer start zk server on port:32793
   [junit4]   2> 415  INFO  (TEST-StreamingTest.streamTests-seed#[8ABA9BB025CBE00B]) [    ] o.a.s.c.c.SolrZkClient Using default ZkCredentialsProvider
   [junit4]   2> 441  INFO  (TEST-StreamingTest.streamTests-seed#[8ABA9BB025CBE00B]) [    ] o.a.s.c.c.ConnectionManager Waiting for client to connect to ZooKeeper
   [junit4]   2> 473  INFO  (zkCallback-1-thread-1) [    ] o.a.s.c.c.ConnectionManager Watcher org.apache.solr.common.cloud.ConnectionManager@1cbf72 name:ZooKeeperConnection Watcher:127.0.0.1:32793 got event WatchedEvent state:SyncConnected type:None path:null path:null type:None
   [junit4]   2> 473  INFO  (TEST-StreamingTest.streamTests-seed#[8ABA9BB025CBE00B]) [    ] o.a.s.c.c.ConnectionManager Client is connected to ZooKeeper
   [junit4]   2> 475  INFO  (TEST-StreamingTest.streamTests-seed#[8ABA9BB025CBE00B]) [    ] o.a.s.c.c.SolrZkClient Using default ZkACLProvider
   [junit4]   2> 477  INFO  (TEST-StreamingTest.streamTests-seed#[8ABA9BB025CBE00B]) [    ] o.a.s.c.c.SolrZkClient makePath: /solr
   [junit4]   2> 496  INFO  (TEST-StreamingTest.streamTests-seed#[8ABA9BB025CBE00B]) [    ] o.a.s.c.c.SolrZkClient Using default ZkCredentialsProvider
   [junit4]   2> 496  INFO  (TEST-StreamingTest.streamTests-seed#[8ABA9BB025CBE00B]) [    ] o.a.s.c.c.ConnectionManager Waiting for client to connect to ZooKeeper
   [junit4]   2> 497  WARN  (NIOServerCxn.Factory:0.0.0.0/0.0.0.0:0) [    ] o.a.z.s.NIOServerCnxn caught end of stream exception
   [junit4]   2> EndOfStreamException: Unable to read additional data from client sessionid 0x1539a10886d0000, likely client has closed socket
   [junit4]   2> 	at org.apache.zookeeper.server.NIOServerCnxn.doIO(NIOServerCnxn.java:228)
   [junit4]   2> 	at org.apache.zookeeper.server.NIOServerCnxnFactory.run(NIOServerCnxnFactory.java:208)
   [junit4]   2> 	at java.lang.Thread.run(java.base@9-ea/Thread.java:804)
   [junit4]   2> 507  INFO  (zkCallback-2-thread-1) [    ] o.a.s.c.c.ConnectionManager Watcher org.apache.solr.common.cloud.ConnectionManager@aacf1 name:ZooKeeperConnection Watcher:127.0.0.1:32793/solr got event WatchedEvent state:SyncConnected type:None path:null path:null type:None
   [junit4]   2> 509  INFO  (TEST-StreamingTest.streamTests-seed#[8ABA9BB025CBE00B]) [    ] o.a.s.c.c.ConnectionManager Client is connected to ZooKeeper
   [junit4]   2> 510  INFO  (TEST-StreamingTest.streamTests-seed#[8ABA9BB025CBE00B]) [    ] o.a.s.c.c.SolrZkClient Using default ZkACLProvider
   [junit4]   2> 514  INFO  (TEST-StreamingTest.streamTests-seed#[8ABA9BB025CBE00B]) [    ] o.a.s.c.c.SolrZkClient makePath: /collections/collection1
   [junit4]   2> 519  INFO  (TEST-StreamingTest.streamTests-seed#[8ABA9BB025CBE00B]) [    ] o.a.s.c.c.SolrZkClient makePath: /collections/collection1/shards
   [junit4]   2> 531  INFO  (TEST-StreamingTest.streamTests-seed#[8ABA9BB025CBE00B]) [    ] o.a.s.c.c.SolrZkClient makePath: /collections/control_collection
   [junit4]   2> 533  INFO  (TEST-StreamingTest.streamTests-seed#[8ABA9BB025CBE00B]) [    ] o.a.s.c.c.SolrZkClient makePath: /collections/control_collection/shards
   [junit4]   2> 536  INFO  (TEST-StreamingTest.streamTests-seed#[8ABA9BB025CBE00B]) [    ] o.a.s.c.AbstractZkTestCase put /home/jenkins/workspace/Lucene-Solr-master-Linux/solr/solrj/src/test-files/solrj/solr/collection1/conf/solrconfig-streaming.xml to /configs/conf1/solrconfig.xml
   [junit4]   2> 559  INFO  (TEST-StreamingTest.streamTests-seed#[8ABA9BB025CBE00B]) [    ] o.a.s.c.c.SolrZkClient makePath: /configs/conf1/solrconfig.xml
   [junit4]   2> 568  INFO  (TEST-StreamingTest.streamTests-seed#[8ABA9BB025CBE00B]) [    ] o.a.s.c.AbstractZkTestCase put /home/jenkins/workspace/Lucene-Solr-master-Linux/solr/solrj/src/test-files/solrj/solr/collection1/conf/schema-streaming.xml to /configs/conf1/schema.xml
   [junit4]   2> 569  INFO  (TEST-StreamingTest.streamTests-seed#[8ABA9BB025CBE00B]) [    ] o.a.s.c.c.SolrZkClient makePath: /configs/conf1/schema.xml
   [junit4]   2> 572  INFO  (TEST-StreamingTest.streamTests-seed#[8ABA9BB025CBE00B]) [    ] o.a.s.c.AbstractZkTestCase skipping /home/jenkins/workspace/Lucene-Solr-master-Linux/solr/solrj/src/test-files/solrj/solr/collection1/conf/solrconfig.snippet.randomindexconfig.xml because it doesn't exist
   [junit4]   2> 572  INFO  (TEST-StreamingTest.streamTests-seed#[8ABA9BB025CBE00B]) [    ] o.a.s.c.AbstractZkTestCase skipping /home/jenkins/workspace/Lucene-Solr-master-Linux/solr/solrj/src/test-files/solrj/solr/collection1/conf/stopwords.txt because it doesn't exist
   [junit4]   2> 572  INFO  (TEST-StreamingTest.streamTests-seed#[8ABA9BB025CBE00B]) [    ] o.a.s.c.AbstractZkTestCase skipping /home/jenkins/workspace/Lucene-Solr-master-Linux/solr/solrj/src/test-files/solrj/solr/collection1/conf/protwords.txt because it doesn't exist
   [junit4]   2> 572  INFO  (TEST-StreamingTest.streamTests-seed#[8ABA9BB025CBE00B]) [    ] o.a.s.c.AbstractZkTestCase skipping /home/jenkins/workspace/Lucene-Solr-master-Linux/solr/solrj/src/test-files/solrj/solr/collection1/conf/currency.xml because it doesn't exist
   [junit4]   2> 572  INFO  (TEST-StreamingTest.streamTests-seed#[8ABA9BB025CBE00B]) [    ] o.a.s.c.AbstractZkTestCase skipping /home/jenkins/workspace/Lucene-Solr-master-Linux/solr/solrj/src/test-files/solrj/solr/collection1/conf/enumsConfig.xml because it doesn't exist
   [junit4]   2> 573  INFO  (TEST-StreamingTest.streamTests-seed#[8ABA9BB025CBE00B]) [    ] o.a.s.c.AbstractZkTestCase skipping /home/jenkins/workspace/Lucene-Solr-master-Linux/solr/solrj/src/test-files/solrj/solr/collection1/conf/open-exchange-rates.json because it doesn't exist
   [junit4]   2> 573  INFO  (TEST-StreamingTest.streamTests-seed#[8ABA9BB025CBE00B]) [    ] o.a.s.c.AbstractZkTestCase skipping /home/jenkins/workspace/Lucene-Solr-master-Linux/solr/solrj/src/test-files/solrj/solr/collection1/conf/mapping-ISOLatin1Accent.txt because it doesn't exist
   [junit4]   2> 573  INFO  (TEST-StreamingTest.streamTests-seed#[8ABA9BB025CBE00B]) [    ] o.a.s.c.AbstractZkTestCase skipping /home/jenkins/workspace/Lucene-Solr-master-Linux/solr/solrj/src/test-files/solrj/solr/collection1/conf/old_synonyms.txt because it doesn't exist
   [junit4]   2> 573  INFO  (TEST-StreamingTest.streamTests-seed#[8ABA9BB025CBE00B]) [    ] o.a.s.c.AbstractZkTestCase skipping /home/jenkins/workspace/Lucene-Solr-master-Linux/solr/solrj/src/test-files/solrj/solr/collection1/conf/synonyms.txt because it doesn't exist
   [junit4]   2> 578  INFO  (TEST-StreamingTest.streamTests-seed#[8ABA9BB025CBE00B]) [    ] o.a.s.c.c.SolrZkClient Using default ZkCredentialsProvider
   [junit4]   2> 579  INFO  (TEST-StreamingTest.streamTests-seed#[8ABA9BB025CBE00B]) [    ] o.a.s.c.c.ConnectionManager Waiting for client to connect to ZooKeeper
   [junit4]   2> 580  INFO  (zkCallback-3-thread-1) [    ] o.a.s.c.c.ConnectionManager Watcher org.apache.solr.common.cloud.ConnectionManager@1f488c5 name:ZooKeeperConnection Watcher:127.0.0.1:32793/solr got event WatchedEvent state:SyncConnected type:None path:null path:null type:None
   [junit4]   2> 580  INFO  (TEST-StreamingTest.streamTests-seed#[8ABA9BB025CBE00B]) [    ] o.a.s.c.c.ConnectionManager Client is connected to ZooKeeper
   [junit4]   2> 581  INFO  (TEST-StreamingTest.streamTests-seed#[8ABA9BB025CBE00B]) [    ] o.a.s.c.c.SolrZkClient Using default ZkACLProvider
   [junit4]   2> 611  INFO  (TEST-StreamingTest.streamTests-seed#[8ABA9BB025CBE00B]) [    ] o.a.s.SolrTestCaseJ4 Writing core.properties file to /home/jenkins/workspace/Lucene-Solr-master-Linux/solr/build/solr-solrj/test/J0/temp/solr.client.solrj.io.stream.StreamingTest_8ABA9BB025CBE00B-001/control-001/cores/collection1
   [junit4]   2> 650  INFO  (TEST-StreamingTest.streamTests-seed#[8ABA9BB025CBE00B]) [    ] o.e.j.u.log Logging initialized @2339ms
   [junit4]   2> 831  INFO  (TEST-StreamingTest.streamTests-seed#[8ABA9BB025CBE00B]) [    ] o.e.j.s.Server jetty-9.3.8.v20160314
   [junit4]   2> 858  INFO  (TEST-StreamingTest.streamTests-seed#[8ABA9BB025CBE00B]) [    ] o.e.j.s.h.ContextHandler Started o.e.j.s.ServletContextHandler@7e45c{/cd_j/cy,null,AVAILABLE}
   [junit4]   2> 885  INFO  (TEST-StreamingTest.streamTests-seed#[8ABA9BB025CBE00B]) [    ] o.e.j.u.s.SslContextFactory x509=X509@1c01800(solrtest,h=[],w=[]) for SslContextFactory@eb1053(file:///home/jenkins/workspace/Lucene-Solr-master-Linux/solr/server/etc/test/solrtest.keystore,file:///home/jenkins/workspace/Lucene-Solr-master-Linux/solr/server/etc/test/solrtest.keystore)
   [junit4]   2> 956  INFO  (TEST-StreamingTest.streamTests-seed#[8ABA9BB025CBE00B]) [    ] o.e.j.s.ServerConnector Started ServerConnector@8fd6b9{SSL,[ssl, http/1.1]}{127.0.0.1:37759}
   [junit4]   2> 956  INFO  (TEST-StreamingTest.streamTests-seed#[8ABA9BB025CBE00B]) [    ] o.e.j.s.Server Started @2648ms
   [junit4]   2> 956  INFO  (TEST-StreamingTest.streamTests-seed#[8ABA9BB025CBE00B]) [    ] o.a.s.c.s.e.JettySolrRunner Jetty properties: {solr.data.dir=/home/jenkins/workspace/Lucene-Solr-master-Linux/solr/build/solr-solrj/test/J0/temp/solr.client.solrj.io.stream.StreamingTest_8ABA9BB025CBE00B-001/tempDir-001/control/data, hostContext=/cd_j/cy, hostPort=37759, coreRootDirectory=/home/jenkins/workspace/Lucene-Solr-master-Linux/solr/build/solr-solrj/test/J0/temp/solr.client.solrj.io.stream.StreamingTest_8ABA9BB025CBE00B-001/control-001/cores}
   [junit4]   2> 999  INFO  (TEST-StreamingTest.streamTests-seed#[8ABA9BB025CBE00B]) [    ] o.a.s.s.SolrDispatchFilter SolrDispatchFilter.init(): jdk.internal.loader.ClassLoaders$AppClassLoader@6a03af
   [junit4]   2> 1018 INFO  (TEST-StreamingTest.streamTests-seed#[8ABA9BB025CBE00B]) [    ] o.a.s.c.SolrResourceLoader new SolrResourceLoader for directory: '/home/jenkins/workspace/Lucene-Solr-master-Linux/solr/build/solr-solrj/test/J0/temp/solr.client.solrj.io.stream.StreamingTest_8ABA9BB025CBE00B-001/control-001'
   [junit4]   2> 1024 INFO  (TEST-StreamingTest.streamTests-seed#[8ABA9BB025CBE00B]) [    ] o.a.s.c.SolrResourceLoader JNDI not configured for solr (NoInitialContextEx)
   [junit4]   2> 1025 INFO  (TEST-StreamingTest.streamTests-seed#[8ABA9BB025CBE00B]) [    ] o.a.s.c.SolrResourceLoader solr home defaulted to 'solr/' (could not find system property or JNDI)
   [junit4]   2> 1029 INFO  (TEST-StreamingTest.streamTests-seed#[8ABA9BB025CBE00B]) [    ] o.a.s.c.c.SolrZkClient Using default ZkCredentialsProvider
   [junit4]   2> 1029 INFO  (TEST-StreamingTest.streamTests-seed#[8ABA9BB025CBE00B]) [    ] o.a.s.c.c.ConnectionManager Waiting for client to connect to ZooKeeper
   [junit4]   2> 1032 INFO  (zkCallback-4-thread-1) [    ] o.a.s.c.c.ConnectionManager Watcher org.apache.solr.common.cloud.ConnectionManager@5de650 name:ZooKeeperConnection Watcher:127.0.0.1:32793/solr got event WatchedEvent state:SyncConnected type:None path:null path:null type:None
   [junit4]   2> 1032 INFO  (TEST-StreamingTest.streamTests-seed#[8ABA9BB025CBE00B]) [    ] o.a.s.c.c.ConnectionManager Client is connected to ZooKeeper
   [junit4]   2> 1032 INFO  (TEST-StreamingTest.streamTests-seed#[8ABA9BB025CBE00B]) [    ] o.a.s.c.c.SolrZkClient Using default ZkACLProvider
   [junit4]   2> 1034 INFO  (TEST-StreamingTest.streamTests-seed#[8ABA9BB025CBE00B]) [    ] o.a.s.s.SolrDispatchFilter Loading solr.xml from SolrHome (not found in ZooKeeper)
   [junit4]   2> 1035 INFO  (TEST-StreamingTest.streamTests-seed#[8ABA9BB025CBE00B]) [    ] o.a.s.c.SolrXmlConfig Loading container configuration from /home/jenkins/workspace/Lucene-Solr-master-Linux/solr/build/solr-solrj/test/J0/temp/solr.client.solrj.io.stream.StreamingTest_8ABA9BB025CBE00B-001/control-001/solr.xml
   [junit4]   2> 1150 INFO  (TEST-StreamingTest.streamTests-seed#[8ABA9BB025CBE00B]) [    ] o.a.s.c.CorePropertiesLocator Config-defined core root directory: /home/jenkins/workspace/Lucene-Solr-master-Linux/solr/build/solr-solrj/test/J0/temp/solr.client.solrj.io.stream.StreamingTest_8ABA9BB025CBE00B-001/control-001/cores
   [junit4]   2> 1187 INFO  (TEST-StreamingTest.streamTests-seed#[8ABA9BB025CBE00B]) [    ] o.a.s.c.CoreContainer New CoreContainer 15232152
   [junit4]   2> 1188 INFO  (TEST-StreamingTest.streamTests-seed#[8ABA9BB025CBE00B]) [    ] o.a.s.c.CoreContainer Loading cores into CoreContainer [instanceDir=/home/jenkins/workspace/Lucene-Solr-master-Linux/solr/build/solr-solrj/test/J0/temp/solr.client.solrj.io.stream.StreamingTest_8ABA9BB025CBE00B-001/control-001]
   [junit4]   2> 1196 WARN  (TEST-StreamingTest.streamTests-seed#[8ABA9BB025CBE00B]) [    ] o.a.s.c.CoreContainer Couldn't add files from /home/jenkins/workspace/Lucene-Solr-master-Linux/solr/build/solr-solrj/test/J0/temp/solr.client.solrj.io.stream.StreamingTest_8ABA9BB025CBE00B-001/control-001/lib to classpath: /home/jenkins/workspace/Lucene-Solr-master-Linux/solr/build/solr-solrj/test/J0/temp/solr.client.solrj.io.stream.StreamingTest_8ABA9BB025CBE00B-001/control-001/lib
   [junit4]   2> 1216 INFO  (TEST-StreamingTest.streamTests-seed#[8ABA9BB025CBE00B]) [    ] o.a.s.h.c.HttpShardHandlerFactory created with socketTimeout : 90000,urlScheme : ,connTimeout : 15000,maxConnectionsPerHost : 20,maxConnections : 10000,corePoolSize : 0,maximumPoolSize : 2147483647,maxThreadIdleTime : 5,sizeOfQueue : -1,fairnessPolicy : false,useRetries : false,
   [junit4]   2> 1349 INFO  (TEST-StreamingTest.streamTests-seed#[8ABA9BB025CBE00B]) [    ] o.a.s.u.UpdateShardHandler Creating UpdateShardHandler HTTP client with params: socketTimeout=340000&connTimeout=45000&retry=true
   [junit4]   2> 1357 INFO  (TEST-StreamingTest.streamTests-seed#[8ABA9BB025CBE00B]) [    ] o.a.s.l.LogWatcher SLF4J impl is org.slf4j.impl.Log4jLoggerFactory
   [junit4]   2> 1358 INFO  (TEST-StreamingTest.streamTests-seed#[8ABA9BB025CBE00B]) [    ] o.a.s.l.LogWatcher Registering Log Listener [Log4j (org.slf4j.impl.Log4jLoggerFactory)]
   [junit4]   2> 1360 INFO  (TEST-StreamingTest.streamTests-seed#[8ABA9BB025CBE00B]) [    ] o.a.s.c.ZkContainer Zookeeper client=127.0.0.1:32793/solr
   [junit4]   2> 1375 INFO  (TEST-StreamingTest.streamTests-seed#[8ABA9BB025CBE00B]) [    ] o.a.s.c.ZkController zkHost includes chroot
   [junit4]   2> 1375 INFO  (TEST-StreamingTest.streamTests-seed#[8ABA9BB025CBE00B]) [    ] o.a.s.c.c.SolrZkClient Using default ZkCredentialsProvider
   [junit4]   2> 1375 INFO  (TEST-StreamingTest.streamTests-seed#[8ABA9BB025CBE00B]) [    ] o.a.s.c.c.ConnectionManager Waiting for client to connect to ZooKeeper
   [junit4]   2> 1378 INFO  (zkCallback-7-thread-1) [    ] o.a.s.c.c.ConnectionManager Watcher org.apache.solr.common.cloud.ConnectionManager@83d4b1 name:ZooKeeperConnection Watcher:127.0.0.1:32793 got event WatchedEvent state:SyncConnected type:None path:null path:null type:None
   [junit4]   2> 1378 INFO  (TEST-StreamingTest.streamTests-seed#[8ABA9BB025CBE00B]) [    ] o.a.s.c.c.ConnectionManager Client is connected to ZooKeeper
   [junit4]   2> 1379 INFO  (TEST-StreamingTest.streamTests-seed#[8ABA9BB025CBE00B]) [    ] o.a.s.c.c.SolrZkClient Using default ZkACLProvider
   [junit4]   2> 1385 INFO  (TEST-StreamingTest.streamTests-seed#[8ABA9BB025CBE00B]) [    ] o.a.s.c.c.ConnectionManager Waiting for client to connect to ZooKeeper
   [junit4]   2> 1387 INFO  (zkCallback-8-thread-1) [    ] o.a.s.c.c.ConnectionManager Watcher org.apache.solr.common.cloud.ConnectionManager@ae494f name:ZooKeeperConnection Watcher:127.0.0.1:32793/solr got event WatchedEvent state:SyncConnected type:None path:null path:null type:None
   [junit4]   2> 1387 INFO  (TEST-StreamingTest.streamTests-seed#[8ABA9BB025CBE00B]) [    ] o.a.s.c.c.ConnectionManager Client is connected to ZooKeeper
   [junit4]   2> 1392 INFO  (TEST-StreamingTest.streamTests-seed#[8ABA9BB025CBE00B]) [    ] o.a.s.c.c.SolrZkClient makePath: /overseer/queue
   [junit4]   2> 1399 INFO  (TEST-StreamingTest.streamTests-seed#[8ABA9BB025CBE00B]) [    ] o.a.s.c.c.SolrZkClient makePath: /overseer/collection-queue-work
   [junit4]   2> 1410 INFO  (TEST-StreamingTest.streamTests-seed#[8ABA9BB025CBE00B]) [    ] o.a.s.c.c.SolrZkClient makePath: /overseer/collection-map-running
   [junit4]   2> 1415 INFO  (TEST-StreamingTest.streamTests-seed#[8ABA9BB025CBE00B]) [    ] o.a.s.c.c.SolrZkClient makePath: /overseer/collection-map-completed
   [junit4]   2> 1419 INFO  (TEST-StreamingTest.streamTests-seed#[8ABA9BB025CBE00B]) [    ] o.a.s.c.c.SolrZkClient makePath: /overseer/collection-map-failure
   [junit4]   2> 1426 INFO  (TEST-StreamingTest.streamTests-seed#[8ABA9BB025CBE00B]) [    ] o.a.s.c.c.SolrZkClient makePath: /live_nodes
   [junit4]   2> 1429 INFO  (TEST-StreamingTest.streamTests-seed#[8ABA9BB025CBE00B]) [    ] o.a.s.c.c.SolrZkClient makePath: /aliases.json
   [junit4]   2> 1431 INFO  (TEST-StreamingTest.streamTests-seed#[8ABA9BB025CBE00B]) [    ] o.a.s.c.c.SolrZkClient makePath: /clusterstate.json
   [junit4]   2> 1433 INFO  (TEST-StreamingTest.streamTests-seed#[8ABA9BB025CBE00B]) [    ] o.a.s.c.c.SolrZkClient makePath: /security.json
   [junit4]   2> 1438 INFO  (TEST-StreamingTest.streamTests-seed#[8ABA9BB025CBE00B]) [    ] o.a.s.c.c.ZkStateReader Updating cluster state from ZooKeeper... 
   [junit4]   2> 1448 INFO  (TEST-StreamingTest.streamTests-seed#[8ABA9BB025CBE00B]) [    ] o.a.s.c.c.ZkStateReader Updated live nodes from ZooKeeper... (0) -> (0)
   [junit4]   2> 1464 INFO  (TEST-StreamingTest.streamTests-seed#[8ABA9BB025CBE00B]) [    ] o.a.s.c.c.SolrZkClient makePath: /overseer_elect
   [junit4]   2> 1468 INFO  (TEST-StreamingTest.streamTests-seed#[8ABA9BB025CBE00B]) [    ] o.a.s.c.c.SolrZkClient makePath: /overseer_elect/election
   [junit4]   2> 1471 INFO  (TEST-StreamingTest.streamTests-seed#[8ABA9BB025CBE00B]) [    ] o.a.s.c.Overseer Overseer (id=null) closing
   [junit4]   2> 1472 INFO  (TEST-StreamingTest.streamTests-seed#[8ABA9BB025CBE00B]) [    ] o.a.s.c.LeaderElector Joined leadership election with path: /overseer_elect/election/95589412903911429-127.0.0.1:37759_cd_j%2Fcy-n_0000000000
   [junit4]   2> 1473 INFO  (TEST-StreamingTest.streamTests-seed#[8ABA9BB025CBE00B]) [    ] o.a.s.c.OverseerElectionContext I am going to be the leader 127.0.0.1:37759_cd_j%2Fcy
   [junit4]   2> 1473 INFO  (TEST-StreamingTest.streamTests-seed#[8ABA9BB025CBE00B]) [    ] o.a.s.c.c.SolrZkClient makePath: /overseer_elect/leader
   [junit4]   2> 1477 INFO  (TEST-StreamingTest.streamTests-seed#[8ABA9BB025CBE00B]) [    ] o.a.s.c.Overseer Overseer (id=95589412903911429-127.0.0.1:37759_cd_j%2Fcy-n_0000000000) starting
   [junit4]   2> 1484 INFO  (TEST-StreamingTest.streamTests-seed#[8ABA9BB025CBE00B]) [    ] o.a.s.c.c.SolrZkClient makePath: /overseer/queue-work
   [junit4]   2> 1514 INFO  (TEST-StreamingTest.streamTests-seed#[8ABA9BB025CBE00B]) [    ] o.a.s.c.OverseerAutoReplicaFailoverThread Starting OverseerAutoReplicaFailoverThread autoReplicaFailoverWorkLoopDelay=10000 autoReplicaFailoverWaitAfterExpiration=30000 autoReplicaFailoverBadNodeExpiration=60000
   [junit4]   2> 1586 INFO  (OverseerCollectionConfigSetProcessor-95589412903911429-127.0.0.1:37759_cd_j%2Fcy-n_0000000000) [    ] o.a.s.c.OverseerTaskProcessor Process current queue of overseer operations
   [junit4]   2> 1587 INFO  (TEST-StreamingTest.streamTests-seed#[8ABA9BB025CBE00B]) [    ] o.a.s.c.ZkController Register node as live in ZooKeeper:/live_nodes/127.0.0.1:37759_cd_j%2Fcy
   [junit4]   2> 1590 INFO  (TEST-StreamingTest.streamTests-seed#[8ABA9BB025CBE00B]) [    ] o.a.s.c.c.SolrZkClient makePath: /live_nodes/127.0.0.1:37759_cd_j%2Fcy
   [junit4]   2> 1593 INFO  (zkCallback-8-thread-1) [    ] o.a.s.c.c.ZkStateReader A live node change: [WatchedEvent state:SyncConnected type:NodeChildrenChanged path:/live_nodes], has occurred - updating... (live nodes size: [0])
   [junit4]   2> 1594 INFO  (zkCallback-8-thread-1) [    ] o.a.s.c.c.ZkStateReader Updated live nodes from ZooKeeper... (0) -> (1)
   [junit4]   2> 1598 INFO  (OverseerStateUpdate-95589412903911429-127.0.0.1:37759_cd_j%2Fcy-n_0000000000) [    ] o.a.s.c.Overseer Starting to work on the main queue
   [junit4]   2> 1601 INFO  (OverseerStateUpdate-95589412903911429-127.0.0.1:37759_cd_j%2Fcy-n_0000000000) [    ] o.a.s.c.c.ZkStateReader Updated live nodes from ZooKeeper... (1) -> (1)
   [junit4]   2> 1682 INFO  (TEST-StreamingTest.streamTests-seed#[8ABA9BB025CBE00B]) [    ] o.a.s.c.CoreContainer Security conf doesn't exist. Skipping setup for authorization module.
   [junit4]   2> 1683 INFO  (TEST-StreamingTest.streamTests-seed#[8ABA9BB025CBE00B]) [    ] o.a.s.c.CoreContainer No authentication plugin used.
   [junit4]   2> 1737 INFO  (TEST-StreamingTest.streamTests-seed#[8ABA9BB025CBE00B]) [    ] o.a.s.c.CorePropertiesLocator Looking for core definitions underneath /home/jenkins/workspace/Lucene-Solr-master-Linux/solr/build/solr-solrj/test/J0/temp/solr.client.solrj.io.stream.StreamingTest_8ABA9BB025CBE00B-001/control-001/cores
   [junit4]   2> 1742 INFO  (TEST-StreamingTest.streamTests-seed#[8ABA9BB025CBE00B]) [    ] o.a.s.c.CoreDescriptor Created CoreDescriptor: {name=collection1, config=solrconfig.xml, transient=false, schema=schema.xml, loadOnStartup=true, configSetProperties=configsetprops.json, collection=control_collection, coreNodeName=, dataDir=data/, shard=}
   [junit4]   2> 1742 INFO  (TEST-StreamingTest.streamTests-seed#[8ABA9BB025CBE00B]) [    ] o.a.s.c.CorePropertiesLocator Found core collection1 in /home/jenkins/workspace/Lucene-Solr-master-Linux/solr/build/solr-solrj/test/J0/temp/solr.client.solrj.io.stream.StreamingTest_8ABA9BB025CBE00B-001/control-001/cores/collection1
   [junit4]   2> 1742 INFO  (TEST-StreamingTest.streamTests-seed#[8ABA9BB025CBE00B]) [    ] o.a.s.c.CorePropertiesLocator Found 1 core definitions
   [junit4]   2> 1744 INFO  (TEST-StreamingTest.streamTests-seed#[8ABA9BB025CBE00B]) [    ] o.a.s.s.SolrDispatchFilter user.dir=/home/jenkins/workspace/Lucene-Solr-master-Linux/solr/build/solr-solrj/test/J0
   [junit4]   2> 1744 INFO  (TEST-StreamingTest.streamTests-seed#[8ABA9BB025CBE00B]) [    ] o.a.s.s.SolrDispatchFilter SolrDispatchFilter.init() done
   [junit4]   2> 1746 INFO  (coreLoadExecutor-7-thread-1) [    ] o.a.s.c.ZkController publishing state=down
   [junit4]   2> 1746 INFO  (coreLoadExecutor-7-thread-1) [    ] o.a.s.c.ZkController numShards not found on descriptor - reading it from system property
   [junit4]   2> 1749 INFO  (OverseerStateUpdate-95589412903911429-127.0.0.1:37759_cd_j%2Fcy-n_0000000000) [    ] o.a.s.c.Overseer processMessage: queueSize: 1, message = {
   [junit4]   2>   "core":"collection1",
   [junit4]   2>   "roles":null,
   [junit4]   2>   "base_url":"https://127.0.0.1:37759/cd_j/cy",
   [junit4]   2>   "node_name":"127.0.0.1:37759_cd_j%2Fcy",
   [junit4]   2>   "numShards":"1",
   [junit4]   2>   "state":"down",
   [junit4]   2>   "shard":null,
   [junit4]   2>   "collection":"control_collection",
   [junit4]   2>   "operation":"state"} current state version: 0
   [junit4]   2> 1749 INFO  (coreLoadExecutor-7-thread-1) [    ] o.a.s.c.ZkController look for our core node name
   [junit4]   2> 1756 INFO  (OverseerStateUpdate-95589412903911429-127.0.0.1:37759_cd_j%2Fcy-n_0000000000) [    ] o.a.s.c.o.ReplicaMutator Update state numShards=1 message={
   [junit4]   2>   "core":"collection1",
   [junit4]   2>   "roles":null,
   [junit4]   2>   "base_url":"https://127.0.0.1:37759/cd_j/cy",
   [junit4]   2>   "node_name":"127.0.0.1:37759_cd_j%2Fcy",
   [junit4]   2>   "numShards":"1",
   [junit4]   2>   "state":"down",
   [junit4]   2>   "shard":null,
   [junit4]   2>   "collection":"control_collection",
   [junit4]   2>   "operation":"state"}
   [junit4]   2> 1758 INFO  (OverseerStateUpdate-95589412903911429-127.0.0.1:37759_cd_j%2Fcy-n_0000000000) [    ] o.a.s.c.o.ClusterStateMutator building a new cName: control_collection
   [junit4]   2> 1767 INFO  (OverseerStateUpdate-95589412903911429-127.0.0.1:37759_cd_j%2Fcy-n_0000000000) [    ] o.a.s.c.o.ReplicaMutator Assigning new node to shard shard=shard1
   [junit4]   2> 1772 INFO  (zkCallback-8-thread-1) [    ] o.a.s.c.c.ZkStateReader A cluster state change: [WatchedEvent state:SyncConnected type:NodeDataChanged path:/clusterstate.json], has occurred - updating... (live nodes size: [1])
   [junit4]   2> 2750 INFO  (coreLoadExecutor-7-thread-1) [    ] o.a.s.c.ZkController waiting to find shard id in clusterstate for collection1
   [junit4]   2> 2750 INFO  (coreLoadExecutor-7-thread-1) [    ] o.a.s.c.ZkController Check for collection zkNode:control_collection
   [junit4]   2> 2751 INFO  (coreLoadExecutor-7-thread-1) [    ] o.a.s.c.ZkController Collection zkNode exists
   [junit4]   2> 2751 INFO  (coreLoadExecutor-7-thread-1) [    ] o.a.s.c.c.ZkStateReader Load collection config from: [/collections/control_collection]
   [junit4]   2> 2752 INFO  (coreLoadExecutor-7-thread-1) [    ] o.a.s.c.c.ZkStateReader path=[/collections/control_collection] [configName]=[conf1] specified config exists in ZooKeeper
   [junit4]   2> 2752 INFO  (coreLoadExecutor-7-thread-1) [    ] o.a.s.c.SolrResourceLoader new SolrResourceLoader for directory: '/home/jenkins/workspace/Lucene-Solr-master-Linux/solr/build/solr-solrj/test/J0/temp/solr.client.solrj.io.stream.StreamingTest_8ABA9BB025CBE00B-001/control-001/cores/collection1'
   [junit4]   2> 2753 INFO  (coreLoadExecutor-7-thread-1) [    ] o.a.s.c.SolrResourceLoader JNDI not configured for solr (NoInitialContextEx)
   [junit4]   2> 2753 INFO  (coreLoadExecutor-7-thread-1) [    ] o.a.s.c.SolrResourceLoader solr home defaulted to 'solr/' (could not find system property or JNDI)
   [junit4]   2> 2755 INFO  (coreLoadExecutor-7-thread-1) [    ] o.a.s.c.Config loaded config solrconfig.xml with version 0 
   [junit4]   2> 2767 INFO  (coreLoadExecutor-7-thread-1) [    ] o.a.s.c.SolrConfig current version of requestparams : -1
   [junit4]   2> 2780 INFO  (coreLoadExecutor-7-thread-1) [    ] o.a.s.c.SolrConfig Using Lucene MatchVersion: 7.0.0
   [junit4]   2> 2812 INFO  (coreLoadExecutor-7-thread-1) [    ] o.a.s.c.SolrConfig Loaded SolrConfig: solrconfig.xml
   [junit4]   2> 2860 INFO  (coreLoadExecutor-7-thread-1) [    ] o.a.s.s.IndexSchema [collection1] Schema name=test
   [junit4]   2> 3148 INFO  (coreLoadExecutor-7-thread-1) [    ] o.a.s.s.IndexSchema default search field in schema is text
   [junit4]   2> 3149 INFO  (coreLoadExecutor-7-thread-1) [    ] o.a.s.s.IndexSchema unique key field: id
   [junit4]   2> 3151 WARN  (coreLoadExecutor-7-thread-1) [    ] o.a.s.s.IndexSchema Field lowerfilt1and2 is not multivalued and destination for multiple copyFields (2)
   [junit4]   2> 3151 WARN  (coreLoadExecutor-7-thread-1) [    ] o.a.s.s.IndexSchema Field text is not multivalued and destination for multiple copyFields (3)
   [junit4]   2> 3170 INFO  (coreLoadExecutor-7-thread-1) [    ] o.a.s.c.ConfigSetProperties Did not find ConfigSet properties, assuming default properties: Can't find resource 'configsetprops.json' in classpath or '/configs/conf1', cwd=/home/jenkins/workspace/Lucene-Solr-master-Linux/solr/build/solr-solrj/test/J0
   [junit4]   2> 3170 INFO  (coreLoadExecutor-7-thread-1) [    ] o.a.s.c.CoreContainer Creating SolrCore 'collection1' using configuration from collection control_collection
   [junit4]   2> 3199 INFO  (coreLoadExecutor-7-thread-1) [    ] o.a.s.c.SolrCore org.apache.solr.core.MockDirectoryFactory
   [junit4]   2> 3206 INFO  (coreLoadExecutor-7-thread-1) [    ] o.a.s.c.SolrCore [[collection1] ] Opening new SolrCore at [/home/jenkins/workspace/Lucene-Solr-master-Linux/solr/build/solr-solrj/test/J0/temp/solr.client.solrj.io.stream.StreamingTest_8ABA9BB025CBE00B-001/control-001/cores/collection1], dataDir=[/home/jenkins/workspace/Lucene-Solr-master-Linux/solr/build/solr-solrj/test/J0/temp/solr.client.solrj.io.stream.StreamingTest_8ABA9BB025CBE00B-001/control-001/cores/collection1/data/]
   [junit4]   2> 3207 INFO  (coreLoadExecutor-7-thread-1) [    ] o.a.s.c.SolrCore JMX monitoring not detected for core: collection1
   [junit4]   2> 3223 INFO  (coreLoadExecutor-7-thread-1) [    ] o.a.s.c.CachingDirectoryFactory return new directory for /home/jenkins/workspace/Lucene-Solr-master-Linux/solr/build/solr-solrj/test/J0/temp/solr.client.solrj.io.stream.StreamingTest_8ABA9BB025CBE00B-001/control-001/cores/collection1/data
   [junit4]   2> 3223 INFO  (coreLoadExecutor-7-thread-1) [    ] o.a.s.c.SolrCore New index directory detected: old=null new=/home/jenkins/workspace/Lucene-Solr-master-Linux/solr/build/solr-solrj/test/J0/temp/solr.client.solrj.io.stream.StreamingTest_8ABA9BB025CBE00B-001/control-001/cores/collection1/data/index/
   [junit4]   2> 3223 WARN  (coreLoadExecutor-7-thread-1) [    ] o.a.s.c.SolrCore [collection1] Solr index directory '/home/jenkins/workspace/Lucene-Solr-master-Linux/solr/build/solr-solrj/test/J0/temp/solr.client.solrj.io.stream.StreamingTest_8ABA9BB025CBE00B-001/control-001/cores/collection1/data/index' doesn't exist. Creating new index...
   [junit4]   2> 3233 INFO  (coreLoadExecutor-7-thread-1) [    ] o.a.s.c.CachingDirectoryFactory return new directory for /home/jenkins/workspace/Lucene-Solr-master-Linux/solr/build/solr-solrj/test/J0/temp/solr.client.solrj.io.stream.StreamingTest_8ABA9BB025CBE00B-001/control-001/cores/collection1/data/index
   [junit4]   2> 3266 INFO  (coreLoadExecutor-7-thread-1) [    ] o.a.s.c.SolrDeletionPolicy SolrDeletionPolicy.onCommit: commits: num=1
   [junit4]   2> 	commit{dir=MockDirectoryWrapper(RAMDirectory@929292 lockFactory=org.apache.lucene.store.SingleInstanceLockFactory@ac0fe0),segFN=segments_1,generation=1}
   [junit4]   2> 3267 INFO  (coreLoadExecutor-7-thread-1) [    ] o.a.s.c.SolrDeletionPolicy newest commit generation = 1
   [junit4]   2> 3268 INFO  (OldIndexDirectoryCleanupThreadForCore-collection1) [    ] o.a.s.c.SolrCore Looking for old index directories to cleanup for core collection1 in /home/jenkins/workspace/Lucene-Solr-master-Linux/solr/build/solr-solrj/test/J0/temp/solr.client.solrj.io.stream.StreamingTest_8ABA9BB025CBE00B-001/control-001/cores/collection1/data/
   [junit4]   2> 3268 WARN  (OldIndexDirectoryCleanupThreadForCore-collection1) [    ] o.a.s.c.DirectoryFactory /home/jenkins/workspace/Lucene-Solr-master-Linux/solr/build/solr-solrj/test/J0/temp/solr.client.solrj.io.stream.StreamingTest_8ABA9BB025CBE00B-001/control-001/cores/collection1/data/ does not point to a valid data directory; skipping clean-up of old index directories.
   [junit4]   2> 3420 INFO  (coreLoadExecutor-7-thread-1) [    ] o.a.s.c.SolrCore no updateRequestProcessorChain defined as default, creating implicit default
   [junit4]   2> 3462 INFO  (coreLoadExecutor-7-thread-1) [    ] o.a.s.h.l.XMLLoader xsltCacheLifetimeSeconds=60
   [junit4]   2> 3467 INFO  (coreLoadExecutor-7-thread-1) [    ] o.a.s.h.l.XMLLoader xsltCacheLifetimeSeconds=60
   [junit4]   2> 3468 INFO  (coreLoadExecutor-7-thread-1) [    ] o.a.s.h.l.XMLLoader xsltCacheLifetimeSeconds=60
   [junit4]   2> 3471 INFO  (coreLoadExecutor-7-thread-1) [    ] o.a.s.h.l.XMLLoader xsltCacheLifetimeSeconds=60
   [junit4]   2> 3612 INFO  (coreLoadExecutor-7-thread-1) [    ] o.a.s.c.RequestHandlers Registered paths: /admin/mbeans,standard,,/update/csv,/sql,/update/json/docs,/admin/luke,/export,/admin/segments,/get,/admin/system,/replication,/admin/properties,/config,/stream,/schema,/admin/plugins,/admin/logging,/update/json,/admin/ping,/admin/threads,/update,/admin/file
   [junit4]   2> 3612 INFO  (coreLoadExecutor-7-thread-1) [    ] o.a.s.c.SolrCore Using default statsCache cache: org.apache.solr.search.stats.LocalStatsCache
   [junit4]   2> 3623 INFO  (coreLoadExecutor-7-thread-1) [    ] o.a.s.u.UpdateHandler Using UpdateLog implementation: org.apache.solr.update.UpdateLog
   [junit4]   2> 3623 INFO  (coreLoadExecutor-7-thread-1) [    ] o.a.s.u.UpdateLog Initializing UpdateLog: dataDir= defaultSyncLevel=FLUSH numRecordsToKeep=100 maxNumLogsToKeep=10 numVersionBuckets=65536
   [junit4]   2> 3630 INFO  (coreLoadExecutor-7-thread-1) [    ] o.a.s.u.CommitTracker Hard AutoCommit: disabled
   [junit4]   2> 3630 INFO  (coreLoadExecutor-7-thread-1) [    ] o.a.s.u.CommitTracker Soft AutoCommit: disabled
   [junit4]   2> 3632 INFO  (coreLoadExecutor-7-thread-1) [    ] o.a.s.c.SolrDeletionPolicy SolrDeletionPolicy.onInit: commits: num=1
   [junit4]   2> 	commit{dir=MockDirectoryWrapper(RAMDirectory@929292 lockFactory=org.apache.lucene.store.SingleInstanceLockFactory@ac0fe0),segFN=segments_1,generation=1}
   [junit4]   2> 3633 INFO  (coreLoadExecutor-7-thread-1) [    ] o.a.s.c.SolrDeletionPolicy newest commit generation = 1
   [junit4]   2> 3649 INFO  (coreLoadExecutor-7-thread-1) [    ] o.a.s.s.SolrIndexSearcher Opening [Searcher@a740ae[collection1] main]
   [junit4]   2> 3656 INFO  (coreLoadExecutor-7-thread-1) [    ] o.a.s.c.c.ZkStateReader Load collection config from: [/collections/control_collection]
   [junit4]   2> 3657 INFO  (coreLoadExecutor-7-thread-1) [    ] o.a.s.c.c.ZkStateReader path=[/collections/control_collection] [configName]=[conf1] specified config exists in ZooKeeper
   [junit4]   2> 3657 INFO  (coreLoadExecutor-7-thread-1) [    ] o.a.s.r.ManagedResourceStorage Setting up ZooKeeper-based storage for the RestManager with znodeBase: /configs/conf1
   [junit4]   2> 3659 INFO  (coreLoadExecutor-7-thread-1) [    ] o.a.s.r.ManagedResourceStorage Configured ZooKeeperStorageIO with znodeBase: /configs/conf1
   [junit4]   2> 3659 INFO  (coreLoadExecutor-7-thread-1) [    ] o.a.s.r.RestManager Initializing RestManager with initArgs: {}
   [junit4]   2> 3673 INFO  (coreLoadExecutor-7-thread-1) [    ] o.a.s.r.ManagedResourceStorage Reading _rest_managed.json using ZooKeeperStorageIO:path=/configs/conf1
   [junit4]   2> 3674 INFO  (coreLoadExecutor-7-thread-1) [    ] o.a.s.r.ManagedResourceStorage No data found for znode /configs/conf1/_rest_managed.json
   [junit4]   2> 3674 INFO  (coreLoadExecutor-7-thread-1) [    ] o.a.s.r.ManagedResourceStorage Loaded null at path _rest_managed.json using ZooKeeperStorageIO:path=/configs/conf1
   [junit4]   2> 3674 INFO  (coreLoadExecutor-7-thread-1) [    ] o.a.s.r.RestManager Initializing 0 registered ManagedResources
   [junit4]   2> 3690 INFO  (coreLoadExecutor-7-thread-1) [    ] o.a.s.h.ReplicationHandler Commits will be reserved for  10000
   [junit4]   2> 3702 INFO  (searcherExecutor-8-thread-1) [    ] o.a.s.c.SolrCore [collection1] Registered new searcher Searcher@a740ae[collection1] main{ExitableDirectoryReader(UninvertingDirectoryReader())}
   [junit4]   2> 3702 INFO  (coreLoadExecutor-7-thread-1) [    ] o.a.s.u.UpdateLog Looking up max value of version field to seed version buckets
   [junit4]   2> 3703 INFO  (coreLoadExecutor-7-thread-1) [    ] o.a.s.u.VersionInfo Refreshing highest value of _version_ for 65536 version buckets from index
   [junit4]   2> 3704 INFO  (coreLoadExecutor-7-thread-1) [    ] o.a.s.u.VersionInfo No terms found for _version_, cannot seed version bucket highest value from index
   [junit4]   2> 3704 INFO  (coreLoadExecutor-7-thread-1) [    ] o.a.s.u.UpdateLog Could not find max version in index or recent updates, using new clock 1529430609983700992
   [junit4]   2> 3706 INFO  (coreLoadExecutor-7-thread-1) [    ] o.a.s.u.UpdateLog Took 2.0ms to seed version buckets with highest version 1529430609983700992
   [junit4]   2> 3707 INFO  (coreLoadExecutor-7-thread-1) [    ] o.a.s.c.ZkController watch zkdir /configs/conf1
   [junit4]   2> 3708 INFO  (coreLoadExecutor-7-thread-1) [    ] o.a.s.c.CoreContainer registering core: collection1
   [junit4]   2> 3709 INFO  (coreZkRegister-1-thread-1) [    ] o.a.s.c.ZkController Register replica - core:collection1 address:https://127.0.0.1:37759/cd_j/cy collection:control_collection shard:shard1
   [junit4]   2> 3714 INFO  (coreZkRegister-1-thread-1) [    ] o.a.s.c.c.SolrZkClient makePath: /collections/control_collection/leader_elect/shard1/election
   [junit4]   2> 3719 INFO  (coreZkRegister-1-thread-1) [    ] o.a.s.c.LeaderElector Joined leadership election with path: /collections/control_collection/leader_elect/shard1/election/95589412903911429-core_node1-n_0000000000
   [junit4]   2> 3719 INFO  (coreZkRegister-1-thread-1) [    ] o.a.s.c.ShardLeaderElectionContext Running the leader process for shard=shard1 and weAreReplacement=false and leaderVoteWait=0
   [junit4]   2> 3722 INFO  (coreZkRegister-1-thread-1) [    ] o.a.s.c.ShardLeaderElectionContext Enough replicas found to continue.
   [junit4]   2> 3722 INFO  (coreZkRegister-1-thread-1) [    ] o.a.s.c.ShardLeaderElectionContext I may be the new leader - try and sync
   [junit4]   2> 3722 INFO  (OverseerStateUpdate-95589412903911429-127.0.0.1:37759_cd_j%2Fcy-n_0000000000) [    ] o.a.s.c.Overseer processMessage: queueSize: 1, message = {
   [junit4]   2>   "operation":"leader",
   [junit4]   2>   "shard":"shard1",
   [junit4]   2>   "collection":"control_collection"} current state version: 1
   [junit4]   2> 3723 INFO  (coreZkRegister-1-thread-1) [    ] o.a.s.c.SyncStrategy Sync replicas to https://127.0.0.1:37759/cd_j/cy/collection1/
   [junit4]   2> 3723 INFO  (coreZkRegister-1-thread-1) [    ] o.a.s.c.SyncStrategy Sync Success - now sync replicas to me
   [junit4]   2> 3723 INFO  (coreZkRegister-1-thread-1) [    ] o.a.s.c.SyncStrategy https://127.0.0.1:37759/cd_j/cy/collection1/ has no replicas
   [junit4]   2> 3725 INFO  (zkCallback-8-thread-1) [    ] o.a.s.c.c.ZkStateReader A cluster state change: [WatchedEvent state:SyncConnected type:NodeDataChanged path:/clusterstate.json], has occurred - updating... (live nodes size: [1])
   [junit4]   2> 3727 INFO  (coreZkRegister-1-thread-1) [    ] o.a.s.c.c.SolrZkClient makePath: /collections/control_collection/leaders/shard1
   [junit4]   2> 3732 INFO  (coreZkRegister-1-thread-1) [    ] o.a.s.c.ShardLeaderElectionContextBase Creating leader registration node /collections/control_collection/leaders/shard1/leader after winning as /collections/control_collection/leader_elect/shard1/election/95589412903911429-core_node1-n_0000000000
   [junit4]   2> 3742 INFO  (coreZkRegister-1-thread-1) [    ] o.a.s.c.ShardLeaderElectionContext I am the new leader: https://127.0.0.1:37759/cd_j/cy/collection1/ shard1
   [junit4]   2> 3743 INFO  (OverseerStateUpdate-95589412903911429-127.0.0.1:37759_cd_j%2Fcy-n_0000000000) [    ] o.a.s.c.Overseer processMessage: queueSize: 1, message = {
   [junit4]   2>   "operation":"leader",
   [junit4]   2>   "shard":"shard1",
   [junit4]   2>   "collection":"control_collection",
   [junit4]   2>   "base_url":"https://127.0.0.1:37759/cd_j/cy",
   [junit4]   2>   "core":"collection1",
   [junit4]   2>   "state":"active"} current state version: 2
   [junit4]   2> 3773 INFO  (TEST-StreamingTest.streamTests-seed#[8ABA9BB025CBE00B]) [    ] o.a.s.c.c.SolrZkClient Using default ZkCredentialsProvider
   [junit4]   2> 3774 INFO  (TEST-StreamingTest.streamTests-seed#[8ABA9BB025CBE00B]) [    ] o.a.s.c.c.ConnectionManager Waiting for client to connect to ZooKeeper
   [junit4]   2> 3776 INFO  (zkCallback-10-thread-1) [    ] o.a.s.c.c.ConnectionManager Watcher org.apache.solr.common.cloud.ConnectionManager@1c9b796 name:ZooKeeperConnection Watcher:127.0.0.1:32793/solr got event WatchedEvent state:SyncConnected type:None path:null path:null type:None
   [junit4]   2> 3776 INFO  (TEST-StreamingTest.streamTests-seed#[8ABA9BB025CBE00B]) [    ] o.a.s.c.c.ConnectionManager Client is connected to ZooKeeper
   [junit4]   2> 3776 INFO  (TEST-StreamingTest.streamTests-seed#[8ABA9BB025CBE00B]) [    ] o.a.s.c.c.SolrZkClient Using default ZkACLProvider
   [junit4]   2> 3777 INFO  (TEST-StreamingTest.streamTests-seed#[8ABA9BB025CBE00B]) [    ] o.a.s.c.c.ZkStateReader Updating cluster state from ZooKeeper... 
   [junit4]   2> 3779 INFO  (TEST-StreamingTest.streamTests-seed#[8ABA9BB025CBE00B]) [    ] o.a.s.c.c.ZkStateReader Updated live nodes from ZooKeeper... (0) -> (1)
   [junit4]   2> 3782 INFO  (TEST-StreamingTest.streamTests-seed#[8ABA9BB025CBE00B]) [    ] o.a.s.c.ChaosMonkey monkey: init - expire sessions:false cause connection loss:false
   [junit4]   2> 3829 INFO  (TEST-StreamingTest.streamTests-seed#[8ABA9BB025CBE00B]) [    ] o.a.s.SolrTestCaseJ4 Writing core.properties file to /home/jenkins/workspace/Lucene-Solr-master-Linux/solr/build/solr-solrj/test/J0/temp/solr.client.solrj.io.stream.StreamingTest_8ABA9BB025CBE00B-001/shard-1-001/cores/collection1
   [junit4]   2> 3830 INFO  (TEST-StreamingTest.streamTests-seed#[8ABA9BB025CBE00B]) [    ] o.a.s.c.AbstractFullDistribZkTestBase create jetty 1 in directory /home/jenkins/workspace/Lucene-Solr-master-Linux/solr/build/solr-solrj/test/J0/temp/solr.client.solrj.io.stream.StreamingTest_8ABA9BB025CBE00B-001/shard-1-001
   [junit4]   2> 3832 INFO  (TEST-StreamingTest.streamTests-seed#[8ABA9BB025CBE00B]) [    ] o.e.j.s.Server jetty-9.3.8.v20160314
   [junit4]   2> 3834 INFO  (TEST-StreamingTest.streamTests-seed#[8ABA9BB025CBE00B]) [    ] o.e.j.s.h.ContextHandler Started o.e.j.s.ServletContextHandler@55a871{/cd_j/cy,null,AVAILABLE}
   [junit4]   2> 3836 INFO  (TEST-StreamingTest.streamTests-seed#[8ABA9BB025CBE00B]) [    ] o.e.j.u.s.SslContextFactory x509=X509@1a8dc01(solrtest,h=[],w=[]) for SslContextFactory@1cb3f80(file:///home/jenkins/workspace/Lucene-Solr-master-Linux/solr/server/etc/test/solrtest.keystore,file:///home/jenkins/workspace/Lucene-Solr-master-Linux/solr/server/etc/test/solrtest.keystore)
   [junit4]   2> 3838 INFO  (TEST-StreamingTest.streamTests-seed#[8ABA9BB025CBE00B]) [    ] o.e.j.s.ServerConnector Started ServerConnector@147877c{SSL,[ssl, http/1.1]}{127.0.0.1:38769}
   [junit4]   2> 3838 INFO  (TEST-StreamingTest.streamTests-seed#[8ABA9BB025CBE00B]) [    ] o.e.j.s.Server Started @5530ms
   [junit4]   2> 3838 INFO  (TEST-StreamingTest.streamTests-seed#[8ABA9BB025CBE00B]) [    ] o.a.s.c.s.e.JettySolrRunner Jetty properties: {solr.data.dir=/home/jenkins/workspace/Lucene-Solr-master-Linux/solr/build/solr-solrj/test/J0/temp/solr.client.solrj.io.stream.StreamingTest_8ABA9BB025CBE00B-001/tempDir-001/jetty1, solrconfig=solrconfig.xml, hostContext=/cd_j/cy, hostPort=38769, coreRootDirectory=/home/jenkins/workspace/Lucene-Solr-master-Linux/solr/build/solr-solrj/test/J0/../../../../../../../../../home/jenkins/workspace/Lucene-Solr-master-Linux/solr/build/solr-solrj/test/J0/temp/solr.client.solrj.io.stream.StreamingTest_8ABA9BB025CBE00B-001/shard-1-001/cores}
   [junit4]   2> 3839 INFO  (TEST-StreamingTest.streamTests-seed#[8ABA9BB025CBE00B]) [    ] o.a.s.s.SolrDispatchFilter SolrDispatchFilter.init(): jdk.internal.loader.ClassLoaders$AppClassLoader@6a03af
   [junit4]   2> 3839 INFO  (TEST-StreamingTest.streamTests-seed#[8ABA9BB025CBE00B]) [    ] o.a.s.c.SolrResourceLoader new SolrResourceLoader for directory: '/home/jenkins/workspace/Lucene-Solr-master-Linux/solr/build/solr-solrj/test/J0/temp/solr.client.solrj.io.stream.StreamingTest_8ABA9BB025CBE00B-001/shard-1-001'
   [junit4]   2> 3839 INFO  (TEST-StreamingTest.streamTests-seed#[8ABA9BB025CBE00B]) [    ] o.a.s.c.SolrResourceLoader JNDI not configured for solr (NoInitialContextEx)
   [junit4]   2> 3839 INFO  (TEST-StreamingTest.streamTests-seed#[8ABA9BB025CBE00B]) [    ] o.a.s.c.SolrResourceLoader solr home defaulted to 'solr/' (could not find system property or JNDI)
   [junit4]   2> 3840 INFO  (TEST-StreamingTest.streamTests-seed#[8ABA9BB025CBE00B]) [    ] o.a.s.c.c.SolrZkClient Using default ZkCredentialsProvider
   [junit4]   2> 3840 INFO  (TEST-StreamingTest.streamTests-seed#[8ABA9BB025CBE00B]) [    ] o.a.s.c.c.ConnectionManager Waiting for client to connect to ZooKeeper
   [junit4]   2> 3843 INFO  (zkCallback-11-thread-1) [    ] o.a.s.c.c.ConnectionManager Watcher org.apache.solr.common.cloud.ConnectionManager@3960c3 name:ZooKeeperConnection Watcher:127.0.0.1:32793/solr got event WatchedEvent state:SyncConnected type:None path:null path:null type:None
   [junit4]   2> 3843 INFO  (TEST-StreamingTest.streamTests-seed#[8ABA9BB025CBE00B]) [    ] o.a.s.c.c.ConnectionManager Client is connected to ZooKeeper
   [junit4]   2> 3844 INFO  (TEST-StreamingTest.streamTests-seed#[8ABA9BB025CBE00B]) [    ] o.a.s.c.c.SolrZkClient Using default ZkACLProvider
   [junit4]   2> 3845 INFO  (TEST-StreamingTest.streamTests-seed#[8ABA9BB025CBE00B]) [    ] o.a.s.s.SolrDispatchFilter Loading solr.xml from SolrHome (not found in ZooKeeper)
   [junit4]   2> 3846 INFO  (TEST-StreamingTest.streamTests-seed#[8ABA9BB025CBE00B]) [    ] o.a.s.c.SolrXmlConfig Loading container configuration from /home/jenkins/workspace/Lucene-Solr-master-Linux/solr/build/solr-solrj/test/J0/temp/solr.client.solrj.io.stream.StreamingTest_8ABA9BB025CBE00B-001/shard-1-001/solr.xml
   [junit4]   2> 3846 INFO  (zkCallback-8-thread-1) [    ] o.a.s.c.c.ZkStateReader A cluster state change: [WatchedEvent state:SyncConnected type:NodeDataChanged path:/clusterstate.json], has occurred - updating... (live nodes size: [1])
   [junit4]   2> 3846 INFO  (zkCallback-10-thread-1) [    ] o.a.s.c.c.ZkStateReader A cluster state change: [WatchedEvent state:SyncConnected type:NodeDataChanged path:/clusterstate.json], has occurred - updating... (live nodes size: [1])
   [junit4]   2> 3871 INFO  (TEST-StreamingTest.streamTests-seed#[8ABA9BB025CBE00B]) [    ] o.a.s.c.CorePropertiesLocator Config-defined core root directory: /home/jenkins/workspace/Lucene-Solr-master-Linux/solr/build/solr-solrj/test/J0/../../../../../../../../../home/jenkins/workspace/Lucene-Solr-master-Linux/solr/build/solr-solrj/test/J0/temp/solr.client.solrj.io.stream.StreamingTest_8ABA9BB025CBE00B-001/shard-1-001/cores
   [junit4]   2> 3871 INFO  (TEST-StreamingTest.streamTests-seed#[8ABA9BB025CBE00B]) [    ] o.a.s.c.CoreContainer New CoreContainer 32628360
   [junit4]   2> 3871 INFO  (TEST-StreamingTest.streamTests-seed#[8ABA9BB025CBE00B]) [    ] o.a.s.c.CoreContainer Loading cores into CoreContainer [instanceDir=/home/jenkins/workspace/Lucene-Solr-master-Linux/solr/build/solr-solrj/test/J0/temp/solr.client.solrj.io.stream.StreamingTest_8ABA9BB025CBE00B-001/shard-1-001]
   [junit4]   2> 3871 WARN  (TEST-StreamingTest.streamTests-seed#[8ABA9BB025CBE00B]) [    ] o.a.s.c.CoreContainer Couldn't add files from /home/jenkins/workspace/Lucene-Solr-master-Linux/solr/build/solr-solrj/test/J0/temp/solr.client.solrj.io.stream.StreamingTest_8ABA9BB025CBE00B-001/shard-1-001/lib to classpath: /home/jenkins/workspace/Lucene-Solr-master-Linux/solr/build/solr-solrj/test/J0/temp/solr.client.solrj.io.stream.StreamingTest_8ABA9BB025CBE00B-001/shard-1-001/lib
   [junit4]   2> 3872 INFO  (TEST-StreamingTest.streamTests-seed#[8ABA9BB025CBE00B]) [    ] o.a.s.h.c.HttpShardHandlerFactory created with socketTimeout : 90000,urlScheme : ,connTimeout : 15000,maxConnectionsPerHost : 20,maxConnections : 10000,corePoolSize : 0,maximumPoolSize : 2147483647,maxThreadIdleTime : 5,sizeOfQueue : -1,fairnessPolicy : false,useRetries : false,
   [junit4]   2> 3874 INFO  (TEST-StreamingTest.streamTests-seed#[8ABA9BB025CBE00B]) [    ] o.a.s.u.UpdateShardHandler Creating UpdateShardHandler HTTP client with params: socketTimeout=340000&connTimeout=45000&retry=true
   [junit4]   2> 3876 INFO  (TEST-StreamingTest.streamTests-seed#[8ABA9BB025CBE00B]) [    ] o.a.s.l.LogWatcher SLF4J impl is org.slf4j.impl.Log4jLoggerFactory
   [junit4]   2> 3876 INFO  (TEST-StreamingTest.streamTests-seed#[8ABA9BB025CBE00B]) [    ] o.a.s.l.LogWatcher Registering Log Listener [Log4j (org.slf4j.impl.Log4jLoggerFactory)]
   [junit4]   2> 3876 INFO  (TEST-StreamingTest.streamTests-seed#[8ABA9BB025CBE00B]) [    ] o.a.s.c.ZkContainer Zookeeper client=127.0.0.1:32793/solr
   [junit4]   2> 3876 INFO  (TEST-StreamingTest.streamTests-seed#[8ABA9BB025CBE00B]) [    ] o.a.s.c.ZkController zkHost includes chroot
   [junit4]   2> 3876 INFO  (TEST-StreamingTest.streamTests-seed#[8ABA9BB025CBE00B]) [    ] o.a.s.c.c.SolrZkClient Using default ZkCredentialsProvider
   [junit4]   2> 3877 INFO  (TEST-StreamingTest.streamTests-seed#[8ABA9BB025CBE00B]) [    ] o.a.s.c.c.ConnectionManager Waiting for client to connect to ZooKeeper
   [junit4]   2> 3879 INFO  (zkCallback-14-thread-1) [    ] o.a.s.c.c.ConnectionManager Watcher org.apache.solr.common.cloud.ConnectionManager@7f5865 name:ZooKeeperConnection Watcher:127.0.0.1:32793 got event WatchedEvent state:SyncConnected type:None path:null path:null type:None
   [junit4]   2> 3879 INFO  (TEST-StreamingTest.streamTests-seed#[8ABA9BB025CBE00B]) [    ] o.a.s.c.c.ConnectionManager Client is connected to ZooKeeper
   [junit4]   2> 3880 INFO  (TEST-StreamingTest.streamTests-seed#[8ABA9BB025CBE00B]) [    ] o.a.s.c.c.SolrZkClient Using default ZkACLProvider
   [junit4]   2> 3882 INFO  (TEST-StreamingTest.streamTests-seed#[8ABA9BB025CBE00B]) [    ] o.a.s.c.c.ConnectionManager Waiting for client to connect to ZooKeeper
   [junit4]   2> 3883 INFO  (zkCallback-15-thread-1) [    ] o.a.s.c.c.ConnectionManager Watcher org.apache.solr.common.cloud.ConnectionManager@df50f2 name:ZooKeeperConnection Watcher:127.0.0.1:32793/solr got event WatchedEvent state:SyncConnected type:None path:null path:null type:None
   [junit4]   2> 3883 INFO  (TEST-StreamingTest.streamTests-seed#[8ABA9BB025CBE00B]) [    ] o.a.s.c.c.ConnectionManager Client is connected to ZooKeeper
   [junit4]   2> 3891 INFO  (TEST-StreamingTest.streamTests-seed#[8ABA9BB025CBE00B]) [    ] o.a.s.c.c.ZkStateReader Updating cluster state from ZooKeeper... 
   [junit4]   2> 3892 INFO  (TEST-StreamingTest.streamTests-seed#[8ABA9BB025CBE00B]) [    ] o.a.s.c.c.ZkStateReader Updated live nodes from ZooKeeper... (0) -> (1)
   [junit4]   2> 3893 INFO  (coreZkRegister-1-thread-1) [    ] o.a.s.c.ZkController We are https://127.0.0.1:37759/cd_j/cy/collection1/ and leader is https://127.0.0.1:37759/cd_j/cy/collection1/
   [junit4]   2> 3894 INFO  (coreZkRegister-1-thread-1) [    ] o.a.s.c.ZkController No LogReplay needed for core=collection1 baseURL=https://127.0.0.1:37759/cd_j/cy
   [junit4]   2> 3894 INFO  (coreZkRegister-1-thread-1) [    ] o.a.s.c.ZkController I am the leader, no recovery necessary
   [junit4]   2> 3894 INFO  (coreZkRegister-1-thread-1) [    ] o.a.s.c.ZkController publishing state=active
   [junit4]   2> 3894 INFO  (coreZkRegister-1-thread-1) [    ] o.a.s.c.ZkController numShards not found on descriptor - reading it from system property
   [junit4]   2> 3894 INFO  (TEST-StreamingTest.streamTests-seed#[8ABA9BB025CBE00B]) [    ] o.a.s.c.Overseer Overseer (id=null) closing
   [junit4]   2> 3908 INFO  (TEST-StreamingTest.streamTests-seed#[8ABA9BB025CBE00B]) [    ] o.a.s.c.LeaderElector Joined leadership election with path: /overseer_elect/election/95589412903911433-127.0.0.1:38769_cd_j%2Fcy-n_0000000001
   [junit4]   2> 3909 INFO  (OverseerStateUpdate-95589412903911429-127.0.0.1:37759_cd_j%2Fcy-n_0000000000) [    ] o.a.s.c.Overseer processMessage: queueSize: 1, message = {
   [junit4]   2>   "core":"collection1",
   [junit4]   2>   "core_node_name":"core_node1",
   [junit4]   2>   "roles":null,
   [junit4]   2>   "base_url":"https://127.0.0.1:37759/cd_j/cy",
   [junit4]   2>   "node_name":"127.0.0.1:37759_cd_j%2Fcy",
   [junit4]   2>   "numShards":"2",
   [junit4]   2>   "state":"active",
   [junit4]   2>   "shard":"shard1",
   [junit4]   2>   "collection":"control_collection",
   [junit4]   2>   "operation":"state"} current state version: 3
   [junit4]   2> 3910 INFO  (OverseerStateUpdate-95589412903911429-127.0.0.1:37759_cd_j%2Fcy-n_0000000000) [    ] o.a.s.c.o.ReplicaMutator Update state numShards=2 message={
   [junit4]   2>   "core":"collection1",
   [junit4]   2>   "core_node_name":"core_node1",
   [junit4]   2>   "roles":null,
   [junit4]   2>   "base_url":"https://127.0.0.1:37759/cd_j/cy",
   [junit4]   2>   "node_name":"127.0.0.1:37759_cd_j%2Fcy",
   [junit4]   2>   "numShards":"2",
   [junit4]   2>   "state":"active",
   [junit4]   2>   "shard":"shard1",
   [junit4]   2>   "collection":"control_collection",
   [junit4]   2>   "operation":"state"}
   [junit4]   2> 3910 INFO  (TEST-StreamingTest.streamTests-seed#[8ABA9BB025CBE00B]) [    ] o.a.s.c.LeaderElector Watching path /overseer_elect/election/95589412903911429-127.0.0.1:37759_cd_j%2Fcy-n_0000000000 to know if I could be the leader
   [junit4]   2> 3911 INFO  (TEST-StreamingTest.streamTests-seed#[8ABA9BB025CBE00B]) [    ] o.a.s.c.ZkController Publish node=127.0.0.1:38769_cd_j%2Fcy as DOWN
   [junit4]   2> 3913 INFO  (OverseerStateUpdate-95589412903911429-127.0.0.1:37759_cd_j%2Fcy-n_0000000000) [    ] o.a.s.c.Overseer processMessage: queueSize: 1, message = {
   [junit4]   2>   "operation":"downnode",
   [junit4]   2>   "node_name":"127.0.0.1:38769_cd_j%2Fcy"} current state version: 3
   [junit4]   2> 3914 INFO  (OverseerStateUpdate-95589412903911429-127.0.0.1:37759_cd_j%2Fcy-n_0000000000) [    ] o.a.s.c.o.NodeMutator DownNode state invoked for node: 127.0.0.1:38769_cd_j%2Fcy
   [junit4]   2> 4017 INFO  (zkCallback-8-thread-1) [    ] o.a.s.c.c.ZkStateReader A cluster state change: [WatchedEvent state:SyncConnected type:NodeDataChanged path:/clusterstate.json], has occurred - updating... (live nodes size: [1])
   [junit4]   2> 4018 INFO  (zkCallback-10-thread-1) [    ] o.a.s.c.c.ZkStateReader A cluster state change: [WatchedEvent state:SyncConnected type:NodeDataChanged path:/clusterstate.json], has occurred - updating... (live nodes size: [1])
   [junit4]   2> 4018 INFO  (zkCallback-15-thread-1) [    ] o.a.s.c.c.ZkStateReader A cluster state change: [WatchedEvent state:SyncConnected type:NodeDataChanged path:/clusterstate.json], has occurred - updating... (live nodes size: [1])
   [junit4]   2> 4914 INFO  (TEST-StreamingTest.streamTests-seed#[8ABA9BB025CBE00B]) [    ] o.a.s.c.ZkController Register node as live in ZooKeeper:/live_nodes/127.0.0.1:38769_cd_j%2Fcy
   [junit4]   2> 4915 INFO  (TEST-StreamingTest.streamTests-seed#[8ABA9BB025CBE00B]) [    ] o.a.s.c.c.SolrZkClient makePath: /live_nodes/127.0.0.1:38769_cd_j%2Fcy
   [junit4]   2> 4916 INFO  (zkCallback-10-thread-1) [    ] o.a.s.c.c.ZkStateReader A live node change: [WatchedEvent state:SyncConnected type:NodeChildrenChanged path:/live_nodes], has occurred - updating... (live nodes size: [1])
   [junit4]   2> 4916 INFO  (zkCallback-15-thread-1) [    ] o.a.s.c.c.ZkStateReader A live node change: [WatchedEvent state:SyncConnected type:NodeChildrenChanged path:/live_nodes], has occurred - updating... (live nodes size: [1])
   [junit4]   2> 4916 INFO  (zkCallback-8-thread-1) [    ] o.a.s.c.c.ZkStateReader A live node change: [WatchedEvent state:SyncConnected type:NodeChildrenChanged path:/live_nodes], has occurred - updating... (live nodes size: [1])
   [junit4]   2> 4917 INFO  (zkCallback-10-thread-1) [    ] o.a.s.c.c.ZkStateReader Updated live nodes from ZooKeeper... (1) -> (2)
   [junit4]   2> 4917 INFO  (zkCallback-15-thread-1) [    ] o.a.s.c.c.ZkStateReader Updated live nodes from ZooKeeper... (1) -> (2)
   [junit4]   2> 4918 INFO  (zkCallback-8-thread-1) [    ] o.a.s.c.c.ZkStateReader Updated live nodes from ZooKeeper... (1) -> (2)
   [junit4]   2> 4947 INFO  (TEST-StreamingTest.streamTests-seed#[8ABA9BB025CBE00B]) [    ] o.a.s.c.CoreContainer Security conf doesn't exist. Skipping setup for authorization module.
   [junit4]   2> 4947 INFO  (TEST-StreamingTest.streamTests-seed#[8ABA9BB025CBE00B]) [    ] o.a.s.c.CoreContainer No authentication plugin used.
   [junit4]   2> 4948 INFO  (TEST-StreamingTest.streamTests-seed#[8ABA9BB025CBE00B]) [    ] o.a.s.c.CorePropertiesLocator Looking for core definitions underneath /home/jenkins/workspace/Lucene-Solr-master-Linux/solr/build/solr-solrj/test/J0/../../../../../../../../../home/jenkins/workspace/Lucene-Solr-master-Linux/solr/build/solr-solrj/test/J0/temp/solr.client.solrj.io.stream.StreamingTest_8ABA9BB025CBE00B-001/shard-1-001/cores
   [junit4]   2> 4949 INFO  (TEST-StreamingTest.streamTests-seed#[8ABA9BB025CBE00B]) [    ] o.a.s.c.CoreDescriptor Created CoreDescriptor: {name=collection1, config=solrconfig.xml, transient=false, schema=schema.xml, loadOnStartup=true, configSetProperties=configsetprops.json, collection=collection1, coreNodeName=, dataDir=data/, shard=}
   [junit4]   2> 4949 INFO  (TEST-StreamingTest.streamTests-seed#[8ABA9BB025CBE00B]) [    ] o.a.s.c.CorePropertiesLocator Found core collection1 in /home/jenkins/workspace/Lucene-Solr-master-Linux/solr/build/solr-solrj/test/J0/../../../../../../../../../home/jenkins/workspace/Lucene-Solr-master-Linux/solr/build/solr-solrj/test/J0/temp/solr.client.solrj.io.stream.StreamingTest_8ABA9BB025CBE00B-001/shard-1-001/cores/collection1
   [junit4]   2> 4949 INFO  (TEST-StreamingTest.streamTests-seed#[8ABA9BB025CBE00B]) [    ] o.a.s.c.CorePropertiesLocator Found 1 core definitions
   [junit4]   2> 4954 INFO  (TEST-StreamingTest.streamTests-seed#[8ABA9BB025CBE00B]) [    ] o.a.s.s.SolrDispatchFilter user.dir=/home/jenkins/workspace/Lucene-Solr-master-Linux/solr/build/solr-solrj/test/J0
   [junit4]   2> 4954 INFO  (TEST-StreamingTest.streamTests-seed#[8ABA9BB025CBE00B]) [    ] o.a.s.s.SolrDispatchFilter SolrDispatchFilter.init() done
   [junit4]   2> 4955 INFO  (coreLoadExecutor-18-thread-1) [    ] o.a.s.c.ZkController publishing state=down
   [junit4]   2> 4955 INFO  (coreLoadExecutor-18-thread-1) [    ] o.a.s.c.ZkController numShards not found on descriptor - reading it from system property
   [junit4]   2> 4956 INFO  (coreLoadExecutor-18-thread-1) [    ] o.a.s.c.ZkController look for our core node name
   [junit4]   2> 4957 INFO  (OverseerStateUpdate-95589412903911429-127.0.0.1:37759_cd_j%2Fcy-n_0000000000) [    ] o.a.s.c.Overseer processMessage: queueSize: 1, message = {
   [junit4]   2>   "core":"collection1",
   [junit4]   2>   "roles":null,
   [junit4]   2>   "base_url":"https://127.0.0.1:38769/cd_j/cy",
   [junit4]   2>   "node_name":"127.0.0.1:38769_cd_j%2Fcy",
   [junit4]   2>   "numShards":"2",
   [junit4]   2>   "state":"down",
   [junit4]   2>   "shard":null,
   [junit4]   2>   "collection":"collection1",
   [junit4]   2>   "operation":"state"} current state version: 4
   [junit4]   2> 4958 INFO  (OverseerStateUpdate-95589412903911429-127.0.0.1:37759_cd_j%2Fcy-n_0000000000) [    ] o.a.s.c.o.ReplicaMutator Update state numShards=2 message={
   [junit4]   2>   "core":"collection1",
   [junit4]   2>   "roles":null,
   [junit4]   2>   "base_url":"https://127.0.0.1:38769/cd_j/cy",
   [junit4]   2>   "node_name":"127.0.0.1:38769_cd_j%2Fcy",
   [junit4]   2>   "numShards":"2",
   [junit4]   2>   "state":"down",
   [junit4]   2>   "shard":null,
   [junit4]   2>   "collection":"collection1",
   [junit4]   2>   "operation":"state"}
   [junit4]   2> 4958 INFO  (OverseerStateUpdate-95589412903911429-127.0.0.1:37759_cd_j%2Fcy-n_0000000000) [    ] o.a.s.c.o.ClusterStateMutator building a new cName: collection1
   [junit4]   2> 4958 INFO  (OverseerStateUpdate-95589412903911429-127.0.0.1:37759_cd_j%2Fcy-n_0000000000) [    ] o.a.s.c.o.ReplicaMutator Assigning new node to shard shard=shard2
   [junit4]   2> 5061 INFO  (zkCallback-10-thread-1) [    ] o.a.s.c.c.ZkStateReader A cluster state change: [WatchedEvent state:SyncConnected type:NodeDataChanged path:/clusterstate.json], has occurred - updating... (live nodes size: [2])
   [junit4]   2> 5061 INFO  (zkCallback-8-thread-1) [    ] o.a.s.c.c.ZkStateReader A cluster state change: [WatchedEvent state:SyncConnected type:NodeDataChanged path:/clusterstate.json], has occurred - updating... (live nodes size: [2])
   [junit4]   2> 5061 INFO  (zkCallback-15-thread-1) [    ] o.a.s.c.c.ZkStateReader A cluster state change: [WatchedEvent state:SyncConnected type:NodeDataChanged path:/clusterstate.json], has occurred - updating... (live nodes size: [2])
   [junit4]   2> 5957 INFO  (coreLoadExecutor-18-thread-1) [    ] o.a.s.c.ZkController waiting to find shard id in clusterstate for collection1
   [junit4]   2> 5957 INFO  (coreLoadExecutor-18-thread-1) [    ] o.a.s.c.ZkController Check for collection zkNode:collection1
   [junit4]   2> 5958 INFO  (coreLoadExecutor-18-thread-1) [    ] o.a.s.c.ZkController Collection zkNode exists
   [junit4]   2> 5958 INFO  (coreLoadExecutor-18-thread-1) [    ] o.a.s.c.c.ZkStateReader Load collection config from: [/collections/collection1]
   [junit4]   2> 5958 INFO  (coreLoadExecutor-18-thread-1) [    ] o.a.s.c.c.ZkStateReader path=[/collections/collection1] [configName]=[conf1] specified config exists in ZooKeeper
   [junit4]   2> 5958 INFO  (coreLoadExecutor-18-thread-1) [    ] o.a.s.c.SolrResourceLoader new SolrResourceLoader for directory: '/home/jenkins/workspace/Lucene-Solr-master-Linux/solr/build/solr-solrj/test/J0/temp/solr.client.solrj.io.stream.StreamingTest_8ABA9BB025CBE00B-001/shard-1-001/cores/collection1'
   [junit4]   2> 5959 INFO  (coreLoadExecutor-18-thread-1) [    ] o.a.s.c.SolrResourceLoader JNDI not configured for solr (NoInitialContextEx)
   [junit4]   2> 5959 INFO  (coreLoadExecutor-18-thread-1) [    ] o.a.s.c.SolrResourceLoader solr home defaulted to 'solr/' (could not find system property or JNDI)
   [junit4]   2> 5960 INFO  (coreLoadExecutor-18-thread-1) [    ] o.a.s.c.Config loaded config solrconfig.xml with version 0 
   [junit4]   2> 5967 INFO  (coreLoadExecutor-18-thread-1) [    ] o.a.s.c.SolrConfig current version of requestparams : -1
   [junit4]   2> 5971 INFO  (coreLoadExecutor-18-thread-1) [    ] o.a.s.c.SolrConfig Using Lucene MatchVersion: 7.0.0
   [junit4]   2> 5983 INFO  (coreLoadExecutor-18-thread-1) [    ] o.a.s.c.SolrConfig Loaded SolrConfig: solrconfig.xml
   [junit4]   2> 6024 INFO  (coreLoadExecutor-18-thread-1) [    ] o.a.s.s.IndexSchema [collection1] Schema name=test
   [junit4]   2> 6154 INFO  (coreLoadExecutor-18-thread-1) [    ] o.a.s.s.IndexSchema default search field in schema is text
   [junit4]   2> 6155 INFO  (coreLoadExecutor-18-thread-1) [    ] o.a.s.s.IndexSchema unique key field: id
   [junit4]   2> 6156 WARN  (coreLoadExecutor-18-thread-1) [    ] o.a.s.s.IndexSchema Field lowerfilt1and2 is not multivalued and destination for multiple copyFields (2)
   [junit4]   2> 6156 WARN  (coreLoadExecutor-18-thread-1) [    ] o.a.s.s.IndexSchema Field text is not multivalued and destination for multiple copyFields (3)
   [junit4]   2> 6158 INFO  (coreLoadExecutor-18-thread-1) [    ] o.a.s.c.ConfigSetProperties Did not find ConfigSet properties, assuming default properties: Can't find resource 'configsetprops.json' in classpath or '/configs/conf1', cwd=/home/jenkins/workspace/Lucene-Solr-master-Linux/solr/build/solr-solrj/test/J0
   [junit4]   2> 6158 INFO  (coreLoadExecutor-18-thread-1) [    ] o.a.s.c.CoreContainer Creating SolrCore 'collection1' using configuration from collection collection1
   [junit4]   2> 6159 INFO  (coreLoadExecutor-18-thread-1) [    ] o.a.s.c.SolrCore org.apache.solr.core.MockDirectoryFactory
   [junit4]   2> 6159 INFO  (coreLoadExecutor-18-thread-1) [    ] o.a.s.c.SolrCore [[collection1] ] Opening new SolrCore at [/home/jenkins/workspace/Lucene-Solr-master-Linux/solr/build/solr-solrj/test/J0/temp/solr.client.solrj.io.stream.StreamingTest_8ABA9BB025CBE00B-001/shard-1-001/cores/collection1], dataDir=[/home/jenkins/workspace/Lucene-Solr-master-Linux/solr/build/solr-solrj/test/J0/../../../../../../../../../home/jenkins/workspace/Lucene-Solr-master-Linux/solr/build/solr-solrj/test/J0/temp/solr.client.solrj.io.stream.StreamingTest_8ABA9BB025CBE00B-001/shard-1-001/cores/collection1/data/]
   [junit4]   2> 6159 INFO  (coreLoadExecutor-18-thread-1) [    ] o.a.s.c.SolrCore JMX monitoring not detected for core: collection1
   [junit4]   2> 6160 INFO  (coreLoadExecutor-18-thread-1) [    ] o.a.s.c.CachingDirectoryFactory return new directory for /home/jenkins/workspace/Lucene-Solr-master-Linux/solr/build/solr-solrj/test/J0/../../../../../../../../../home/jenkins/workspace/Lucene-Solr-master-Linux/solr/build/solr-solrj/test/J0/temp/solr.client.solrj.io.stream.StreamingTest_8ABA9BB025CBE00B-001/shard-1-001/cores/collection1/data
   [junit4]   2> 6160 INFO  (coreLoadExecutor-18-thread-1) [    ] o.a.s.c.SolrCore New index directory detected: old=null new=/home/jenkins/workspace/Lucene-Solr-master-Linux/solr/build/solr-solrj/test/J0/../../../../../../../../../home/jenkins/workspace/Lucene-Solr-master-Linux/solr/build/solr-solrj/test/J0/temp/solr.client.solrj.io.stream.StreamingTest_8ABA9BB025CBE00B-001/shard-1-001/cores/collection1/data/index/
   [junit4]   2> 6160 WARN  (coreLoadExecutor-18-thread-1) [    ] o.a.s.c.SolrCore [collection1] Solr index directory '/home/jenkins/workspace/Lucene-Solr-master-Linux/solr/build/solr-solrj/test/J0/../../../../../../../../../home/jenkins/workspace/Lucene-Solr-master-Linux/solr/build/solr-solrj/test/J0/temp/solr.client.solrj.io.stream.StreamingTest_8ABA9BB025CBE00B-001/shard-1-001/cores/collection1/data/index' doesn't exist. Creating new index...
   [junit4]   2> 6160 INFO  (coreLoadExecutor-18-thread-1) [    ] o.a.s.c.CachingDirectoryFactory return new directory for /home/jenkins/workspace/Lucene-Solr-master-Linux/solr/build/solr-solrj/test/J0/../../../../../../../../../home/jenkins/workspace/Lucene-Solr-master-Linux/solr/build/solr-solrj/test/J0/temp/solr.client.solrj.io.stream.StreamingTest_8ABA9BB025CBE00B-001/shard-1-001/cores/collection1/data/index
   [junit4]   2> 6161 INFO  (coreLoadExecutor-18-thread-1) [    ] o.a.s.c.SolrDeletionPolicy SolrDeletionPolicy.onCommit: commits: num=1
   [junit4]   2> 	commit{dir=MockDirectoryWrapper(RAMDirectory@de75da lockFactory=org.apache.lucene.store.SingleInstanceLockFactory@376016),segFN=segments_1,generation=1}
   [junit4]   2> 6161 INFO  (coreLoadExecutor-18-thread-1) [    ] o.a.s.c.SolrDeletionPolicy newest commit generation = 1
   [junit4]   2> 6161 INFO  (OldIndexDirectoryCleanupThreadForCore-collection1) [    ] o.a.s.c.SolrCore Looking for old index directories to cleanup for core collection1 in /home/jenkins/workspace/Lucene-Solr-master-Linux/solr/build/solr-solrj/test/J0/../../../../../../../../../home/jenkins/workspace/Lucene-Solr-master-Linux/solr/build/solr-solrj/test/J0/temp/solr.client.solrj.io.stream.StreamingTest_8ABA9BB025CBE00B-001/shard-1-001/cores/collection1/data/
   [junit4]   2> 6162 WARN  (OldIndexDirectoryCleanupThreadForCore-collection1) [    ] o.a.s.c.DirectoryFactory /home/jenkins/workspace/Lucene-Solr-master-Linux/solr/build/solr-solrj/test/J0/../../../../../../../../../home/jenkins/workspace/Lucene-Solr-master-Linux/solr/build/solr-solrj/test/J0/temp/solr.client.solrj.io.stream.StreamingTest_8ABA9BB025CBE00B-001/shard-1-001/cores/collection1/data/ does not point to a valid data directory; skipping clean-up of old index directories.
   [junit4]   2> 6163 INFO  (coreLoadExecutor-18-thread-1) [    ] o.a.s.c.SolrCore no updateRequestProcessorChain defined as default, creating implicit default
   [junit4]   2> 6165 INFO  (coreLoadExecutor-18-thread-1) [    ] o.a.s.h.l.XMLLoader xsltCacheLifetimeSeconds=60
   [junit4]   2> 6166 INFO  (coreLoadExecutor-18-thread-1) [    ] o.a.s.h.l.XMLLoader xsltCacheLifetimeSeconds=60
   [junit4]   2> 6167 INFO  (coreLoadExecutor-18-thread-1) [    ] o.a.s.h.l.XMLLoader xsltCacheLifetimeSeconds=60
   [junit4]   2> 6168 INFO  (coreLoadExecutor-18-thread-1) [    ] o.a.s.h.l.XMLLoader xsltCacheLifetimeSeconds=60
   [junit4]   2> 6170 INFO  (coreLoadExecutor-18-thread-1) [    ] o.a.s.c.RequestHandlers Registered paths: /admin/mbeans,standard,,/update/csv,/sql,/update/json/docs,/admin/luke,/export,/admin/segments,/get,/admin/system,/replication,/admin/properties,/config,/stream,/schema,/admin/plugins,/admin/logging,/update/json,/admin/ping,/admin/threads,/update,/admin/file
   [junit4]   2> 6170 INFO  (coreLoadExecutor-18-thread-1) [    ] o.a.s.c.SolrCore Using default statsCache cache: org.apache.solr.search.stats.LocalStatsCache
   [junit4]   2> 6171 INFO  (coreLoadExecutor-18-thread-1) [    ] o.a.s.u.UpdateHandler Using UpdateLog implementation: org.apache.solr.update.UpdateLog
   [junit4]   2> 6171 INFO  (coreLoadExecutor-18-thread-1) [    ] o.a.s.u.UpdateLog Initializing UpdateLog: dataDir= defaultSyncLevel=FLUSH numRecordsToKeep=100 maxNumLogsToKeep=10 numVersionBuckets=65536
   [junit4]   2> 6173 INFO  (coreLoadExecutor-18-thread-1) [    ] o.a.s.u.CommitTracker Hard AutoCommit: disabled
   [junit4]   2> 6173 INFO  (coreLoadExecutor-18-thread-1) [    ] o.a.s.u.CommitTracker Soft AutoCommit: disabled
   [junit4]   2> 6174 INFO  (coreLoadExecutor-18-thread-1) [    ] o.a.s.c.SolrDeletionPolicy SolrDeletionPolicy.onInit: commits: num=1
   [junit4]   2> 	commit{dir=MockDirectoryWrapper(RAMDirectory@de75da lockFactory=org.apache.lucene.store.SingleInstanceLockFactory@376016),segFN=segments_1,generation=1}
   [junit4]   2> 6174 INFO  (coreLoadExecutor-18-thread-1) [    ] o.a.s.c.SolrDeletionPolicy newest commit generation = 1
   [junit4]   2> 6174 INFO  (coreLoadExecutor-18-thread-1) [    ] o.a.s.s.SolrIndexSearcher Opening [Searcher@17370b5[collection1] main]
   [junit4]   2> 6174 INFO  (coreLoadExecutor-18-thread-1) [    ] o.a.s.c.c.ZkStateReader Load collection config from: [/collections/collection1]
   [junit4]   2> 6175 INFO  (coreLoadExecutor-18-thread-1) [    ] o.a.s.c.c.ZkStateReader path=[/collections/collection1] [configName]=[conf1] specified config exists in ZooKeeper
   [junit4]   2> 6175 INFO  (coreLoadExecutor-18-thread-1) [    ] o.a.s.r.ManagedResourceStorage Setting up ZooKeeper-based storage for the RestManager with znodeBase: /configs/conf1
   [junit4]   2> 6175 INFO  (coreLoadExecutor-18-thread-1) [    ] o.a.s.r.ManagedResourceStorage Configured ZooKeeperStorageIO with znodeBase: /configs/conf1
   [junit4]   2> 6175 INFO  (coreLoadExecutor-18-thread-1) [    ] o.a.s.r.RestManager Initializing RestManager with initArgs: {}
   [junit4]   2> 6176 INFO  (coreLoadExecutor-18-thread-1) [    ] o.a.s.r.ManagedResourceStorage Reading _rest_managed.json using ZooKeeperStorageIO:path=/configs/conf1
   [junit4]   2> 6176 INFO  (coreLoadExecutor-18-thread-1) [    ] o.a.s.r.ManagedResourceStorage No data found for znode /configs/conf1/_rest_managed.json
   [junit4]   2> 6176 INFO  (coreLoadExecutor-18-thread-1) [    ] o.a.s.r.ManagedResourceStorage Loaded null at path _rest_managed.json using ZooKeeperStorageIO:path=/configs/conf1
   [junit4]   2> 6176 INFO  (coreLoadExecutor-18-thread-1) [    ] o.a.s.r.RestManager Initializing 0 registered ManagedResources
   [junit4]   2> 6176 INFO  (coreLoadExecutor-18-thread-1) [    ] o.a.s.h.ReplicationHandler Commits will be reserved for  10000
   [junit4]   2> 6177 INFO  (searcherExecutor-19-thread-1) [    ] o.a.s.c.SolrCore [collection1] Registered new searcher Searcher@17370b5[collection1] main{ExitableDirectoryReader(UninvertingDirectoryReader())}
   [junit4]   2> 6177 INFO  (coreLoadExecutor-18-thread-1) [    ] o.a.s.u.UpdateLog Looking up max value of version field to seed version buckets
   [junit4]   2> 6177 INFO  (coreLoadExecutor-18-thread-1) [    ] o.a.s.u.VersionInfo Refreshing highest value of _version_ for 65536 version buckets from index
   [junit4]   2> 6177 INFO  (coreLoadExecutor-18-thread-1) [    ] o.a.s.u.VersionInfo No terms found for _version_, cannot seed version bucket highest value from index
   [junit4]   2> 6177 INFO  (coreLoadExecutor-18-thread-1) [    ] o.a.s.u.UpdateLog Could not find max version in index or recent updates, using new clock 1529430612576829440
   [junit4]   2> 6179 INFO  (coreLoadExecutor-18-thread-1) [    ] o.a.s.u.UpdateLog Took 2.0ms to seed version buckets with highest version 1529430612576829440
   [junit4]   2> 6179 INFO  (coreLoadExecutor-18-thread-1) [    ] o.a.s.c.ZkController watch zkdir /configs/conf1
   [junit4]   2> 6180 INFO  (coreLoadExecutor-18-thread-1) [    ] o.a.s.c.CoreContainer registering core: collection1
   [junit4]   2> 6180 INFO  (coreZkRegister-13-thread-1) [    ] o.a.s.c.ZkController Register replica - core:collection1 address:https://127.0.0.1:38769/cd_j/cy collection:collection1 shard:shard2
   [junit4]   2> 6181 INFO  (coreZkRegister-13-thread-1) [    ] o.a.s.c.c.SolrZkClient makePath: /collections/collection1/leader_elect/shard2/election
   [junit4]   2> 6185 INFO  (coreZkRegister-13-thread-1) [    ] o.a.s.c.LeaderElector Joined leadership election with path: /collections/collection1/leader_elect/shard2/election/95589412903911433-core_node1-n_0000000000
   [junit4]   2> 6185 INFO  (coreZkRegister-13-thread-1) [    ] o.a.s.c.ShardLeaderElectionContext Running the leader process for shard=shard2 and weAreReplacement=false and leaderVoteWait=0
   [junit4]   2> 6187 INFO  (coreZkRegister-13-thread-1) [    ] o.a.s.c.ShardLeaderElectionContext Enough replicas found to continue.
   [junit4]   2> 6187 INFO  (coreZkRegister-13-thread-1) [    ] o.a.s.c.ShardLeaderElectionContext I may be the new leader - try and sync
   [junit4]   2> 6187 INFO  (coreZkRegister-13-thread-1) [    ] o.a.s.c.SyncStrategy Sync replicas to https://127.0.0.1:38769/cd_j/cy/collection1/
   [junit4]   2> 6187 INFO  (coreZkRegister-13-thread-1) [    ] o.a.s.c.SyncStrategy Sync Success - now sync replicas to me
   [junit4]   2> 6187 INFO  (coreZkRegister-13-thread-1) [    ] o.a.s.c.SyncStrategy https://127.0.0.1:38769/cd_j/cy/collection1/ has no replicas
   [junit4]   2> 6187 INFO  (OverseerStateUpdate-95589412903911429-127.0.0.1:37759_cd_j%2Fcy-n_0000000000) [    ] o.a.s.c.Overseer processMessage: queueSize: 1, message = {
   [junit4]   2>   "operation":"leader",
   [junit4]   2>   "shard":"shard2",
   [junit4]   2>   "collection":"collection1"} current state version: 5
   [junit4]   2> 6188 INFO  (coreZkRegister-13-thread-1) [    ] o.a.s.c.c.SolrZkClient makePath: /collections/collection1/leaders/shard2
   [junit4]   2> 6192 INFO  (coreZkRegister-13-thread-1) [    ] o.a.s.c.ShardLeaderElectionContextBase Creating leader registration node /collections/collection1/leaders/shard2/leader after winning as /collections/collection1/leader_elect/shard2/election/95589412903911433-core_node1-n_0000000000
   [junit4]   2> 6195 INFO  (coreZkRegister-13-thread-1) [    ] o.a.s.c.ShardLeaderElectionContext I am the new leader: https://127.0.0.1:38769/cd_j/cy/collection1/ shard2
   [junit4]   2> 6195 INFO  (OverseerStateUpdate-95589412903911429-127.0.0.1:37759_cd_j%2Fcy-n_0000000000) [    ] o.a.s.c.Overseer processMessage: queueSize: 1, message = {
   [junit4]   2>   "operation":"leader",
   [junit4]   2>   "shard":"shard2",
   [junit4]   2>   "collection":"collection1",
   [junit4]   2>   "base_url":"https://127.0.0.1:38769/cd_j/cy",
   [junit4]   2>   "core":"collection1",
   [junit4]   2>   "state":"active"} current state version: 5
   [junit4]   2> 6298 INFO  (zkCallback-8-thread-1) [    ] o.a.s.c.c.ZkStateReader A cluster state change: [WatchedEvent state:SyncConnected type:NodeDataChanged path:/clusterstate.json], has occurred - updating... (live nodes size: [2])
   [junit4]   2> 6298 INFO  (zkCallback-15-thread-1) [    ] o.a.s.c.c.ZkStateReader A cluster state change: [WatchedEvent state:SyncConnected type:NodeDataChanged path:/clusterstate.json], has occurred - updating... (live nodes size: [2])
   [junit4]   2> 6298 INFO  (zkCallback-10-thread-1) [    ] o.a.s.c.c.ZkStateReader A cluster state change: [WatchedEvent state:SyncConnected type:NodeDataChanged path:/clusterstate.json], has occurred - updating... (live nodes size: [2])
   [junit4]   2> 6346 INFO  (coreZkRegister-13-thread-1) [    ] o.a.s.c.ZkController We are https://127.0.0.1:38769/cd_j/cy/collection1/ and leader is https://127.0.0.1:38769/cd_j/cy/collection1/
   [junit4]   2> 6346 INFO  (coreZkRegister-13-thread-1) [    ] o.a.s.c.ZkController No LogReplay needed for core=collection1 baseURL=https://127.0.0.1:38769/cd_j/cy
   [junit4]   2> 6346 INFO  (coreZkRegister-13-thread-1) [    ] o.a.s.c.ZkController I am the leader, no recovery necessary
   [junit4]   2> 6346 INFO  (coreZkRegister-13-thread-1) [    ] o.a.s.c.ZkController publishing state=active
   [junit4]   2> 6346 INFO  (coreZkRegister-13-thread-1) [    ] o.a.s.c.ZkController numShards not found on descriptor - reading it from system property
   [junit4]   2> 6348 INFO  (OverseerStateUpdate-95589412903911429-127.0.0.1:37759_cd_j%2Fcy-n_0000000000) [    ] o.a.s.c.Overseer processMessage: queueSize: 1, message = {
   [junit4]   2>   "core":"collection1",
   [junit4]   2>   "core_node_name":"core_node1",
   [junit4]   2>   "roles":null,
   [junit4]   2>   "base_url":"https://127.0.0.1:38769/cd_j/cy",
   [junit4]   2>   "node_name":"127.0.0.1:38769_cd_j%2Fcy",
   [junit4]   2>   "numShards":"2",
   [junit4]   2>   "state":"active",
   [junit4]   2>   "shard":"shard2",
   [junit4]   2>   "collection":"collection1",
   [junit4]   2>   "operation":"state"} current state version: 6
   [junit4]   2> 6349 INFO  (OverseerStateUpdate-95589412903911429-127.0.0.1:37759_cd_j%2Fcy-n_0000000000) [    ] o.a.s.c.o.ReplicaMutator Update state numShards=2 message={
   [junit4]   2>   "core":"collection1",
   [junit4]   2>   "core_node_name":"core_node1",
   [junit4]   2>   "roles":null,
   [junit4]   2>   "base_url":"https://127.0.0.1:38769/cd_j/cy",
   [junit4]   2>   "node_name":"127.0.0.1:38769_cd_j%2Fcy",
   [junit4]   2>   "numShards":"2",
   [junit4]   2>   "state":"active",
   [junit4]   2>   "shard":"shard2",
   [junit4]   2>   "collection":"collection1",
   [junit4]   2>   "operation":"state"}
   [junit4]   2> 6452 INFO  (zkCallback-15-thread-1) [    ] o.a.s.c.c.ZkStateReader A cluster state change: [WatchedEvent state:SyncConnected type:NodeDataChanged path:/clusterstate.json], has occurred - updating... (live nodes size: [2])
   [junit4]   2> 6452 INFO  (zkCallback-10-thread-1) [    ] o.a.s.c.c.ZkStateReader A cluster state change: [WatchedEvent state:SyncConnected type:NodeDataChanged path:/clusterstate.json], has occurred - updating... (live nodes size: [2])
   [junit4]   2> 6452 INFO  (zkCallback-8-thread-1) [    ] o.a.s.c.c.ZkStateReader A cluster state change: [WatchedEvent state:SyncConnected type:NodeDataChanged path:/clusterstate.json], has occurred - updating... (live nodes size: [2])
   [junit4]   2> 6471 INFO  (TEST-StreamingTest.streamTests-seed#[8ABA9BB025CBE00B]) [    ] o.a.s.SolrTestCaseJ4 Writing core.properties file to /home/jenkins/workspace/Lucene-Solr-master-Linux/solr/build/solr-solrj/test/J0/temp/solr.client.solrj.io.stream.StreamingTest_8ABA9BB025CBE00B-001/shard-2-001/cores/collection1
   [junit4]   2> 6472 INFO  (TEST-StreamingTest.streamTests-seed#[8ABA9BB025CBE00B]) [    ] o.a.s.c.AbstractFullDistribZkTestBase create jetty 2 in directory /home/jenkins/workspace/Lucene-Solr-master-Linux/solr/build/solr-solrj/test/J0/temp/solr.client.solrj.io.stream.StreamingTest_8ABA9BB025CBE00B-001/shard-2-001
   [junit4]   2> 6473 INFO  (TEST-StreamingTest.streamTests-seed#[8ABA9BB025CBE00B]) [    ] o.e.j.s.Server jetty-9.3.8.v20160314
   [junit4]   2> 6479 INFO  (TEST-StreamingTest.streamTests-seed#[8ABA9BB025CBE00B]) [    ] o.e.j.s.h.ContextHandler Started o.e.j.s.ServletContextHandler@18d7f84{/cd_j/cy,null,AVAILABLE}
   [junit4]   2> 6480 INFO  (TEST-StreamingTest.streamTests-seed#[8ABA9BB025CBE00B]) [    ] o.e.j.u.s.SslContextFactory x509=X509@1acdd41(solrtest,h=[],w=[]) for SslContextFactory@10519fb(file:///home/jenkins/workspace/Lucene-Solr-master-Linux/solr/server/etc/test/solrtest.keystore,file:///home/jenkins/workspace/Lucene-Solr-master-Linux/solr/server/etc/test/solrtest.keystore)
   [junit4]   2> 6482 INFO  (TEST-StreamingTest.streamTests-seed#[8ABA9BB025CBE00B]) [    ] o.e.j.s.ServerConnector Started ServerConnector@1c9ce{SSL,[ssl, http/1.1]}{127.0.0.1:44720}
   [junit4]   2> 6482 INFO  (TEST-StreamingTest.streamTests-seed#[8ABA9BB025CBE00B]) [    ] o.e.j.s.Server Started @8174ms
   [junit4]   2> 6483 INFO  (TEST-StreamingTest.streamTests-seed#[8ABA9BB025CBE00B]) [    ] o.a.s.c.s.e.JettySolrRunner Jetty properties: {solr.data.dir=/home/jenkins/workspace/Lucene-Solr-master-Linux/solr/build/solr-solrj/test/J0/temp/solr.client.solrj.io.stream.StreamingTest_8ABA9BB025CBE00B-001/tempDir-001/jetty2, solrconfig=solrconfig.xml, hostContext=/cd_j/cy, hostPort=44720, coreRootDirectory=/home/jenkins/workspace/Lucene-Solr-master-Linux/solr/build/solr-solrj/test/J0/../../../../../../../../../home/jenkins/workspace/Lucene-Solr-master-Linux/solr/build/solr-solrj/test/J0/temp/solr.client.solrj.io.stream.StreamingTest_8ABA9BB025CBE00B-001/shard-2-001/cores}
   [junit4]   2> 6483 INFO  (TEST-StreamingTest.streamTests-seed#[8ABA9BB025CBE00B]) [    ] o.a.s.s.SolrDispatchFilter SolrDispatchFilter.init(): jdk.internal.loader.ClassLoaders$AppClassLoader@6a03af
   [junit4]   2> 6483 INFO  (TEST-StreamingTest.streamTests-seed#[8ABA9BB025CBE00B]) [    ] o.a.s.c.SolrResourceLoader new SolrResourceLoader for directory: '/home/jenkins/workspace/Lucene-Solr-master-Linux/solr/build/solr-solrj/test/J0/temp/solr.client.solrj.io.stream.StreamingTest_8ABA9BB025CBE00B-001/shard-2-001'
   [junit4]   2> 6483 INFO  (TEST-StreamingTest.streamTests-seed#[8ABA9BB025CBE00B]) [    ] o.a.s.c.SolrResourceLoader JNDI not configured for solr (NoInitialContextEx)
   [junit4]   2> 6483 INFO  (TEST-StreamingTest.streamTests-seed#[8ABA9BB025CBE00B]) [    ] o.a.s.c.SolrResourceLoader solr home defaulted to 'solr/' (could not find system property or JNDI)
   [junit4]   2> 6483 INFO  (TEST-StreamingTest.streamTests-seed#[8ABA9BB025CBE00B]) [    ] o.a.s.c.c.SolrZkClient Using default ZkCredentialsProvider
   [junit4]   2> 6484 INFO  (TEST-StreamingTest.streamTests-seed#[8ABA9BB025CBE00B]) [    ] o.a.s.c.c.ConnectionManager Waiting for client to connect to ZooKeeper
   [junit4]   2> 6486 INFO  (zkCallback-16-thread-1) [    ] o.a.s.c.c.ConnectionManager Watcher org.apache.solr.common.cloud.ConnectionManager@7ab0e8 name:ZooKeeperConnection Watcher:127.0.0.1:32793/solr got event WatchedEvent state:SyncConnected type:None path:null path:null type:None
   [junit4]   2> 6486 INFO  (TEST-StreamingTest.streamTests-seed#[8ABA9BB025CBE00B]) [    ] o.a.s.c.c.ConnectionManager Client is connected to ZooKeeper
   [junit4]   2> 6487 INFO  (TEST-StreamingTest.streamTests-seed#[8ABA9BB025CBE00B]) [    ] o.a.s.c.c.SolrZkClient Using default ZkACLProvider
   [junit4]   2> 6488 INFO  (TEST-StreamingTest.streamTests-seed#[8ABA9BB025CBE00B]) [    ] o.a.s.s.SolrDispatchFilter Loading solr.xml from SolrHome (not found in ZooKeeper)
   [junit4]   2> 6488 INFO  (TEST-StreamingTest.streamTests-seed#[8ABA9BB025CBE00B]) [    ] o.a.s.c.SolrXmlConfig Loading container configuration from /home/jenkins/workspace/Lucene-Solr-master-Linux/solr/build/solr-solrj/test/J0/temp/solr.client.solrj.io.stream.StreamingTest_8ABA9BB025CBE00B-001/shard-2-001/solr.xml
   [junit4]   2> 6495 INFO  (TEST-StreamingTest.streamTests-seed#[8ABA9BB025CBE00B]) [    ] o.a.s.c.CorePropertiesLocator Config-defined core root directory: /home/jenkins/workspace/Lucene-Solr-master-Linux/solr/build/solr-solrj/test/J0/../../../../../../../../../home/jenkins/workspace/Lucene-Solr-master-Linux/solr/build/solr-solrj/test/J0/temp/solr.client.solrj.io.stream.StreamingTest_8ABA9BB025CBE00B-001/shard-2-001/cores
   [junit4]   2> 6496 INFO  (TEST-StreamingTest.streamTests-seed#[8ABA9BB025CBE00B]) [    ] o.a.s.c.CoreContainer New CoreContainer 4560201
   [junit4]   2> 6496 INFO  (TEST-StreamingTest.streamTests-seed#[8ABA9BB025CBE00B]) [    ] o.a.s.c.CoreContainer Loading cores into CoreContainer [instanceDir=/home/jenkins/workspace/Lucene-Solr-master-Linux/solr/build/solr-solrj/test/J0/temp/solr.client.solrj.io.stream.StreamingTest_8ABA9BB025CBE00B-001/shard-2-001]
   [junit4]   2> 6496 WARN  (TEST-StreamingTest.streamTests-seed#[8ABA9BB025CBE00B]) [    ] o.a.s.c.CoreContainer Couldn't add files from /home/jenkins/workspace/Lucene-Solr-master-Linux/solr/build/solr-solrj/test/J0/temp/solr.client.solrj.io.stream.StreamingTest_8ABA9BB025CBE00B-001/shard-2-001/lib to classpath: /home/jenkins/workspace/Lucene-Solr-master-Linux/solr/build/solr-solrj/test/J0/temp/solr.client.solrj.io.stream.StreamingTest_8ABA9BB025CBE00B-001/shard-2-001/lib
   [junit4]   2> 6496 INFO  (TEST-StreamingTest.streamTests-seed#[8ABA9BB025CBE00B]) [    ] o.a.s.h.c.HttpShardHandlerFactory created with socketTimeout : 90000,urlScheme : ,connTimeout : 15000,maxConnectionsPerHost : 20,maxConnections : 10000,corePoolSize : 0,maximumPoolSize : 2147483647,maxThreadIdleTime : 5,sizeOfQueue : -1,fairnessPolicy : false,useRetries : false,
   [junit4]   2> 6498 INFO  (TEST-StreamingTest.streamTests-seed#[8ABA9BB025CBE00B]) [    ] o.a.s.u.UpdateShardHandler Creating UpdateShardHandler HTTP client with params: socketTimeout=340000&connTimeout=45000&retry=true
   [junit4]   2> 6499 INFO  (TEST-StreamingTest.streamTests-seed#[8ABA9BB025CBE00B]) [    ] o.a.s.l.LogWatcher SLF4J impl is org.slf4j.impl.Log4jLoggerFactory
   [junit4]   2> 6499 INFO  (TEST-StreamingTest.streamTests-seed#[8ABA9BB025CBE00B]) [    ] o.a.s.l.LogWatcher Registering Log Listener [Log4j (org.slf4j.impl.Log4jLoggerFactory)]
   [junit4]   2> 6499 INFO  (TEST-StreamingTest.streamTests-seed#[8ABA9BB025CBE00B]) [    ] o.a.s.c.ZkContainer Zookeeper client=127.0.0.1:32793/solr
   [junit4]   2> 6500 INFO  (TEST-StreamingTest.streamTests-seed#[8ABA9BB025CBE00B]) [    ] o.a.s.c.ZkController zkHost includes chroot
   [junit4]   2> 6500 INFO  (TEST-StreamingTest.streamTests-seed#[8ABA9BB025CBE00B]) [    ] o.a.s.c.c.SolrZkClient Using default ZkCredentialsProvider
   [junit4]   2> 6500 INFO  (TEST-StreamingTest.streamTests-seed#[8ABA9BB025CBE00B]) [    ] o.a.s.c.c.ConnectionManager Waiting for client to connect to ZooKeeper
   [junit4]   2> 6502 INFO  (zkCallback-19-thread-1) [    ] o.a.s.c.c.ConnectionManager Watcher org.apache.solr.common.cloud.ConnectionManager@bf9aca name:ZooKeeperConnection Watcher:127.0.0.1:32793 got event WatchedEvent state:SyncConnected type:None path:null path:null type:None
   [junit4]   2> 6502 INFO  (TEST-StreamingTest.streamTests-seed#[8ABA9BB025CBE00B]) [    ] o.a.s.c.c.ConnectionManager Client is connected to ZooKeeper
   [junit4]   2> 6503 INFO  (TEST-StreamingTest.streamTests-seed#[8ABA9BB025CBE00B]) [    ] o.a.s.c.c.SolrZkClient Using default ZkACLProvider
   [junit4]   2> 6504 INFO  (TEST-StreamingTest.streamTests-seed#[8ABA9BB025CBE00B]) [    ] o.a.s.c.c.ConnectionManager Waiting for client to connect to ZooKeeper
   [junit4]   2> 6506 INFO  (zkCallback-20-thread-1) [    ] o.a.s.c.c.ConnectionManager Watcher org.apache.solr.common.cloud.ConnectionManager@3a11ed name:ZooKeeperConnection Watcher:127.0.0.1:32793/solr got event WatchedEvent state:SyncConnected type:None path:null path:null type:None
   [junit4]   2> 6506 INFO  (TEST-StreamingTest.streamTests-seed#[8ABA9BB025CBE00B]) [    ] o.a.s.c.c.ConnectionManager Client is connected to ZooKeeper
   [junit4]   2> 6511 INFO  (TEST-StreamingTest.streamTests-seed#[8ABA9BB025CBE00B]) [    ] o.a.s.c.c.ZkStateReader Updating cluster state from ZooKeeper... 
   [junit4]   2> 6512 INFO  (TEST-StreamingTest.streamTests-seed#[8ABA9BB025CBE00B]) [    ] o.a.s.c.c.ZkStateReader Updated live nodes from ZooKeeper... (0) -> (2)
   [junit4]   2> 6514 INFO  (TEST-StreamingTest.streamTests-seed#[8ABA9BB025CBE00B]) [    ] o.a.s.c.Overseer Overseer (id=null) closing
   [junit4]   2> 6514 INFO  (TEST-StreamingTest.streamTests-seed#[8ABA9BB025CBE00B]) [    ] o.a.s.c.LeaderElector Joined leadership election with path: /overseer_elect/election/95589412903911436-127.0.0.1:44720_cd_j%2Fcy-n_0000000002
   [junit4]   2> 6515 INFO  (TEST-StreamingTest.streamTests-seed#[8ABA9BB025CBE00B]) [    ] o.a.s.c.LeaderElector Watching path /overseer_elect/election/95589412903911433-127.0.0.1:38769_cd_j%2Fcy-n_0000000001 to know if I could be the leader
   [junit4]   2> 6515 INFO  (TEST-StreamingTest.streamTests-seed#[8ABA9BB025CBE00B]) [    ] o.a.s.c.ZkController Publish node=127.0.0.1:44720_cd_j%2Fcy as DOWN
   [junit4]   2> 6517 INFO  (OverseerStateUpdate-95589412903911429-127.0.0.1:37759_cd_j%2Fcy-n_0000000000) [    ] o.a.s.c.Overseer processMessage: queueSize: 1, message = {
   [junit4]   2>   "operation":"downnode",
   [junit4]   2>   "node_name":"127.0.0.1:44720_cd_j%2Fcy"} current state version: 7
   [junit4]   2> 6517 INFO  (OverseerStateUpdate-95589412903911429-127.0.0.1:37759_cd_j%2Fcy-n_0000000000) [    ] o.a.s.c.o.NodeMutator DownNode state invoked for node: 127.0.0.1:44720_cd_j%2Fcy
 

[...truncated too long message...]

ud.ChaosMonkey.stopJettySolrRunner(ChaosMonkey.java:197)
   [junit4]   2>         at org.apache.solr.cloud.ChaosMonkey.stop(ChaosMonkey.java:575)
   [junit4]   2>         at org.apache.solr.cloud.AbstractFullDistribZkTestBase.destroyServers(AbstractFullDistribZkTestBase.java:1534)
   [junit4]   2>         at org.apache.solr.BaseDistributedSearchTestCase.distribTearDown(BaseDistributedSearchTestCase.java:318)
   [junit4]   2>         at org.apache.solr.cloud.AbstractDistribZkTestBase.distribTearDown(AbstractDistribZkTestBase.java:275)
   [junit4]   2>         at org.apache.solr.cloud.AbstractFullDistribZkTestBase.distribTearDown(AbstractFullDistribZkTestBase.java:1508)
   [junit4]   2>         at org.apache.solr.BaseDistributedSearchTestCase$ShardsRepeatRule$ShardsStatement.evaluate(BaseDistributedSearchTestCase.java:973)
   [junit4]   2>         at com.carrotsearch.randomizedtesting.rules.SystemPropertiesRestoreRule$1.evaluate(SystemPropertiesRestoreRule.java:57)
   [junit4]   2>         at org.apache.lucene.util.TestRuleSetupTeardownChained$1.evaluate(TestRuleSetupTeardownChained.java:49)
   [junit4]   2>         at org.apache.lucene.util.AbstractBeforeAfterRule$1.evaluate(AbstractBeforeAfterRule.java:45)
   [junit4]   2>         at org.apache.lucene.util.TestRuleThreadAndTestName$1.evaluate(TestRuleThreadAndTestName.java:48)
   [junit4]   2>         at org.apache.lucene.util.TestRuleIgnoreAfterMaxFailures$1.evaluate(TestRuleIgnoreAfterMaxFailures.java:64)
   [junit4]   2>         at org.apache.lucene.util.TestRuleMarkFailure$1.evaluate(TestRuleMarkFailure.java:47)
   [junit4]   2>         at com.carrotsearch.randomizedtesting.rules.StatementAdapter.evaluate(StatementAdapter.java:36)
   [junit4]   2>         at com.carrotsearch.randomizedtesting.ThreadLeakControl$StatementRunner.run(ThreadLeakControl.java:367)
   [junit4]   2>         at com.carrotsearch.randomizedtesting.ThreadLeakControl.forkTimeoutingTask(ThreadLeakControl.java:809)
   [junit4]   2>         at com.carrotsearch.randomizedtesting.ThreadLeakControl$3.evaluate(ThreadLeakControl.java:460)
   [junit4]   2>         at com.carrotsearch.randomizedtesting.RandomizedRunner.runSingleTest(RandomizedRunner.java:880)
   [junit4]   2>         at com.carrotsearch.randomizedtesting.RandomizedRunner$5.evaluate(RandomizedRunner.java:781)
   [junit4]   2>         at com.carrotsearch.randomizedtesting.RandomizedRunner$6.evaluate(RandomizedRunner.java:816)
   [junit4]   2>         at com.carrotsearch.randomizedtesting.RandomizedRunner$7.evaluate(RandomizedRunner.java:827)
   [junit4]   2>         at com.carrotsearch.randomizedtesting.rules.StatementAdapter.evaluate(StatementAdapter.java:36)
   [junit4]   2>         at com.carrotsearch.randomizedtesting.rules.SystemPropertiesRestoreRule$1.evaluate(SystemPropertiesRestoreRule.java:57)
   [junit4]   2>         at org.apache.lucene.util.AbstractBeforeAfterRule$1.evaluate(AbstractBeforeAfterRule.java:45)
   [junit4]   2>         at com.carrotsearch.randomizedtesting.rules.StatementAdapter.evaluate(StatementAdapter.java:36)
   [junit4]   2>         at org.apache.lucene.util.TestRuleStoreClassName$1.evaluate(TestRuleStoreClassName.java:41)
   [junit4]   2>         at com.carrotsearch.randomizedtesting.rules.NoShadowingOrOverridesOnMethodsRule$1.evaluate(NoShadowingOrOverridesOnMethodsRule.java:40)
   [junit4]   2>         at com.carrotsearch.randomizedtesting.rules.NoShadowingOrOverridesOnMethodsRule$1.evaluate(NoShadowingOrOverridesOnMethodsRule.java:40)
   [junit4]   2>         at com.carrotsearch.randomizedtesting.rules.StatementAdapter.evaluate(StatementAdapter.java:36)
   [junit4]   2>         at com.carrotsearch.randomizedtesting.rules.StatementAdapter.evaluate(StatementAdapter.java:36)
   [junit4]   2>         at com.carrotsearch.randomizedtesting.rules.StatementAdapter.evaluate(StatementAdapter.java:36)
   [junit4]   2>         at org.apache.lucene.util.TestRuleAssertionsRequired$1.evaluate(TestRuleAssertionsRequired.java:53)
   [junit4]   2>         at org.apache.lucene.util.TestRuleMarkFailure$1.evaluate(TestRuleMarkFailure.java:47)
   [junit4]   2>         at org.apache.lucene.util.TestRuleIgnoreAfterMaxFailures$1.evaluate(TestRuleIgnoreAfterMaxFailures.java:64)
   [junit4]   2>         at org.apache.lucene.util.TestRuleIgnoreTestSuites$1.evaluate(TestRuleIgnoreTestSuites.java:54)
   [junit4]   2>         at com.carrotsearch.randomizedtesting.rules.StatementAdapter.evaluate(StatementAdapter.java:36)
   [junit4]   2>         at com.carrotsearch.randomizedtesting.ThreadLeakControl$StatementRunner.run(ThreadLeakControl.java:367)
   [junit4]   2>         at java.lang.Thread.run(java.base@9-ea/Thread.java:804)
   [junit4]   2>   12) Thread[id=164, name=org.eclipse.jetty.server.session.HashSessionManager@1e03955Timer, state=TIMED_WAITING, group=TGRP-StreamingTest]
   [junit4]   2>         at jdk.internal.misc.Unsafe.park(java.base@9-ea/Native Method)
   [junit4]   2>         at java.util.concurrent.locks.LockSupport.parkNanos(java.base@9-ea/LockSupport.java:230)
   [junit4]   2>         at java.util.concurrent.locks.AbstractQueuedSynchronizer$ConditionObject.awaitNanos(java.base@9-ea/AbstractQueuedSynchronizer.java:2106)
   [junit4]   2>         at java.util.concurrent.ScheduledThreadPoolExecutor$DelayedWorkQueue.take(java.base@9-ea/ScheduledThreadPoolExecutor.java:1131)
   [junit4]   2>         at java.util.concurrent.ScheduledThreadPoolExecutor$DelayedWorkQueue.take(java.base@9-ea/ScheduledThreadPoolExecutor.java:848)
   [junit4]   2>         at java.util.concurrent.ThreadPoolExecutor.getTask(java.base@9-ea/ThreadPoolExecutor.java:1083)
   [junit4]   2>         at java.util.concurrent.ThreadPoolExecutor.runWorker(java.base@9-ea/ThreadPoolExecutor.java:1143)
   [junit4]   2>         at java.util.concurrent.ThreadPoolExecutor$Worker.run(java.base@9-ea/ThreadPoolExecutor.java:632)
   [junit4]   2>         at java.lang.Thread.run(java.base@9-ea/Thread.java:804)
   [junit4]   2>   13) Thread[id=138, name=TEST-StreamingTest.streamTests-seed#[8ABA9BB025CBE00B]-SendThread(127.0.0.1:32793), state=TIMED_WAITING, group=TGRP-StreamingTest]
   [junit4]   2>         at java.lang.Thread.sleep(java.base@9-ea/Native Method)
   [junit4]   2>         at org.apache.zookeeper.client.StaticHostProvider.next(StaticHostProvider.java:101)
   [junit4]   2>         at org.apache.zookeeper.ClientCnxn$SendThread.startConnect(ClientCnxn.java:940)
   [junit4]   2>         at org.apache.zookeeper.ClientCnxn$SendThread.run(ClientCnxn.java:1003)
   [junit4]   2>   14) Thread[id=163, name=Scheduler-22382988, state=TIMED_WAITING, group=TGRP-StreamingTest]
   [junit4]   2>         at jdk.internal.misc.Unsafe.park(java.base@9-ea/Native Method)
   [junit4]   2>         at java.util.concurrent.locks.LockSupport.parkNanos(java.base@9-ea/LockSupport.java:230)
   [junit4]   2>         at java.util.concurrent.locks.AbstractQueuedSynchronizer$ConditionObject.awaitNanos(java.base@9-ea/AbstractQueuedSynchronizer.java:2106)
   [junit4]   2>         at java.util.concurrent.ScheduledThreadPoolExecutor$DelayedWorkQueue.take(java.base@9-ea/ScheduledThreadPoolExecutor.java:1131)
   [junit4]   2>         at java.util.concurrent.ScheduledThreadPoolExecutor$DelayedWorkQueue.take(java.base@9-ea/ScheduledThreadPoolExecutor.java:848)
   [junit4]   2>         at java.util.concurrent.ThreadPoolExecutor.getTask(java.base@9-ea/ThreadPoolExecutor.java:1083)
   [junit4]   2>         at java.util.concurrent.ThreadPoolExecutor.runWorker(java.base@9-ea/ThreadPoolExecutor.java:1143)
   [junit4]   2>         at java.util.concurrent.ThreadPoolExecutor$Worker.run(java.base@9-ea/ThreadPoolExecutor.java:632)
   [junit4]   2>         at java.lang.Thread.run(java.base@9-ea/Thread.java:804)
   [junit4]   2> NOTE: test params are: codec=Lucene60, sim=RandomSimilarity(queryNorm=true,coord=yes): {}, locale=luy-KE, timezone=America/Bahia_Banderas
   [junit4]   2> NOTE: Linux 4.2.0-34-generic i386/Oracle Corporation 9-ea (32-bit)/cpus=12,threads=20,free=36403656,total=164626432
   [junit4]   2> NOTE: All tests run in this JVM: [CommonParamsTest, TestJsonRecordReader, AnlysisResponseBaseTest, StreamingTest]
   [junit4]   2> NOTE: reproduce with: ant test  -Dtestcase=StreamingTest -Dtests.seed=8ABA9BB025CBE00B -Dtests.multiplier=3 -Dtests.slow=true -Dtests.locale=luy-KE -Dtests.timezone=America/Bahia_Banderas -Dtests.asserts=true -Dtests.file.encoding=UTF-8
   [junit4] ERROR   0.00s J0 | StreamingTest (suite) <<<
   [junit4]    > Throwable #1: java.lang.Exception: Suite timeout exceeded (>= 7200000 msec).
   [junit4]    > 	at __randomizedtesting.SeedInfo.seed([8ABA9BB025CBE00B]:0)
   [junit4] Completed [68/77 (1!)] on J0 in 7223.80s, 1 test, 2 errors <<< FAILURES!

[...truncated 39 lines...]
BUILD FAILED
/home/jenkins/workspace/Lucene-Solr-master-Linux/build.xml:740: The following error occurred while executing this line:
/home/jenkins/workspace/Lucene-Solr-master-Linux/build.xml:684: The following error occurred while executing this line:
/home/jenkins/workspace/Lucene-Solr-master-Linux/build.xml:59: The following error occurred while executing this line:
/home/jenkins/workspace/Lucene-Solr-master-Linux/solr/build.xml:246: The following error occurred while executing this line:
/home/jenkins/workspace/Lucene-Solr-master-Linux/solr/common-build.xml:529: The following error occurred while executing this line:
/home/jenkins/workspace/Lucene-Solr-master-Linux/lucene/common-build.xml:1457: The following error occurred while executing this line:
/home/jenkins/workspace/Lucene-Solr-master-Linux/lucene/common-build.xml:1014: There were test failures: 77 suites, 521 tests, 1 suite-level error, 1 error, 61 ignored [seed: 8ABA9BB025CBE00B]

Total time: 179 minutes 51 seconds
Build step 'Invoke Ant' marked build as failure
Archiving artifacts
[WARNINGS] Skipping publisher since build result is FAILURE
Recording test results
Email was triggered for: Failure - Any
Sending email for trigger: Failure - Any



Mime
View raw message