lucene-dev mailing list archives

Site index · List index
Message view « Date » · « Thread »
Top « Date » · « Thread »
From Apache Jenkins Server <jenk...@builds.apache.org>
Subject [JENKINS] Lucene-Solr-Tests-trunk-Java8 - Build # 917 - Failure
Date Tue, 01 Mar 2016 16:37:18 GMT
Build: https://builds.apache.org/job/Lucene-Solr-Tests-trunk-Java8/917/

1 tests failed.
FAILED:  org.apache.solr.handler.TestReplicationHandler.doTestStressReplication

Error Message:
timed out waiting for collection1 startAt time to exceed: Wed Mar 02 03:10:54 GMT+11:00 2016

Stack Trace:
java.lang.AssertionError: timed out waiting for collection1 startAt time to exceed: Wed Mar 02 03:10:54 GMT+11:00 2016
	at __randomizedtesting.SeedInfo.seed([90B644A0B69269D4:4B1D4466B3BA0067]:0)
	at org.junit.Assert.fail(Assert.java:93)
	at org.apache.solr.handler.TestReplicationHandler.watchCoreStartAt(TestReplicationHandler.java:1419)
	at org.apache.solr.handler.TestReplicationHandler.doTestStressReplication(TestReplicationHandler.java:771)
	at sun.reflect.NativeMethodAccessorImpl.invoke0(Native Method)
	at sun.reflect.NativeMethodAccessorImpl.invoke(NativeMethodAccessorImpl.java:62)
	at sun.reflect.DelegatingMethodAccessorImpl.invoke(DelegatingMethodAccessorImpl.java:43)
	at java.lang.reflect.Method.invoke(Method.java:497)
	at com.carrotsearch.randomizedtesting.RandomizedRunner.invoke(RandomizedRunner.java:1764)
	at com.carrotsearch.randomizedtesting.RandomizedRunner$8.evaluate(RandomizedRunner.java:871)
	at com.carrotsearch.randomizedtesting.RandomizedRunner$9.evaluate(RandomizedRunner.java:907)
	at com.carrotsearch.randomizedtesting.RandomizedRunner$10.evaluate(RandomizedRunner.java:921)
	at com.carrotsearch.randomizedtesting.rules.SystemPropertiesRestoreRule$1.evaluate(SystemPropertiesRestoreRule.java:57)
	at org.apache.lucene.util.TestRuleSetupTeardownChained$1.evaluate(TestRuleSetupTeardownChained.java:49)
	at org.apache.lucene.util.AbstractBeforeAfterRule$1.evaluate(AbstractBeforeAfterRule.java:45)
	at org.apache.lucene.util.TestRuleThreadAndTestName$1.evaluate(TestRuleThreadAndTestName.java:48)
	at org.apache.lucene.util.TestRuleIgnoreAfterMaxFailures$1.evaluate(TestRuleIgnoreAfterMaxFailures.java:64)
	at org.apache.lucene.util.TestRuleMarkFailure$1.evaluate(TestRuleMarkFailure.java:47)
	at com.carrotsearch.randomizedtesting.rules.StatementAdapter.evaluate(StatementAdapter.java:36)
	at com.carrotsearch.randomizedtesting.ThreadLeakControl$StatementRunner.run(ThreadLeakControl.java:367)
	at com.carrotsearch.randomizedtesting.ThreadLeakControl.forkTimeoutingTask(ThreadLeakControl.java:809)
	at com.carrotsearch.randomizedtesting.ThreadLeakControl$3.evaluate(ThreadLeakControl.java:460)
	at com.carrotsearch.randomizedtesting.RandomizedRunner.runSingleTest(RandomizedRunner.java:880)
	at com.carrotsearch.randomizedtesting.RandomizedRunner$5.evaluate(RandomizedRunner.java:781)
	at com.carrotsearch.randomizedtesting.RandomizedRunner$6.evaluate(RandomizedRunner.java:816)
	at com.carrotsearch.randomizedtesting.RandomizedRunner$7.evaluate(RandomizedRunner.java:827)
	at com.carrotsearch.randomizedtesting.rules.StatementAdapter.evaluate(StatementAdapter.java:36)
	at com.carrotsearch.randomizedtesting.rules.SystemPropertiesRestoreRule$1.evaluate(SystemPropertiesRestoreRule.java:57)
	at org.apache.lucene.util.AbstractBeforeAfterRule$1.evaluate(AbstractBeforeAfterRule.java:45)
	at com.carrotsearch.randomizedtesting.rules.StatementAdapter.evaluate(StatementAdapter.java:36)
	at org.apache.lucene.util.TestRuleStoreClassName$1.evaluate(TestRuleStoreClassName.java:41)
	at com.carrotsearch.randomizedtesting.rules.NoShadowingOrOverridesOnMethodsRule$1.evaluate(NoShadowingOrOverridesOnMethodsRule.java:40)
	at com.carrotsearch.randomizedtesting.rules.NoShadowingOrOverridesOnMethodsRule$1.evaluate(NoShadowingOrOverridesOnMethodsRule.java:40)
	at com.carrotsearch.randomizedtesting.rules.StatementAdapter.evaluate(StatementAdapter.java:36)
	at com.carrotsearch.randomizedtesting.rules.StatementAdapter.evaluate(StatementAdapter.java:36)
	at com.carrotsearch.randomizedtesting.rules.StatementAdapter.evaluate(StatementAdapter.java:36)
	at org.apache.lucene.util.TestRuleAssertionsRequired$1.evaluate(TestRuleAssertionsRequired.java:53)
	at org.apache.lucene.util.TestRuleMarkFailure$1.evaluate(TestRuleMarkFailure.java:47)
	at org.apache.lucene.util.TestRuleIgnoreAfterMaxFailures$1.evaluate(TestRuleIgnoreAfterMaxFailures.java:64)
	at org.apache.lucene.util.TestRuleIgnoreTestSuites$1.evaluate(TestRuleIgnoreTestSuites.java:54)
	at com.carrotsearch.randomizedtesting.rules.StatementAdapter.evaluate(StatementAdapter.java:36)
	at com.carrotsearch.randomizedtesting.ThreadLeakControl$StatementRunner.run(ThreadLeakControl.java:367)
	at java.lang.Thread.run(Thread.java:745)




Build Log:
[...truncated 11155 lines...]
   [junit4] Suite: org.apache.solr.handler.TestReplicationHandler
   [junit4]   2> Creating dataDir: /x1/jenkins/jenkins-slave/workspace/Lucene-Solr-Tests-trunk-Java8/solr/build/solr-core/test/J0/temp/solr.handler.TestReplicationHandler_90B644A0B69269D4-001/init-core-data-001
   [junit4]   2> 648203 INFO  (TEST-TestReplicationHandler.doTestReplicateAfterStartupWithNoActivity-seed#[90B644A0B69269D4]) [    ] o.a.s.SolrTestCaseJ4 ###Starting doTestReplicateAfterStartupWithNoActivity
   [junit4]   2> 648203 INFO  (TEST-TestReplicationHandler.doTestReplicateAfterStartupWithNoActivity-seed#[90B644A0B69269D4]) [    ] o.a.s.SolrTestCaseJ4 Writing core.properties file to /x1/jenkins/jenkins-slave/workspace/Lucene-Solr-Tests-trunk-Java8/solr/build/solr-core/test/J0/temp/solr.handler.TestReplicationHandler_90B644A0B69269D4-001/solr-instance-001/collection1
   [junit4]   2> 648211 INFO  (TEST-TestReplicationHandler.doTestReplicateAfterStartupWithNoActivity-seed#[90B644A0B69269D4]) [    ] o.e.j.s.Server jetty-9.3.6.v20151106
   [junit4]   2> 648217 INFO  (TEST-TestReplicationHandler.doTestReplicateAfterStartupWithNoActivity-seed#[90B644A0B69269D4]) [    ] o.e.j.s.h.ContextHandler Started o.e.j.s.ServletContextHandler@6b402862{/solr,null,AVAILABLE}
   [junit4]   2> 648219 INFO  (TEST-TestReplicationHandler.doTestReplicateAfterStartupWithNoActivity-seed#[90B644A0B69269D4]) [    ] o.e.j.s.ServerConnector Started ServerConnector@476b71d7{HTTP/1.1,[http/1.1]}{127.0.0.1:41358}
   [junit4]   2> 648219 INFO  (TEST-TestReplicationHandler.doTestReplicateAfterStartupWithNoActivity-seed#[90B644A0B69269D4]) [    ] o.e.j.s.Server Started @651480ms
   [junit4]   2> 648219 INFO  (TEST-TestReplicationHandler.doTestReplicateAfterStartupWithNoActivity-seed#[90B644A0B69269D4]) [    ] o.a.s.c.s.e.JettySolrRunner Jetty properties: {solr.data.dir=/x1/jenkins/jenkins-slave/workspace/Lucene-Solr-Tests-trunk-Java8/solr/build/solr-core/test/J0/temp/solr.handler.TestReplicationHandler_90B644A0B69269D4-001/solr-instance-001/collection1/data, hostContext=/solr, hostPort=41358}
   [junit4]   2> 648219 INFO  (TEST-TestReplicationHandler.doTestReplicateAfterStartupWithNoActivity-seed#[90B644A0B69269D4]) [    ] o.a.s.s.SolrDispatchFilter SolrDispatchFilter.init(): sun.misc.Launcher$AppClassLoader@4e0e2f2a
   [junit4]   2> 648219 INFO  (TEST-TestReplicationHandler.doTestReplicateAfterStartupWithNoActivity-seed#[90B644A0B69269D4]) [    ] o.a.s.c.SolrResourceLoader new SolrResourceLoader for directory: '/x1/jenkins/jenkins-slave/workspace/Lucene-Solr-Tests-trunk-Java8/solr/build/solr-core/test/J0/temp/solr.handler.TestReplicationHandler_90B644A0B69269D4-001/solr-instance-001'
   [junit4]   2> 648220 INFO  (TEST-TestReplicationHandler.doTestReplicateAfterStartupWithNoActivity-seed#[90B644A0B69269D4]) [    ] o.a.s.c.SolrResourceLoader JNDI not configured for solr (NoInitialContextEx)
   [junit4]   2> 648220 INFO  (TEST-TestReplicationHandler.doTestReplicateAfterStartupWithNoActivity-seed#[90B644A0B69269D4]) [    ] o.a.s.c.SolrResourceLoader solr home defaulted to 'solr/' (could not find system property or JNDI)
   [junit4]   2> 648220 INFO  (TEST-TestReplicationHandler.doTestReplicateAfterStartupWithNoActivity-seed#[90B644A0B69269D4]) [    ] o.a.s.c.SolrXmlConfig Loading container configuration from /x1/jenkins/jenkins-slave/workspace/Lucene-Solr-Tests-trunk-Java8/solr/build/solr-core/test/J0/temp/solr.handler.TestReplicationHandler_90B644A0B69269D4-001/solr-instance-001/solr.xml
   [junit4]   2> 648224 INFO  (TEST-TestReplicationHandler.doTestReplicateAfterStartupWithNoActivity-seed#[90B644A0B69269D4]) [    ] o.a.s.c.CorePropertiesLocator Config-defined core root directory: /x1/jenkins/jenkins-slave/workspace/Lucene-Solr-Tests-trunk-Java8/solr/build/solr-core/test/J0/temp/solr.handler.TestReplicationHandler_90B644A0B69269D4-001/solr-instance-001/.
   [junit4]   2> 648225 INFO  (TEST-TestReplicationHandler.doTestReplicateAfterStartupWithNoActivity-seed#[90B644A0B69269D4]) [    ] o.a.s.c.CoreContainer New CoreContainer 1071589697
   [junit4]   2> 648225 INFO  (TEST-TestReplicationHandler.doTestReplicateAfterStartupWithNoActivity-seed#[90B644A0B69269D4]) [    ] o.a.s.c.CoreContainer Loading cores into CoreContainer [instanceDir=/x1/jenkins/jenkins-slave/workspace/Lucene-Solr-Tests-trunk-Java8/solr/build/solr-core/test/J0/temp/solr.handler.TestReplicationHandler_90B644A0B69269D4-001/solr-instance-001]
   [junit4]   2> 648225 WARN  (TEST-TestReplicationHandler.doTestReplicateAfterStartupWithNoActivity-seed#[90B644A0B69269D4]) [    ] o.a.s.c.CoreContainer Couldn't add files from /x1/jenkins/jenkins-slave/workspace/Lucene-Solr-Tests-trunk-Java8/solr/build/solr-core/test/J0/temp/solr.handler.TestReplicationHandler_90B644A0B69269D4-001/solr-instance-001/lib to classpath: /x1/jenkins/jenkins-slave/workspace/Lucene-Solr-Tests-trunk-Java8/solr/build/solr-core/test/J0/temp/solr.handler.TestReplicationHandler_90B644A0B69269D4-001/solr-instance-001/lib
   [junit4]   2> 648225 INFO  (TEST-TestReplicationHandler.doTestReplicateAfterStartupWithNoActivity-seed#[90B644A0B69269D4]) [    ] o.a.s.h.c.HttpShardHandlerFactory created with socketTimeout : 90000,urlScheme : ,connTimeout : 15000,maxConnectionsPerHost : 20,maxConnections : 10000,corePoolSize : 0,maximumPoolSize : 2147483647,maxThreadIdleTime : 5,sizeOfQueue : -1,fairnessPolicy : false,useRetries : false,
   [junit4]   2> 648226 INFO  (TEST-TestReplicationHandler.doTestReplicateAfterStartupWithNoActivity-seed#[90B644A0B69269D4]) [    ] o.a.s.u.UpdateShardHandler Creating UpdateShardHandler HTTP client with params: socketTimeout=340000&connTimeout=45000&retry=true
   [junit4]   2> 648227 INFO  (TEST-TestReplicationHandler.doTestReplicateAfterStartupWithNoActivity-seed#[90B644A0B69269D4]) [    ] o.a.s.l.LogWatcher SLF4J impl is org.slf4j.impl.Log4jLoggerFactory
   [junit4]   2> 648227 INFO  (TEST-TestReplicationHandler.doTestReplicateAfterStartupWithNoActivity-seed#[90B644A0B69269D4]) [    ] o.a.s.l.LogWatcher Registering Log Listener [Log4j (org.slf4j.impl.Log4jLoggerFactory)]
   [junit4]   2> 648227 INFO  (TEST-TestReplicationHandler.doTestReplicateAfterStartupWithNoActivity-seed#[90B644A0B69269D4]) [    ] o.a.s.c.CoreContainer Security conf doesn't exist. Skipping setup for authorization module.
   [junit4]   2> 648227 INFO  (TEST-TestReplicationHandler.doTestReplicateAfterStartupWithNoActivity-seed#[90B644A0B69269D4]) [    ] o.a.s.c.CoreContainer No authentication plugin used.
   [junit4]   2> 648227 INFO  (TEST-TestReplicationHandler.doTestReplicateAfterStartupWithNoActivity-seed#[90B644A0B69269D4]) [    ] o.a.s.c.CorePropertiesLocator Looking for core definitions underneath /x1/jenkins/jenkins-slave/workspace/Lucene-Solr-Tests-trunk-Java8/solr/build/solr-core/test/J0/temp/solr.handler.TestReplicationHandler_90B644A0B69269D4-001/solr-instance-001/.
   [junit4]   2> 648228 INFO  (TEST-TestReplicationHandler.doTestReplicateAfterStartupWithNoActivity-seed#[90B644A0B69269D4]) [    ] o.a.s.c.CoreDescriptor Created CoreDescriptor: {name=collection1, config=solrconfig.xml, loadOnStartup=true, schema=schema.xml, configSetProperties=configsetprops.json, transient=false, dataDir=data/}
   [junit4]   2> 648228 INFO  (TEST-TestReplicationHandler.doTestReplicateAfterStartupWithNoActivity-seed#[90B644A0B69269D4]) [    ] o.a.s.c.CorePropertiesLocator Found core collection1 in /x1/jenkins/jenkins-slave/workspace/Lucene-Solr-Tests-trunk-Java8/solr/build/solr-core/test/J0/temp/solr.handler.TestReplicationHandler_90B644A0B69269D4-001/solr-instance-001/./collection1
   [junit4]   2> 648228 INFO  (TEST-TestReplicationHandler.doTestReplicateAfterStartupWithNoActivity-seed#[90B644A0B69269D4]) [    ] o.a.s.c.CorePropertiesLocator Found 1 core definitions
   [junit4]   2> 648229 INFO  (coreLoadExecutor-2213-thread-1) [    ] o.a.s.c.SolrResourceLoader new SolrResourceLoader for directory: '/x1/jenkins/jenkins-slave/workspace/Lucene-Solr-Tests-trunk-Java8/solr/build/solr-core/test/J0/temp/solr.handler.TestReplicationHandler_90B644A0B69269D4-001/solr-instance-001/collection1'
   [junit4]   2> 648233 INFO  (TEST-TestReplicationHandler.doTestReplicateAfterStartupWithNoActivity-seed#[90B644A0B69269D4]) [    ] o.a.s.s.SolrDispatchFilter user.dir=/x1/jenkins/jenkins-slave/workspace/Lucene-Solr-Tests-trunk-Java8/solr/build/solr-core/test/J0
   [junit4]   2> 648233 INFO  (coreLoadExecutor-2213-thread-1) [    ] o.a.s.c.SolrResourceLoader JNDI not configured for solr (NoInitialContextEx)
   [junit4]   2> 648233 INFO  (TEST-TestReplicationHandler.doTestReplicateAfterStartupWithNoActivity-seed#[90B644A0B69269D4]) [    ] o.a.s.s.SolrDispatchFilter SolrDispatchFilter.init() done
   [junit4]   2> 648233 INFO  (coreLoadExecutor-2213-thread-1) [    ] o.a.s.c.SolrResourceLoader solr home defaulted to 'solr/' (could not find system property or JNDI)
   [junit4]   2> 648240 INFO  (coreLoadExecutor-2213-thread-1) [    ] o.a.s.c.SolrConfig current version of requestparams : -1
   [junit4]   2> 648242 INFO  (coreLoadExecutor-2213-thread-1) [    ] o.a.s.c.SolrConfig Using Lucene MatchVersion: 6.0.0
   [junit4]   2> 648248 INFO  (coreLoadExecutor-2213-thread-1) [    ] o.a.s.c.SolrConfig Loaded SolrConfig: solrconfig.xml
   [junit4]   2> 648251 INFO  (coreLoadExecutor-2213-thread-1) [    ] o.a.s.s.IndexSchema [collection1] Schema name=test
   [junit4]   2> 648253 INFO  (coreLoadExecutor-2213-thread-1) [    ] o.a.s.s.IndexSchema unique key field: id
   [junit4]   2> 648255 INFO  (coreLoadExecutor-2213-thread-1) [    ] o.a.s.c.ConfigSetProperties Did not find ConfigSet properties, assuming default properties: Can't find resource 'configsetprops.json' in classpath or '/x1/jenkins/jenkins-slave/workspace/Lucene-Solr-Tests-trunk-Java8/solr/build/solr-core/test/J0/temp/solr.handler.TestReplicationHandler_90B644A0B69269D4-001/solr-instance-001/collection1'
   [junit4]   2> 648255 INFO  (coreLoadExecutor-2213-thread-1) [    ] o.a.s.c.CoreContainer Creating SolrCore 'collection1' using configuration from instancedir /x1/jenkins/jenkins-slave/workspace/Lucene-Solr-Tests-trunk-Java8/solr/build/solr-core/test/J0/temp/solr.handler.TestReplicationHandler_90B644A0B69269D4-001/solr-instance-001/./collection1
   [junit4]   2> 648255 INFO  (coreLoadExecutor-2213-thread-1) [    x:collection1] o.a.s.c.SolrCore org.apache.solr.core.MockDirectoryFactory
   [junit4]   2> 648256 INFO  (coreLoadExecutor-2213-thread-1) [    x:collection1] o.a.s.c.SolrCore [[collection1] ] Opening new SolrCore at [/x1/jenkins/jenkins-slave/workspace/Lucene-Solr-Tests-trunk-Java8/solr/build/solr-core/test/J0/temp/solr.handler.TestReplicationHandler_90B644A0B69269D4-001/solr-instance-001/collection1], dataDir=[/x1/jenkins/jenkins-slave/workspace/Lucene-Solr-Tests-trunk-Java8/solr/build/solr-core/test/J0/temp/solr.handler.TestReplicationHandler_90B644A0B69269D4-001/solr-instance-001/./collection1/data/]
   [junit4]   2> 648256 INFO  (coreLoadExecutor-2213-thread-1) [    x:collection1] o.a.s.c.SolrCore JMX monitoring not detected for core: collection1
   [junit4]   2> 648256 INFO  (coreLoadExecutor-2213-thread-1) [    x:collection1] o.a.s.c.CachingDirectoryFactory return new directory for /x1/jenkins/jenkins-slave/workspace/Lucene-Solr-Tests-trunk-Java8/solr/build/solr-core/test/J0/temp/solr.handler.TestReplicationHandler_90B644A0B69269D4-001/solr-instance-001/./collection1/data
   [junit4]   2> 648256 INFO  (coreLoadExecutor-2213-thread-1) [    x:collection1] o.a.s.c.SolrCore New index directory detected: old=null new=/x1/jenkins/jenkins-slave/workspace/Lucene-Solr-Tests-trunk-Java8/solr/build/solr-core/test/J0/temp/solr.handler.TestReplicationHandler_90B644A0B69269D4-001/solr-instance-001/./collection1/data/index/
   [junit4]   2> 648256 WARN  (coreLoadExecutor-2213-thread-1) [    x:collection1] o.a.s.c.SolrCore [collection1] Solr index directory '/x1/jenkins/jenkins-slave/workspace/Lucene-Solr-Tests-trunk-Java8/solr/build/solr-core/test/J0/temp/solr.handler.TestReplicationHandler_90B644A0B69269D4-001/solr-instance-001/./collection1/data/index' doesn't exist. Creating new index...
   [junit4]   2> 648256 INFO  (coreLoadExecutor-2213-thread-1) [    x:collection1] o.a.s.c.CachingDirectoryFactory return new directory for /x1/jenkins/jenkins-slave/workspace/Lucene-Solr-Tests-trunk-Java8/solr/build/solr-core/test/J0/temp/solr.handler.TestReplicationHandler_90B644A0B69269D4-001/solr-instance-001/./collection1/data/index
   [junit4]   2> 648257 INFO  (coreLoadExecutor-2213-thread-1) [    x:collection1] o.a.s.u.RandomMergePolicy RandomMergePolicy wrapping class org.apache.lucene.index.TieredMergePolicy: [TieredMergePolicy: maxMergeAtOnce=32, maxMergeAtOnceExplicit=18, maxMergedSegmentMB=13.1552734375, floorSegmentMB=1.9931640625, forceMergeDeletesPctAllowed=24.50759693976705, segmentsPerTier=12.0, maxCFSSegmentSizeMB=8.796093022207999E12, noCFSRatio=1.0
   [junit4]   2> 648257 INFO  (coreLoadExecutor-2213-thread-1) [    x:collection1] o.a.s.c.SolrDeletionPolicy SolrDeletionPolicy.onCommit: commits: num=1
   [junit4]   2> 	commit{dir=MockDirectoryWrapper(RAMDirectory@11eb0cfd lockFactory=org.apache.lucene.store.SingleInstanceLockFactory@7a2a1b54),segFN=segments_1,generation=1}
   [junit4]   2> 648257 INFO  (coreLoadExecutor-2213-thread-1) [    x:collection1] o.a.s.c.SolrDeletionPolicy newest commit generation = 1
   [junit4]   2> 648259 INFO  (coreLoadExecutor-2213-thread-1) [    x:collection1] o.a.s.c.SolrCore no updateRequestProcessorChain defined as default, creating implicit default
   [junit4]   2> 648259 INFO  (OldIndexDirectoryCleanupThreadForCore-collection1) [    x:collection1] o.a.s.c.SolrCore Looking for old index directories to cleanup for core collection1 in /x1/jenkins/jenkins-slave/workspace/Lucene-Solr-Tests-trunk-Java8/solr/build/solr-core/test/J0/temp/solr.handler.TestReplicationHandler_90B644A0B69269D4-001/solr-instance-001/./collection1/data/
   [junit4]   2> 648261 INFO  (coreLoadExecutor-2213-thread-1) [    x:collection1] o.a.s.h.l.XMLLoader xsltCacheLifetimeSeconds=60
   [junit4]   2> 648261 INFO  (coreLoadExecutor-2213-thread-1) [    x:collection1] o.a.s.h.l.XMLLoader xsltCacheLifetimeSeconds=60
   [junit4]   2> 648262 INFO  (coreLoadExecutor-2213-thread-1) [    x:collection1] o.a.s.h.l.XMLLoader xsltCacheLifetimeSeconds=60
   [junit4]   2> 648263 INFO  (coreLoadExecutor-2213-thread-1) [    x:collection1] o.a.s.h.l.XMLLoader xsltCacheLifetimeSeconds=60
   [junit4]   2> 648264 INFO  (coreLoadExecutor-2213-thread-1) [    x:collection1] o.a.s.c.PluginBag requestHandler : 'lazy' created with startup=lazy 
   [junit4]   2> 648264 INFO  (coreLoadExecutor-2213-thread-1) [    x:collection1] o.a.s.c.RequestHandlers Registered paths: /admin/mbeans,standard,lazy,/update/json/docs,/admin/luke,/export,/get,/admin/properties,/update/json,/admin/threads,/update/csv,/sql,/admin/segments,/admin/system,/replication,defaults,/config,/stream,/schema,/admin/plugins,/admin/logging,/admin/ping,/update,/admin/file
   [junit4]   2> 648264 INFO  (coreLoadExecutor-2213-thread-1) [    x:collection1] o.a.s.c.SolrCore Using default statsCache cache: org.apache.solr.search.stats.LocalStatsCache
   [junit4]   2> 648265 INFO  (coreLoadExecutor-2213-thread-1) [    x:collection1] o.a.s.u.CommitTracker Hard AutoCommit: disabled
   [junit4]   2> 648265 INFO  (coreLoadExecutor-2213-thread-1) [    x:collection1] o.a.s.u.CommitTracker Soft AutoCommit: disabled
   [junit4]   2> 648265 INFO  (coreLoadExecutor-2213-thread-1) [    x:collection1] o.a.s.u.RandomMergePolicy RandomMergePolicy wrapping class org.apache.lucene.index.TieredMergePolicy: [TieredMergePolicy: maxMergeAtOnce=45, maxMergeAtOnceExplicit=44, maxMergedSegmentMB=84.0283203125, floorSegmentMB=0.869140625, forceMergeDeletesPctAllowed=2.7117179061710353, segmentsPerTier=24.0, maxCFSSegmentSizeMB=8.796093022207999E12, noCFSRatio=0.0
   [junit4]   2> 648265 INFO  (coreLoadExecutor-2213-thread-1) [    x:collection1] o.a.s.c.SolrDeletionPolicy SolrDeletionPolicy.onInit: commits: num=1
   [junit4]   2> 	commit{dir=MockDirectoryWrapper(RAMDirectory@11eb0cfd lockFactory=org.apache.lucene.store.SingleInstanceLockFactory@7a2a1b54),segFN=segments_1,generation=1}
   [junit4]   2> 648265 INFO  (coreLoadExecutor-2213-thread-1) [    x:collection1] o.a.s.c.SolrDeletionPolicy newest commit generation = 1
   [junit4]   2> 648265 INFO  (coreLoadExecutor-2213-thread-1) [    x:collection1] o.a.s.s.SolrIndexSearcher Opening [Searcher@f5b107b[collection1] main]
   [junit4]   2> 648265 INFO  (coreLoadExecutor-2213-thread-1) [    x:collection1] o.a.s.r.ManagedResourceStorage File-based storage initialized to use dir: /x1/jenkins/jenkins-slave/workspace/Lucene-Solr-Tests-trunk-Java8/solr/build/solr-core/test/J0/temp/solr.handler.TestReplicationHandler_90B644A0B69269D4-001/solr-instance-001/collection1/conf
   [junit4]   2> 648265 INFO  (coreLoadExecutor-2213-thread-1) [    x:collection1] o.a.s.r.RestManager Initializing RestManager with initArgs: {storageDir=/x1/jenkins/jenkins-slave/workspace/Lucene-Solr-Tests-trunk-Java8/solr/build/solr-core/test/J0/temp/solr.handler.TestReplicationHandler_90B644A0B69269D4-001/solr-instance-001/collection1/conf}
   [junit4]   2> 648266 INFO  (coreLoadExecutor-2213-thread-1) [    x:collection1] o.a.s.r.ManagedResourceStorage Reading _rest_managed.json using file:dir=/x1/jenkins/jenkins-slave/workspace/Lucene-Solr-Tests-trunk-Java8/solr/build/solr-core/test/J0/temp/solr.handler.TestReplicationHandler_90B644A0B69269D4-001/solr-instance-001/collection1/conf
   [junit4]   2> 648266 INFO  (coreLoadExecutor-2213-thread-1) [    x:collection1] o.a.s.r.RestManager Initializing 0 registered ManagedResources
   [junit4]   2> 648266 INFO  (coreLoadExecutor-2213-thread-1) [    x:collection1] o.a.s.h.ReplicationHandler Replication enabled for following config files: schema.xml,xslt/dummy.xsl
   [junit4]   2> 648266 INFO  (coreLoadExecutor-2213-thread-1) [    x:collection1] o.a.s.h.ReplicationHandler Commits will be reserved for  10000
   [junit4]   2> 648266 INFO  (searcherExecutor-2214-thread-1-processing-x:collection1) [    x:collection1] o.a.s.c.SolrCore [collection1] Registered new searcher Searcher@f5b107b[collection1] main{ExitableDirectoryReader(UninvertingDirectoryReader())}
   [junit4]   2> 648266 INFO  (coreLoadExecutor-2213-thread-1) [    x:collection1] o.a.s.c.CoreContainer registering core: collection1
   [junit4]   2> 648734 INFO  (TEST-TestReplicationHandler.doTestReplicateAfterStartupWithNoActivity-seed#[90B644A0B69269D4]) [    ] o.a.s.SolrTestCaseJ4 Writing core.properties file to /x1/jenkins/jenkins-slave/workspace/Lucene-Solr-Tests-trunk-Java8/solr/build/solr-core/test/J0/temp/solr.handler.TestReplicationHandler_90B644A0B69269D4-001/solr-instance-002/collection1
   [junit4]   2> 648738 INFO  (TEST-TestReplicationHandler.doTestReplicateAfterStartupWithNoActivity-seed#[90B644A0B69269D4]) [    ] o.e.j.s.Server jetty-9.3.6.v20151106
   [junit4]   2> 648739 INFO  (TEST-TestReplicationHandler.doTestReplicateAfterStartupWithNoActivity-seed#[90B644A0B69269D4]) [    ] o.e.j.s.h.ContextHandler Started o.e.j.s.ServletContextHandler@76dffba{/solr,null,AVAILABLE}
   [junit4]   2> 648741 INFO  (TEST-TestReplicationHandler.doTestReplicateAfterStartupWithNoActivity-seed#[90B644A0B69269D4]) [    ] o.e.j.s.ServerConnector Started ServerConnector@62ab7462{HTTP/1.1,[http/1.1]}{127.0.0.1:57040}
   [junit4]   2> 648742 INFO  (TEST-TestReplicationHandler.doTestReplicateAfterStartupWithNoActivity-seed#[90B644A0B69269D4]) [    ] o.e.j.s.Server Started @652002ms
   [junit4]   2> 648742 INFO  (TEST-TestReplicationHandler.doTestReplicateAfterStartupWithNoActivity-seed#[90B644A0B69269D4]) [    ] o.a.s.c.s.e.JettySolrRunner Jetty properties: {solr.data.dir=/x1/jenkins/jenkins-slave/workspace/Lucene-Solr-Tests-trunk-Java8/solr/build/solr-core/test/J0/temp/solr.handler.TestReplicationHandler_90B644A0B69269D4-001/solr-instance-002/collection1/data, hostContext=/solr, hostPort=57040}
   [junit4]   2> 648742 INFO  (TEST-TestReplicationHandler.doTestReplicateAfterStartupWithNoActivity-seed#[90B644A0B69269D4]) [    ] o.a.s.s.SolrDispatchFilter SolrDispatchFilter.init(): sun.misc.Launcher$AppClassLoader@4e0e2f2a
   [junit4]   2> 648742 INFO  (TEST-TestReplicationHandler.doTestReplicateAfterStartupWithNoActivity-seed#[90B644A0B69269D4]) [    ] o.a.s.c.SolrResourceLoader new SolrResourceLoader for directory: '/x1/jenkins/jenkins-slave/workspace/Lucene-Solr-Tests-trunk-Java8/solr/build/solr-core/test/J0/temp/solr.handler.TestReplicationHandler_90B644A0B69269D4-001/solr-instance-002'
   [junit4]   2> 648742 INFO  (TEST-TestReplicationHandler.doTestReplicateAfterStartupWithNoActivity-seed#[90B644A0B69269D4]) [    ] o.a.s.c.SolrResourceLoader JNDI not configured for solr (NoInitialContextEx)
   [junit4]   2> 648742 INFO  (TEST-TestReplicationHandler.doTestReplicateAfterStartupWithNoActivity-seed#[90B644A0B69269D4]) [    ] o.a.s.c.SolrResourceLoader solr home defaulted to 'solr/' (could not find system property or JNDI)
   [junit4]   2> 648743 INFO  (TEST-TestReplicationHandler.doTestReplicateAfterStartupWithNoActivity-seed#[90B644A0B69269D4]) [    ] o.a.s.c.SolrXmlConfig Loading container configuration from /x1/jenkins/jenkins-slave/workspace/Lucene-Solr-Tests-trunk-Java8/solr/build/solr-core/test/J0/temp/solr.handler.TestReplicationHandler_90B644A0B69269D4-001/solr-instance-002/solr.xml
   [junit4]   2> 648747 INFO  (TEST-TestReplicationHandler.doTestReplicateAfterStartupWithNoActivity-seed#[90B644A0B69269D4]) [    ] o.a.s.c.CorePropertiesLocator Config-defined core root directory: /x1/jenkins/jenkins-slave/workspace/Lucene-Solr-Tests-trunk-Java8/solr/build/solr-core/test/J0/temp/solr.handler.TestReplicationHandler_90B644A0B69269D4-001/solr-instance-002/.
   [junit4]   2> 648747 INFO  (TEST-TestReplicationHandler.doTestReplicateAfterStartupWithNoActivity-seed#[90B644A0B69269D4]) [    ] o.a.s.c.CoreContainer New CoreContainer 862835054
   [junit4]   2> 648748 INFO  (TEST-TestReplicationHandler.doTestReplicateAfterStartupWithNoActivity-seed#[90B644A0B69269D4]) [    ] o.a.s.c.CoreContainer Loading cores into CoreContainer [instanceDir=/x1/jenkins/jenkins-slave/workspace/Lucene-Solr-Tests-trunk-Java8/solr/build/solr-core/test/J0/temp/solr.handler.TestReplicationHandler_90B644A0B69269D4-001/solr-instance-002]
   [junit4]   2> 648748 WARN  (TEST-TestReplicationHandler.doTestReplicateAfterStartupWithNoActivity-seed#[90B644A0B69269D4]) [    ] o.a.s.c.CoreContainer Couldn't add files from /x1/jenkins/jenkins-slave/workspace/Lucene-Solr-Tests-trunk-Java8/solr/build/solr-core/test/J0/temp/solr.handler.TestReplicationHandler_90B644A0B69269D4-001/solr-instance-002/lib to classpath: /x1/jenkins/jenkins-slave/workspace/Lucene-Solr-Tests-trunk-Java8/solr/build/solr-core/test/J0/temp/solr.handler.TestReplicationHandler_90B644A0B69269D4-001/solr-instance-002/lib
   [junit4]   2> 648748 INFO  (TEST-TestReplicationHandler.doTestReplicateAfterStartupWithNoActivity-seed#[90B644A0B69269D4]) [    ] o.a.s.h.c.HttpShardHandlerFactory created with socketTimeout : 90000,urlScheme : ,connTimeout : 15000,maxConnectionsPerHost : 20,maxConnections : 10000,corePoolSize : 0,maximumPoolSize : 2147483647,maxThreadIdleTime : 5,sizeOfQueue : -1,fairnessPolicy : false,useRetries : false,
   [junit4]   2> 648749 INFO  (TEST-TestReplicationHandler.doTestReplicateAfterStartupWithNoActivity-seed#[90B644A0B69269D4]) [    ] o.a.s.u.UpdateShardHandler Creating UpdateShardHandler HTTP client with params: socketTimeout=340000&connTimeout=45000&retry=true
   [junit4]   2> 648750 INFO  (TEST-TestReplicationHandler.doTestReplicateAfterStartupWithNoActivity-seed#[90B644A0B69269D4]) [    ] o.a.s.l.LogWatcher SLF4J impl is org.slf4j.impl.Log4jLoggerFactory
   [junit4]   2> 648750 INFO  (TEST-TestReplicationHandler.doTestReplicateAfterStartupWithNoActivity-seed#[90B644A0B69269D4]) [    ] o.a.s.l.LogWatcher Registering Log Listener [Log4j (org.slf4j.impl.Log4jLoggerFactory)]
   [junit4]   2> 648750 INFO  (TEST-TestReplicationHandler.doTestReplicateAfterStartupWithNoActivity-seed#[90B644A0B69269D4]) [    ] o.a.s.c.CoreContainer Security conf doesn't exist. Skipping setup for authorization module.
   [junit4]   2> 648750 INFO  (TEST-TestReplicationHandler.doTestReplicateAfterStartupWithNoActivity-seed#[90B644A0B69269D4]) [    ] o.a.s.c.CoreContainer No authentication plugin used.
   [junit4]   2> 648751 INFO  (TEST-TestReplicationHandler.doTestReplicateAfterStartupWithNoActivity-seed#[90B644A0B69269D4]) [    ] o.a.s.c.CorePropertiesLocator Looking for core definitions underneath /x1/jenkins/jenkins-slave/workspace/Lucene-Solr-Tests-trunk-Java8/solr/build/solr-core/test/J0/temp/solr.handler.TestReplicationHandler_90B644A0B69269D4-001/solr-instance-002/.
   [junit4]   2> 648753 INFO  (TEST-TestReplicationHandler.doTestReplicateAfterStartupWithNoActivity-seed#[90B644A0B69269D4]) [    ] o.a.s.c.CoreDescriptor Created CoreDescriptor: {name=collection1, config=solrconfig.xml, loadOnStartup=true, schema=schema.xml, configSetProperties=configsetprops.json, transient=false, dataDir=data/}
   [junit4]   2> 648753 INFO  (TEST-TestReplicationHandler.doTestReplicateAfterStartupWithNoActivity-seed#[90B644A0B69269D4]) [    ] o.a.s.c.CorePropertiesLocator Found core collection1 in /x1/jenkins/jenkins-slave/workspace/Lucene-Solr-Tests-trunk-Java8/solr/build/solr-core/test/J0/temp/solr.handler.TestReplicationHandler_90B644A0B69269D4-001/solr-instance-002/./collection1
   [junit4]   2> 648753 INFO  (TEST-TestReplicationHandler.doTestReplicateAfterStartupWithNoActivity-seed#[90B644A0B69269D4]) [    ] o.a.s.c.CorePropertiesLocator Found 1 core definitions
   [junit4]   2> 648754 INFO  (coreLoadExecutor-2223-thread-1) [    ] o.a.s.c.SolrResourceLoader new SolrResourceLoader for directory: '/x1/jenkins/jenkins-slave/workspace/Lucene-Solr-Tests-trunk-Java8/solr/build/solr-core/test/J0/temp/solr.handler.TestReplicationHandler_90B644A0B69269D4-001/solr-instance-002/collection1'
   [junit4]   2> 648754 INFO  (TEST-TestReplicationHandler.doTestReplicateAfterStartupWithNoActivity-seed#[90B644A0B69269D4]) [    ] o.a.s.s.SolrDispatchFilter user.dir=/x1/jenkins/jenkins-slave/workspace/Lucene-Solr-Tests-trunk-Java8/solr/build/solr-core/test/J0
   [junit4]   2> 648756 INFO  (TEST-TestReplicationHandler.doTestReplicateAfterStartupWithNoActivity-seed#[90B644A0B69269D4]) [    ] o.a.s.s.SolrDispatchFilter SolrDispatchFilter.init() done
   [junit4]   2> 648756 INFO  (coreLoadExecutor-2223-thread-1) [    ] o.a.s.c.SolrResourceLoader JNDI not configured for solr (NoInitialContextEx)
   [junit4]   2> 648756 INFO  (coreLoadExecutor-2223-thread-1) [    ] o.a.s.c.SolrResourceLoader solr home defaulted to 'solr/' (could not find system property or JNDI)
   [junit4]   2> 648761 INFO  (coreLoadExecutor-2223-thread-1) [    ] o.a.s.c.SolrConfig current version of requestparams : -1
   [junit4]   2> 648765 INFO  (coreLoadExecutor-2223-thread-1) [    ] o.a.s.c.SolrConfig Using Lucene MatchVersion: 6.0.0
   [junit4]   2> 648782 INFO  (coreLoadExecutor-2223-thread-1) [    ] o.a.s.c.SolrConfig Loaded SolrConfig: solrconfig.xml
   [junit4]   2> 648784 INFO  (coreLoadExecutor-2223-thread-1) [    ] o.a.s.s.IndexSchema [collection1] Schema name=test
   [junit4]   2> 648786 INFO  (coreLoadExecutor-2223-thread-1) [    ] o.a.s.s.IndexSchema unique key field: id
   [junit4]   2> 648787 INFO  (coreLoadExecutor-2223-thread-1) [    ] o.a.s.c.ConfigSetProperties Did not find ConfigSet properties, assuming default properties: Can't find resource 'configsetprops.json' in classpath or '/x1/jenkins/jenkins-slave/workspace/Lucene-Solr-Tests-trunk-Java8/solr/build/solr-core/test/J0/temp/solr.handler.TestReplicationHandler_90B644A0B69269D4-001/solr-instance-002/collection1'
   [junit4]   2> 648787 INFO  (coreLoadExecutor-2223-thread-1) [    ] o.a.s.c.CoreContainer Creating SolrCore 'collection1' using configuration from instancedir /x1/jenkins/jenkins-slave/workspace/Lucene-Solr-Tests-trunk-Java8/solr/build/solr-core/test/J0/temp/solr.handler.TestReplicationHandler_90B644A0B69269D4-001/solr-instance-002/./collection1
   [junit4]   2> 648788 INFO  (coreLoadExecutor-2223-thread-1) [    x:collection1] o.a.s.c.SolrCore org.apache.solr.core.MockDirectoryFactory
   [junit4]   2> 648788 INFO  (coreLoadExecutor-2223-thread-1) [    x:collection1] o.a.s.c.SolrCore [[collection1] ] Opening new SolrCore at [/x1/jenkins/jenkins-slave/workspace/Lucene-Solr-Tests-trunk-Java8/solr/build/solr-core/test/J0/temp/solr.handler.TestReplicationHandler_90B644A0B69269D4-001/solr-instance-002/collection1], dataDir=[/x1/jenkins/jenkins-slave/workspace/Lucene-Solr-Tests-trunk-Java8/solr/build/solr-core/test/J0/temp/solr.handler.TestReplicationHandler_90B644A0B69269D4-001/solr-instance-002/./collection1/data/]
   [junit4]   2> 648788 INFO  (coreLoadExecutor-2223-thread-1) [    x:collection1] o.a.s.c.SolrCore JMX monitoring not detected for core: collection1
   [junit4]   2> 648788 INFO  (coreLoadExecutor-2223-thread-1) [    x:collection1] o.a.s.c.CachingDirectoryFactory return new directory for /x1/jenkins/jenkins-slave/workspace/Lucene-Solr-Tests-trunk-Java8/solr/build/solr-core/test/J0/temp/solr.handler.TestReplicationHandler_90B644A0B69269D4-001/solr-instance-002/./collection1/data
   [junit4]   2> 648788 INFO  (coreLoadExecutor-2223-thread-1) [    x:collection1] o.a.s.c.SolrCore New index directory detected: old=null new=/x1/jenkins/jenkins-slave/workspace/Lucene-Solr-Tests-trunk-Java8/solr/build/solr-core/test/J0/temp/solr.handler.TestReplicationHandler_90B644A0B69269D4-001/solr-instance-002/./collection1/data/index/
   [junit4]   2> 648788 WARN  (coreLoadExecutor-2223-thread-1) [    x:collection1] o.a.s.c.SolrCore [collection1] Solr index directory '/x1/jenkins/jenkins-slave/workspace/Lucene-Solr-Tests-trunk-Java8/solr/build/solr-core/test/J0/temp/solr.handler.TestReplicationHandler_90B644A0B69269D4-001/solr-instance-002/./collection1/data/index' doesn't exist. Creating new index...
   [junit4]   2> 648789 INFO  (coreLoadExecutor-2223-thread-1) [    x:collection1] o.a.s.c.CachingDirectoryFactory return new directory for /x1/jenkins/jenkins-slave/workspace/Lucene-Solr-Tests-trunk-Java8/solr/build/solr-core/test/J0/temp/solr.handler.TestReplicationHandler_90B644A0B69269D4-001/solr-instance-002/./collection1/data/index
   [junit4]   2> 648789 INFO  (coreLoadExecutor-2223-thread-1) [    x:collection1] o.a.s.u.RandomMergePolicy RandomMergePolicy wrapping class org.apache.lucene.index.TieredMergePolicy: [TieredMergePolicy: maxMergeAtOnce=32, maxMergeAtOnceExplicit=18, maxMergedSegmentMB=13.1552734375, floorSegmentMB=1.9931640625, forceMergeDeletesPctAllowed=24.50759693976705, segmentsPerTier=12.0, maxCFSSegmentSizeMB=8.796093022207999E12, noCFSRatio=1.0
   [junit4]   2> 648789 INFO  (coreLoadExecutor-2223-thread-1) [    x:collection1] o.a.s.c.SolrDeletionPolicy SolrDeletionPolicy.onCommit: commits: num=1
   [junit4]   2> 	commit{dir=MockDirectoryWrapper(RAMDirectory@58b223e2 lockFactory=org.apache.lucene.store.SingleInstanceLockFactory@6c7a5759),segFN=segments_1,generation=1}
   [junit4]   2> 648789 INFO  (coreLoadExecutor-2223-thread-1) [    x:collection1] o.a.s.c.SolrDeletionPolicy newest commit generation = 1
   [junit4]   2> 648790 INFO  (OldIndexDirectoryCleanupThreadForCore-collection1) [    x:collection1] o.a.s.c.SolrCore Looking for old index directories to cleanup for core collection1 in /x1/jenkins/jenkins-slave/workspace/Lucene-Solr-Tests-trunk-Java8/solr/build/solr-core/test/J0/temp/solr.handler.TestReplicationHandler_90B644A0B69269D4-001/solr-instance-002/./collection1/data/
   [junit4]   2> 648791 INFO  (coreLoadExecutor-2223-thread-1) [    x:collection1] o.a.s.c.SolrCore no updateRequestProcessorChain defined as default, creating implicit default
   [junit4]   2> 648792 INFO  (coreLoadExecutor-2223-thread-1) [    x:collection1] o.a.s.h.l.XMLLoader xsltCacheLifetimeSeconds=60
   [junit4]   2> 648793 INFO  (coreLoadExecutor-2223-thread-1) [    x:collection1] o.a.s.h.l.XMLLoader xsltCacheLifetimeSeconds=60
   [junit4]   2> 648794 INFO  (coreLoadExecutor-2223-thread-1) [    x:collection1] o.a.s.h.l.XMLLoader xsltCacheLifetimeSeconds=60
   [junit4]   2> 648794 INFO  (coreLoadExecutor-2223-thread-1) [    x:collection1] o.a.s.h.l.XMLLoader xsltCacheLifetimeSeconds=60
   [junit4]   2> 648795 INFO  (coreLoadExecutor-2223-thread-1) [    x:collection1] o.a.s.c.PluginBag requestHandler : 'lazy' created with startup=lazy 
   [junit4]   2> 648796 INFO  (coreLoadExecutor-2223-thread-1) [    x:collection1] o.a.s.c.RequestHandlers Registered paths: /admin/mbeans,standard,lazy,/update/json/docs,/admin/luke,/export,/get,/admin/properties,/update/json,/admin/threads,/update/csv,/sql,/admin/segments,/admin/system,/replication,defaults,/config,/stream,/schema,/admin/plugins,/admin/logging,/admin/ping,/update,/admin/file
   [junit4]   2> 648796 INFO  (coreLoadExecutor-2223-thread-1) [    x:collection1] o.a.s.c.SolrCore Using default statsCache cache: org.apache.solr.search.stats.LocalStatsCache
   [junit4]   2> 648796 INFO  (coreLoadExecutor-2223-thread-1) [    x:collection1] o.a.s.u.CommitTracker Hard AutoCommit: disabled
   [junit4]   2> 648796 INFO  (coreLoadExecutor-2223-thread-1) [    x:collection1] o.a.s.u.CommitTracker Soft AutoCommit: disabled
   [junit4]   2> 648796 INFO  (coreLoadExecutor-2223-thread-1) [    x:collection1] o.a.s.u.RandomMergePolicy RandomMergePolicy wrapping class org.apache.lucene.index.TieredMergePolicy: [TieredMergePolicy: maxMergeAtOnce=45, maxMergeAtOnceExplicit=44, maxMergedSegmentMB=84.0283203125, floorSegmentMB=0.869140625, forceMergeDeletesPctAllowed=2.7117179061710353, segmentsPerTier=24.0, maxCFSSegmentSizeMB=8.796093022207999E12, noCFSRatio=0.0
   [junit4]   2> 648797 INFO  (coreLoadExecutor-2223-thread-1) [    x:collection1] o.a.s.c.SolrDeletionPolicy SolrDeletionPolicy.onInit: commits: num=1
   [junit4]   2> 	commit{dir=MockDirectoryWrapper(RAMDirectory@58b223e2 lockFactory=org.apache.lucene.store.SingleInstanceLockFactory@6c7a5759),segFN=segments_1,generation=1}
   [junit4]   2> 648797 INFO  (coreLoadExecutor-2223-thread-1) [    x:collection1] o.a.s.c.SolrDeletionPolicy newest commit generation = 1
   [junit4]   2> 648797 INFO  (coreLoadExecutor-2223-thread-1) [    x:collection1] o.a.s.s.SolrIndexSearcher Opening [Searcher@53a42564[collection1] main]
   [junit4]   2> 648797 INFO  (coreLoadExecutor-2223-thread-1) [    x:collection1] o.a.s.r.ManagedResourceStorage File-based storage initialized to use dir: /x1/jenkins/jenkins-slave/workspace/Lucene-Solr-Tests-trunk-Java8/solr/build/solr-core/test/J0/temp/solr.handler.TestReplicationHandler_90B644A0B69269D4-001/solr-instance-002/collection1/conf
   [junit4]   2> 648797 INFO  (coreLoadExecutor-2223-thread-1) [    x:collection1] o.a.s.r.RestManager Initializing RestManager with initArgs: {storageDir=/x1/jenkins/jenkins-slave/workspace/Lucene-Solr-Tests-trunk-Java8/solr/build/solr-core/test/J0/temp/solr.handler.TestReplicationHandler_90B644A0B69269D4-001/solr-instance-002/collection1/conf}
   [junit4]   2> 648797 INFO  (coreLoadExecutor-2223-thread-1) [    x:collection1] o.a.s.r.ManagedResourceStorage Reading _rest_managed.json using file:dir=/x1/jenkins/jenkins-slave/workspace/Lucene-Solr-Tests-trunk-Java8/solr/build/solr-core/test/J0/temp/solr.handler.TestReplicationHandler_90B644A0B69269D4-001/solr-instance-002/collection1/conf
   [junit4]   2> 648797 INFO  (coreLoadExecutor-2223-thread-1) [    x:collection1] o.a.s.r.RestManager Initializing 0 registered ManagedResources
   [junit4]   2> 648799 INFO  (coreLoadExecutor-2223-thread-1) [    x:collection1] o.a.s.h.ReplicationHandler Poll scheduled at an interval of 1000ms
   [junit4]   2> 648799 INFO  (searcherExecutor-2224-thread-1-processing-x:collection1) [    x:collection1] o.a.s.c.SolrCore [collection1] Registered new searcher Searcher@53a42564[collection1] main{ExitableDirectoryReader(UninvertingDirectoryReader())}
   [junit4]   2> 648800 INFO  (coreLoadExecutor-2223-thread-1) [    x:collection1] o.a.s.c.CoreContainer registering core: collection1
   [junit4]   2> 648802 INFO  (qtp728076039-5408) [    x:collection1] o.a.s.c.S.Request [collection1]  webapp=/solr path=/replication params={qt=/replication&wt=javabin&version=2&command=indexversion} status=0 QTime=0
   [junit4]   2> 649258 INFO  (TEST-TestReplicationHandler.doTestReplicateAfterStartupWithNoActivity-seed#[90B644A0B69269D4]) [    ] o.e.j.s.ServerConnector Stopped ServerConnector@62ab7462{HTTP/1.1,[http/1.1]}{127.0.0.1:0}
   [junit4]   2> 649258 INFO  (TEST-TestReplicationHandler.doTestReplicateAfterStartupWithNoActivity-seed#[90B644A0B69269D4]) [    ] o.a.s.c.CoreContainer Shutting down CoreContainer instance=862835054
   [junit4]   2> 649259 INFO  (coreCloseExecutor-2229-thread-1) [    x:collection1] o.a.s.c.SolrCore [collection1]  CLOSING SolrCore org.apache.solr.core.SolrCore@734a2951
   [junit4]   2> 649260 INFO  (coreCloseExecutor-2229-thread-1) [    x:collection1] o.a.s.u.DirectUpdateHandler2 closing DirectUpdateHandler2{commits=0,autocommits=0,soft autocommits=0,optimizes=0,rollbacks=0,expungeDeletes=0,docsPending=0,adds=0,deletesById=0,deletesByQuery=0,errors=0,cumulative_adds=0,cumulative_deletesById=0,cumulative_deletesByQuery=0,cumulative_errors=0}
   [junit4]   2> 649260 INFO  (coreCloseExecutor-2229-thread-1) [    x:collection1] o.a.s.u.SolrCoreState Closing SolrCoreState
   [junit4]   2> 649260 INFO  (coreCloseExecutor-2229-thread-1) [    x:collection1] o.a.s.u.DefaultSolrCoreState SolrCoreState ref count has reached 0 - closing IndexWriter
   [junit4]   2> 649260 INFO  (coreCloseExecutor-2229-thread-1) [    x:collection1] o.a.s.u.DefaultSolrCoreState closing IndexWriter with IndexWriterCloser
   [junit4]   2> 649260 INFO  (coreCloseExecutor-2229-thread-1) [    x:collection1] o.a.s.c.SolrCore [collection1] Closing main searcher on request.
   [junit4]   2> 649260 INFO  (coreCloseExecutor-2229-thread-1) [    x:collection1] o.a.s.c.CachingDirectoryFactory Closing MockDirectoryFactory - 2 directories currently being tracked
   [junit4]   2> 649260 INFO  (coreCloseExecutor-2229-thread-1) [    x:collection1] o.a.s.c.CachingDirectoryFactory looking to close /x1/jenkins/jenkins-slave/workspace/Lucene-Solr-Tests-trunk-Java8/solr/build/solr-core/test/J0/temp/solr.handler.TestReplicationHandler_90B644A0B69269D4-001/solr-instance-002/./collection1/data/index [CachedDir<<refCount=0;path=/x1/jenkins/jenkins-slave/workspace/Lucene-Solr-Tests-trunk-Java8/solr/build/solr-core/test/J0/temp/solr.handler.TestReplicationHandler_90B644A0B69269D4-001/solr-instance-002/./collection1/data/index;done=false>>]
   [junit4]   2> 649260 INFO  (coreCloseExecutor-2229-thread-1) [    x:collection1] o.a.s.c.CachingDirectoryFactory Closing directory: /x1/jenkins/jenkins-slave/workspace/Lucene-Solr-Tests-trunk-Java8/solr/build/solr-core/test/J0/temp/solr.handler.TestReplicationHandler_90B644A0B69269D4-001/solr-instance-002/./collection1/data/index
   [junit4]   2> 649260 INFO  (coreCloseExecutor-2229-thread-1) [    x:collection1] o.a.s.c.CachingDirectoryFactory looking to close /x1/jenkins/jenkins-slave/workspace/Lucene-Solr-Tests-trunk-Java8/solr/build/solr-core/test/J0/temp/solr.handler.TestReplicationHandler_90B644A0B69269D4-001/solr-instance-002/./collection1/data [CachedDir<<refCount=0;path=/x1/jenkins/jenkins-slave/workspace/Lucene-Solr-Tests-trunk-Java8/solr/build/solr-core/test/J0/temp/solr.handler.TestReplicationHandler_90B644A0B69269D4-001/solr-instance-002/./collection1/data;done=false>>]
   [junit4]   2> 649261 INFO  (coreCloseExecutor-2229-thread-1) [    x:collection1] o.a.s.c.CachingDirectoryFactory Closing directory: /x1/jenkins/jenkins-slave/workspace/Lucene-Solr-Tests-trunk-Java8/solr/build/solr-core/test/J0/temp/solr.handler.TestReplicationHandler_90B644A0B69269D4-001/solr-instance-002/./collection1/data
   [junit4]   2> 649262 INFO  (TEST-TestReplicationHandler.doTestReplicateAfterStartupWithNoActivity-seed#[90B644A0B69269D4]) [    ] o.e.j.s.h.ContextHandler Stopped o.e.j.s.ServletContextHandler@76dffba{/solr,null,UNAVAILABLE}
   [junit4]   2> 649264 INFO  (qtp728076039-5410) [    x:collection1] o.a.s.u.DirectUpdateHandler2 [collection1] REMOVING ALL DOCUMENTS FROM INDEX
   [junit4]   2> 649264 INFO  (qtp728076039-5410) [    x:collection1] o.a.s.u.p.LogUpdateProcessorFactory [collection1]  webapp=/solr path=/update params={wt=javabin&version=2}{deleteByQuery=*:*} 0 0
   [junit4]   2> 649266 INFO  (qtp728076039-5411) [    x:collection1] o.a.s.u.DirectUpdateHandler2 start commit{,optimize=false,openSearcher=true,waitSearcher=true,expungeDeletes=false,softCommit=false,prepareCommit=false}
   [junit4]   2> 649266 INFO  (qtp728076039-5411) [    x:collection1] o.a.s.c.SolrDeletionPolicy SolrDeletionPolicy.onCommit: commits: num=2
   [junit4]   2> 	commit{dir=MockDirectoryWrapper(RAMDirectory@11eb0cfd lockFactory=org.apache.lucene.store.SingleInstanceLockFactory@7a2a1b54),segFN=segments_1,generation=1}
   [junit4]   2> 	commit{dir=MockDirectoryWrapper(RAMDirectory@11eb0cfd lockFactory=org.apache.lucene.store.SingleInstanceLockFactory@7a2a1b54),segFN=segments_2,generation=2}
   [junit4]   2> 649267 INFO  (qtp728076039-5411) [    x:collection1] o.a.s.c.SolrDeletionPolicy newest commit generation = 2
   [junit4]   2> 649267 INFO  (qtp728076039-5411) [    x:collection1] o.a.s.s.SolrIndexSearcher Opening [Searcher@242c6d4d[collection1] main]
   [junit4]   2> 649267 INFO  (qtp728076039-5411) [    x:collection1] o.a.s.u.DirectUpdateHandler2 end_commit_flush
   [junit4]   2> 649267 INFO  (searcherExecutor-2214-thread-1-processing-x:collection1) [    x:collection1] o.a.s.c.SolrCore [collection1] Registered new searcher Searcher@242c6d4d[collection1] main{ExitableDirectoryReader(UninvertingDirectoryReader())}
   [junit4]   2> 649267 INFO  (qtp728076039-5411) [    x:collection1] o.a.s.u.p.LogUpdateProcessorFactory [collection1]  webapp=/solr path=/update params={waitSearcher=true&commit=true&softCommit=false&wt=javabin&version=2}{commit=} 0 1
   [junit4]   2> 649269 INFO  (TEST-TestReplicationHandler.doTestReplicateAfterStartupWithNoActivity-seed#[90B644A0B69269D4]) [    ] o.e.j.s.ServerConnector Stopped ServerConnector@476b71d7{HTTP/1.1,[http/1.1]}{127.0.0.1:0}
   [junit4]   2> 649269 INFO  (TEST-TestReplicationHandler.doTestReplicateAfterStartupWithNoActivity-seed#[90B644A0B69269D4]) [    ] o.a.s.c.CoreContainer Shutting down CoreContainer instance=1071589697
   [junit4]   2> 649270 INFO  (coreCloseExecutor-2230-thread-1) [    x:collection1] o.a.s.c.SolrCore [collection1]  CLOSING SolrCore org.apache.solr.core.SolrCore@68b76a41
   [junit4]   2> 649270 INFO  (coreCloseExecutor-2230-thread-1) [    x:collection1] o.a.s.u.DirectUpdateHandler2 closing DirectUpdateHandler2{commits=1,autocommits=0,soft autocommits=0,optimizes=0,rollbacks=0,expungeDeletes=0,docsPending=0,adds=0,deletesById=0,deletesByQuery=0,errors=0,cumulative_adds=0,cumulative_deletesById=0,cumulative_deletesByQuery=1,cumulative_errors=0}
   [junit4]   2> 649271 INFO  (coreCloseExecutor-2230-thread-1) [    x:collection1] o.a.s.u.SolrCoreState Closing SolrCoreState
   [junit4]   2> 649271 INFO  (coreCloseExecutor-2230-thread-1) [    x:collection1] o.a.s.u.DefaultSolrCoreState SolrCoreState ref count has reached 0 - closing IndexWriter
   [junit4]   2> 649271 INFO  (coreCloseExecutor-2230-thread-1) [    x:collection1] o.a.s.u.DefaultSolrCoreState closing IndexWriter with IndexWriterCloser
   [junit4]   2> 649271 INFO  (coreCloseExecutor-2230-thread-1) [    x:collection1] o.a.s.c.SolrCore [collection1] Closing main searcher on request.
   [junit4]   2> 649271 INFO  (coreCloseExecutor-2230-thread-1) [    x:collection1] o.a.s.c.CachingDirectoryFactory Closing MockDirectoryFactory - 2 directories currently being tracked
   [junit4]   2> 649271 INFO  (coreCloseExecutor-2230-thread-1) [    x:collection1] o.a.s.c.CachingDirectoryFactory looking to close /x1/jenkins/jenkins-slave/workspace/Lucene-Solr-Tests-trunk-Java8/solr/build/solr-core/test/J0/temp/solr.handler.TestReplicationHandler_90B644A0B69269D4-001/solr-instance-001/./collection1/data/index [CachedDir<<refCount=0;path=/x1/jenkins/jenkins-slave/workspace/Lucene-Solr-Tests-trunk-Java8/solr/build/solr-core/test/J0/temp/solr.handler.TestReplicationHandler_90B644A0B69269D4-001/solr-instance-001/./collection1/data/index;done=false>>]
   [junit4]   2> 649271 INFO  (coreCloseExecutor-2230-thread-1) [    x:collection1] o.a.s.c.CachingDirectoryFactory Closing directory: /x1/jenkins/jenkins-slave/workspace/Lucene-Solr-Tests-trunk-Java8/solr/build/solr-core/test/J0/temp/solr.handler.TestReplicationHandler_90B644A0B69269D4-001/solr-instance-001/./collection1/data/index
   [junit4]   2> 649271 INFO  (coreCloseExecutor-2230-thread-1) [    x:collection1] o.a.s.c.CachingDirectoryFactory looking to close /x1/jenkins/jenkins-slave/workspace/Lucene-Solr-Tests-trunk-Java8/solr/build/solr-core/test/J0/temp/solr.handler.TestReplicationHandler_90B644A0B69269D4-001/solr-instance-001/./collection1/data [CachedDir<<refCount=0;path=/x1/jenkins/jenkins-slave/workspace/Lucene-Solr-Tests-trunk-Java8/solr/build/solr-core/test/J0/temp/solr.handler.TestReplicationHandler_90B644A0B69269D4-001/solr-instance-001/./collection1/data;done=false>>]
   [junit4]   2> 649271 INFO  (coreCloseExecutor-2230-thread-1) [    x:collection1] o.a.s.c.CachingDirectoryFactory Closing directory: /x1/jenkins/jenkins-slave/workspace/Lucene-Solr-Tests-trunk-Java8/solr/build/solr-core/test/J0/temp/solr.handler.TestReplicationHandler_90B644A0B69269D4-001/solr-instance-001/./collection1/data
   [junit4]   2> 649273 INFO  (TEST-TestReplicationHandler.doTestReplicateAfterStartupWithNoActivity-seed#[90B644A0B69269D4]) [    ] o.e.j.s.h.ContextHandler Stopped o.e.j.s.ServletContextHandler@6b402862{/solr,null,UNAVAILABLE}
   [junit4]   2> 649274 INFO  (TEST-TestReplicationHandler.doTestReplicateAfterStartupWithNoActivity-seed#[90B644A0B69269D4]) [    ] o.e.j.s.Server jetty-9.3.6.v20151106
   [junit4]   2> 649276 INFO  (TEST-TestReplicationHandler.doTestReplicateAfterStartupWithNoActivity-seed#[90B644A0B69269D4]) [    ] o.e.j.s.h.ContextHandler Started o.e.j.s.ServletContextHandler@d26a882{/solr,null,AVAILABLE}
   [junit4]   2> 649276 INFO  (TEST-TestReplicationHandler.doTestReplicateAfterStartupWithNoActivity-seed#[90B644A0B69269D4]) [    ] o.e.j.s.ServerConnector Started ServerConnector@247b23{HTTP/1.1,[http/1.1]}{127.0.0.1:38092}
   [junit4]   2> 649276 INFO  (TEST-TestReplicationHandler.doTestReplicateAfterStartupWithNoActivity-seed#[90B644A0B69269D4]) [    ] o.e.j.s.Server Started @652537ms
   [junit4]   2> 649277 INFO  (TEST-TestReplicationHandler.doTestReplicateAfterStartupWithNoActivity-seed#[90B644A0B69269D4]) [    ] o.a.s.c.s.e.JettySolrRunner Jetty properties: {solr.data.dir=/x1/jenkins/jenkins-slave/workspace/Lucene-Solr-Tests-trunk-Java8/solr/build/solr-core/test/J0/temp/solr.handler.TestReplicationHandler_90B644A0B69269D4-001/solr-instance-001/collection1/data, hostContext=/solr, hostPort=38092}
   [junit4]   2> 649277 INFO  (TEST-TestReplicationHandler.doTestReplicateAfterStartupWithNoActivity-seed#[90B644A0B69269D4]) [    ] o.a.s.s.SolrDispatchFilter SolrDispatchFilter.init(): sun.misc.Launcher$AppClassLoader@4e0e2f2a
   [junit4]   2> 649277 INFO  (TEST-TestReplicationHandler.doTestReplicateAfterStartupWithNoActivity-seed#[90B644A0B69269D4]) [    ] o.a.s.c.SolrResourceLoader new SolrResourceLoader for directory: '/x1/jenkins/jenkins-slave/workspace/Lucene-Solr-Tests-trunk-Java8/solr/build/solr-core/test/J0/temp/solr.handler.TestReplicationHandler_90B644A0B69269D4-001/solr-instance-001'
   [junit4]   2> 649277 INFO  (TEST-TestReplicationHandler.doTestReplicateAfterStartupWithNoActivity-seed#[90B644A0B69269D4]) [    ] o.a.s.c.SolrResourceLoader JNDI not configured for solr (NoInitialContextEx)
   [junit4]   2> 649277 INFO  (TEST-TestReplicationHandler.doTestReplicateAfterStartupWithNoActivity-seed#[90B644A0B69269D4]) [    ] o.a.s.c.SolrResourceLoader solr home defaulted to 'solr/' (could not find system property or JNDI)
   [junit4]   2> 649277 INFO  (TEST-TestReplicationHandler.doTestReplicateAfterStartupWithNoActivity-seed#[90B644A0B69269D4]) [    ] o.a.s.c.SolrXmlConfig Loading container configuration from /x1/jenkins/jenkins-slave/workspace/Lucene-Solr-Tests-trunk-Java8/solr/build/solr-core/test/J0/temp/solr.handler.TestReplicationHandler_90B644A0B69269D4-001/solr-instance-001/solr.xml
   [junit4]   2> 649281 INFO  (TEST-TestReplicationHandler.doTestReplicateAfterStartupWithNoActivity-seed#[90B644A0B69269D4]) [    ] o.a.s.c.CorePropertiesLocator Config-defined core root directory: /x1/jenkins/jenkins-slave/workspace/Lucene-Solr-Tests-trunk-Java8/solr/build/solr-core/test/J0/temp/solr.handler.TestReplicationHandler_90B644A0B69269D4-001/solr-instance-001/.
   [junit4]   2> 649281 INFO  (TEST-TestReplicationHandler.doTestReplicateAfterStartupWithNoActivity-seed#[90B644A0B69269D4]) [    ] o.a.s.c.CoreContainer New CoreContainer 1613522816
   [junit4]   2> 649281 INFO  (TEST-TestReplicationHandler.doTestReplicateAfterStartupWithNoActivity-seed#[90B644A0B69269D4]) [    ] o.a.s.c.CoreContainer Loading cores into CoreContainer [instanceDir=/x1/jenkins/jenkins-slave/workspace/Lucene-Solr-Tests-trunk-Java8/solr/build/solr-core/test/J0/temp/solr.handler.TestReplicationHandler_90B644A0B69269D4-001/solr-instance-001]
   [junit4]   2> 649281 WARN  (TEST-TestReplicationHandler.doTestReplicateAfterStartupWithNoActivity-seed#[90B644A0B69269D4]) [    ] o.a.s.c.CoreContainer Couldn't add files from /x1/jenkins/jenkins-slave/workspace/Lucene-Solr-Tests-trunk-Java8/solr/build/solr-core/test/J0/temp/solr.handler.TestReplicationHandler_90B644A0B69269D4-001/solr-instance-001/lib to classpath: /x1/jenkins/jenkins-slave/workspace/Lucene-Solr-Tests-trunk-Java8/solr/build/solr-core/test/J0/temp/solr.handler.TestReplicationHandler_90B644A0B69269D4-001/solr-instance-001/lib
   [junit4]   2> 649282 INFO  (TEST-TestReplicationHandler.doTestReplicateAfterStartupWithNoActivity-seed#[90B644A0B69269D4]) [    ] o.a.s.h.c.HttpShardHandlerFactory created with socketTimeout : 90000,urlScheme : ,connTimeout : 15000,maxConnectionsPerHost : 20,maxConnections : 10000,corePoolSize : 0,maximumPoolSize : 2147483647,maxThreadIdleTime : 5,sizeOfQueue : -1,fairnessPolicy : false,useRetries : false,
   [junit4]   2> 649283 INFO  (TEST-TestReplicationHandler.doTestReplicateAfterStartupWithNoActivity-seed#[90B644A0B69269D4]) [    ] o.a.s.u.UpdateShardHandler Creating UpdateShardHandler HTTP client with params: socketTimeout=340000&connTimeout=45000&retry=true
   [junit4]   2> 649283 INFO  (TEST-TestReplicationHandler.doTestReplicateAfterStartupWithNoActivity-seed#[90B644A0B69269D4]) [    ] o.a.s.l.LogWatcher SLF4J impl is org.slf4j.impl.Log4jLoggerFactory
   [junit4]   2> 649283 INFO  (TEST-TestReplicationHandler.doTestReplicateAfterStartupWithNoActivity-seed#[90B644A0B69269D4]) [    ] o.a.s.l.LogWatcher Registering Log Listener [Log4j (org.slf4j.impl.Log4jLoggerFactory)]
   [junit4]   2> 649283 INFO  (TEST-TestReplicationHandler.doTestReplicateAfterStartupWithNoActivity-seed#[90B644A0B69269D4]) [    ] o.a.s.c.CoreContainer Security conf doesn't exist. Skipping setup for authorization module.
   [junit4]   2> 649283 INFO  (TEST-TestReplicationHandler.doTestReplicateAfterStartupWithNoActivity-seed#[90B644A0B69269D4]) [    ] o.a.s.c.CoreContainer No authentication plugin used.
   [junit4]   2> 649284 INFO  (TEST-TestReplicationHandler.doTestReplicateAfterStartupWithNoActivity-seed#[90B644A0B69269D4]) [    ] o.a.s.c.CorePropertiesLocator Looking for core definitions underneath /x1/jenkins/jenkins-slave/workspace/Lucene-Solr-Tests-trunk-Java8/solr/build/solr-core/test/J0/temp/solr.handler.TestReplicationHandler_90B644A0B69269D4-001/solr-instance-001/.
   [junit4]   2> 649285 INFO  (TEST-TestReplicationHandler.doTestReplicateAfterStartupWithNoActivity-seed#[90B644A0B69269D4]) [    ] o.a.s.c.CoreDescriptor Created CoreDescriptor: {name=collection1, config=solrconfig.xml, loadOnStartup=true, schema=schema.xml, configSetProperties=configsetprops.json, transient=false, dataDir=data/}
   [junit4]   2> 649285 INFO  (TEST-TestReplicationHandler.doTestReplicateAfterStartupWithNoActivity-seed#[90B644A0B69269D4]) [    ] o.a.s.c.CorePropertiesLocator Found core collection1 in /x1/jenkins/jenkins-slave/workspace/Lucene-Solr-Tests-trunk-Java8/solr/build/solr-core/test/J0/temp/solr.handler.TestReplicationHandler_90B644A0B69269D4-001/solr-instance-001/./collection1
   [junit4]   2> 649285 INFO  (TEST-TestReplicationHandler.doTestReplicateAfterStartupWithNoActivity-seed#[90B644A0B69269D4]) [    ] o.a.s.c.CorePropertiesLocator Found 1 core definitions
   [junit4]   2> 649285 INFO  (coreLoadExecutor-2236-thread-1) [    ] o.a.s.c.SolrResourceLoader new SolrResourceLoader for directory: '/x1/jenkins/jenkins-slave/workspace/Lucene-Solr-Tests-trunk-Java8/solr/build/solr-core/test/J0/temp/solr.handler.TestReplicationHandler_90B644A0B69269D4-001/solr-instance-001/collection1'
   [junit4]   2> 649285 INFO  (TEST-TestReplicationHandler.doTestReplicateAfterStartupWithNoActivity-seed#[90B644A0B69269D4]) [    ] o.a.s.s.SolrDispatchFilter user.dir=/x1/jenkins/jenkins-slave/workspace/Lucene-Solr-Tests-trunk-Java8/solr/build/solr-core/test/J0
   [junit4]   2> 649286 INFO  (TEST-TestReplicationHandler.doTestReplicateAfterStartupWithNoActivity-seed#[90B644A0B69269D4]) [    ] o.a.s.s.SolrDispatchFilter SolrDispatchFilter.init() done
   [junit4]   2> 649286 INFO  (coreLoadExecutor-2236-thread-1) [    ] o.a.s.c.SolrResourceLoader JNDI not configured for solr (NoInitialContextEx)
   [junit4]   2> 649286 INFO  (coreLoadExecutor-2236-thread-1) [    ] o.a.s.c.SolrResourceLoader solr home defaulted to 'solr/' (could not find system property or JNDI)
   [junit4]   2> 649290 INFO  (coreLoadExecutor-2236-thread-1) [    ] o.a.s.c.SolrConfig current version of requestparams : -1
   [junit4]   2> 649293 INFO  (coreLoadExecutor-2236-thread-1) [    ] o.a.s.c.SolrConfig Using Lucene MatchVersion: 6.0.0
   [junit4]   2> 649299 INFO  (coreLoadExecutor-2236-thread-1) [    ] o.a.s.c.SolrConfig Loaded SolrConfig: solrconfig.xml
   [junit4]   2> 649301 INFO  (coreLoadExecutor-2236-thread-1) [    ] o.a.s.s.IndexSchema [collection1] Schema name=test
   [junit4]   2> 649303 INFO  (coreLoadExecutor-2236-thread-1) [    ] o.a.s.s.IndexSchema unique key field: id
   [junit4]   2> 649304 INFO  (coreLoadExecutor-2236-thread-1) [    ] o.a.s.c.ConfigSetProperties Did not find ConfigSet properties, assuming default properties: Can't find resource 'configsetprops.json' in classpath or '/x1/jenkins/jenkins-slave/workspace/Lucene-Solr-Tests-trunk-Java8/solr/build/solr-core/test/J0/temp/solr.handler.TestReplicationHandler_90B644A0B69269D4-001/solr-instance-001/collection1'
   [junit4]   2> 649304 INFO  (coreLoadExecutor-2236-thread-1) [    ] o.a.s.c.CoreContainer Creating SolrCore 'collection1' using configuration from instancedir /x1/jenkins/jenkins-slave/workspace/Lucene-Solr-Tests-trunk-Java8/solr/build/solr-core/test/J0/temp/solr.handler.TestReplicationHandler_90B644A0B69269D4-001/solr-instance-001/./collection1
   [junit4]   2> 649304 INFO  (coreLoadExecutor-2236-thread-1) [    x:collection1] o.a.s.c.SolrCore solr.NRTCachingDirectoryFactory
   [junit4]   2> 649310 INFO  (coreLoadExecutor-2236-thread-1) [    x:collection1] o.a.s.c.SolrCore [[collection1] ] Opening new SolrCore at [/x1/jenkins/jenkins-slave/workspace/Lucene-Solr-Tests-trunk-Java8/solr/build/solr-core/test/J0/temp/solr.handler.TestReplicationHandler_90B644A0B69269D4-001/solr-instance-001/collection1], dataDir=[/x1/jenkins/jenkins-slave/workspace/Lucene-Solr-Tests-trunk-Java8/solr/build/solr-core/test/J0/temp/solr.handler.TestReplicationHandler_90B644A0B69269D4-001/solr-instance-001/./collection1/data/]
   [junit4]   2> 649310 INFO  (coreLoadExecutor-2236-thread-1) [    x:collection1] o.a.s.c.SolrCore JMX monitoring not detected for core: collection1
   [junit4]   2> 649310 INFO  (coreLoadExecutor-2236-thread-1) [    x:collection1] o.a.s.c.CachingDirectoryFactory return new directory for /x1/jenkins/jenkins-slave/workspace/Lucene-Solr-Tests-trunk-Java8/solr/build/solr-core/test/J0/temp/solr.handler.TestReplicationHandler_90B644A0B69269D4-001/solr-instance-001/collection1/data
   [junit4]   2> 649310 INFO  (coreLoadExecutor-2236-thread-1) [    x:collection1] o.a.s.c.SolrCore New index directory detected: old=null new=/x1/jenkins/jenkins-slave/workspace/Lucene-Solr-Tests-trunk-Java8/solr/build/solr-core/test/J0/temp/solr.handler.TestReplicationHandler_90B644A0B69269D4-001/solr-instance-001/./collection1/data/index/
   [junit4]   2> 649311 WARN  (coreLoadExecutor-2236-thread-1) [    x:collection1] o.a.s.c.SolrCore [collection1] Solr index directory '/x1/jenkins/jenkins-slave/workspace/Lucene-Solr-Tests-trunk-Java8/solr/build/solr-core/test/J0/temp/solr.handler.TestReplicationHandler_90B644A0B69269D4-001/solr-instance-001/./collection1/data/index' doesn't exist. Creating new index...
   [junit4]   2> 649311 INFO  (coreLoadExecutor-2236-thread-1) [    x:collection1] o.a.s.c.CachingDirectoryFactory return new directory for /x1/jenkins/jenkins-slave/workspace/Lucene-Solr-Tests-trunk-Java8/solr/build/solr-core/test/J0/temp/solr.handler.TestReplicationHandler_90B644A0B69269D4-001/solr-instance-001/collection1/data/index
   [junit4]   2> 649311 INFO  (coreLoadExecutor-2236-thread-1) [    x:collection1] o.a.s.u.RandomMergePolicy RandomMergePolicy wrapping class org.apache.lucene.index.AlcoholicMergePolicy: [AlcoholicMergePolicy: minMergeSize=0, mergeFactor=10, maxMergeSize=630569122, maxMergeSizeForForcedMerge=9223372036854775807, calibrateSizeByDeletes=true, maxMergeDocs=2147483647, maxCFSSegmentSizeMB=8.796093022207999E12, noCFSRatio=0.1]
   [junit4]   2> 649317 INFO  (coreLoadExecutor-2236-thread-1) [    x:collection1] o.a.s.c.SolrDeletionPolicy SolrDeletionPolicy.onCommit: commits: num=1
   [junit4]   2> 	commit{dir=NRTCachingDirectory(MMapDirectory@/x1/jenkins/jenkins-slave/workspace/Lucene-Solr-Tests-trunk-Java8/solr/build/solr-core/test/J0/temp/solr.handler.TestReplicationHandler_90B644A0B69269D4-001/solr-instance-001/collection1/data/index lockFactory=org.apache.lucene.store.SingleInstanceLockFactory@9086771; maxCacheMB=48.0 maxMergeSizeMB=4.0),segFN=segments_1,generation=1}
   [junit4]   2> 649317 INFO  (coreLoadExecutor-2236-thread-1) [    x:collection1] o.a.s.c.SolrDeletionPolicy newest commit generation = 1
   [junit4]   2> 649317 INFO  (OldIndexDirectoryCleanupThreadForCore-collection1) [    x:collection1] o.a.s.c.SolrCore Looking for old index directories to cleanup for core collection1 in /x1/jenkins/jenkins-slave/workspace/Lucene-Solr-Tests-trunk-Java8/solr/build/solr-core/test/J0/temp/solr.handler.TestReplicationHandler_90B644A0B69269D4-001/solr-instance-001/./collection1/data/
   [junit4]   2> 649319 INFO  (coreLoadExecutor-2236-thread-1) [    x:collection1] o.a.s.c.SolrCore no updateRequestProcessorChain defined as default, creating implicit default
   [junit4]   2> 649320 INFO  (coreLoadExecutor-2236-thread-1) [    x:collection1] o.a.s.h.l.XMLLoader xsltCacheLifetimeSeconds=60
   [junit4]   2> 649320 INFO  (coreLoadExecutor-2236-thread-1) [    x:collection1] o.a.s.h.l.XMLLoader xsltCacheLifetimeSeconds=60
   [junit4]   2> 649321 INFO  (coreLoadExecutor-2236-thread-1) [    x:collection1] o.a.s.h.l.XMLLoader xsltCacheLifetimeSeconds=60
   [junit4]   2> 649322 INFO  (coreLoadExecutor-2236-thread-1) [    x:collection1] o.a.s.h.l.XMLLoader xsltCacheLifetimeSeconds=60
   [junit4]   2> 649323 INFO  (coreLoadExecutor-2236-thread-1) [    x:collection1] o.a.s.c.PluginBag requestHandler : 'lazy' created with startup=lazy 
   [junit4]   2> 649323 INFO  (coreLoadExecutor-2236-thread-1) [    x:collection1] o.a.s.c.RequestHandlers Registered paths: /admin/mbeans,standard,lazy,/update/json/docs,/admin/luke,/export,/get,/admin/properties,/update/json,/admin/threads,/update/csv,/sql,/admin/segments,/admin/system,/replication,defaults,/config,/stream,/schema,/admin/plugins,/admin/logging,/admin/ping,/update,/admin/file
   [junit4]   2> 649324 INFO  (coreLoadExecutor-2236-thread-1) [    x:collection1] o.a.s.c.SolrCore Using default statsCache cache: org.apache.solr.search.stats.LocalStatsCache
   [junit4]   2> 649324 INFO  (coreLoadExecutor-2236-thread-1) [    x:collection1] o.a.s.u.CommitTracker Hard AutoCommit: disabled
   [junit4]   2> 649324 INFO  (coreLoadExecutor-2236-thread-1) [    x:collection1] o.a.s.u.CommitTracker Soft AutoCommit: disabled
   [junit4]   2> 649324 INFO  (coreLoadExecutor-2236-thread-1) [    x:collection1] o.a.s.u.RandomMergePolicy RandomMergePolicy wrapping class org.apache.lucene.index.AlcoholicMergePolicy: [AlcoholicMergePolicy: minMergeSize=0, mergeFactor=10, maxMergeSize=1928159520, maxMergeSizeForForcedMerge=9223372036854775807, calibrateSizeByDeletes=true, maxMergeDocs=2147483647, maxCFSSegmentSizeMB=8.796093022207999E12, noCFSRatio=0.1]
   [junit4]   2> 649325 INFO  (coreLoadExecutor-2236-thread-1) [    x:collection1] o.a.s.c.SolrDeletionPolicy SolrDeletionPolicy.onInit: commits: num=1
   [junit4]   2> 	commit{dir=NRTCachingDirectory(MMapDirectory@/x1/jenkins/jenkins-slave/workspace/Lucene-Solr-Tests-trunk-Java8/solr/build/solr-core/test/J0/temp/solr.handler.TestReplicationHandler_90B644A0B69269D4-001/solr-instance-001/collection1/data/index lockFactory=org.apache.lucene.store.SingleInstanceLockFactory@9086771; maxCacheMB=48.0 maxMergeSizeMB=4.0),segFN=segments_1,generation=1}
   [junit4]   2> 649325 INFO  (coreLoadExecutor-2236-thread-1) [    x:collection1] o.a.s.c.SolrDeletionPolicy newest commit generation = 1
   [junit4]   2> 649325 INFO  (coreLoadExecutor-2236-thread-1) [    x:collection1] o.a.s.s.SolrIndexSearcher Opening [Searcher@35f6913c[collection1] main]
   [junit4]   2> 649325 INFO  (coreLoadExecutor-2236-thread-1) [    x:collection1] o.a.s.r.ManagedResourceStorage File-based storage initialized to use dir: /x1/jenkins/jenkins-slave/workspace/Lucene-Solr-Tests-trunk-Java8/solr/build/solr-core/test/J0/temp/solr.handler.TestReplicationHandler_90B644A0B69269D4-001/solr-instance-001/collection1/conf
   [junit4]   2> 649325 INFO  (coreLoadExecutor-2236-thread-1) [    x:collection1] o.a.s.r.RestManager Initializing RestManager with initArgs: {storageDir=/x1/jenkins/jenkins-slave/workspace/Lucene-Solr-Tests-trunk-Java8/solr/build/solr-core/test/J0/temp/solr.handler.TestReplicationHandler_90B644A0B69269D4-001/solr-instance-001/collection1/conf}
   [junit4]   2> 649325 INFO  (coreLoadExecutor-2236-thread-1) [    x:collection1] o.a.s.r.ManagedResourceStorage Reading _rest_managed.json using file:dir=/x1/jenkins/jenkins-slave/workspace/Lucene-Solr-Tests-trunk-Java8/solr/build/solr-core/test/J0/temp/solr.handler.TestReplicationHandler_90B644A0B69269D4-001/solr-instance-001/collection1/conf
   [junit4]   2> 649325 INFO  (coreLoadExecutor-2236-thread-1) [    x:collection1] o.a.s.r.RestManager Initializing 0 registered ManagedResources
   [junit4]   2> 649326 INFO  (coreLoadExecutor-2236-thread-1) [    x:collection1] o.a.s.h.ReplicationHandler Replication enabled for following config files: schema.xml
   [junit4]   2> 649326 INFO  (coreLoadExecutor-2236-thread-1) [    x:collection1] o.a.s.h.ReplicationHandler Commits will be reserved for  10000
   [junit4]   2> 649326 INFO  (searcherExecutor-2237-thread-1-processing-x:collection1) [    x:collection1] o.a.s.c.SolrCore [collection1] Registered new searcher Searcher@35f6913c[collection1] main{ExitableDirectoryReader(UninvertingDirectoryReader())}
   [junit4]   2> 649326 INFO  (coreLoadExecutor-2236-thread-1) [    x:collection1] o.a.s.c.CoreContainer registering core: collection1
   [junit4]   2> 649790 INFO  (qtp1320718279-5449) [    x:collection1] o.a.s.u.p.LogUpdateProcessorFactory [collection1]  webapp=/solr path=/update params={wt=javabin&version=2}{add=[0]} 0 1
   [junit4]   2> 649792 INFO  (qtp1320718279-5450) [    x:collection1] o.a.s.u.p.LogUpdateProcessorFactory [collection1]  webapp=/solr path=/update params={wt=javabin&version=2}{add=[1]} 0 0
   [junit4]   2> 649794 INFO  (qtp1320718279-5451) [    x:collection1] o.a.s.u.p.LogUpdateProcessorFactory [collection1]  webapp=/solr path=/update params={wt=javabin&version=2}{add=[2]} 0 0
   [junit4]   2> 649798 INFO  (qtp1320718279-5452) [    x:collection1] o.a.s.u.p.LogUpdateProcessorFactory [collection1]  webapp=/solr path=/update params={wt=javabin&version=2}{add=[3]} 0 0
   [junit4]   2> 649800 INFO  (qtp1320718279-5452) [    x:collection1] o.a.s.u.p.LogUpdateProcessorFactory [collection1]  webapp=/solr path=/update params={wt=javabin&version=2}{add=[4]} 0 0
   [junit4]   2> 649802 INFO  (qtp1320718279-5446) [    x:collection1] o.a.s.u.p.LogUpdateProcessorFactory [collection1]  webapp=/solr path=/update params={wt=javabin&version=2}{add=[5]} 0 0
   [junit4]   2> 649804 INFO  (qtp1320718279-5449) [    x:collection1] o.a.s.u.p.LogUpdateProcessorFactory [collection1]  webapp=/solr path=/update params={wt=javabin&version=2}{add=[6]} 0 0
   [junit4]   2> 649806 INFO  (qtp1320718279-5450) [    x:collection1] o.a.s.u.p.LogUpdateProcessorFactory [collection1]  webapp=/solr path=/update params={wt=javabin&version=2}{add=[7]} 0 0
   [junit4]   2> 649808 INFO  (qtp1320718279-5451) [    x:collection1] o.a.s.u.p.LogUpdateProcessorFactory [collection1]  webapp=/solr path=/update params={wt=javabin&version=2}{add=[8]} 0 0
   [junit4]   2> 649809 INFO  (qtp1320718279-5453) [    x:collection1] o.a.s.u.p.LogUpdateProcessorFactory [collection1]  webapp=/solr path=/update params={wt=javabin&version=2}{add=[9]} 0 0
   [junit4]   2> 649811 INFO  (qtp1320718279-5452) [    x:collection1] o.a.s.u.p.LogUpdateProcessorFactory [collection1]  webapp=/solr path=/update params={wt=javabin&version=2}{add=[10]} 0 0
   [junit4]   2> 649813 INFO  (qtp1320718279-5446) [    x:collection1] o.a.s.u.p.LogUpdateProcessorFactory [collection1]  webapp=/solr path=/update params={wt=javabin&version=2}{add=[11]} 0 0
   [junit4]   2> 649815 INFO  (qtp1320718279-5449) [    x:collection1] o.a.s.u.p.LogUpdateProcessorFactory [collection1]  webapp=/solr path=/update params={wt=javabin&version=2}{add=[12]} 0 0
   [junit4]   2> 649817 INFO  (qtp1320718279-5449) [    x:collection1] o.a.s.u.p.LogUpdateProcessorFactory [collection1]  webapp=/solr path=/update params={wt=javabin&version=2}{add=[13]} 0 0
   [junit4]   2> 649819 INFO  (qtp1320718279-5451) [    x:collection1] o.a.s.u.p.LogUpdateProcessorFactory [collection1]  webapp=/solr path=/update params={wt=javabin&version=2}{add=[14]} 0 0
   [junit4]   2> 649820 INFO  (qtp1320718279-5453) [    x:collection1] o.a.s.u.p.LogUpdateProcessorFactory [collection1]  webapp=/solr path=/update params={wt=javabin&version=2}{add=[15]} 0 0
   [junit4]   2> 649822 INFO  (qtp1320718279-5453) [    x:collection1] o.a.s.u.p.LogUpdateProcessorFactory [collection1]  webapp=/solr path=/update params={wt=javabin&version=2}{add=[16]} 0 0
   [junit4]   2> 649824 INFO  (qtp1320718279-5446) [    x:collection1] o.a.s.u.p.LogUpdateProcessorFactory [collection1]  webapp=/solr path=/update params={wt=javabin&version=2}{add=[17]} 0 0
   [junit4]   2> 649826 INFO  (qtp1320718279-5450) [    x:collection1] o.a.s.u.p.LogUpdateProcessorFactory [collection1]  webapp=/solr path=/update params={wt=javabin&version=2}{add=[18]} 0 0
   [junit4]   2> 649828 INFO  (qtp1320718279-5450) [    x:collection1] o.a.s.u.p.LogUpdateProcessorFactory [collection1]  webapp=/solr path=/update params={wt=javabin&version=2}{add=[19]} 0 0
   [junit4]   2> 649830 INFO  (qtp1320718279-5451) [    x:collection1] o.a.s.u.p.LogUpdateProcessorFactory [collection1]  webapp=/solr path=/update params={wt=javabin&version=2}{add=[20]} 0 0
   [junit4]   2> 649832 INFO  (qtp1320718279-5452) [    x:collection1] o.a.s.u.p.LogUpdateProcessorFactory [collection1]  webapp=/solr path=/update params={wt=javabin&version=2}{add=[21]} 0 0
   [junit4]   2> 649833 INFO  (qtp1320718279-5453) [    x:collection1] o.a.s.u.p.LogUpdateProcessorFactory [collection1]  webapp=/solr path=/update params={wt=javabin&version=2}{add=[22]} 0 0
   [junit4]   2> 649835 INFO  (qtp1320718279-5446) [    x:collection1] o.a.s.u.p.LogUpdateProcessorFactory [collection1]  webapp=/solr path=/update params={wt=javabin&version=2}{add=[23]} 0 0
   [junit4]   2> 649837 INFO  (qtp1320718279-5449) [    x:collection1] o.a.s.u.p.LogUpdateProcessorFactory [collection1]  webapp=/solr path=/update params={wt=javabin&version=2}{add=[24]} 0 0
   [junit4]   2> 649839 INFO  (qtp1320718279-5449) [    x:collection1] o.a.s.u.p.LogUpdateProcessorFactory [collection1]  webapp=/solr path=/update params={wt=javabin&version=2}{add=[25]} 0 0
   [junit4]   2> 649841 INFO  (qtp1320718279-5451) [    x:collection1] o.a.s.u.p.LogUpdateProcessorFactory [collection1]  webapp=/solr path=/update params={wt=javabin&version=2}{add=[26]} 0 0
   [junit4]   2> 649843 INFO  (qtp1320718279-5452) [    x:collection1] o.a.s.u.p.LogUpdateProcessorFactory [collection1]  webapp=/solr path=/update params={wt=javabin&version=2}{add=[27]} 0 0
   [junit4]   2> 649844 INFO  (qtp1320718279-5452) [    x:collection1] o.a.s.u.p.LogUpdateProcessorFactory [collection1]  webapp=/solr path=/update params={wt=javabin&version=2}{add=[28]} 0 0
   [junit4]   2> 649846 INFO  (qtp1320718279-5446) [    x:collection1] o.a.s.u.p.LogUpdateProcessorFactory [collection1]  webapp=/solr path=/update params={wt=javabin&version=2}{add=[29]} 0 0
   [junit4]   2> 649848 INFO  (qtp1320718279-5450) [    x:collection1] o.a.s.u.p.LogUpdateProcessorFactory [collection1]  webapp=/solr path=/update params={wt=javabin&version=2}{add=[30]} 0 0
   [junit4]   2> 649850 INFO  (qtp1320718279-5449) [    x:collection1] o.a.s.u.p.LogUpdateProcessorFactory [collection1]  webapp=/solr path=/update params={wt=javabin&version=2}{add=[31]} 0 0
   [junit4]   2> 649852 INFO  (qtp1320718279-5451) [    x:collection1] o.a.s.u.p.LogUpdateProcessorFactory [collection1]  webapp=/solr path=/update params={wt=javabin&version=2}{add=[32]} 0 0
   [junit4]   2> 649854 INFO  (qtp1320718279-5453) [    x:collection1] o.a.s.u.p.LogUpdateProcessorFactory [collection1]  webapp=/solr path=/update params={wt=javabin&version=2}{add=[33]} 0 0
   [junit4]   2> 649855 INFO  (qtp1320718279-5453) [    x:collection1] o.a.s.u.p.LogUpdateProcessorFactory [collection1]  webapp=/solr path=/update params={wt=javabin&version=2}{add=[34]} 0 0
   [junit4]   2> 649857 INFO  (qtp1320718279-5446) [    x:collection1] o.a.s.u.p.LogUpdateProcessorFactory [collection1]  webapp=/solr path=/update params={wt=javabin&version=2}{add=[35]} 0 0
   [junit4]   2> 649859 INFO  (qtp1320718279-5450) [    x:collection1] o.a.s.u.p.LogUpdateProcessorFactory [collection1]  webapp=/solr path=/update params={wt=javabin&version=2}{add=[36]} 0 0
   [junit4]   2> 649861 INFO  (qtp1320718279-5449) [    x:collection1] o.a.s.u.p.LogUpdateProcessorFactory [collection1]  webapp=/solr path=/update params={wt=javabin&version=2}{add=[37]} 0 0
   [junit4]   2> 649863 INFO  (qtp1320718279-5451) [    x:collection1] o.a.s.u.p.LogUpdateProcessorFactory [collection1]  webapp=/solr path=/update params={wt=javabin&version=2}{add=[38]} 0 0
   [junit4]   2> 649865 INFO  (qtp1320718279-5452) [    x:collection1] o.a.s.u.p.LogUpdateProcessorFactory [collection1]  webapp=/solr path=/update params={wt=javabin&version=2}{add=[39]} 0 0
   [junit4]   2> 649866 INFO  (qtp1320718279-5452) [    x:collection1] o.a.s.u.p.LogUpdateProcessorFactory [collection1]  webapp=/solr path=/update params={wt=javabin&version=2}{add=[40]} 0 0
   [junit4]   2> 649868 INFO  (qtp1320718279-5446) [    x:collection1] o.a.s.u.p.LogUpdateProcessorFactory [collection1]  webapp=/solr path=/update params={wt=javabin&version=2}{add=[41]} 0 0
   [junit4]   2> 649870 INFO  (qtp1320718279-5450) [    x:collection1] o.a.s.u.p.LogUpdateProcessorFactory [collection1]  webapp=/solr path=/update params={wt=javabin&version=2}{add=[42]} 0 0
   [junit4]   2> 649872 INFO  (qtp1320718279-5449) [    x:collection1] o.a.s.u.p.LogUpdateProcessorFactory [collection1]  webapp=/solr path=/update params={wt=javabin&version=2}{add=[43]} 0 0
   [junit4]   2> 649874 INFO  (qtp1320718279-5451) [    x:collection1] o.a.s.u.p.LogUpdateProcessorFactory [collection1]  webapp=/solr path=/update params={wt=javabin&version=2}{add=[44]} 0 0
   [junit4]   2> 649875 INFO  (qtp1320718279-5453) [    x:collection1] o.a.s.u.p.LogUpdateProcessorFactory [collection1]  webapp=/solr path=/update params={wt=javabin&version=2}{add=[45]} 0 0
   [junit4]   2> 649877 INFO  (qtp1320718279-5453) [    x:collection1] o.a.s.u.p.LogUpdateProcessorFactory [collection1]  webapp=/solr path=/update params={wt=javabin&version=2}{add=[46]} 0 0
   [junit4]   2> 649879 INFO  (qtp1320718279-5446) [    x:collection1] o.a.s.u.p.LogUpdateProcessorFactory [collection1]  webapp=/solr path=/update params={wt=javabin&version=2}{add=[47]} 0 0
   [junit4]   2> 649881 INFO  (qtp1320718279-5450) [    x:collection1] o.a.s.u.p.LogUpdateProcessorFactory [collection1]  webapp=/solr path=/update params={wt=javabin&version=2}{add=[48]} 0 0
   [junit4]   2> 649883 INFO  (qtp1320718279-5449) [    x:collection1] o.a.s.u.p.LogUpdateProcessorFactory [collection1]  webapp=/solr path=/update params={wt=javabin&version=2}{add=[49]} 0 0
   [junit4]   2> 649885 INFO  (qtp1320718279-5451) [    x:collection1] o.a.s.u.p.LogUpdateProcessorFactory [collection1]  webapp=/solr path=/update params={wt=javabin&version=2}{add=[50]} 0 0
   [junit4]   2> 649887 INFO  (qtp1320718279-5452) [    x:collection1] o.a.s.u.p.LogUpdateProcessorFactory [collection1]  webapp=/solr path=/update params={wt=javabin&version=2}{add=[51]} 0 0
   [junit4]   2> 649888 INFO  (qtp1320718279-5453) [    x:collection1] o.a.s.u.p.LogUpdateProcessorFactory [collection1]  webapp=/solr path=/update params={wt=javabin&version=2}{add=[52]} 0 0
   [junit4]   2> 649890 INFO  (qtp1320718279-5446) [    x:collection1] o.a.s.u.p.LogUpdateProcessorFactory [collection1]  webapp=/solr path=/update params={wt=javabin&version=2}{add=[53]} 0 0
   [junit4]   2> 649892 INFO  (qtp1320718279-5446) [    x:collection1] o.a.s.u.p.LogUpdateProcessorFactory [collection1]  webapp=/solr path=/update params={wt=javabin&version=2}{add=[54]} 0 0
   [junit4]   2> 649894 INFO  (qtp1320718279-5449) [    x:collection1] o.a.s.u.p.LogUpdateProcessorFactory [collection1]  webapp=/solr path=/update params={wt=javabin&version=2}{add=[55]} 0 0
   [junit4]   2> 649896 INFO  (qtp1320718279-5451) [    x:collection1] o.a.s.u.p.LogUpdateProcessorFactory [collection1]  webapp=/solr path=/update params={wt=javabin&version=2}{add=[56]} 0 0
   [junit4]   2> 649898 INFO  (qtp1320718279-5452) [    x:collection1] o.a.s.u.p.LogUpdateProcessorFactory [collection1]  webapp=/solr path=/update params={wt=javabin&version=2}{add=[57]} 0 0
   [junit4]   2> 649900 INFO  (qtp1320718279-5453) [    x:collection1] o.a.s.u.p.LogUpdateProcessorFactory [collection1]  webapp=/solr path=/update params={wt=javabin&version=2}{add=[58]} 0 0
   [junit4]   2> 649901 INFO  (qtp1320718279-5450) [    x:collection1] o.a.s.u.p.LogUpdateProcessorFactory [collection1]  webapp=/solr path=/update params={wt=javabin&version=2}{add=[59]} 0 0
   [junit4]   2> 649903 INFO  (qtp1320718279-5450) [    x:collection1] o.a.s.u.p.LogUpdateProcessorFactory [collection1]  webapp=/solr path=/update params={wt=javabin&version=2}{add=[60]} 0 0
   [junit4]   2> 649905 INFO  (qtp1320718279-5449) [    x:collection1] o.a.s.u.p.LogUpdateProcessorFactory [collection1]  webapp=/solr path=/update params={wt=javabin&version=2}{add=[61]} 0 0
   [junit4]   2> 649907 INFO  (qtp1320718279-5451) [    x:collection1] o.a.s.u.p.LogUpdateProcessorFactory [collection1]  webapp=/solr path=/update params={wt=javabin&version=2}{add=[62]} 0 0
   [junit4]   2> 649910 INFO  (qtp1320718279-5452) [    x:collection1] o.a.s.u.p.LogUpdateProcessorFactory [collection1]  webapp=/solr path=/update params={wt=javabin&version=2}{add=[63]} 0 0
   [junit4]   2> 649912 INFO  (qtp1320718279-5453) [    x:collection1] o.a.s.u.p.LogUpdateProcessorFactory [collection1]  webapp=/solr path=/update params={wt=javabin&version=2}{add=[64]} 0 0
   [junit4]   2> 649914 INFO  (qtp1320718279-5446) [    x:collection1] o.a.s.u.p.LogUpdateProcessorFactory [collection1]  webapp=/solr path=/update params={wt=javabin&version=2}{add=[65]} 0 0
   [junit4]   2> 649915 INFO  (qtp1320718279-5450) [    x:collection1] o.a.s.u.p.LogUpdateProcessorFactory [collection1]  webapp=/solr path=/update params={wt=javabin&version=2}{add=[66]} 0 0
   [junit4]   2> 649917 INFO  (qtp1320718279-5449) [    x:collection1] o.a.s.u.p.LogUpdateProcessorFactory [collection1]  webapp=/solr path=/update params={wt=javabin&version=2}{add=[67]} 0 0
   [junit4]   2> 649919 INFO  (qtp1320718279-5451) [    x:collection1] o.a.s.u.p.LogUpdateProcessorFactory [collection1]  webapp=/solr path=/update params={wt=javabin&version=2}{add=[68]} 0 0
   [junit4]   2> 649921 INFO  (qtp1320718279-5452) [    x:collection1] o.a.s.u.p.LogUpdateProcessorFactory [collection1]  webapp=/solr path=/update params={wt=javabin&version=2}{add=[69]} 0 0
   [junit4]   2> 649923 INFO  (qtp1320718279-5453) [    x:collection1] o.a.s.u.p.LogUpdateProcessorFactory [collection1]  webapp=/solr path=/update params={wt=javabin&version=2}{add=[70]} 0 0
   [junit4]   2> 649925 INFO  (qtp1320718279-5446) [    x:collection1] o.a.s.u.p.LogUpdateProcessorFactory [collection1]  webapp=/solr path=/update params={wt=javabin&version=2}{add=[71]} 0 0
   [junit4]   2> 649926 INFO  (qtp1320718279-5446) [    x:collection1] o.a.s.u.p.LogUpdateProcessorFactory [collection1]  webapp=/solr path=/update params={wt=javabin&version=2}{add=[72]} 0 0
   [junit4]   2> 649928 INFO  (qtp1320718279-5449) [    x:collection1] o.a.s.u.p.LogUpdateProcessorFactory [collection1]  webapp=/solr path=/update params={wt=javabin&version=2}{add=[73]} 0 0
   [junit4]   2> 649930 INFO  (qtp1320718279-5451) [    x:collection1] o.a.s.u.p.LogUpdateProcessorFactory [collection1]  webapp=/solr path=/update params={wt=javabin&version=2}{add=[74]} 0 0
   [junit4]   2> 649932 INFO  (qtp1320718279-5452) [    x:collection1] o.a.s.u.p.LogUpdateProcessorFactory [collection1]  webapp=/solr path=/update params={wt=javabin&version=2}{add=[75]} 0 0
   [junit4]   2> 649934 INFO  (qtp1320718279-5453) [    x:collection1] o.a.s.u.p.LogUpdateProcessorFactory [collection1]  webapp=/solr path=/update params={wt=javabin&version=2}{add=[76]} 0 0
   [junit4]   2> 649935 INFO  (qtp1320718279-5450) [    x:collection1] o.a.s.u.p.LogUpdateProcessorFactory [collection1]  webapp=/solr path=/update params={wt=javabin&version=2}{add=[77]} 0 0
   [junit4]   2> 649937 INFO  (qtp1320718279-5446) [    x:collection1] o.a.s.u.p.LogUpdateProcessorFactory [collection1]  webapp=/solr path=/update params={wt=javabin&version=2}{add=[78]} 0 0
   [junit4]   2> 649939 INFO  (qtp1320718279-5449) [    x:collection1] o.a.s.u.p.LogUpdateProcessorFactory [collection1]  webapp=/solr path=/update params={wt=javabin&version=2}{add=[79]} 0 0
   [junit4]   2> 649941 INFO  (qtp1320718279-5451) [    x:collection1] o.a.s.u.p.LogUpdateProcessorFactory [collection1]  webapp=/solr path=/update params={wt=javabin&version=2}{add=[80]} 0 0
   [junit4]   2> 649943 INFO  (qtp1320718279-5452) [    x:collection1] o.a.s.u.p.LogUpdateProcessorFactory [collection1]  webapp=/solr path=/update params={wt=javabin&version=2}{add=[81]} 0 0
   [junit4]   2> 649944 INFO  (qtp1320718279-5453) [    x:collection1] o.a.s.u.p.LogUpdateProcessorFactory [collection1]  webapp=/solr path=/update params={wt=javabin&version=2}{add=[82]} 0 0
   [junit4]   2> 649946 INFO  (qtp1320718279-5450) [    x:collection1] o.a.s.u.p.LogUpdateProcessorFactory [collection1]  webapp=/solr path=/update params={wt=javabin&version=2}{add=[83]} 0 0
   [junit4]   2> 649948 INFO  (qtp1320718279-5450) [    x:collection1] o.a.s.u.p.LogUpdateProcessorFactory [collection1]  webapp=/solr path=/update params={wt=javabin&version=2}{add=[84]} 0 0
   [junit4]   2> 649950 INFO  (qtp1320718279-5449) [    x:collection1] o.a.s.u.p.LogUpdateProcessorFactory [collection1]  webapp=/solr path=/update params={wt=javabin&version=2}{add=[85]} 0 0
   [junit4]   2> 649952 INFO  (qtp1320718279-5451) [    x:collection1] o.a.s.u.p.LogUpdateProcessorFactory [collection1]  webapp=/solr path=/update params={wt=javabin&version=2}{add=[86]} 0 0
   [junit4]   2> 649953 INFO  (qtp1320718279-5452) [    x:collection1] o.a.s.u.p.LogUpdateProcessorFactory [collection1]  webapp=/solr path=/update params={wt=javabin&version=2}{add=[87]} 0 0
   [junit4]   2> 649955 INFO  (qtp1320718279-5453) [    x:collection1] o.a.s.u.p.LogUpdateProcessorFactory [collection1]  webapp=/solr path=/update params={wt=javabin&version=2}{add=[88]} 0 0
   [junit4]   2> 649957 INFO  (qtp1320718279-5446) [    x:collection1] o.a.s.u.p.LogUpdateProcessorFactory [collection1]  webapp=/solr path=/update params={wt=javabin&version=2}{add=[89]} 0 0
   [junit4]   2> 649959 INFO  (qtp1320718279-5446) [    x:collection1] o.a.s.u.p.LogUpdateProcessorFactory [collection1]  webapp=/solr path=/update params={wt=javabin&version=2}{add=[90]} 0 0
   [junit4]   2> 649961 INFO  (qtp1320718279-5449) [    x:collection1] o.a.s.u.p.LogUpdateProcessorFactory [collection1]  webapp=/solr path=/update params={wt=javabin&version=2}{add=[91]} 0 0
   [junit4]   2> 649963 INFO  (qtp1320718279-5451) [    x:collection1] o.a.s.u.p.LogUpdateProcessorFactory [collection1]  webapp=/solr path=/update params={wt=javabin&version=2}{add=[92]} 0 0
   [junit4]   2> 649965 INFO  (qtp1320718279-5452) [    x:collection1] o.a.s.u.p.LogUpdateProcessorFactory [collection1]  webapp=/solr path=/update params={wt=javabin&version=2}{add=[93]} 0 0
   [junit4]   2> 649966 INFO  (qtp1320718279-5453) [    x:collection1] o.a.s.u.p.LogUpdateProcessorFactory [collection1]  webapp=/solr path=/update params={wt=javabin&version=2}{add=[94]} 0 0
   [junit4]   2> 649968 INFO  (qtp1320718279-5450) [    x:collection1] o.a.s.u.p.LogUpdateProcessorFactory [collection1]  webapp=/solr path=/update params={wt=javabin&version=2}{add=[95]} 0 0
   [junit4]   2> 649970 INFO  (qtp1320718279-5450) [    x:collection1] o.a.s.u.p.LogUpdateProcessorFactory [collection1]  webapp=/solr path=/update params={wt=javabin&version=2}{add=[96]} 0 0
   [junit4]   2> 649972 INFO  (qtp1320718279-5449) [    x:collection1] o.a.s.u.p.LogUpdateProcessorFactory [collection1]  webapp=/solr path=/update params={wt=javabin&version=2}{add=[97]} 0 0
   [junit4]   2> 649974 INFO  (qtp1320718279-5451) [    x:collection1] o.a.s.u.p.LogUpdateProcessorFactory [collection1]  webapp=/solr path=/update params={wt=javabin&version=2}{add=[98]} 0 0
   [junit4]   2> 649975 INFO  (qtp1320718279-5452) [    x:collection1] o.a.s.u.p.LogUpdateProcessorFactory [collection1]  webapp=/solr path=/update params={wt=javabin&version=2}{add=[99]} 0 0
   [junit4]   2> 649977 INFO  (qtp1320718279-5453) [    x:collection1] o.a.s.u.p.LogUpdateProcessorFactory [collection1]  webapp=/solr path=/update params={wt=javabin&version=2}{add=[100]} 0 0
   [junit4]   2> 649979 INFO  (qtp1320718279-5446) [    x:collection1] o.a.s.u.p.LogUpdateProcessorFactory [collection1]  webapp=/solr path=/update params={wt=javabin&version=2}{add=[101]} 0 0
   [junit4]   2> 649981 INFO  (qtp1320718279-5450) [    x:collection1] o.a.s.u.p.LogUpdateProcessorFactory [collection1]  webapp=/solr path=/update params={wt=javabin&version=2}{add=[102]} 0 0
   [junit4]   2> 649983 INFO  (qtp1320718279-5449) [    x:collection1] o.a.s.u.p.LogUpdateProcessorFactory [collection1]  webapp=/solr path=/update params={wt=javabin&version=2}{add=[103]} 0 0
   [junit4]   2> 649985 INFO  (qtp1320718279-5451) [    x:collection1] o.a.s.u.p.LogUpdateProcessorFactory [collection1]  webapp=/solr path=/update params={wt=javabin&version=2}{add=[104]} 0 0
   [junit4]   2> 649987 INFO  (qtp1320718279-5452) [    x:collection1] o.a.s.u.p.LogUpdateProcessorFactory [collection1]  webapp=/solr path=/update params={wt=javabin&version=2}{add=[105]} 0 0
   [junit4]   2> 649988 INFO  (qtp1320718279-5453) [    x:collection1] o.a.s.u.p.LogUpdateProcessorFactory [collection1]  webapp=/solr path=/update params={wt=javabin&version=2}{add=[106]} 0 0
   [junit4]   2> 649991 INFO  (qtp1320718279-5446) [    x:collection1] o.a.s.u.p.LogUpdateProcessorFactory [collection1]  webapp=/solr path=/update params={wt=javabin&version=2}{add=[107]} 0 0
   [junit4]   2> 649994 INFO  (qtp1320718279-5450) [    x:collection1] o.a.s.u.p.LogUpdateProcessorFactory [collection1]  webapp=/solr path=/update params={wt=javabin&version=2}{add=[108]} 0 0
   [junit4]   2> 649997 INFO  (qtp1320718279-5449) [    x:collection1] o.a.s.u.p.LogUpdateProcessorFactory [collection1]  webapp=/solr path=/update params={wt=javabin&version=2}{add=[109]} 0 0
   [junit4]   2> 649999 INFO  (qtp1320718279-5449) [    x:collection1] o.a.s.u.p.LogUpdateProcessorFactory [collection1]  webapp=/solr path=/update params={wt=javabin&version=2}{add=[110]} 0 0
   [junit4]   2> 650000 INFO  (qtp1320718279-5449) [    x:collection1] o.a.s.u.p.LogUpdateProcessorFactory [collection1]  webapp=/solr path=/update params={wt=javabin&version=2}{add=[111]} 0 0
   [junit4]   2> 650002 INFO  (qtp1320718279-5449) [    x:collection1] o.a.s.u.p.LogUpdateProcessorFactory [collection1]  webapp=/sol

[...truncated too long message...]

reState SolrCoreState ref count has reached 0 - closing IndexWriter
   [junit4]   2> 725776 INFO  (coreCloseExecutor-2795-thread-1) [    x:collection1] o.a.s.u.DefaultSolrCoreState closing IndexWriter with IndexWriterCloser
   [junit4]   2> 725783 INFO  (coreCloseExecutor-2795-thread-1) [    x:collection1] o.a.s.c.SolrCore [collection1] Closing main searcher on request.
   [junit4]   2> 725784 INFO  (coreCloseExecutor-2795-thread-1) [    x:collection1] o.a.s.c.CachingDirectoryFactory Closing MockDirectoryFactory - 2 directories currently being tracked
   [junit4]   2> 725784 INFO  (coreCloseExecutor-2795-thread-1) [    x:collection1] o.a.s.c.CachingDirectoryFactory looking to close /x1/jenkins/jenkins-slave/workspace/Lucene-Solr-Tests-trunk-Java8/solr/build/solr-core/test/J0/temp/solr.handler.TestReplicationHandler_90B644A0B69269D4-001/solr-instance-027/./collection1/data [CachedDir<<refCount=0;path=/x1/jenkins/jenkins-slave/workspace/Lucene-Solr-Tests-trunk-Java8/solr/build/solr-core/test/J0/temp/solr.handler.TestReplicationHandler_90B644A0B69269D4-001/solr-instance-027/./collection1/data;done=false>>]
   [junit4]   2> 725784 INFO  (coreCloseExecutor-2795-thread-1) [    x:collection1] o.a.s.c.CachingDirectoryFactory Closing directory: /x1/jenkins/jenkins-slave/workspace/Lucene-Solr-Tests-trunk-Java8/solr/build/solr-core/test/J0/temp/solr.handler.TestReplicationHandler_90B644A0B69269D4-001/solr-instance-027/./collection1/data
   [junit4]   2> 725784 INFO  (coreCloseExecutor-2795-thread-1) [    x:collection1] o.a.s.c.CachingDirectoryFactory looking to close /x1/jenkins/jenkins-slave/workspace/Lucene-Solr-Tests-trunk-Java8/solr/build/solr-core/test/J0/temp/solr.handler.TestReplicationHandler_90B644A0B69269D4-001/solr-instance-027/./collection1/data/index [CachedDir<<refCount=0;path=/x1/jenkins/jenkins-slave/workspace/Lucene-Solr-Tests-trunk-Java8/solr/build/solr-core/test/J0/temp/solr.handler.TestReplicationHandler_90B644A0B69269D4-001/solr-instance-027/./collection1/data/index;done=false>>]
   [junit4]   2> 725784 INFO  (coreCloseExecutor-2795-thread-1) [    x:collection1] o.a.s.c.CachingDirectoryFactory Closing directory: /x1/jenkins/jenkins-slave/workspace/Lucene-Solr-Tests-trunk-Java8/solr/build/solr-core/test/J0/temp/solr.handler.TestReplicationHandler_90B644A0B69269D4-001/solr-instance-027/./collection1/data/index
   [junit4]   2> 725785 INFO  (TEST-TestReplicationHandler.doTestIndexAndConfigReplication-seed#[90B644A0B69269D4]) [    ] o.e.j.s.h.ContextHandler Stopped o.e.j.s.ServletContextHandler@62eb11e1{/solr,null,UNAVAILABLE}
   [junit4]   2> 725805 INFO  (TEST-TestReplicationHandler.doTestIndexAndConfigReplication-seed#[90B644A0B69269D4]) [    ] o.e.j.s.ServerConnector Stopped ServerConnector@688b613{HTTP/1.1,[http/1.1]}{127.0.0.1:0}
   [junit4]   2> 725806 INFO  (TEST-TestReplicationHandler.doTestIndexAndConfigReplication-seed#[90B644A0B69269D4]) [    ] o.a.s.c.CoreContainer Shutting down CoreContainer instance=893320353
   [junit4]   2> 725814 INFO  (coreCloseExecutor-2796-thread-1) [    x:collection1] o.a.s.c.SolrCore [collection1]  CLOSING SolrCore org.apache.solr.core.SolrCore@c4016d3
   [junit4]   2> 725814 INFO  (coreCloseExecutor-2796-thread-1) [    x:collection1] o.a.s.u.DirectUpdateHandler2 closing DirectUpdateHandler2{commits=0,autocommits=0,soft autocommits=0,optimizes=0,rollbacks=0,expungeDeletes=0,docsPending=0,adds=0,deletesById=0,deletesByQuery=0,errors=0,cumulative_adds=0,cumulative_deletesById=0,cumulative_deletesByQuery=0,cumulative_errors=0}
   [junit4]   2> 725814 INFO  (coreCloseExecutor-2796-thread-1) [    x:collection1] o.a.s.u.SolrCoreState Closing SolrCoreState
   [junit4]   2> 725814 INFO  (coreCloseExecutor-2796-thread-1) [    x:collection1] o.a.s.u.DefaultSolrCoreState SolrCoreState ref count has reached 0 - closing IndexWriter
   [junit4]   2> 725814 INFO  (coreCloseExecutor-2796-thread-1) [    x:collection1] o.a.s.u.DefaultSolrCoreState closing IndexWriter with IndexWriterCloser
   [junit4]   2> 725821 INFO  (coreCloseExecutor-2796-thread-1) [    x:collection1] o.a.s.c.SolrCore [collection1] Closing main searcher on request.
   [junit4]   2> 725822 INFO  (coreCloseExecutor-2796-thread-1) [    x:collection1] o.a.s.c.CachingDirectoryFactory Closing MockDirectoryFactory - 2 directories currently being tracked
   [junit4]   2> 725822 INFO  (coreCloseExecutor-2796-thread-1) [    x:collection1] o.a.s.c.CachingDirectoryFactory looking to close /x1/jenkins/jenkins-slave/workspace/Lucene-Solr-Tests-trunk-Java8/solr/build/solr-core/test/J0/temp/solr.handler.TestReplicationHandler_90B644A0B69269D4-001/solr-instance-028/./collection1/data/index [CachedDir<<refCount=0;path=/x1/jenkins/jenkins-slave/workspace/Lucene-Solr-Tests-trunk-Java8/solr/build/solr-core/test/J0/temp/solr.handler.TestReplicationHandler_90B644A0B69269D4-001/solr-instance-028/./collection1/data/index;done=false>>]
   [junit4]   2> 725822 INFO  (coreCloseExecutor-2796-thread-1) [    x:collection1] o.a.s.c.CachingDirectoryFactory Closing directory: /x1/jenkins/jenkins-slave/workspace/Lucene-Solr-Tests-trunk-Java8/solr/build/solr-core/test/J0/temp/solr.handler.TestReplicationHandler_90B644A0B69269D4-001/solr-instance-028/./collection1/data/index
   [junit4]   2> 725822 INFO  (coreCloseExecutor-2796-thread-1) [    x:collection1] o.a.s.c.CachingDirectoryFactory looking to close /x1/jenkins/jenkins-slave/workspace/Lucene-Solr-Tests-trunk-Java8/solr/build/solr-core/test/J0/temp/solr.handler.TestReplicationHandler_90B644A0B69269D4-001/solr-instance-028/./collection1/data [CachedDir<<refCount=0;path=/x1/jenkins/jenkins-slave/workspace/Lucene-Solr-Tests-trunk-Java8/solr/build/solr-core/test/J0/temp/solr.handler.TestReplicationHandler_90B644A0B69269D4-001/solr-instance-028/./collection1/data;done=false>>]
   [junit4]   2> 725822 INFO  (coreCloseExecutor-2796-thread-1) [    x:collection1] o.a.s.c.CachingDirectoryFactory Closing directory: /x1/jenkins/jenkins-slave/workspace/Lucene-Solr-Tests-trunk-Java8/solr/build/solr-core/test/J0/temp/solr.handler.TestReplicationHandler_90B644A0B69269D4-001/solr-instance-028/./collection1/data
   [junit4]   2> 725822 INFO  (TEST-TestReplicationHandler.doTestIndexAndConfigReplication-seed#[90B644A0B69269D4]) [    ] o.e.j.s.h.ContextHandler Stopped o.e.j.s.ServletContextHandler@78a5af8b{/solr,null,UNAVAILABLE}
   [junit4]   2> 725824 INFO  (SUITE-TestReplicationHandler-seed#[90B644A0B69269D4]-worker) [    ] o.a.s.SolrTestCaseJ4 ###deleteCore
   [junit4]   2> NOTE: leaving temporary files on disk at: /x1/jenkins/jenkins-slave/workspace/Lucene-Solr-Tests-trunk-Java8/solr/build/solr-core/test/J0/temp/solr.handler.TestReplicationHandler_90B644A0B69269D4-001
   [junit4]   2> NOTE: test params are: codec=Asserting(Lucene60): {name=PostingsFormat(name=MockRandom), id=PostingsFormat(name=MockRandom), newname=PostingsFormat(name=MockRandom)}, docValues:{}, maxPointsInLeafNode=1565, maxMBSortInHeap=4.394668606024969, sim=ClassicSimilarity, locale=ar-LY, timezone=Etc/GMT-11
   [junit4]   2> NOTE: Linux 3.13.0-52-generic amd64/Oracle Corporation 1.8.0_66 (64-bit)/cpus=4,threads=1,free=300846600,total=530579456
   [junit4]   2> NOTE: All tests run in this JVM: [CdcrReplicationDistributedZkTest, HdfsRestartWhileUpdatingTest, TestArbitraryIndexDir, LeaderFailoverAfterPartitionTest, DistributedVersionInfoTest, AnalysisErrorHandlingTest, HLLUtilTest, CollectionTooManyReplicasTest, PrimUtilsTest, DisMaxRequestHandlerTest, TestExactStatsCache, PKIAuthenticationIntegrationTest, TestClassicSimilarityFactory, TestLazyCores, TestHighlightDedupGrouping, TestRTGBase, TestPerFieldSimilarityClassic, DistributedExpandComponentTest, TestRTimerTree, TestReqParamsAPI, ActionThrottleTest, CursorMarkTest, SolrCoreTest, ParsingFieldUpdateProcessorsTest, JSONWriterTest, TestSolrQueryParserResource, TestOrdValues, StressHdfsTest, XsltUpdateRequestHandlerTest, DistributedQueryElevationComponentTest, SystemInfoHandlerTest, TestRestManager, TestSchemaNameResource, TestIBSimilarityFactory, PolyFieldTest, PathHierarchyTokenizerFactoryTest, TestXmlQParser, SOLR749Test, DeleteInactiveReplicaTest, OverriddenZkACLAndCredentialsProvidersTest, VMParamsZkACLAndCredentialsProvidersTest, TestCollapseQParserPlugin, HighlighterMaxOffsetTest, RulesTest, DefaultValueUpdateProcessorTest, TestCopyFieldCollectionResource, SignatureUpdateProcessorFactoryTest, ReturnFieldsTest, TestLRUCache, TestStandardQParsers, OutputWriterTest, DeleteShardTest, AlternateDirectoryTest, CurrencyFieldOpenExchangeTest, TestSolrDynamicMBean, RollingRestartTest, TestReplicationHandler]
   [junit4] Completed [207/581 (1!)] on J0 in 77.64s, 13 tests, 1 failure <<< FAILURES!

[...truncated 1228 lines...]
BUILD FAILED
/x1/jenkins/jenkins-slave/workspace/Lucene-Solr-Tests-trunk-Java8/build.xml:740: The following error occurred while executing this line:
/x1/jenkins/jenkins-slave/workspace/Lucene-Solr-Tests-trunk-Java8/build.xml:684: The following error occurred while executing this line:
/x1/jenkins/jenkins-slave/workspace/Lucene-Solr-Tests-trunk-Java8/build.xml:59: The following error occurred while executing this line:
/x1/jenkins/jenkins-slave/workspace/Lucene-Solr-Tests-trunk-Java8/solr/build.xml:233: The following error occurred while executing this line:
/x1/jenkins/jenkins-slave/workspace/Lucene-Solr-Tests-trunk-Java8/solr/common-build.xml:524: The following error occurred while executing this line:
/x1/jenkins/jenkins-slave/workspace/Lucene-Solr-Tests-trunk-Java8/lucene/common-build.xml:1457: The following error occurred while executing this line:
/x1/jenkins/jenkins-slave/workspace/Lucene-Solr-Tests-trunk-Java8/lucene/common-build.xml:1014: There were test failures: 581 suites (8 ignored), 2349 tests, 1 failure, 87 ignored (71 assumptions) [seed: 90B644A0B69269D4]

Total time: 61 minutes 8 seconds
Build step 'Invoke Ant' marked build as failure
Archiving artifacts
Recording test results
Email was triggered for: Failure - Any
Sending email for trigger: Failure - Any



Mime
View raw message