lucene-dev mailing list archives

Site index · List index
Message view « Date » · « Thread »
Top « Date » · « Thread »
From Apache Jenkins Server <jenk...@builds.apache.org>
Subject [JENKINS] Lucene-Solr-Tests-master - Build # 1032 - Still Failing
Date Mon, 21 Mar 2016 23:59:58 GMT
Build: https://builds.apache.org/job/Lucene-Solr-Tests-master/1032/

1 tests failed.
FAILED:  org.apache.solr.cloud.FullSolrCloudDistribCmdsTest.test

Error Message:
expected:<1> but was:<0>

Stack Trace:
java.lang.AssertionError: expected:<1> but was:<0>
	at __randomizedtesting.SeedInfo.seed([F5FD9807FBEA7D1A:7DA9A7DD551610E2]:0)
	at org.junit.Assert.fail(Assert.java:93)
	at org.junit.Assert.failNotEquals(Assert.java:647)
	at org.junit.Assert.assertEquals(Assert.java:128)
	at org.junit.Assert.assertEquals(Assert.java:472)
	at org.junit.Assert.assertEquals(Assert.java:456)
	at org.apache.solr.cloud.FullSolrCloudDistribCmdsTest.addUpdateDelete(FullSolrCloudDistribCmdsTest.java:479)
	at org.apache.solr.cloud.FullSolrCloudDistribCmdsTest.test(FullSolrCloudDistribCmdsTest.java:81)
	at sun.reflect.NativeMethodAccessorImpl.invoke0(Native Method)
	at sun.reflect.NativeMethodAccessorImpl.invoke(NativeMethodAccessorImpl.java:62)
	at sun.reflect.DelegatingMethodAccessorImpl.invoke(DelegatingMethodAccessorImpl.java:43)
	at java.lang.reflect.Method.invoke(Method.java:498)
	at com.carrotsearch.randomizedtesting.RandomizedRunner.invoke(RandomizedRunner.java:1764)
	at com.carrotsearch.randomizedtesting.RandomizedRunner$8.evaluate(RandomizedRunner.java:871)
	at com.carrotsearch.randomizedtesting.RandomizedRunner$9.evaluate(RandomizedRunner.java:907)
	at com.carrotsearch.randomizedtesting.RandomizedRunner$10.evaluate(RandomizedRunner.java:921)
	at org.apache.solr.BaseDistributedSearchTestCase$ShardsRepeatRule$ShardsFixedStatement.callStatement(BaseDistributedSearchTestCase.java:996)
	at org.apache.solr.BaseDistributedSearchTestCase$ShardsRepeatRule$ShardsStatement.evaluate(BaseDistributedSearchTestCase.java:971)
	at com.carrotsearch.randomizedtesting.rules.SystemPropertiesRestoreRule$1.evaluate(SystemPropertiesRestoreRule.java:57)
	at org.apache.lucene.util.TestRuleSetupTeardownChained$1.evaluate(TestRuleSetupTeardownChained.java:49)
	at org.apache.lucene.util.AbstractBeforeAfterRule$1.evaluate(AbstractBeforeAfterRule.java:45)
	at org.apache.lucene.util.TestRuleThreadAndTestName$1.evaluate(TestRuleThreadAndTestName.java:48)
	at org.apache.lucene.util.TestRuleIgnoreAfterMaxFailures$1.evaluate(TestRuleIgnoreAfterMaxFailures.java:64)
	at org.apache.lucene.util.TestRuleMarkFailure$1.evaluate(TestRuleMarkFailure.java:47)
	at com.carrotsearch.randomizedtesting.rules.StatementAdapter.evaluate(StatementAdapter.java:36)
	at com.carrotsearch.randomizedtesting.ThreadLeakControl$StatementRunner.run(ThreadLeakControl.java:367)
	at com.carrotsearch.randomizedtesting.ThreadLeakControl.forkTimeoutingTask(ThreadLeakControl.java:809)
	at com.carrotsearch.randomizedtesting.ThreadLeakControl$3.evaluate(ThreadLeakControl.java:460)
	at com.carrotsearch.randomizedtesting.RandomizedRunner.runSingleTest(RandomizedRunner.java:880)
	at com.carrotsearch.randomizedtesting.RandomizedRunner$5.evaluate(RandomizedRunner.java:781)
	at com.carrotsearch.randomizedtesting.RandomizedRunner$6.evaluate(RandomizedRunner.java:816)
	at com.carrotsearch.randomizedtesting.RandomizedRunner$7.evaluate(RandomizedRunner.java:827)
	at com.carrotsearch.randomizedtesting.rules.StatementAdapter.evaluate(StatementAdapter.java:36)
	at com.carrotsearch.randomizedtesting.rules.SystemPropertiesRestoreRule$1.evaluate(SystemPropertiesRestoreRule.java:57)
	at org.apache.lucene.util.AbstractBeforeAfterRule$1.evaluate(AbstractBeforeAfterRule.java:45)
	at com.carrotsearch.randomizedtesting.rules.StatementAdapter.evaluate(StatementAdapter.java:36)
	at org.apache.lucene.util.TestRuleStoreClassName$1.evaluate(TestRuleStoreClassName.java:41)
	at com.carrotsearch.randomizedtesting.rules.NoShadowingOrOverridesOnMethodsRule$1.evaluate(NoShadowingOrOverridesOnMethodsRule.java:40)
	at com.carrotsearch.randomizedtesting.rules.NoShadowingOrOverridesOnMethodsRule$1.evaluate(NoShadowingOrOverridesOnMethodsRule.java:40)
	at com.carrotsearch.randomizedtesting.rules.StatementAdapter.evaluate(StatementAdapter.java:36)
	at com.carrotsearch.randomizedtesting.rules.StatementAdapter.evaluate(StatementAdapter.java:36)
	at com.carrotsearch.randomizedtesting.rules.StatementAdapter.evaluate(StatementAdapter.java:36)
	at org.apache.lucene.util.TestRuleAssertionsRequired$1.evaluate(TestRuleAssertionsRequired.java:53)
	at org.apache.lucene.util.TestRuleMarkFailure$1.evaluate(TestRuleMarkFailure.java:47)
	at org.apache.lucene.util.TestRuleIgnoreAfterMaxFailures$1.evaluate(TestRuleIgnoreAfterMaxFailures.java:64)
	at org.apache.lucene.util.TestRuleIgnoreTestSuites$1.evaluate(TestRuleIgnoreTestSuites.java:54)
	at com.carrotsearch.randomizedtesting.rules.StatementAdapter.evaluate(StatementAdapter.java:36)
	at com.carrotsearch.randomizedtesting.ThreadLeakControl$StatementRunner.run(ThreadLeakControl.java:367)
	at java.lang.Thread.run(Thread.java:745)




Build Log:
[...truncated 11223 lines...]
   [junit4] Suite: org.apache.solr.cloud.FullSolrCloudDistribCmdsTest
   [junit4]   2> Creating dataDir: /x1/jenkins/jenkins-slave/workspace/Lucene-Solr-Tests-master/solr/build/solr-core/test/J2/temp/solr.cloud.FullSolrCloudDistribCmdsTest_F5FD9807FBEA7D1A-001/init-core-data-001
   [junit4]   2> 576671 INFO  (SUITE-FullSolrCloudDistribCmdsTest-seed#[F5FD9807FBEA7D1A]-worker) [    ] o.a.s.BaseDistributedSearchTestCase Setting hostContext system property: /bed/a
   [junit4]   2> 576679 INFO  (TEST-FullSolrCloudDistribCmdsTest.test-seed#[F5FD9807FBEA7D1A]) [    ] o.a.s.c.ZkTestServer STARTING ZK TEST SERVER
   [junit4]   2> 576679 INFO  (Thread-1842) [    ] o.a.s.c.ZkTestServer client port:0.0.0.0/0.0.0.0:0
   [junit4]   2> 576679 INFO  (Thread-1842) [    ] o.a.s.c.ZkTestServer Starting server
   [junit4]   2> 576779 INFO  (TEST-FullSolrCloudDistribCmdsTest.test-seed#[F5FD9807FBEA7D1A]) [    ] o.a.s.c.ZkTestServer start zk server on port:51324
   [junit4]   2> 576780 INFO  (TEST-FullSolrCloudDistribCmdsTest.test-seed#[F5FD9807FBEA7D1A]) [    ] o.a.s.c.c.SolrZkClient Using default ZkCredentialsProvider
   [junit4]   2> 576780 INFO  (TEST-FullSolrCloudDistribCmdsTest.test-seed#[F5FD9807FBEA7D1A]) [    ] o.a.s.c.c.ConnectionManager Waiting for client to connect to ZooKeeper
   [junit4]   2> 576784 INFO  (zkCallback-608-thread-1) [    ] o.a.s.c.c.ConnectionManager Watcher org.apache.solr.common.cloud.ConnectionManager@fc54451 name:ZooKeeperConnection Watcher:127.0.0.1:51324 got event WatchedEvent state:SyncConnected type:None path:null path:null type:None
   [junit4]   2> 576784 INFO  (TEST-FullSolrCloudDistribCmdsTest.test-seed#[F5FD9807FBEA7D1A]) [    ] o.a.s.c.c.ConnectionManager Client is connected to ZooKeeper
   [junit4]   2> 576784 INFO  (TEST-FullSolrCloudDistribCmdsTest.test-seed#[F5FD9807FBEA7D1A]) [    ] o.a.s.c.c.SolrZkClient Using default ZkACLProvider
   [junit4]   2> 576784 INFO  (TEST-FullSolrCloudDistribCmdsTest.test-seed#[F5FD9807FBEA7D1A]) [    ] o.a.s.c.c.SolrZkClient makePath: /solr
   [junit4]   2> 576791 INFO  (TEST-FullSolrCloudDistribCmdsTest.test-seed#[F5FD9807FBEA7D1A]) [    ] o.a.s.c.c.SolrZkClient Using default ZkCredentialsProvider
   [junit4]   2> 576791 INFO  (TEST-FullSolrCloudDistribCmdsTest.test-seed#[F5FD9807FBEA7D1A]) [    ] o.a.s.c.c.ConnectionManager Waiting for client to connect to ZooKeeper
   [junit4]   2> 576792 INFO  (zkCallback-609-thread-1) [    ] o.a.s.c.c.ConnectionManager Watcher org.apache.solr.common.cloud.ConnectionManager@3daca00b name:ZooKeeperConnection Watcher:127.0.0.1:51324/solr got event WatchedEvent state:SyncConnected type:None path:null path:null type:None
   [junit4]   2> 576792 INFO  (TEST-FullSolrCloudDistribCmdsTest.test-seed#[F5FD9807FBEA7D1A]) [    ] o.a.s.c.c.ConnectionManager Client is connected to ZooKeeper
   [junit4]   2> 576793 INFO  (TEST-FullSolrCloudDistribCmdsTest.test-seed#[F5FD9807FBEA7D1A]) [    ] o.a.s.c.c.SolrZkClient Using default ZkACLProvider
   [junit4]   2> 576793 INFO  (TEST-FullSolrCloudDistribCmdsTest.test-seed#[F5FD9807FBEA7D1A]) [    ] o.a.s.c.c.SolrZkClient makePath: /collections/collection1
   [junit4]   2> 576794 INFO  (TEST-FullSolrCloudDistribCmdsTest.test-seed#[F5FD9807FBEA7D1A]) [    ] o.a.s.c.c.SolrZkClient makePath: /collections/collection1/shards
   [junit4]   2> 576795 INFO  (TEST-FullSolrCloudDistribCmdsTest.test-seed#[F5FD9807FBEA7D1A]) [    ] o.a.s.c.c.SolrZkClient makePath: /collections/control_collection
   [junit4]   2> 576797 INFO  (TEST-FullSolrCloudDistribCmdsTest.test-seed#[F5FD9807FBEA7D1A]) [    ] o.a.s.c.c.SolrZkClient makePath: /collections/control_collection/shards
   [junit4]   2> 576798 INFO  (TEST-FullSolrCloudDistribCmdsTest.test-seed#[F5FD9807FBEA7D1A]) [    ] o.a.s.c.AbstractZkTestCase put /x1/jenkins/jenkins-slave/workspace/Lucene-Solr-Tests-master/solr/core/src/test-files/solr/collection1/conf/solrconfig-tlog.xml to /configs/conf1/solrconfig.xml
   [junit4]   2> 576798 INFO  (TEST-FullSolrCloudDistribCmdsTest.test-seed#[F5FD9807FBEA7D1A]) [    ] o.a.s.c.c.SolrZkClient makePath: /configs/conf1/solrconfig.xml
   [junit4]   2> 576800 INFO  (TEST-FullSolrCloudDistribCmdsTest.test-seed#[F5FD9807FBEA7D1A]) [    ] o.a.s.c.AbstractZkTestCase put /x1/jenkins/jenkins-slave/workspace/Lucene-Solr-Tests-master/solr/core/src/test-files/solr/collection1/conf/schema15.xml to /configs/conf1/schema.xml
   [junit4]   2> 576800 INFO  (TEST-FullSolrCloudDistribCmdsTest.test-seed#[F5FD9807FBEA7D1A]) [    ] o.a.s.c.c.SolrZkClient makePath: /configs/conf1/schema.xml
   [junit4]   2> 576802 INFO  (TEST-FullSolrCloudDistribCmdsTest.test-seed#[F5FD9807FBEA7D1A]) [    ] o.a.s.c.AbstractZkTestCase put /x1/jenkins/jenkins-slave/workspace/Lucene-Solr-Tests-master/solr/core/src/test-files/solr/collection1/conf/solrconfig.snippet.randomindexconfig.xml to /configs/conf1/solrconfig.snippet.randomindexconfig.xml
   [junit4]   2> 576802 INFO  (TEST-FullSolrCloudDistribCmdsTest.test-seed#[F5FD9807FBEA7D1A]) [    ] o.a.s.c.c.SolrZkClient makePath: /configs/conf1/solrconfig.snippet.randomindexconfig.xml
   [junit4]   2> 576803 INFO  (TEST-FullSolrCloudDistribCmdsTest.test-seed#[F5FD9807FBEA7D1A]) [    ] o.a.s.c.AbstractZkTestCase put /x1/jenkins/jenkins-slave/workspace/Lucene-Solr-Tests-master/solr/core/src/test-files/solr/collection1/conf/stopwords.txt to /configs/conf1/stopwords.txt
   [junit4]   2> 576803 INFO  (TEST-FullSolrCloudDistribCmdsTest.test-seed#[F5FD9807FBEA7D1A]) [    ] o.a.s.c.c.SolrZkClient makePath: /configs/conf1/stopwords.txt
   [junit4]   2> 576805 INFO  (TEST-FullSolrCloudDistribCmdsTest.test-seed#[F5FD9807FBEA7D1A]) [    ] o.a.s.c.AbstractZkTestCase put /x1/jenkins/jenkins-slave/workspace/Lucene-Solr-Tests-master/solr/core/src/test-files/solr/collection1/conf/protwords.txt to /configs/conf1/protwords.txt
   [junit4]   2> 576805 INFO  (TEST-FullSolrCloudDistribCmdsTest.test-seed#[F5FD9807FBEA7D1A]) [    ] o.a.s.c.c.SolrZkClient makePath: /configs/conf1/protwords.txt
   [junit4]   2> 576806 INFO  (TEST-FullSolrCloudDistribCmdsTest.test-seed#[F5FD9807FBEA7D1A]) [    ] o.a.s.c.AbstractZkTestCase put /x1/jenkins/jenkins-slave/workspace/Lucene-Solr-Tests-master/solr/core/src/test-files/solr/collection1/conf/currency.xml to /configs/conf1/currency.xml
   [junit4]   2> 576806 INFO  (TEST-FullSolrCloudDistribCmdsTest.test-seed#[F5FD9807FBEA7D1A]) [    ] o.a.s.c.c.SolrZkClient makePath: /configs/conf1/currency.xml
   [junit4]   2> 576808 INFO  (TEST-FullSolrCloudDistribCmdsTest.test-seed#[F5FD9807FBEA7D1A]) [    ] o.a.s.c.AbstractZkTestCase put /x1/jenkins/jenkins-slave/workspace/Lucene-Solr-Tests-master/solr/core/src/test-files/solr/collection1/conf/enumsConfig.xml to /configs/conf1/enumsConfig.xml
   [junit4]   2> 576808 INFO  (TEST-FullSolrCloudDistribCmdsTest.test-seed#[F5FD9807FBEA7D1A]) [    ] o.a.s.c.c.SolrZkClient makePath: /configs/conf1/enumsConfig.xml
   [junit4]   2> 576809 INFO  (TEST-FullSolrCloudDistribCmdsTest.test-seed#[F5FD9807FBEA7D1A]) [    ] o.a.s.c.AbstractZkTestCase put /x1/jenkins/jenkins-slave/workspace/Lucene-Solr-Tests-master/solr/core/src/test-files/solr/collection1/conf/open-exchange-rates.json to /configs/conf1/open-exchange-rates.json
   [junit4]   2> 576809 INFO  (TEST-FullSolrCloudDistribCmdsTest.test-seed#[F5FD9807FBEA7D1A]) [    ] o.a.s.c.c.SolrZkClient makePath: /configs/conf1/open-exchange-rates.json
   [junit4]   2> 576811 INFO  (TEST-FullSolrCloudDistribCmdsTest.test-seed#[F5FD9807FBEA7D1A]) [    ] o.a.s.c.AbstractZkTestCase put /x1/jenkins/jenkins-slave/workspace/Lucene-Solr-Tests-master/solr/core/src/test-files/solr/collection1/conf/mapping-ISOLatin1Accent.txt to /configs/conf1/mapping-ISOLatin1Accent.txt
   [junit4]   2> 576811 INFO  (TEST-FullSolrCloudDistribCmdsTest.test-seed#[F5FD9807FBEA7D1A]) [    ] o.a.s.c.c.SolrZkClient makePath: /configs/conf1/mapping-ISOLatin1Accent.txt
   [junit4]   2> 576812 INFO  (TEST-FullSolrCloudDistribCmdsTest.test-seed#[F5FD9807FBEA7D1A]) [    ] o.a.s.c.AbstractZkTestCase put /x1/jenkins/jenkins-slave/workspace/Lucene-Solr-Tests-master/solr/core/src/test-files/solr/collection1/conf/old_synonyms.txt to /configs/conf1/old_synonyms.txt
   [junit4]   2> 576812 INFO  (TEST-FullSolrCloudDistribCmdsTest.test-seed#[F5FD9807FBEA7D1A]) [    ] o.a.s.c.c.SolrZkClient makePath: /configs/conf1/old_synonyms.txt
   [junit4]   2> 576814 INFO  (TEST-FullSolrCloudDistribCmdsTest.test-seed#[F5FD9807FBEA7D1A]) [    ] o.a.s.c.AbstractZkTestCase put /x1/jenkins/jenkins-slave/workspace/Lucene-Solr-Tests-master/solr/core/src/test-files/solr/collection1/conf/synonyms.txt to /configs/conf1/synonyms.txt
   [junit4]   2> 576814 INFO  (TEST-FullSolrCloudDistribCmdsTest.test-seed#[F5FD9807FBEA7D1A]) [    ] o.a.s.c.c.SolrZkClient makePath: /configs/conf1/synonyms.txt
   [junit4]   2> 576946 INFO  (TEST-FullSolrCloudDistribCmdsTest.test-seed#[F5FD9807FBEA7D1A]) [    ] o.a.s.SolrTestCaseJ4 Writing core.properties file to /x1/jenkins/jenkins-slave/workspace/Lucene-Solr-Tests-master/solr/build/solr-core/test/J2/temp/solr.cloud.FullSolrCloudDistribCmdsTest_F5FD9807FBEA7D1A-001/control-001/cores/collection1
   [junit4]   2> 576948 INFO  (TEST-FullSolrCloudDistribCmdsTest.test-seed#[F5FD9807FBEA7D1A]) [    ] o.e.j.s.Server jetty-9.3.8.v20160314
   [junit4]   2> 576949 INFO  (TEST-FullSolrCloudDistribCmdsTest.test-seed#[F5FD9807FBEA7D1A]) [    ] o.e.j.s.h.ContextHandler Started o.e.j.s.ServletContextHandler@585b5d8f{/bed/a,null,AVAILABLE}
   [junit4]   2> 576950 INFO  (TEST-FullSolrCloudDistribCmdsTest.test-seed#[F5FD9807FBEA7D1A]) [    ] o.e.j.s.ServerConnector Started ServerConnector@7e0a3bb1{HTTP/1.1,[http/1.1]}{127.0.0.1:53285}
   [junit4]   2> 576950 INFO  (TEST-FullSolrCloudDistribCmdsTest.test-seed#[F5FD9807FBEA7D1A]) [    ] o.e.j.s.Server Started @580182ms
   [junit4]   2> 576950 INFO  (TEST-FullSolrCloudDistribCmdsTest.test-seed#[F5FD9807FBEA7D1A]) [    ] o.a.s.c.s.e.JettySolrRunner Jetty properties: {solr.data.dir=/x1/jenkins/jenkins-slave/workspace/Lucene-Solr-Tests-master/solr/build/solr-core/test/J2/temp/solr.cloud.FullSolrCloudDistribCmdsTest_F5FD9807FBEA7D1A-001/tempDir-001/control/data, hostContext=/bed/a, hostPort=53285, coreRootDirectory=/x1/jenkins/jenkins-slave/workspace/Lucene-Solr-Tests-master/solr/build/solr-core/test/J2/temp/solr.cloud.FullSolrCloudDistribCmdsTest_F5FD9807FBEA7D1A-001/control-001/cores}
   [junit4]   2> 576950 INFO  (TEST-FullSolrCloudDistribCmdsTest.test-seed#[F5FD9807FBEA7D1A]) [    ] o.a.s.s.SolrDispatchFilter SolrDispatchFilter.init(): sun.misc.Launcher$AppClassLoader@73d16e93
   [junit4]   2> 576950 INFO  (TEST-FullSolrCloudDistribCmdsTest.test-seed#[F5FD9807FBEA7D1A]) [    ] o.a.s.c.SolrResourceLoader new SolrResourceLoader for directory: '/x1/jenkins/jenkins-slave/workspace/Lucene-Solr-Tests-master/solr/build/solr-core/test/J2/temp/solr.cloud.FullSolrCloudDistribCmdsTest_F5FD9807FBEA7D1A-001/control-001'
   [junit4]   2> 576950 INFO  (TEST-FullSolrCloudDistribCmdsTest.test-seed#[F5FD9807FBEA7D1A]) [    ] o.a.s.c.SolrResourceLoader JNDI not configured for solr (NoInitialContextEx)
   [junit4]   2> 576950 INFO  (TEST-FullSolrCloudDistribCmdsTest.test-seed#[F5FD9807FBEA7D1A]) [    ] o.a.s.c.SolrResourceLoader solr home defaulted to 'solr/' (could not find system property or JNDI)
   [junit4]   2> 576951 INFO  (TEST-FullSolrCloudDistribCmdsTest.test-seed#[F5FD9807FBEA7D1A]) [    ] o.a.s.c.c.SolrZkClient Using default ZkCredentialsProvider
   [junit4]   2> 576961 INFO  (TEST-FullSolrCloudDistribCmdsTest.test-seed#[F5FD9807FBEA7D1A]) [    ] o.a.s.c.c.ConnectionManager Waiting for client to connect to ZooKeeper
   [junit4]   2> 576970 INFO  (zkCallback-610-thread-1) [    ] o.a.s.c.c.ConnectionManager Watcher org.apache.solr.common.cloud.ConnectionManager@3fcc1776 name:ZooKeeperConnection Watcher:127.0.0.1:51324/solr got event WatchedEvent state:SyncConnected type:None path:null path:null type:None
   [junit4]   2> 576971 INFO  (TEST-FullSolrCloudDistribCmdsTest.test-seed#[F5FD9807FBEA7D1A]) [    ] o.a.s.c.c.ConnectionManager Client is connected to ZooKeeper
   [junit4]   2> 576971 INFO  (TEST-FullSolrCloudDistribCmdsTest.test-seed#[F5FD9807FBEA7D1A]) [    ] o.a.s.c.c.SolrZkClient Using default ZkACLProvider
   [junit4]   2> 576978 INFO  (TEST-FullSolrCloudDistribCmdsTest.test-seed#[F5FD9807FBEA7D1A]) [    ] o.a.s.s.SolrDispatchFilter Loading solr.xml from SolrHome (not found in ZooKeeper)
   [junit4]   2> 576978 INFO  (TEST-FullSolrCloudDistribCmdsTest.test-seed#[F5FD9807FBEA7D1A]) [    ] o.a.s.c.SolrXmlConfig Loading container configuration from /x1/jenkins/jenkins-slave/workspace/Lucene-Solr-Tests-master/solr/build/solr-core/test/J2/temp/solr.cloud.FullSolrCloudDistribCmdsTest_F5FD9807FBEA7D1A-001/control-001/solr.xml
   [junit4]   2> 576983 INFO  (TEST-FullSolrCloudDistribCmdsTest.test-seed#[F5FD9807FBEA7D1A]) [    ] o.a.s.c.CorePropertiesLocator Config-defined core root directory: /x1/jenkins/jenkins-slave/workspace/Lucene-Solr-Tests-master/solr/build/solr-core/test/J2/temp/solr.cloud.FullSolrCloudDistribCmdsTest_F5FD9807FBEA7D1A-001/control-001/cores
   [junit4]   2> 576983 INFO  (TEST-FullSolrCloudDistribCmdsTest.test-seed#[F5FD9807FBEA7D1A]) [    ] o.a.s.c.CoreContainer New CoreContainer 586219600
   [junit4]   2> 576983 INFO  (TEST-FullSolrCloudDistribCmdsTest.test-seed#[F5FD9807FBEA7D1A]) [    ] o.a.s.c.CoreContainer Loading cores into CoreContainer [instanceDir=/x1/jenkins/jenkins-slave/workspace/Lucene-Solr-Tests-master/solr/build/solr-core/test/J2/temp/solr.cloud.FullSolrCloudDistribCmdsTest_F5FD9807FBEA7D1A-001/control-001]
   [junit4]   2> 576984 WARN  (TEST-FullSolrCloudDistribCmdsTest.test-seed#[F5FD9807FBEA7D1A]) [    ] o.a.s.c.CoreContainer Couldn't add files from /x1/jenkins/jenkins-slave/workspace/Lucene-Solr-Tests-master/solr/build/solr-core/test/J2/temp/solr.cloud.FullSolrCloudDistribCmdsTest_F5FD9807FBEA7D1A-001/control-001/lib to classpath: /x1/jenkins/jenkins-slave/workspace/Lucene-Solr-Tests-master/solr/build/solr-core/test/J2/temp/solr.cloud.FullSolrCloudDistribCmdsTest_F5FD9807FBEA7D1A-001/control-001/lib
   [junit4]   2> 576984 INFO  (TEST-FullSolrCloudDistribCmdsTest.test-seed#[F5FD9807FBEA7D1A]) [    ] o.a.s.h.c.HttpShardHandlerFactory created with socketTimeout : 90000,urlScheme : ,connTimeout : 15000,maxConnectionsPerHost : 20,maxConnections : 10000,corePoolSize : 0,maximumPoolSize : 2147483647,maxThreadIdleTime : 5,sizeOfQueue : -1,fairnessPolicy : false,useRetries : false,
   [junit4]   2> 576985 INFO  (TEST-FullSolrCloudDistribCmdsTest.test-seed#[F5FD9807FBEA7D1A]) [    ] o.a.s.u.UpdateShardHandler Creating UpdateShardHandler HTTP client with params: socketTimeout=340000&connTimeout=45000&retry=true
   [junit4]   2> 576985 INFO  (TEST-FullSolrCloudDistribCmdsTest.test-seed#[F5FD9807FBEA7D1A]) [    ] o.a.s.l.LogWatcher SLF4J impl is org.slf4j.impl.Log4jLoggerFactory
   [junit4]   2> 576985 INFO  (TEST-FullSolrCloudDistribCmdsTest.test-seed#[F5FD9807FBEA7D1A]) [    ] o.a.s.l.LogWatcher Registering Log Listener [Log4j (org.slf4j.impl.Log4jLoggerFactory)]
   [junit4]   2> 576986 INFO  (TEST-FullSolrCloudDistribCmdsTest.test-seed#[F5FD9807FBEA7D1A]) [    ] o.a.s.c.ZkContainer Zookeeper client=127.0.0.1:51324/solr
   [junit4]   2> 576986 INFO  (TEST-FullSolrCloudDistribCmdsTest.test-seed#[F5FD9807FBEA7D1A]) [    ] o.a.s.c.ZkController zkHost includes chroot
   [junit4]   2> 576986 INFO  (TEST-FullSolrCloudDistribCmdsTest.test-seed#[F5FD9807FBEA7D1A]) [    ] o.a.s.c.c.SolrZkClient Using default ZkCredentialsProvider
   [junit4]   2> 576987 INFO  (TEST-FullSolrCloudDistribCmdsTest.test-seed#[F5FD9807FBEA7D1A]) [    ] o.a.s.c.c.ConnectionManager Waiting for client to connect to ZooKeeper
   [junit4]   2> 576988 INFO  (zkCallback-613-thread-1) [    ] o.a.s.c.c.ConnectionManager Watcher org.apache.solr.common.cloud.ConnectionManager@3ff8fde6 name:ZooKeeperConnection Watcher:127.0.0.1:51324 got event WatchedEvent state:SyncConnected type:None path:null path:null type:None
   [junit4]   2> 576991 INFO  (TEST-FullSolrCloudDistribCmdsTest.test-seed#[F5FD9807FBEA7D1A]) [    ] o.a.s.c.c.ConnectionManager Client is connected to ZooKeeper
   [junit4]   2> 576991 INFO  (TEST-FullSolrCloudDistribCmdsTest.test-seed#[F5FD9807FBEA7D1A]) [    ] o.a.s.c.c.SolrZkClient Using default ZkACLProvider
   [junit4]   2> 577009 INFO  (TEST-FullSolrCloudDistribCmdsTest.test-seed#[F5FD9807FBEA7D1A]) [n:127.0.0.1:53285_bed%2Fa    ] o.a.s.c.c.ConnectionManager Waiting for client to connect to ZooKeeper
   [junit4]   2> 577020 INFO  (zkCallback-614-thread-1-processing-n:127.0.0.1:53285_bed%2Fa) [n:127.0.0.1:53285_bed%2Fa    ] o.a.s.c.c.ConnectionManager Watcher org.apache.solr.common.cloud.ConnectionManager@74df543d name:ZooKeeperConnection Watcher:127.0.0.1:51324/solr got event WatchedEvent state:SyncConnected type:None path:null path:null type:None
   [junit4]   2> 577020 INFO  (TEST-FullSolrCloudDistribCmdsTest.test-seed#[F5FD9807FBEA7D1A]) [n:127.0.0.1:53285_bed%2Fa    ] o.a.s.c.c.ConnectionManager Client is connected to ZooKeeper
   [junit4]   2> 577021 INFO  (TEST-FullSolrCloudDistribCmdsTest.test-seed#[F5FD9807FBEA7D1A]) [n:127.0.0.1:53285_bed%2Fa    ] o.a.s.c.c.SolrZkClient makePath: /overseer/queue
   [junit4]   2> 577022 INFO  (TEST-FullSolrCloudDistribCmdsTest.test-seed#[F5FD9807FBEA7D1A]) [n:127.0.0.1:53285_bed%2Fa    ] o.a.s.c.c.SolrZkClient makePath: /overseer/collection-queue-work
   [junit4]   2> 577024 INFO  (TEST-FullSolrCloudDistribCmdsTest.test-seed#[F5FD9807FBEA7D1A]) [n:127.0.0.1:53285_bed%2Fa    ] o.a.s.c.c.SolrZkClient makePath: /overseer/collection-map-running
   [junit4]   2> 577025 INFO  (TEST-FullSolrCloudDistribCmdsTest.test-seed#[F5FD9807FBEA7D1A]) [n:127.0.0.1:53285_bed%2Fa    ] o.a.s.c.c.SolrZkClient makePath: /overseer/collection-map-completed
   [junit4]   2> 577026 INFO  (TEST-FullSolrCloudDistribCmdsTest.test-seed#[F5FD9807FBEA7D1A]) [n:127.0.0.1:53285_bed%2Fa    ] o.a.s.c.c.SolrZkClient makePath: /overseer/collection-map-failure
   [junit4]   2> 577028 INFO  (TEST-FullSolrCloudDistribCmdsTest.test-seed#[F5FD9807FBEA7D1A]) [n:127.0.0.1:53285_bed%2Fa    ] o.a.s.c.c.SolrZkClient makePath: /live_nodes
   [junit4]   2> 577029 INFO  (TEST-FullSolrCloudDistribCmdsTest.test-seed#[F5FD9807FBEA7D1A]) [n:127.0.0.1:53285_bed%2Fa    ] o.a.s.c.c.SolrZkClient makePath: /aliases.json
   [junit4]   2> 577030 INFO  (TEST-FullSolrCloudDistribCmdsTest.test-seed#[F5FD9807FBEA7D1A]) [n:127.0.0.1:53285_bed%2Fa    ] o.a.s.c.c.SolrZkClient makePath: /clusterstate.json
   [junit4]   2> 577030 INFO  (TEST-FullSolrCloudDistribCmdsTest.test-seed#[F5FD9807FBEA7D1A]) [n:127.0.0.1:53285_bed%2Fa    ] o.a.s.c.c.SolrZkClient makePath: /security.json
   [junit4]   2> 577031 INFO  (TEST-FullSolrCloudDistribCmdsTest.test-seed#[F5FD9807FBEA7D1A]) [n:127.0.0.1:53285_bed%2Fa    ] o.a.s.c.c.ZkStateReader Updating cluster state from ZooKeeper... 
   [junit4]   2> 577032 INFO  (TEST-FullSolrCloudDistribCmdsTest.test-seed#[F5FD9807FBEA7D1A]) [n:127.0.0.1:53285_bed%2Fa    ] o.a.s.c.c.ZkStateReader Updated live nodes from ZooKeeper... (0) -> (0)
   [junit4]   2> 577034 INFO  (TEST-FullSolrCloudDistribCmdsTest.test-seed#[F5FD9807FBEA7D1A]) [n:127.0.0.1:53285_bed%2Fa    ] o.a.s.c.c.SolrZkClient makePath: /overseer_elect
   [junit4]   2> 577035 INFO  (TEST-FullSolrCloudDistribCmdsTest.test-seed#[F5FD9807FBEA7D1A]) [n:127.0.0.1:53285_bed%2Fa    ] o.a.s.c.c.SolrZkClient makePath: /overseer_elect/election
   [junit4]   2> 577035 INFO  (TEST-FullSolrCloudDistribCmdsTest.test-seed#[F5FD9807FBEA7D1A]) [n:127.0.0.1:53285_bed%2Fa    ] o.a.s.c.Overseer Overseer (id=null) closing
   [junit4]   2> 577036 INFO  (TEST-FullSolrCloudDistribCmdsTest.test-seed#[F5FD9807FBEA7D1A]) [n:127.0.0.1:53285_bed%2Fa    ] o.a.s.c.LeaderElector Joined leadership election with path: /overseer_elect/election/95591015245086724-127.0.0.1:53285_bed%2Fa-n_0000000000
   [junit4]   2> 577036 INFO  (TEST-FullSolrCloudDistribCmdsTest.test-seed#[F5FD9807FBEA7D1A]) [n:127.0.0.1:53285_bed%2Fa    ] o.a.s.c.OverseerElectionContext I am going to be the leader 127.0.0.1:53285_bed%2Fa
   [junit4]   2> 577036 INFO  (TEST-FullSolrCloudDistribCmdsTest.test-seed#[F5FD9807FBEA7D1A]) [n:127.0.0.1:53285_bed%2Fa    ] o.a.s.c.c.SolrZkClient makePath: /overseer_elect/leader
   [junit4]   2> 577037 INFO  (TEST-FullSolrCloudDistribCmdsTest.test-seed#[F5FD9807FBEA7D1A]) [n:127.0.0.1:53285_bed%2Fa    ] o.a.s.c.Overseer Overseer (id=95591015245086724-127.0.0.1:53285_bed%2Fa-n_0000000000) starting
   [junit4]   2> 577038 INFO  (TEST-FullSolrCloudDistribCmdsTest.test-seed#[F5FD9807FBEA7D1A]) [n:127.0.0.1:53285_bed%2Fa    ] o.a.s.c.c.SolrZkClient makePath: /overseer/queue-work
   [junit4]   2> 577042 INFO  (TEST-FullSolrCloudDistribCmdsTest.test-seed#[F5FD9807FBEA7D1A]) [n:127.0.0.1:53285_bed%2Fa    ] o.a.s.c.OverseerAutoReplicaFailoverThread Starting OverseerAutoReplicaFailoverThread autoReplicaFailoverWorkLoopDelay=10000 autoReplicaFailoverWaitAfterExpiration=30000 autoReplicaFailoverBadNodeExpiration=60000
   [junit4]   2> 577048 INFO  (OverseerStateUpdate-95591015245086724-127.0.0.1:53285_bed%2Fa-n_0000000000) [n:127.0.0.1:53285_bed%2Fa    ] o.a.s.c.Overseer Starting to work on the main queue
   [junit4]   2> 577051 INFO  (OverseerCollectionConfigSetProcessor-95591015245086724-127.0.0.1:53285_bed%2Fa-n_0000000000) [n:127.0.0.1:53285_bed%2Fa    ] o.a.s.c.OverseerTaskProcessor Process current queue of overseer operations
   [junit4]   2> 577052 INFO  (TEST-FullSolrCloudDistribCmdsTest.test-seed#[F5FD9807FBEA7D1A]) [n:127.0.0.1:53285_bed%2Fa    ] o.a.s.c.ZkController Register node as live in ZooKeeper:/live_nodes/127.0.0.1:53285_bed%2Fa
   [junit4]   2> 577052 INFO  (TEST-FullSolrCloudDistribCmdsTest.test-seed#[F5FD9807FBEA7D1A]) [n:127.0.0.1:53285_bed%2Fa    ] o.a.s.c.c.SolrZkClient makePath: /live_nodes/127.0.0.1:53285_bed%2Fa
   [junit4]   2> 577053 INFO  (OverseerStateUpdate-95591015245086724-127.0.0.1:53285_bed%2Fa-n_0000000000) [n:127.0.0.1:53285_bed%2Fa    ] o.a.s.c.c.ZkStateReader Updated live nodes from ZooKeeper... (0) -> (0)
   [junit4]   2> 577053 INFO  (zkCallback-614-thread-1-processing-n:127.0.0.1:53285_bed%2Fa) [n:127.0.0.1:53285_bed%2Fa    ] o.a.s.c.c.ZkStateReader A live node change: [WatchedEvent state:SyncConnected type:NodeChildrenChanged path:/live_nodes], has occurred - updating... (live nodes size: [0])
   [junit4]   2> 577054 INFO  (zkCallback-614-thread-1-processing-n:127.0.0.1:53285_bed%2Fa) [n:127.0.0.1:53285_bed%2Fa    ] o.a.s.c.c.ZkStateReader Updated live nodes from ZooKeeper... (0) -> (1)
   [junit4]   2> 577062 INFO  (TEST-FullSolrCloudDistribCmdsTest.test-seed#[F5FD9807FBEA7D1A]) [n:127.0.0.1:53285_bed%2Fa    ] o.a.s.c.CoreContainer Security conf doesn't exist. Skipping setup for authorization module.
   [junit4]   2> 577062 INFO  (TEST-FullSolrCloudDistribCmdsTest.test-seed#[F5FD9807FBEA7D1A]) [n:127.0.0.1:53285_bed%2Fa    ] o.a.s.c.CoreContainer No authentication plugin used.
   [junit4]   2> 577063 INFO  (TEST-FullSolrCloudDistribCmdsTest.test-seed#[F5FD9807FBEA7D1A]) [n:127.0.0.1:53285_bed%2Fa    ] o.a.s.c.CorePropertiesLocator Looking for core definitions underneath /x1/jenkins/jenkins-slave/workspace/Lucene-Solr-Tests-master/solr/build/solr-core/test/J2/temp/solr.cloud.FullSolrCloudDistribCmdsTest_F5FD9807FBEA7D1A-001/control-001/cores
   [junit4]   2> 577064 INFO  (TEST-FullSolrCloudDistribCmdsTest.test-seed#[F5FD9807FBEA7D1A]) [n:127.0.0.1:53285_bed%2Fa    ] o.a.s.c.CoreDescriptor Created CoreDescriptor: {name=collection1, config=solrconfig.xml, transient=false, schema=schema.xml, loadOnStartup=true, configSetProperties=configsetprops.json, collection=control_collection, coreNodeName=, dataDir=data/, shard=}
   [junit4]   2> 577064 INFO  (TEST-FullSolrCloudDistribCmdsTest.test-seed#[F5FD9807FBEA7D1A]) [n:127.0.0.1:53285_bed%2Fa    ] o.a.s.c.CorePropertiesLocator Found core collection1 in /x1/jenkins/jenkins-slave/workspace/Lucene-Solr-Tests-master/solr/build/solr-core/test/J2/temp/solr.cloud.FullSolrCloudDistribCmdsTest_F5FD9807FBEA7D1A-001/control-001/cores/collection1
   [junit4]   2> 577064 INFO  (TEST-FullSolrCloudDistribCmdsTest.test-seed#[F5FD9807FBEA7D1A]) [n:127.0.0.1:53285_bed%2Fa    ] o.a.s.c.CorePropertiesLocator Found 1 core definitions
   [junit4]   2> 577067 INFO  (coreLoadExecutor-1944-thread-1-processing-n:127.0.0.1:53285_bed%2Fa) [n:127.0.0.1:53285_bed%2Fa c:control_collection   x:collection1] o.a.s.c.ZkController publishing state=down
   [junit4]   2> 577067 INFO  (coreLoadExecutor-1944-thread-1-processing-n:127.0.0.1:53285_bed%2Fa) [n:127.0.0.1:53285_bed%2Fa c:control_collection   x:collection1] o.a.s.c.ZkController numShards not found on descriptor - reading it from system property
   [junit4]   2> 577069 INFO  (coreLoadExecutor-1944-thread-1-processing-n:127.0.0.1:53285_bed%2Fa) [n:127.0.0.1:53285_bed%2Fa c:control_collection   x:collection1] o.a.s.c.ZkController look for our core node name
   [junit4]   2> 577076 INFO  (TEST-FullSolrCloudDistribCmdsTest.test-seed#[F5FD9807FBEA7D1A]) [n:127.0.0.1:53285_bed%2Fa    ] o.a.s.s.SolrDispatchFilter user.dir=/x1/jenkins/jenkins-slave/workspace/Lucene-Solr-Tests-master/solr/build/solr-core/test/J2
   [junit4]   2> 577076 INFO  (TEST-FullSolrCloudDistribCmdsTest.test-seed#[F5FD9807FBEA7D1A]) [n:127.0.0.1:53285_bed%2Fa    ] o.a.s.s.SolrDispatchFilter SolrDispatchFilter.init() done
   [junit4]   2> 577076 INFO  (OverseerStateUpdate-95591015245086724-127.0.0.1:53285_bed%2Fa-n_0000000000) [n:127.0.0.1:53285_bed%2Fa    ] o.a.s.c.Overseer processMessage: queueSize: 1, message = {
   [junit4]   2>   "core":"collection1",
   [junit4]   2>   "roles":null,
   [junit4]   2>   "base_url":"http://127.0.0.1:53285/bed/a",
   [junit4]   2>   "node_name":"127.0.0.1:53285_bed%2Fa",
   [junit4]   2>   "numShards":"1",
   [junit4]   2>   "state":"down",
   [junit4]   2>   "shard":null,
   [junit4]   2>   "collection":"control_collection",
   [junit4]   2>   "operation":"state"} current state version: 0
   [junit4]   2> 577077 INFO  (OverseerStateUpdate-95591015245086724-127.0.0.1:53285_bed%2Fa-n_0000000000) [n:127.0.0.1:53285_bed%2Fa    ] o.a.s.c.o.ReplicaMutator Update state numShards=1 message={
   [junit4]   2>   "core":"collection1",
   [junit4]   2>   "roles":null,
   [junit4]   2>   "base_url":"http://127.0.0.1:53285/bed/a",
   [junit4]   2>   "node_name":"127.0.0.1:53285_bed%2Fa",
   [junit4]   2>   "numShards":"1",
   [junit4]   2>   "state":"down",
   [junit4]   2>   "shard":null,
   [junit4]   2>   "collection":"control_collection",
   [junit4]   2>   "operation":"state"}
   [junit4]   2> 577077 INFO  (OverseerStateUpdate-95591015245086724-127.0.0.1:53285_bed%2Fa-n_0000000000) [n:127.0.0.1:53285_bed%2Fa    ] o.a.s.c.o.ClusterStateMutator building a new cName: control_collection
   [junit4]   2> 577077 INFO  (OverseerStateUpdate-95591015245086724-127.0.0.1:53285_bed%2Fa-n_0000000000) [n:127.0.0.1:53285_bed%2Fa    ] o.a.s.c.o.ReplicaMutator Assigning new node to shard shard=shard1
   [junit4]   2> 577079 INFO  (zkCallback-614-thread-1-processing-n:127.0.0.1:53285_bed%2Fa) [n:127.0.0.1:53285_bed%2Fa    ] o.a.s.c.c.ZkStateReader A cluster state change: [WatchedEvent state:SyncConnected type:NodeDataChanged path:/clusterstate.json], has occurred - updating... (live nodes size: [1])
   [junit4]   2> 578069 INFO  (coreLoadExecutor-1944-thread-1-processing-n:127.0.0.1:53285_bed%2Fa) [n:127.0.0.1:53285_bed%2Fa c:control_collection   x:collection1] o.a.s.c.ZkController waiting to find shard id in clusterstate for collection1
   [junit4]   2> 578069 INFO  (coreLoadExecutor-1944-thread-1-processing-n:127.0.0.1:53285_bed%2Fa) [n:127.0.0.1:53285_bed%2Fa c:control_collection   x:collection1] o.a.s.c.ZkController Check for collection zkNode:control_collection
   [junit4]   2> 578070 INFO  (coreLoadExecutor-1944-thread-1-processing-n:127.0.0.1:53285_bed%2Fa) [n:127.0.0.1:53285_bed%2Fa c:control_collection   x:collection1] o.a.s.c.ZkController Collection zkNode exists
   [junit4]   2> 578070 INFO  (coreLoadExecutor-1944-thread-1-processing-n:127.0.0.1:53285_bed%2Fa) [n:127.0.0.1:53285_bed%2Fa c:control_collection   x:collection1] o.a.s.c.c.ZkStateReader Load collection config from: [/collections/control_collection]
   [junit4]   2> 578070 INFO  (coreLoadExecutor-1944-thread-1-processing-n:127.0.0.1:53285_bed%2Fa) [n:127.0.0.1:53285_bed%2Fa c:control_collection   x:collection1] o.a.s.c.c.ZkStateReader path=[/collections/control_collection] [configName]=[conf1] specified config exists in ZooKeeper
   [junit4]   2> 578070 INFO  (coreLoadExecutor-1944-thread-1-processing-n:127.0.0.1:53285_bed%2Fa) [n:127.0.0.1:53285_bed%2Fa c:control_collection   x:collection1] o.a.s.c.SolrResourceLoader new SolrResourceLoader for directory: '/x1/jenkins/jenkins-slave/workspace/Lucene-Solr-Tests-master/solr/build/solr-core/test/J2/temp/solr.cloud.FullSolrCloudDistribCmdsTest_F5FD9807FBEA7D1A-001/control-001/cores/collection1'
   [junit4]   2> 578071 INFO  (coreLoadExecutor-1944-thread-1-processing-n:127.0.0.1:53285_bed%2Fa) [n:127.0.0.1:53285_bed%2Fa c:control_collection   x:collection1] o.a.s.c.SolrResourceLoader JNDI not configured for solr (NoInitialContextEx)
   [junit4]   2> 578071 INFO  (coreLoadExecutor-1944-thread-1-processing-n:127.0.0.1:53285_bed%2Fa) [n:127.0.0.1:53285_bed%2Fa c:control_collection   x:collection1] o.a.s.c.SolrResourceLoader solr home defaulted to 'solr/' (could not find system property or JNDI)
   [junit4]   2> 578072 INFO  (coreLoadExecutor-1944-thread-1-processing-n:127.0.0.1:53285_bed%2Fa) [n:127.0.0.1:53285_bed%2Fa c:control_collection   x:collection1] o.a.s.c.Config loaded config solrconfig.xml with version 0 
   [junit4]   2> 578077 INFO  (coreLoadExecutor-1944-thread-1-processing-n:127.0.0.1:53285_bed%2Fa) [n:127.0.0.1:53285_bed%2Fa c:control_collection   x:collection1] o.a.s.c.SolrConfig current version of requestparams : -1
   [junit4]   2> 578081 INFO  (coreLoadExecutor-1944-thread-1-processing-n:127.0.0.1:53285_bed%2Fa) [n:127.0.0.1:53285_bed%2Fa c:control_collection   x:collection1] o.a.s.c.SolrConfig Using Lucene MatchVersion: 7.0.0
   [junit4]   2> 578120 INFO  (coreLoadExecutor-1944-thread-1-processing-n:127.0.0.1:53285_bed%2Fa) [n:127.0.0.1:53285_bed%2Fa c:control_collection   x:collection1] o.a.s.c.SolrConfig Loaded SolrConfig: solrconfig.xml
   [junit4]   2> 578136 INFO  (coreLoadExecutor-1944-thread-1-processing-n:127.0.0.1:53285_bed%2Fa) [n:127.0.0.1:53285_bed%2Fa c:control_collection   x:collection1] o.a.s.s.IndexSchema [collection1] Schema name=test
   [junit4]   2> 578249 INFO  (coreLoadExecutor-1944-thread-1-processing-n:127.0.0.1:53285_bed%2Fa) [n:127.0.0.1:53285_bed%2Fa c:control_collection   x:collection1] o.a.s.s.IndexSchema default search field in schema is text
   [junit4]   2> 578250 INFO  (coreLoadExecutor-1944-thread-1-processing-n:127.0.0.1:53285_bed%2Fa) [n:127.0.0.1:53285_bed%2Fa c:control_collection   x:collection1] o.a.s.s.IndexSchema unique key field: id
   [junit4]   2> 578250 INFO  (coreLoadExecutor-1944-thread-1-processing-n:127.0.0.1:53285_bed%2Fa) [n:127.0.0.1:53285_bed%2Fa c:control_collection   x:collection1] o.a.s.s.FileExchangeRateProvider Reloading exchange rates from file currency.xml
   [junit4]   2> 578252 INFO  (coreLoadExecutor-1944-thread-1-processing-n:127.0.0.1:53285_bed%2Fa) [n:127.0.0.1:53285_bed%2Fa c:control_collection   x:collection1] o.a.s.s.FileExchangeRateProvider Reloading exchange rates from file currency.xml
   [junit4]   2> 578267 INFO  (coreLoadExecutor-1944-thread-1-processing-n:127.0.0.1:53285_bed%2Fa) [n:127.0.0.1:53285_bed%2Fa c:control_collection   x:collection1] o.a.s.c.ConfigSetProperties Did not find ConfigSet properties, assuming default properties: Can't find resource 'configsetprops.json' in classpath or '/configs/conf1', cwd=/x1/jenkins/jenkins-slave/workspace/Lucene-Solr-Tests-master/solr/build/solr-core/test/J2
   [junit4]   2> 578267 INFO  (coreLoadExecutor-1944-thread-1-processing-n:127.0.0.1:53285_bed%2Fa) [n:127.0.0.1:53285_bed%2Fa c:control_collection   x:collection1] o.a.s.c.CoreContainer Creating SolrCore 'collection1' using configuration from collection control_collection
   [junit4]   2> 578267 INFO  (coreLoadExecutor-1944-thread-1-processing-n:127.0.0.1:53285_bed%2Fa) [n:127.0.0.1:53285_bed%2Fa c:control_collection s:shard1 r:core_node1 x:collection1] o.a.s.c.SolrCore org.apache.solr.core.MockDirectoryFactory
   [junit4]   2> 578267 INFO  (coreLoadExecutor-1944-thread-1-processing-n:127.0.0.1:53285_bed%2Fa) [n:127.0.0.1:53285_bed%2Fa c:control_collection s:shard1 r:core_node1 x:collection1] o.a.s.c.SolrCore [[collection1] ] Opening new SolrCore at [/x1/jenkins/jenkins-slave/workspace/Lucene-Solr-Tests-master/solr/build/solr-core/test/J2/temp/solr.cloud.FullSolrCloudDistribCmdsTest_F5FD9807FBEA7D1A-001/control-001/cores/collection1], dataDir=[/x1/jenkins/jenkins-slave/workspace/Lucene-Solr-Tests-master/solr/build/solr-core/test/J2/temp/solr.cloud.FullSolrCloudDistribCmdsTest_F5FD9807FBEA7D1A-001/control-001/cores/collection1/data/]
   [junit4]   2> 578268 INFO  (coreLoadExecutor-1944-thread-1-processing-n:127.0.0.1:53285_bed%2Fa) [n:127.0.0.1:53285_bed%2Fa c:control_collection s:shard1 r:core_node1 x:collection1] o.a.s.c.JmxMonitoredMap JMX monitoring is enabled. Adding Solr mbeans to JMX Server: com.sun.jmx.mbeanserver.JmxMBeanServer@78aed704
   [junit4]   2> 578268 INFO  (coreLoadExecutor-1944-thread-1-processing-n:127.0.0.1:53285_bed%2Fa) [n:127.0.0.1:53285_bed%2Fa c:control_collection s:shard1 r:core_node1 x:collection1] o.a.s.c.CachingDirectoryFactory return new directory for /x1/jenkins/jenkins-slave/workspace/Lucene-Solr-Tests-master/solr/build/solr-core/test/J2/temp/solr.cloud.FullSolrCloudDistribCmdsTest_F5FD9807FBEA7D1A-001/control-001/cores/collection1/data
   [junit4]   2> 578268 INFO  (coreLoadExecutor-1944-thread-1-processing-n:127.0.0.1:53285_bed%2Fa) [n:127.0.0.1:53285_bed%2Fa c:control_collection s:shard1 r:core_node1 x:collection1] o.a.s.c.SolrCore New index directory detected: old=null new=/x1/jenkins/jenkins-slave/workspace/Lucene-Solr-Tests-master/solr/build/solr-core/test/J2/temp/solr.cloud.FullSolrCloudDistribCmdsTest_F5FD9807FBEA7D1A-001/control-001/cores/collection1/data/index/
   [junit4]   2> 578268 WARN  (coreLoadExecutor-1944-thread-1-processing-n:127.0.0.1:53285_bed%2Fa) [n:127.0.0.1:53285_bed%2Fa c:control_collection s:shard1 r:core_node1 x:collection1] o.a.s.c.SolrCore [collection1] Solr index directory '/x1/jenkins/jenkins-slave/workspace/Lucene-Solr-Tests-master/solr/build/solr-core/test/J2/temp/solr.cloud.FullSolrCloudDistribCmdsTest_F5FD9807FBEA7D1A-001/control-001/cores/collection1/data/index' doesn't exist. Creating new index...
   [junit4]   2> 578269 INFO  (coreLoadExecutor-1944-thread-1-processing-n:127.0.0.1:53285_bed%2Fa) [n:127.0.0.1:53285_bed%2Fa c:control_collection s:shard1 r:core_node1 x:collection1] o.a.s.c.CachingDirectoryFactory return new directory for /x1/jenkins/jenkins-slave/workspace/Lucene-Solr-Tests-master/solr/build/solr-core/test/J2/temp/solr.cloud.FullSolrCloudDistribCmdsTest_F5FD9807FBEA7D1A-001/control-001/cores/collection1/data/index
   [junit4]   2> 578269 INFO  (coreLoadExecutor-1944-thread-1-processing-n:127.0.0.1:53285_bed%2Fa) [n:127.0.0.1:53285_bed%2Fa c:control_collection s:shard1 r:core_node1 x:collection1] o.a.s.u.RandomMergePolicy RandomMergePolicy wrapping class org.apache.lucene.index.AlcoholicMergePolicy: [AlcoholicMergePolicy: minMergeSize=0, mergeFactor=10, maxMergeSize=1092697740, maxMergeSizeForForcedMerge=9223372036854775807, calibrateSizeByDeletes=true, maxMergeDocs=2147483647, maxCFSSegmentSizeMB=8.796093022207999E12, noCFSRatio=0.1]
   [junit4]   2> 578269 INFO  (coreLoadExecutor-1944-thread-1-processing-n:127.0.0.1:53285_bed%2Fa) [n:127.0.0.1:53285_bed%2Fa c:control_collection s:shard1 r:core_node1 x:collection1] o.a.s.c.SolrDeletionPolicy SolrDeletionPolicy.onCommit: commits: num=1
   [junit4]   2> 	commit{dir=MockDirectoryWrapper(RAMDirectory@670b3a6 lockFactory=org.apache.lucene.store.SingleInstanceLockFactory@ece7084),segFN=segments_1,generation=1}
   [junit4]   2> 578270 INFO  (coreLoadExecutor-1944-thread-1-processing-n:127.0.0.1:53285_bed%2Fa) [n:127.0.0.1:53285_bed%2Fa c:control_collection s:shard1 r:core_node1 x:collection1] o.a.s.c.SolrDeletionPolicy newest commit generation = 1
   [junit4]   2> 578283 INFO  (coreLoadExecutor-1944-thread-1-processing-n:127.0.0.1:53285_bed%2Fa) [n:127.0.0.1:53285_bed%2Fa c:control_collection s:shard1 r:core_node1 x:collection1] o.a.s.u.p.UpdateRequestProcessorChain creating updateRequestProcessorChain "nodistrib"
   [junit4]   2> 578283 INFO  (coreLoadExecutor-1944-thread-1-processing-n:127.0.0.1:53285_bed%2Fa) [n:127.0.0.1:53285_bed%2Fa c:control_collection s:shard1 r:core_node1 x:collection1] o.a.s.u.p.UpdateRequestProcessorChain creating updateRequestProcessorChain "dedupe"
   [junit4]   2> 578283 INFO  (coreLoadExecutor-1944-thread-1-processing-n:127.0.0.1:53285_bed%2Fa) [n:127.0.0.1:53285_bed%2Fa c:control_collection s:shard1 r:core_node1 x:collection1] o.a.s.u.p.UpdateRequestProcessorChain inserting DistributedUpdateProcessorFactory into updateRequestProcessorChain "dedupe"
   [junit4]   2> 578283 INFO  (coreLoadExecutor-1944-thread-1-processing-n:127.0.0.1:53285_bed%2Fa) [n:127.0.0.1:53285_bed%2Fa c:control_collection s:shard1 r:core_node1 x:collection1] o.a.s.u.p.UpdateRequestProcessorChain creating updateRequestProcessorChain "stored_sig"
   [junit4]   2> 578283 INFO  (coreLoadExecutor-1944-thread-1-processing-n:127.0.0.1:53285_bed%2Fa) [n:127.0.0.1:53285_bed%2Fa c:control_collection s:shard1 r:core_node1 x:collection1] o.a.s.u.p.UpdateRequestProcessorChain inserting DistributedUpdateProcessorFactory into updateRequestProcessorChain "stored_sig"
   [junit4]   2> 578283 INFO  (coreLoadExecutor-1944-thread-1-processing-n:127.0.0.1:53285_bed%2Fa) [n:127.0.0.1:53285_bed%2Fa c:control_collection s:shard1 r:core_node1 x:collection1] o.a.s.u.p.UpdateRequestProcessorChain creating updateRequestProcessorChain "distrib-dup-test-chain-explicit"
   [junit4]   2> 578284 INFO  (coreLoadExecutor-1944-thread-1-processing-n:127.0.0.1:53285_bed%2Fa) [n:127.0.0.1:53285_bed%2Fa c:control_collection s:shard1 r:core_node1 x:collection1] o.a.s.u.p.UpdateRequestProcessorChain creating updateRequestProcessorChain "distrib-dup-test-chain-implicit"
   [junit4]   2> 578284 INFO  (coreLoadExecutor-1944-thread-1-processing-n:127.0.0.1:53285_bed%2Fa) [n:127.0.0.1:53285_bed%2Fa c:control_collection s:shard1 r:core_node1 x:collection1] o.a.s.u.p.UpdateRequestProcessorChain inserting DistributedUpdateProcessorFactory into updateRequestProcessorChain "distrib-dup-test-chain-implicit"
   [junit4]   2> 578284 INFO  (coreLoadExecutor-1944-thread-1-processing-n:127.0.0.1:53285_bed%2Fa) [n:127.0.0.1:53285_bed%2Fa c:control_collection s:shard1 r:core_node1 x:collection1] o.a.s.c.SolrCore no updateRequestProcessorChain defined as default, creating implicit default
   [junit4]   2> 578284 WARN  (coreLoadExecutor-1944-thread-1-processing-n:127.0.0.1:53285_bed%2Fa) [n:127.0.0.1:53285_bed%2Fa c:control_collection s:shard1 r:core_node1 x:collection1] o.a.s.c.RequestHandlers INVALID paramSet a in requestHandler {type = requestHandler,name = /dump,class = DumpRequestHandler,args = {defaults={a=A,b=B}}}
   [junit4]   2> 578285 INFO  (coreLoadExecutor-1944-thread-1-processing-n:127.0.0.1:53285_bed%2Fa) [n:127.0.0.1:53285_bed%2Fa c:control_collection s:shard1 r:core_node1 x:collection1] o.a.s.h.l.XMLLoader xsltCacheLifetimeSeconds=60
   [junit4]   2> 578286 INFO  (coreLoadExecutor-1944-thread-1-processing-n:127.0.0.1:53285_bed%2Fa) [n:127.0.0.1:53285_bed%2Fa c:control_collection s:shard1 r:core_node1 x:collection1] o.a.s.h.l.XMLLoader xsltCacheLifetimeSeconds=60
   [junit4]   2> 578286 INFO  (OldIndexDirectoryCleanupThreadForCore-collection1) [n:127.0.0.1:53285_bed%2Fa c:control_collection s:shard1 r:core_node1 x:collection1] o.a.s.c.SolrCore Looking for old index directories to cleanup for core collection1 in /x1/jenkins/jenkins-slave/workspace/Lucene-Solr-Tests-master/solr/build/solr-core/test/J2/temp/solr.cloud.FullSolrCloudDistribCmdsTest_F5FD9807FBEA7D1A-001/control-001/cores/collection1/data/
   [junit4]   2> 578287 WARN  (OldIndexDirectoryCleanupThreadForCore-collection1) [n:127.0.0.1:53285_bed%2Fa c:control_collection s:shard1 r:core_node1 x:collection1] o.a.s.c.DirectoryFactory /x1/jenkins/jenkins-slave/workspace/Lucene-Solr-Tests-master/solr/build/solr-core/test/J2/temp/solr.cloud.FullSolrCloudDistribCmdsTest_F5FD9807FBEA7D1A-001/control-001/cores/collection1/data/ does not point to a valid data directory; skipping clean-up of old index directories.
   [junit4]   2> 578288 INFO  (coreLoadExecutor-1944-thread-1-processing-n:127.0.0.1:53285_bed%2Fa) [n:127.0.0.1:53285_bed%2Fa c:control_collection s:shard1 r:core_node1 x:collection1] o.a.s.h.l.XMLLoader xsltCacheLifetimeSeconds=60
   [junit4]   2> 578289 INFO  (coreLoadExecutor-1944-thread-1-processing-n:127.0.0.1:53285_bed%2Fa) [n:127.0.0.1:53285_bed%2Fa c:control_collection s:shard1 r:core_node1 x:collection1] o.a.s.h.l.XMLLoader xsltCacheLifetimeSeconds=60
   [junit4]   2> 578292 INFO  (coreLoadExecutor-1944-thread-1-processing-n:127.0.0.1:53285_bed%2Fa) [n:127.0.0.1:53285_bed%2Fa c:control_collection s:shard1 r:core_node1 x:collection1] o.a.s.c.RequestHandlers Registered paths: /admin/mbeans,standard,/dump,/update/csv,/sql,/update/json/docs,/admin/luke,/export,/admin/segments,/get,/admin/system,/replication,/admin/properties,/config,/stream,/schema,/admin/plugins,/admin/logging,/update/json,/admin/ping,/admin/threads,/update,/admin/file
   [junit4]   2> 578292 INFO  (coreLoadExecutor-1944-thread-1-processing-n:127.0.0.1:53285_bed%2Fa) [n:127.0.0.1:53285_bed%2Fa c:control_collection s:shard1 r:core_node1 x:collection1] o.a.s.c.SolrCore Using default statsCache cache: org.apache.solr.search.stats.LocalStatsCache
   [junit4]   2> 578294 INFO  (coreLoadExecutor-1944-thread-1-processing-n:127.0.0.1:53285_bed%2Fa) [n:127.0.0.1:53285_bed%2Fa c:control_collection s:shard1 r:core_node1 x:collection1] o.a.s.u.UpdateHandler Using UpdateLog implementation: org.apache.solr.update.UpdateLog
   [junit4]   2> 578295 INFO  (coreLoadExecutor-1944-thread-1-processing-n:127.0.0.1:53285_bed%2Fa) [n:127.0.0.1:53285_bed%2Fa c:control_collection s:shard1 r:core_node1 x:collection1] o.a.s.u.UpdateLog Initializing UpdateLog: dataDir= defaultSyncLevel=FLUSH numRecordsToKeep=100 maxNumLogsToKeep=10 numVersionBuckets=65536
   [junit4]   2> 578295 INFO  (coreLoadExecutor-1944-thread-1-processing-n:127.0.0.1:53285_bed%2Fa) [n:127.0.0.1:53285_bed%2Fa c:control_collection s:shard1 r:core_node1 x:collection1] o.a.s.u.CommitTracker Hard AutoCommit: disabled
   [junit4]   2> 578295 INFO  (coreLoadExecutor-1944-thread-1-processing-n:127.0.0.1:53285_bed%2Fa) [n:127.0.0.1:53285_bed%2Fa c:control_collection s:shard1 r:core_node1 x:collection1] o.a.s.u.CommitTracker Soft AutoCommit: disabled
   [junit4]   2> 578296 INFO  (coreLoadExecutor-1944-thread-1-processing-n:127.0.0.1:53285_bed%2Fa) [n:127.0.0.1:53285_bed%2Fa c:control_collection s:shard1 r:core_node1 x:collection1] o.a.s.u.RandomMergePolicy RandomMergePolicy wrapping class org.apache.lucene.index.LogDocMergePolicy: [LogDocMergePolicy: minMergeSize=1000, mergeFactor=13, maxMergeSize=9223372036854775807, maxMergeSizeForForcedMerge=9223372036854775807, calibrateSizeByDeletes=false, maxMergeDocs=2147483647, maxCFSSegmentSizeMB=8.796093022207999E12, noCFSRatio=0.0]
   [junit4]   2> 578296 INFO  (coreLoadExecutor-1944-thread-1-processing-n:127.0.0.1:53285_bed%2Fa) [n:127.0.0.1:53285_bed%2Fa c:control_collection s:shard1 r:core_node1 x:collection1] o.a.s.c.SolrDeletionPolicy SolrDeletionPolicy.onInit: commits: num=1
   [junit4]   2> 	commit{dir=MockDirectoryWrapper(RAMDirectory@670b3a6 lockFactory=org.apache.lucene.store.SingleInstanceLockFactory@ece7084),segFN=segments_1,generation=1}
   [junit4]   2> 578296 INFO  (coreLoadExecutor-1944-thread-1-processing-n:127.0.0.1:53285_bed%2Fa) [n:127.0.0.1:53285_bed%2Fa c:control_collection s:shard1 r:core_node1 x:collection1] o.a.s.c.SolrDeletionPolicy newest commit generation = 1
   [junit4]   2> 578296 INFO  (coreLoadExecutor-1944-thread-1-processing-n:127.0.0.1:53285_bed%2Fa) [n:127.0.0.1:53285_bed%2Fa c:control_collection s:shard1 r:core_node1 x:collection1] o.a.s.s.SolrIndexSearcher Opening [Searcher@27d18b66[collection1] main]
   [junit4]   2> 578296 INFO  (coreLoadExecutor-1944-thread-1-processing-n:127.0.0.1:53285_bed%2Fa) [n:127.0.0.1:53285_bed%2Fa c:control_collection s:shard1 r:core_node1 x:collection1] o.a.s.c.c.ZkStateReader Load collection config from: [/collections/control_collection]
   [junit4]   2> 578297 INFO  (coreLoadExecutor-1944-thread-1-processing-n:127.0.0.1:53285_bed%2Fa) [n:127.0.0.1:53285_bed%2Fa c:control_collection s:shard1 r:core_node1 x:collection1] o.a.s.c.c.ZkStateReader path=[/collections/control_collection] [configName]=[conf1] specified config exists in ZooKeeper
   [junit4]   2> 578297 INFO  (coreLoadExecutor-1944-thread-1-processing-n:127.0.0.1:53285_bed%2Fa) [n:127.0.0.1:53285_bed%2Fa c:control_collection s:shard1 r:core_node1 x:collection1] o.a.s.r.ManagedResourceStorage Setting up ZooKeeper-based storage for the RestManager with znodeBase: /configs/conf1
   [junit4]   2> 578297 INFO  (coreLoadExecutor-1944-thread-1-processing-n:127.0.0.1:53285_bed%2Fa) [n:127.0.0.1:53285_bed%2Fa c:control_collection s:shard1 r:core_node1 x:collection1] o.a.s.r.ManagedResourceStorage Configured ZooKeeperStorageIO with znodeBase: /configs/conf1
   [junit4]   2> 578297 INFO  (coreLoadExecutor-1944-thread-1-processing-n:127.0.0.1:53285_bed%2Fa) [n:127.0.0.1:53285_bed%2Fa c:control_collection s:shard1 r:core_node1 x:collection1] o.a.s.r.RestManager Initializing RestManager with initArgs: {}
   [junit4]   2> 578297 INFO  (coreLoadExecutor-1944-thread-1-processing-n:127.0.0.1:53285_bed%2Fa) [n:127.0.0.1:53285_bed%2Fa c:control_collection s:shard1 r:core_node1 x:collection1] o.a.s.r.ManagedResourceStorage Reading _rest_managed.json using ZooKeeperStorageIO:path=/configs/conf1
   [junit4]   2> 578298 INFO  (coreLoadExecutor-1944-thread-1-processing-n:127.0.0.1:53285_bed%2Fa) [n:127.0.0.1:53285_bed%2Fa c:control_collection s:shard1 r:core_node1 x:collection1] o.a.s.r.ManagedResourceStorage No data found for znode /configs/conf1/_rest_managed.json
   [junit4]   2> 578298 INFO  (coreLoadExecutor-1944-thread-1-processing-n:127.0.0.1:53285_bed%2Fa) [n:127.0.0.1:53285_bed%2Fa c:control_collection s:shard1 r:core_node1 x:collection1] o.a.s.r.ManagedResourceStorage Loaded null at path _rest_managed.json using ZooKeeperStorageIO:path=/configs/conf1
   [junit4]   2> 578298 INFO  (coreLoadExecutor-1944-thread-1-processing-n:127.0.0.1:53285_bed%2Fa) [n:127.0.0.1:53285_bed%2Fa c:control_collection s:shard1 r:core_node1 x:collection1] o.a.s.r.RestManager Initializing 0 registered ManagedResources
   [junit4]   2> 578298 INFO  (coreLoadExecutor-1944-thread-1-processing-n:127.0.0.1:53285_bed%2Fa) [n:127.0.0.1:53285_bed%2Fa c:control_collection s:shard1 r:core_node1 x:collection1] o.a.s.h.ReplicationHandler Commits will be reserved for  10000
   [junit4]   2> 578298 INFO  (searcherExecutor-1945-thread-1-processing-n:127.0.0.1:53285_bed%2Fa x:collection1 s:shard1 c:control_collection r:core_node1) [n:127.0.0.1:53285_bed%2Fa c:control_collection s:shard1 r:core_node1 x:collection1] o.a.s.c.SolrCore [collection1] Registered new searcher Searcher@27d18b66[collection1] main{ExitableDirectoryReader(UninvertingDirectoryReader())}
   [junit4]   2> 578299 INFO  (coreLoadExecutor-1944-thread-1-processing-n:127.0.0.1:53285_bed%2Fa) [n:127.0.0.1:53285_bed%2Fa c:control_collection s:shard1 r:core_node1 x:collection1] o.a.s.u.UpdateLog Looking up max value of version field to seed version buckets
   [junit4]   2> 578299 INFO  (coreLoadExecutor-1944-thread-1-processing-n:127.0.0.1:53285_bed%2Fa) [n:127.0.0.1:53285_bed%2Fa c:control_collection s:shard1 r:core_node1 x:collection1] o.a.s.u.VersionInfo Refreshing highest value of _version_ for 65536 version buckets from index
   [junit4]   2> 578299 INFO  (coreLoadExecutor-1944-thread-1-processing-n:127.0.0.1:53285_bed%2Fa) [n:127.0.0.1:53285_bed%2Fa c:control_collection s:shard1 r:core_node1 x:collection1] o.a.s.u.VersionInfo No terms found for _version_, cannot seed version bucket highest value from index
   [junit4]   2> 578299 INFO  (coreLoadExecutor-1944-thread-1-processing-n:127.0.0.1:53285_bed%2Fa) [n:127.0.0.1:53285_bed%2Fa c:control_collection s:shard1 r:core_node1 x:collection1] o.a.s.u.UpdateLog Could not find max version in index or recent updates, using new clock 1529456245619032064
   [junit4]   2> 578300 INFO  (coreLoadExecutor-1944-thread-1-processing-n:127.0.0.1:53285_bed%2Fa) [n:127.0.0.1:53285_bed%2Fa c:control_collection s:shard1 r:core_node1 x:collection1] o.a.s.u.UpdateLog Took 1.0ms to seed version buckets with highest version 1529456245619032064
   [junit4]   2> 578301 INFO  (coreLoadExecutor-1944-thread-1-processing-n:127.0.0.1:53285_bed%2Fa) [n:127.0.0.1:53285_bed%2Fa c:control_collection s:shard1 r:core_node1 x:collection1] o.a.s.c.ZkController watch zkdir /configs/conf1
   [junit4]   2> 578301 INFO  (coreLoadExecutor-1944-thread-1-processing-n:127.0.0.1:53285_bed%2Fa) [n:127.0.0.1:53285_bed%2Fa c:control_collection s:shard1 r:core_node1 x:collection1] o.a.s.c.CoreContainer registering core: collection1
   [junit4]   2> 578301 INFO  (coreZkRegister-1938-thread-1-processing-n:127.0.0.1:53285_bed%2Fa x:collection1 s:shard1 c:control_collection r:core_node1) [n:127.0.0.1:53285_bed%2Fa c:control_collection s:shard1 r:core_node1 x:collection1] o.a.s.c.ZkController Register replica - core:collection1 address:http://127.0.0.1:53285/bed/a collection:control_collection shard:shard1
   [junit4]   2> 578302 INFO  (coreZkRegister-1938-thread-1-processing-n:127.0.0.1:53285_bed%2Fa x:collection1 s:shard1 c:control_collection r:core_node1) [n:127.0.0.1:53285_bed%2Fa c:control_collection s:shard1 r:core_node1 x:collection1] o.a.s.c.c.SolrZkClient makePath: /collections/control_collection/leader_elect/shard1/election
   [junit4]   2> 578306 INFO  (coreZkRegister-1938-thread-1-processing-n:127.0.0.1:53285_bed%2Fa x:collection1 s:shard1 c:control_collection r:core_node1) [n:127.0.0.1:53285_bed%2Fa c:control_collection s:shard1 r:core_node1 x:collection1] o.a.s.c.LeaderElector Joined leadership election with path: /collections/control_collection/leader_elect/shard1/election/95591015245086724-core_node1-n_0000000000
   [junit4]   2> 578306 INFO  (coreZkRegister-1938-thread-1-processing-n:127.0.0.1:53285_bed%2Fa x:collection1 s:shard1 c:control_collection r:core_node1) [n:127.0.0.1:53285_bed%2Fa c:control_collection s:shard1 r:core_node1 x:collection1] o.a.s.c.ShardLeaderElectionContext Running the leader process for shard=shard1 and weAreReplacement=false and leaderVoteWait=10000
   [junit4]   2> 578307 INFO  (coreZkRegister-1938-thread-1-processing-n:127.0.0.1:53285_bed%2Fa x:collection1 s:shard1 c:control_collection r:core_node1) [n:127.0.0.1:53285_bed%2Fa c:control_collection s:shard1 r:core_node1 x:collection1] o.a.s.c.ShardLeaderElectionContext Enough replicas found to continue.
   [junit4]   2> 578307 INFO  (coreZkRegister-1938-thread-1-processing-n:127.0.0.1:53285_bed%2Fa x:collection1 s:shard1 c:control_collection r:core_node1) [n:127.0.0.1:53285_bed%2Fa c:control_collection s:shard1 r:core_node1 x:collection1] o.a.s.c.ShardLeaderElectionContext I may be the new leader - try and sync
   [junit4]   2> 578307 INFO  (coreZkRegister-1938-thread-1-processing-n:127.0.0.1:53285_bed%2Fa x:collection1 s:shard1 c:control_collection r:core_node1) [n:127.0.0.1:53285_bed%2Fa c:control_collection s:shard1 r:core_node1 x:collection1] o.a.s.c.SyncStrategy Sync replicas to http://127.0.0.1:53285/bed/a/collection1/
   [junit4]   2> 578307 INFO  (coreZkRegister-1938-thread-1-processing-n:127.0.0.1:53285_bed%2Fa x:collection1 s:shard1 c:control_collection r:core_node1) [n:127.0.0.1:53285_bed%2Fa c:control_collection s:shard1 r:core_node1 x:collection1] o.a.s.c.SyncStrategy Sync Success - now sync replicas to me
   [junit4]   2> 578308 INFO  (coreZkRegister-1938-thread-1-processing-n:127.0.0.1:53285_bed%2Fa x:collection1 s:shard1 c:control_collection r:core_node1) [n:127.0.0.1:53285_bed%2Fa c:control_collection s:shard1 r:core_node1 x:collection1] o.a.s.c.SyncStrategy http://127.0.0.1:53285/bed/a/collection1/ has no replicas
   [junit4]   2> 578308 INFO  (OverseerStateUpdate-95591015245086724-127.0.0.1:53285_bed%2Fa-n_0000000000) [n:127.0.0.1:53285_bed%2Fa    ] o.a.s.c.Overseer processMessage: queueSize: 1, message = {
   [junit4]   2>   "operation":"leader",
   [junit4]   2>   "shard":"shard1",
   [junit4]   2>   "collection":"control_collection"} current state version: 1
   [junit4]   2> 578309 INFO  (coreZkRegister-1938-thread-1-processing-n:127.0.0.1:53285_bed%2Fa x:collection1 s:shard1 c:control_collection r:core_node1) [n:127.0.0.1:53285_bed%2Fa c:control_collection s:shard1 r:core_node1 x:collection1] o.a.s.c.c.SolrZkClient makePath: /collections/control_collection/leaders/shard1
   [junit4]   2> 578311 INFO  (coreZkRegister-1938-thread-1-processing-n:127.0.0.1:53285_bed%2Fa x:collection1 s:shard1 c:control_collection r:core_node1) [n:127.0.0.1:53285_bed%2Fa c:control_collection s:shard1 r:core_node1 x:collection1] o.a.s.c.ShardLeaderElectionContextBase Creating leader registration node /collections/control_collection/leaders/shard1/leader after winning as /collections/control_collection/leader_elect/shard1/election/95591015245086724-core_node1-n_0000000000
   [junit4]   2> 578312 INFO  (coreZkRegister-1938-thread-1-processing-n:127.0.0.1:53285_bed%2Fa x:collection1 s:shard1 c:control_collection r:core_node1) [n:127.0.0.1:53285_bed%2Fa c:control_collection s:shard1 r:core_node1 x:collection1] o.a.s.c.ShardLeaderElectionContext I am the new leader: http://127.0.0.1:53285/bed/a/collection1/ shard1
   [junit4]   2> 578313 INFO  (OverseerStateUpdate-95591015245086724-127.0.0.1:53285_bed%2Fa-n_0000000000) [n:127.0.0.1:53285_bed%2Fa    ] o.a.s.c.Overseer processMessage: queueSize: 1, message = {
   [junit4]   2>   "operation":"leader",
   [junit4]   2>   "shard":"shard1",
   [junit4]   2>   "collection":"control_collection",
   [junit4]   2>   "base_url":"http://127.0.0.1:53285/bed/a",
   [junit4]   2>   "core":"collection1",
   [junit4]   2>   "state":"active"} current state version: 1
   [junit4]   2> 578415 INFO  (zkCallback-614-thread-1-processing-n:127.0.0.1:53285_bed%2Fa) [n:127.0.0.1:53285_bed%2Fa    ] o.a.s.c.c.ZkStateReader A cluster state change: [WatchedEvent state:SyncConnected type:NodeDataChanged path:/clusterstate.json], has occurred - updating... (live nodes size: [1])
   [junit4]   2> 578464 INFO  (coreZkRegister-1938-thread-1-processing-n:127.0.0.1:53285_bed%2Fa x:collection1 s:shard1 c:control_collection r:core_node1) [n:127.0.0.1:53285_bed%2Fa c:control_collection s:shard1 r:core_node1 x:collection1] o.a.s.c.ZkController We are http://127.0.0.1:53285/bed/a/collection1/ and leader is http://127.0.0.1:53285/bed/a/collection1/
   [junit4]   2> 578464 INFO  (coreZkRegister-1938-thread-1-processing-n:127.0.0.1:53285_bed%2Fa x:collection1 s:shard1 c:control_collection r:core_node1) [n:127.0.0.1:53285_bed%2Fa c:control_collection s:shard1 r:core_node1 x:collection1] o.a.s.c.ZkController No LogReplay needed for core=collection1 baseURL=http://127.0.0.1:53285/bed/a
   [junit4]   2> 578464 INFO  (coreZkRegister-1938-thread-1-processing-n:127.0.0.1:53285_bed%2Fa x:collection1 s:shard1 c:control_collection r:core_node1) [n:127.0.0.1:53285_bed%2Fa c:control_collection s:shard1 r:core_node1 x:collection1] o.a.s.c.ZkController I am the leader, no recovery necessary
   [junit4]   2> 578464 INFO  (coreZkRegister-1938-thread-1-processing-n:127.0.0.1:53285_bed%2Fa x:collection1 s:shard1 c:control_collection r:core_node1) [n:127.0.0.1:53285_bed%2Fa c:control_collection s:shard1 r:core_node1 x:collection1] o.a.s.c.ZkController publishing state=active
   [junit4]   2> 578464 INFO  (coreZkRegister-1938-thread-1-processing-n:127.0.0.1:53285_bed%2Fa x:collection1 s:shard1 c:control_collection r:core_node1) [n:127.0.0.1:53285_bed%2Fa c:control_collection s:shard1 r:core_node1 x:collection1] o.a.s.c.ZkController numShards not found on descriptor - reading it from system property
   [junit4]   2> 578466 INFO  (OverseerStateUpdate-95591015245086724-127.0.0.1:53285_bed%2Fa-n_0000000000) [n:127.0.0.1:53285_bed%2Fa    ] o.a.s.c.Overseer processMessage: queueSize: 1, message = {
   [junit4]   2>   "core":"collection1",
   [junit4]   2>   "core_node_name":"core_node1",
   [junit4]   2>   "roles":null,
   [junit4]   2>   "base_url":"http://127.0.0.1:53285/bed/a",
   [junit4]   2>   "node_name":"127.0.0.1:53285_bed%2Fa",
   [junit4]   2>   "numShards":"1",
   [junit4]   2>   "state":"active",
   [junit4]   2>   "shard":"shard1",
   [junit4]   2>   "collection":"control_collection",
   [junit4]   2>   "operation":"state"} current state version: 2
   [junit4]   2> 578466 INFO  (OverseerStateUpdate-95591015245086724-127.0.0.1:53285_bed%2Fa-n_0000000000) [n:127.0.0.1:53285_bed%2Fa    ] o.a.s.c.o.ReplicaMutator Update state numShards=1 message={
   [junit4]   2>   "core":"collection1",
   [junit4]   2>   "core_node_name":"core_node1",
   [junit4]   2>   "roles":null,
   [junit4]   2>   "base_url":"http://127.0.0.1:53285/bed/a",
   [junit4]   2>   "node_name":"127.0.0.1:53285_bed%2Fa",
   [junit4]   2>   "numShards":"1",
   [junit4]   2>   "state":"active",
   [junit4]   2>   "shard":"shard1",
   [junit4]   2>   "collection":"control_collection",
   [junit4]   2>   "operation":"state"}
   [junit4]   2> 578568 INFO  (zkCallback-614-thread-1-processing-n:127.0.0.1:53285_bed%2Fa) [n:127.0.0.1:53285_bed%2Fa    ] o.a.s.c.c.ZkStateReader A cluster state change: [WatchedEvent state:SyncConnected type:NodeDataChanged path:/clusterstate.json], has occurred - updating... (live nodes size: [1])
   [junit4]   2> 578578 INFO  (TEST-FullSolrCloudDistribCmdsTest.test-seed#[F5FD9807FBEA7D1A]) [    ] o.a.s.c.c.SolrZkClient Using default ZkCredentialsProvider
   [junit4]   2> 578581 INFO  (TEST-FullSolrCloudDistribCmdsTest.test-seed#[F5FD9807FBEA7D1A]) [    ] o.a.s.c.c.ConnectionManager Waiting for client to connect to ZooKeeper
   [junit4]   2> 578582 INFO  (zkCallback-616-thread-1) [    ] o.a.s.c.c.ConnectionManager Watcher org.apache.solr.common.cloud.ConnectionManager@17625502 name:ZooKeeperConnection Watcher:127.0.0.1:51324/solr got event WatchedEvent state:SyncConnected type:None path:null path:null type:None
   [junit4]   2> 578582 INFO  (TEST-FullSolrCloudDistribCmdsTest.test-seed#[F5FD9807FBEA7D1A]) [    ] o.a.s.c.c.ConnectionManager Client is connected to ZooKeeper
   [junit4]   2> 578582 INFO  (TEST-FullSolrCloudDistribCmdsTest.test-seed#[F5FD9807FBEA7D1A]) [    ] o.a.s.c.c.SolrZkClient Using default ZkACLProvider
   [junit4]   2> 578582 INFO  (TEST-FullSolrCloudDistribCmdsTest.test-seed#[F5FD9807FBEA7D1A]) [    ] o.a.s.c.c.ZkStateReader Updating cluster state from ZooKeeper... 
   [junit4]   2> 578585 INFO  (TEST-FullSolrCloudDistribCmdsTest.test-seed#[F5FD9807FBEA7D1A]) [    ] o.a.s.c.c.ZkStateReader Updated live nodes from ZooKeeper... (0) -> (1)
   [junit4]   2> 578586 INFO  (TEST-FullSolrCloudDistribCmdsTest.test-seed#[F5FD9807FBEA7D1A]) [    ] o.a.s.c.ChaosMonkey monkey: init - expire sessions:false cause connection loss:false
   [junit4]   2> 578586 INFO  (TEST-FullSolrCloudDistribCmdsTest.test-seed#[F5FD9807FBEA7D1A]) [    ] o.a.s.c.AbstractFullDistribZkTestBase Creating collection1 with stateFormat=2
   [junit4]   2> 578586 INFO  (TEST-FullSolrCloudDistribCmdsTest.test-seed#[F5FD9807FBEA7D1A]) [    ] o.a.s.c.c.SolrZkClient Using default ZkCredentialsProvider
   [junit4]   2> 578593 INFO  (TEST-FullSolrCloudDistribCmdsTest.test-seed#[F5FD9807FBEA7D1A]) [    ] o.a.s.c.c.ConnectionManager Waiting for client to connect to ZooKeeper
   [junit4]   2> 578593 INFO  (zkCallback-617-thread-1) [    ] o.a.s.c.c.ConnectionManager Watcher org.apache.solr.common.cloud.ConnectionManager@3d3c8cbf name:ZooKeeperConnection Watcher:127.0.0.1:51324/solr got event WatchedEvent state:SyncConnected type:None path:null path:null type:None
   [junit4]   2> 578593 INFO  (TEST-FullSolrCloudDistribCmdsTest.test-seed#[F5FD9807FBEA7D1A]) [    ] o.a.s.c.c.ConnectionManager Client is connected to ZooKeeper
   [junit4]   2> 578593 INFO  (TEST-FullSolrCloudDistribCmdsTest.test-seed#[F5FD9807FBEA7D1A]) [    ] o.a.s.c.c.SolrZkClient Using default ZkACLProvider
   [junit4]   2> 578595 INFO  (OverseerStateUpdate-95591015245086724-127.0.0.1:53285_bed%2Fa-n_0000000000) [n:127.0.0.1:53285_bed%2Fa    ] o.a.s.c.Overseer processMessage: queueSize: 1, message = {
   [junit4]   2>   "operation":"create",
   [junit4]   2>   "name":"collection1",
   [junit4]   2>   "numShards":"3",
   [junit4]   2>   "stateFormat":"2"} current state version: 3
   [junit4]   2> 578595 INFO  (OverseerStateUpdate-95591015245086724-127.0.0.1:53285_bed%2Fa-n_0000000000) [n:127.0.0.1:53285_bed%2Fa    ] o.a.s.c.o.ClusterStateMutator building a new cName: collection1
   [junit4]   2> 578688 INFO  (TEST-FullSolrCloudDistribCmdsTest.test-seed#[F5FD9807FBEA7D1A]) [    ] o.a.s.SolrTestCaseJ4 Writing core.properties file to /x1/jenkins/jenkins-slave/workspace/Lucene-Solr-Tests-master/solr/build/solr-core/test/J2/temp/solr.cloud.FullSolrCloudDistribCmdsTest_F5FD9807FBEA7D1A-001/shard-1-001/cores/collection1
   [junit4]   2> 578689 INFO  (TEST-FullSolrCloudDistribCmdsTest.test-seed#[F5FD9807FBEA7D1A]) [    ] o.a.s.c.AbstractFullDistribZkTestBase create jetty 1 in directory /x1/jenkins/jenkins-slave/workspace/Lucene-Solr-Tests-master/solr/build/solr-core/test/J2/temp/solr.cloud.FullSolrCloudDistribCmdsTest_F5FD9807FBEA7D1A-001/shard-1-001
   [junit4]   2> 578690 INFO  (TEST-FullSolrCloudDistribCmdsTest.test-seed#[F5FD9807FBEA7D1A]) [    ] o.e.j.s.Server jetty-9.3.8.v20160314
   [junit4]   2> 578692 INFO  (TEST-FullSolrCloudDistribCmdsTest.test-seed#[F5FD9807FBEA7D1A]) [    ] o.e.j.s.h.ContextHandler Started o.e.j.s.ServletContextHandler@4a2238b7{/bed/a,null,AVAILABLE}
   [junit4]   2> 578692 INFO  (TEST-FullSolrCloudDistribCmdsTest.test-seed#[F5FD9807FBEA7D1A]) [    ] o.e.j.s.ServerConnector Started ServerConnector@65132fd6{HTTP/1.1,[http/1.1]}{127.0.0.1:47848}
   [junit4]   2> 578692 INFO  (TEST-FullSolrCloudDistribCmdsTest.test-seed#[F5FD9807FBEA7D1A]) [    ] o.e.j.s.Server Started @581924ms
   [junit4]   2> 578693 INFO  (TEST-FullSolrCloudDistribCmdsTest.test-seed#[F5FD9807FBEA7D1A]) [    ] o.a.s.c.s.e.JettySolrRunner Jetty properties: {solr.data.dir=/x1/jenkins/jenkins-slave/workspace/Lucene-Solr-Tests-master/solr/build/solr-core/test/J2/temp/solr.cloud.FullSolrCloudDistribCmdsTest_F5FD9807FBEA7D1A-001/tempDir-001/jetty1, solrconfig=solrconfig.xml, hostContext=/bed/a, hostPort=47848, coreRootDirectory=/x1/jenkins/jenkins-slave/workspace/Lucene-Solr-Tests-master/solr/build/solr-core/test/J2/temp/solr.cloud.FullSolrCloudDistribCmdsTest_F5FD9807FBEA7D1A-001/shard-1-001/cores}
   [junit4]   2> 578693 INFO  (TEST-FullSolrCloudDistribCmdsTest.test-seed#[F5FD9807FBEA7D1A]) [    ] o.a.s.s.SolrDispatchFilter SolrDispatchFilter.init(): sun.misc.Launcher$AppClassLoader@73d16e93
   [junit4]   2> 578693 INFO  (TEST-FullSolrCloudDistribCmdsTest.test-seed#[F5FD9807FBEA7D1A]) [    ] o.a.s.c.SolrResourceLoader new SolrResourceLoader for directory: '/x1/jenkins/jenkins-slave/workspace/Lucene-Solr-Tests-master/solr/build/solr-core/test/J2/temp/solr.cloud.FullSolrCloudDistribCmdsTest_F5FD9807FBEA7D1A-001/shard-1-001'
   [junit4]   2> 578693 INFO  (TEST-FullSolrCloudDistribCmdsTest.test-seed#[F5FD9807FBEA7D1A]) [    ] o.a.s.c.SolrResourceLoader JNDI not configured for solr (NoInitialContextEx)
   [junit4]   2> 578693 INFO  (TEST-FullSolrCloudDistribCmdsTest.test-seed#[F5FD9807FBEA7D1A]) [    ] o.a.s.c.SolrResourceLoader solr home defaulted to 'solr/' (could not find system property or JNDI)
   [junit4]   2> 578693 INFO  (TEST-FullSolrCloudDistribCmdsTest.test-seed#[F5FD9807FBEA7D1A]) [    ] o.a.s.c.c.SolrZkClient Using default ZkCredentialsProvider
   [junit4]   2> 578696 INFO  (TEST-FullSolrCloudDistribCmdsTest.test-seed#[F5FD9807FBEA7D1A]) [    ] o.a.s.c.c.ConnectionManager Waiting for client to connect to ZooKeeper
   [junit4]   2> 578701 INFO  (zkCallback-618-thread-1) [    ] o.a.s.c.c.ConnectionManager Watcher org.apache.solr.common.cloud.ConnectionManager@23cd55c1 name:ZooKeeperConnection Watcher:127.0.0.1:51324/solr got event WatchedEvent state:SyncConnected type:None path:null path:null type:None
   [junit4]   2> 578701 INFO  (OverseerStateUpdate-95591015245086724-127.0.0.1:53285_bed%2Fa-n_0000000000) [n:127.0.0.1:53285_bed%2Fa    ] o.a.s.c.o.ZkStateWriter going to create_collection /collections/collection1/state.json
   [junit4]   2> 578701 INFO  (TEST-FullSolrCloudDistribCmdsTest.test-seed#[F5FD9807FBEA7D1A]) [    ] o.a.s.c.c.ConnectionManager Client is connected to ZooKeeper
   [junit4]   2> 578701 INFO  (TEST-FullSolrCloudDistribCmdsTest.test-seed#[F5FD9807FBEA7D1A]) [    ] o.a.s.c.c.SolrZkClient Using default ZkACLProvider
   [junit4]   2> 578703 INFO  (TEST-FullSolrCloudDistribCmdsTest.test-seed#[F5FD9807FBEA7D1A]) [    ] o.a.s.s.SolrDispatchFilter Loading solr.xml from SolrHome (not found in ZooKeeper)
   [junit4]   2> 578703 INFO  (TEST-FullSolrCloudDistribCmdsTest.test-seed#[F5FD9807FBEA7D1A]) [    ] o.a.s.c.SolrXmlConfig Loading container configuration from /x1/jenkins/jenkins-slave/workspace/Lucene-Solr-Tests-master/solr/build/solr-core/test/J2/temp/solr.cloud.FullSolrCloudDistribCmdsTest_F5FD9807FBEA7D1A-001/shard-1-001/solr.xml
   [junit4]   2> 578708 INFO  (TEST-FullSolrCloudDistribCmdsTest.test-seed#[F5FD9807FBEA7D1A]) [    ] o.a.s.c.CorePropertiesLocator Config-defined core root directory: /x1/jenkins/jenkins-slave/workspace/Lucene-Solr-Tests-master/solr/build/solr-core/test/J2/temp/solr.cloud.FullSolrCloudDistribCmdsTest_F5FD9807FBEA7D1A-001/shard-1-001/cores
   [junit4]   2> 578708 INFO  (TEST-FullSolrCloudDistribCmdsTest.test-seed#[F5FD9807FBEA7D1A]) [    ] o.a.s.c.CoreContainer New CoreContainer 179411633
   [junit4]   2> 578708 INFO  (TEST-FullSolrCloudDistribCmdsTest.test-seed#[F5FD9807FBEA7D1A]) [    ] o.a.s.c.CoreContainer Loading cores into CoreContainer [instanceDir=/x1/jenkins/jenkins-slave/workspace/Lucene-Solr-Tests-master/solr/build/solr-core/test/J2/temp/solr.cloud.FullSolrCloudDistribCmdsTest_F5FD9807FBEA7D1A-001/shard-1-001]
   [junit4]   2> 578708 WARN  (TEST-FullSolrCloudDistribCmdsTest.test-seed#[F5FD9807FBEA7D1A]) [    ] o.a.s.c.CoreContainer Couldn't add files from /x1/jenkins/jenkins-slave/workspace/Lucene-Solr-Tests-master/solr/build/solr-core/test/J2/temp/solr.cloud.FullSolrCloudDistribCmdsTest_F5FD9807FBEA7D1A-001/shard-1-001/lib to classpath: /x1/jenkins/jenkins-slave/workspace/Lucene-Solr-Tests-master/solr/build/solr-core/test/J2/temp/solr.cloud.FullSolrCloudDistribCmdsTest_F5FD9807FBEA7D1A-001/shard-1-001/lib
   [junit4]   2> 578709 INFO  (TEST-FullSolrCloudDistribCmdsTest.test-seed#[F5FD9807FBEA7D1A]) [    ] o.a.s.h.c.HttpShardHandlerFactory created with socketTimeout : 90000,urlScheme : ,connTimeout : 15000,maxConnectionsPerHost : 20,maxConnections : 10000,corePoolSize : 0,maximumPoolSize : 2147483647,maxThreadIdleTime : 5,sizeOfQueue : -1,fairnessPolicy : false,useRetries : false,
   [junit4]   2> 578710 INFO  (TEST-FullSolrCloudDistribCmdsTest.test-seed#[F5FD9807FBEA7D1A]) [    ] o.a.s.u.UpdateShardHandler Creating UpdateShardHandler HTTP client with params: socketTimeout=340000&connTimeout=45000&retry=true
   [junit4]   2> 578710 INFO  (TEST-FullSolrCloudDistribCmdsTest.test-seed#[F5FD9807FBEA7D1A]) [    ] o.a.s.l.LogWatcher SLF4J impl is org.slf4j.impl.Log4jLoggerFactory
   [junit4]   2> 578710 INFO  (TEST-FullSolrCloudDistribCmdsTest.test-seed#[F5FD9807FBEA7D1A]) [    ] o.a.s.l.LogWatcher Registering Log Listener [Log4j (org.slf4j.impl.Log4jLoggerFactory)]
   [junit4]   2> 578710 INFO  (TEST-FullSolrCloudDistribCmdsTest.test-seed#[F5FD9807FBEA7D1A]) [    ] o.a.s.c.ZkContainer Zookeeper client=127.0.0.1:51324/solr
   [junit4]   2> 578711 INFO  (TEST-FullSolrCloudDistribCmdsTest.test-seed#[F5FD9807FBEA7D1A]) [    ] o.a.s.c.ZkController zkHost includes chroot
   [junit4]   2> 578711 INFO  (TEST-FullSolrCloudDistribCmdsTest.test-seed#[F5FD9807FBEA7D1A]) [    ] o.a.s.c.c.SolrZkClient Using default ZkCredentialsProvider
   [junit4]   2> 578711 INFO  (TEST-FullSolrCloudDistribCmdsTest.test-seed#[F5FD9807FBEA7D1A]) [    ] o.a.s.c.c.ConnectionManager Waiting for client to connect to ZooKeeper
   [junit4]   2> 578713 INFO  (zkCallback-621-thread-1) [    ] o.a.s.c.c.ConnectionManager Watcher org.apache.solr.common.cloud.ConnectionManager@469f6c5a name:ZooKeeperConnection Watcher:127.0.0.1:51324 got event WatchedEvent state:SyncConnected type:None path:null path:null type:None
   [junit4]   2> 578720 INFO  (TEST-FullSolrCloudDistribCmdsTest.test-seed#[F5FD9807FBEA7D1A]) [    ] o.a.s.c.c.ConnectionManager Client is connected to ZooKeeper
   [junit4]   2> 578720 INFO  (TEST-FullSolrCloudDistribCmdsTest.test-seed#[F5FD9807FBEA7D1A]) [    ] o.a.s.c.c.SolrZkClient Using default ZkACLProvider
   [junit4]   2> 578732 INFO  (TEST-FullSolrCloudDistribCmdsTest.test-seed#[F5FD9807FBEA7D1A]) [n:127.0.0.1:47848_bed%2Fa    ] o.a.s.c.c.ConnectionManager Waiting for client to connect to ZooKeeper
   [junit4]   2> 578733 INFO  (zkCallback-622-thread-1-processing-n:127.0.0.1:47848_bed%2Fa) [n:127.0.0.1:47848_bed%2Fa    ] o.a.s.c.c.ConnectionManager Watcher org.apache.solr.common.cloud.ConnectionManager@717ce765 name:ZooKeeperConnection Watcher:127.0.0.1:51324/solr got event WatchedEvent state:SyncConnected type:None path:null path:null type:None
   [junit4]   2> 578733 INFO  (TEST-FullSolrCloudDistribCmdsTest.test-seed#[F5FD9807FBEA7D1A]) [n:127.0.0.1:47848_bed%2Fa    ] o.a.s.c.c.ConnectionManager Client is connected to ZooKeeper
   [junit4]   2> 578737 INFO  (TEST-FullSolrCloudDistribCmdsTest.test-seed#[F5FD9807FBEA7D1A]) [n:127.0.0.1:47848_bed%2Fa    ] o.a.s.c.c.ZkStateReader Updating cluster state from ZooKeeper... 
   [junit4]   2> 578738 INFO  (TEST-FullSolrCloudDistribCmdsTest.test-seed#[F5FD9807FBEA7D1A]) [n:127.0.0.1:47848_bed%2Fa    ] o.a.s.c.c.ZkStateReader Updated live nodes from ZooKeeper... (0) -> (1)
   [junit4]   2> 578740 INFO  (TEST-FullSolrCloudDistribCmdsTest.test-seed#[F5FD9807FBEA7D1A]) [n:127.0.0.1:47848_bed%2Fa    ] o.a.s.c.Overseer Overseer (id=null) closing
   [junit4]   2> 578740 INFO  (TEST-FullSolrCloudDistribCmdsTest.test-seed#[F5FD9807FBEA7D1A]) [n:127.0.0.1:47848_bed%2Fa    ] o.a.s.c.LeaderElector Joined leadership election with path: /overseer_elect/election/95591015245086729-127.0.0.1:47848_bed%2Fa-n_0000000001
   [junit4]   2> 578740 INFO  (TEST-FullSolrCloudDistribCmdsTest.test-seed#[F5FD9807FBEA7D1A]) [n:127.0.0.1:47848_bed%2Fa    ] o.a.s.c.LeaderElector Watching path /overseer_elect/election/95591015245086724-127.0.0.1:53285_bed%2Fa-n_0000000000 to know if I could be the leader
   [junit4]   2> 578741 INFO  (TEST-FullSolrCloudDistribCmdsTest.test-seed#[F5FD9807FBEA7D1A]) [n:127.0.0.1:47848_bed%2Fa    ] o.a.s.c.ZkController Publish node=127.0.0.1:47848_bed%2Fa as DOWN
   [junit4]   2> 578742 INFO  (OverseerStateUpdate-95591015245086724-127.0.0.1:53285_bed%2Fa-n_0000000000) [n:127.0.0.1:53285_bed%2Fa    ] o.a.s.c.Overseer processMessage: queueSize: 1, message = {
   [junit4]   2>   "operation":"downnode",
   [junit4]   2>   "node_name":"127.0.0.1:47848_bed%2Fa"} current state version: 3
   [junit4]   2> 578742 INFO  (OverseerStateUpdate-95591015245086724-127.0.0.1:53285_bed%2Fa-n_0000000000) [n:127.0.0.1:53285_bed%2Fa    ] o.a.s.c.o.NodeMutator DownNode state invoked for node: 127.0.0.1:47848_bed%2Fa
   [junit4]   2> 578743 INFO  (OverseerStateUpdate-95591015245086724-127.0.0.1:53285_bed%2Fa-n_0000000000) [n:127.0.0.1:53285_bed%2Fa    ] o.a.s.c.o.ZkStateWriter going to update_collection /collections/collection1/state.json version: 0
   [junit4]   2> 578846 INFO  (zkCallback-622-thread-1-processing-n:127.0.0.1:47848_bed%2Fa) [n:127.0.0.1:47848_bed%2Fa    ] o.a.s.c.c.ZkStateReader A cluster state change: [WatchedEvent state:SyncConnected type:NodeDataChanged path:/clusterstate.json], has occurred - updating... (live nodes size: [1])
   [junit4]   2> 578846 INFO  (zkCallback-614-thread-1-processing-n:127.0.0.1:53285_bed%2Fa) [n:127.0.0.1:53285_bed%2Fa    ] o.a.s.c.c.ZkStateReader A cluster state change: [WatchedEvent state:SyncConnected type:NodeDataChanged path:/clusterstate.json], has occurred - updating... (live nodes size: [1])
   [junit4]   2> 578846 INFO  (zkCallback-616-thread-1) [    ] o.a.s.c.c.ZkStateReader A cluster state change: [WatchedEvent state:SyncConnected type:NodeDataChanged path:/clusterstate.json], has occurred - updating... (live nodes size: [1])
   [junit4]   2> 579743 INFO  (TEST-FullSolrCloudDistribCmdsTest.test-seed#[F5FD9807FBEA7D1A]) [n:127.0.0.1:47848_bed%2Fa    ] o.a.s.c.ZkController Register node as live in ZooKeeper:/live_nodes/127.0.0.1:47848_bed%2Fa
   [junit4]   2> 579743 INFO  (TEST-FullSolrCloudDistribCmdsTest.test-seed#[F5FD9807FBEA7D1A]) [n:127.0.0.1:47848_bed%2Fa    ] o.a.s.c.c.SolrZkClient makePath: /live_nodes/127.0.0.1:47848_bed%2Fa
   [junit4]   2> 579744 INFO  (zkCallback-616-thread-1) [    ] o.a.s.c.c.ZkStateReader A live node change: [WatchedEvent state:SyncConnected type:NodeChildrenChanged path:/live_nodes], has occurred - updating... (live nodes size: [1])
   [junit4]   2> 579744 INFO  (zkCallback-614-thread-1-processing-n:127.0.0.1:53285_bed%2Fa) [n:127.0.0.1:53285_bed%2Fa    ] o.a.s.c.c.ZkStateReader A live node change: [WatchedEvent state:SyncConnected type:NodeChildrenChanged path:/live_nodes], has occurred - updating... (live nodes size: [1])
   [junit4]   2> 579744 INFO  (zkCallback-614-thread-1-processing-n:127.0.0.1:53285_bed%2Fa) [n:127.0.0.1:53285_bed%2Fa    ] o.a.s.c.c.ZkStateReader Updated live nodes from ZooKeeper... (1) -> (2)
   [junit4]   2> 579744 INFO  (zkCallback-616-thread-1) [    ] o.a.s.c.c.ZkStateReader Updated live nodes from ZooKeeper... (1) -> (2)
   [junit4]   2> 579745 INFO  (zkCallback-622-thread-1-processing-n:127.0.0.1:47848_bed%2Fa) [n:127.0.0.1:47848_bed%2Fa    ] o.a.s.c.c.ZkStateReader A live node change: [WatchedEvent state:SyncConnected type:NodeChildrenChanged path:/live_nodes], has occurred - updating... (live nodes size: [1])
   [junit4]   2> 579749 INFO  (zkCallback-622-thread-1-processing-n:127.0.0.1:47848_bed%2Fa) [n:127.0.0.1:47848_bed%2Fa    ] o.a.s.c.c.ZkStateReader Updated live nodes from ZooKeeper... (1) -> (2)
   [junit4]   2> 579757 INFO  (TEST-FullSolrCloudDistribCmdsTest.test-seed#[F5FD9807FBEA7D1A]) [n:127.0.0.1:47848_bed%2Fa    ] o.a.s.c.CoreContainer Security conf doesn't exist. Skipping setup for authorization module.
   [junit4]   2> 579757 INFO  (TEST-FullSolrCloudDistribCmdsTest.test-seed#[F5FD9807FBEA7D1A]) [n:127.0.0.1:47848_bed%2Fa    ] o.a.s.c.CoreContainer No authentication plugin used.
   [junit4]   2> 579758 INFO  (TEST-FullSolrCloudDistribCmdsTest.test-seed#[F5FD9807FBEA7D1A]) [n:127.0.0.1:47848_bed%2Fa    ] o.a.s.c.CorePropertiesLocator Looking for core definitions underneath /x1/jenkins/jenkins-slave/workspace/Lucene-Solr-Tests-master/solr/build/solr-core/test/J2/temp/solr.cloud.FullSolrCloudDistribCmdsTest_F5FD9807FBEA7D1A-001/shard-1-001/cores
   [junit4]   2> 579759 INFO  (TEST-FullSolrCloudDistribCmdsTest.test-seed#[F5FD9807FBEA7D1A]) [n:127.0.0.1:47848_bed%2Fa    ] o.a.s.c.CoreDescriptor Created CoreDescriptor: {name=collection1, config=solrconfig.xml, transient=false, schema=schema.xml, loadOnStartup=true, configSetProperties=configsetprops.json, collection=collection1, coreNodeName=, dataDir=data/, shard=}
   [junit4]   2> 579759 INFO  (TEST-FullSolrCloudDistribCmdsTest.test-seed#[F5FD9807FBEA7D1A]) [n:127.0.0.1:47848_bed%2Fa    ] o.a.s.c.CorePropertiesLocator Found core collection1 in /x1/jenkins/jenkins-slave/workspace/Lucene-Solr-Tests-master/solr/build/solr-core/test/J2/temp/solr.cloud.FullSolrCloudDistribCmdsTest_F5FD9807FBEA7D1A-001/shard-1-001/cores/collection1
   [junit4]   2> 579759 INFO  (TEST-FullSolrCloudDistribCmdsTest.test-seed#[F5FD9807FBEA7D1A]) [n:127.0.0.1:47848_bed%2Fa    ] o.a.s.c.CorePropertiesLocator Found 1 core definitions
   [junit4]   2> 579760 INFO  (coreLoadExecutor-1955-thread-1-processing-n:127.0.0.1:47848_bed%2Fa) [n:127.0.0.1:47848_bed%2Fa c:collection1   x:collection1] o.a.s.c.ZkController publishing state=down
   [junit4]   2> 579760 INFO  (coreLoadExecutor-1955-thread-1-processing-n:127.0.0.1:47848_bed%2Fa) [n:127.0.0.1:47848_bed%2Fa c:collection1   x:collection1] o.a.s.c.ZkController numShards not found on descriptor - reading it from system property
   [junit4]   2> 579761 INFO  (TEST-FullSolrCloudDistribCmdsTest.test-seed#[F5FD9807FBEA7D1A]) [n:127.0.0.1:47848_bed%2Fa    ] o.a.s.s.SolrDispatchFilter user.dir=/x1/jenkins/jenkins-slave/workspace/Lucene-Solr-Tests-master/solr/build/solr-core/test/J2
   [junit4]   2> 579761 INFO  (TEST-FullSolrCloudDistribCmdsTest.test-seed#[F5FD9807FBEA7D1A]) [n:127.0.0.1:47848_bed%2Fa    ] o.a.s.s.SolrDispatchFilter SolrDispatchFilter.init() done
   [junit4]   2> 579762 INFO  (coreLoadExecutor-1955-thread-1-processing-n:127.0.0.1:47848_bed%2Fa) [n:127.0.0.1:47848_bed%2Fa c:collection1   x:collection1] o.a.s.c.ZkController Registering watch for collection collection1
   [junit4]   2> 579762 INFO  (coreLoadExecutor-1955-thread-1-processing-n:127.0.0.1:47848_bed%2Fa) [n:127.0.0.1:47848_bed%2Fa c:collection1   x:collection1] o.a.s.c.c.ZkStateReader addZkWatch [collection1]
   [junit4]   2> 579763 INFO  (OverseerStateUpdate-95591015245086724-127.0.0.1:53285_bed%2Fa-n_0000000000) [n:127.0.0.1:53285_bed%2Fa    ] o.a.s.c.Overseer processMessage: queueSize: 1, message = {
   [junit4]   2>   "core":"collection1",
   [junit4]   2>   "roles":null,
   [junit4]   2>   "base_url":"http://127.0.0.1:47848/bed/a",
   [junit4]   2>   "node_name":"127.0.0.1:47848_bed%2Fa",
   [junit4]   2>   "numShards":"3",
   [junit4]   2>   "state":"down",
   [junit4]   2>   "shard":null,
   [junit4]   2>   "collection":"collection1",
   [junit4]   2>   "operation":"state"} current state version: 4
   [junit4]   2> 579763 INFO  (coreLoadExecutor-1955-thread-1-processing-n:127.0.0.1:47848_bed%2Fa) [n:127.0.0.1:47848_bed%2Fa c:collection1   x:collection1] o.a.s.c.c.ZkStateReader Add data for [collection1] ver [1]
   [junit4]   2> 579763 INFO  (coreLoadExecutor-1955-thread-1-processing-n:127.0.0.1:47848_bed%2Fa) [n:127.0.0.1:47848_bed%2Fa c:collection1   x:collection1] o.a.s.c.ZkController look for our core node name
   [junit4]   2> 579763 INFO  (OverseerStateUpdate-95591015245086724-127.0.0.1:53285_bed%2Fa-n_0000000000) [n:127.0.0.1:53285_bed%2Fa    ] o.a.s.c.o.ReplicaMutator Update state numShards=3 message={
   [junit4]   2>   "core":"collection1",
   [junit4]   2>   "roles":null,
   [junit4]   2>   "base_url":"http://127.0.0.1:47848/bed/a",
   [junit4]   2>   "node_name":"127.0.0.1:47848_bed%2Fa",
   [junit4]   2>   "numShards":"3",
   [junit4]   2>   "state":"down",
   [junit4]   2>   "shard":null,
   [junit4]   2>   "collection":"collection1",
   [junit4]   2>   "operation":"state"}
   [junit4]   2> 579763 INFO  (OverseerStateUpdate-95591015245086724-127.0.0.1:53285_bed%2Fa-n_0000000000) [n:127.0.0.1:53285_bed%2Fa    ] o.a.s.c.o.ReplicaMutator Collection already exists with numShards=3
   [junit4]   2> 579763 INFO  (OverseerStateUpdate-95591015245086724-127.0.0.1:53285_bed%2Fa-n_0000000000) [n:127.0.0.1:53285_bed%2Fa    ] o.a.s.c.o.ReplicaMutator Assigning new node to shard shard=shard2
   [junit4]   2> 579866 INFO  (OverseerStateUpdate-95591015245086724-127.0.0.1:53285_bed%2Fa-n_0000000000) [n:127.0.0.1:53285_bed%2Fa    ] o.a.s.c.o.ZkStateWriter going to update_collection /collections/collection1/state.json version: 1
   [junit4]   2> 579866 INFO  (zkCallback-622-thread-1-processing-n:127.0.0.1:47848_bed%2Fa) [n:127.0.0.1:47848_bed%2Fa    ] o.a.s.c.c.ZkStateReader A cluster state change: [WatchedEvent state:SyncConnected type:NodeDataChanged path:/collections/collection1/state.json] for collection [collection1] has occurred - updating... (live nodes size: [2])
   [junit4]   2> 579866 INFO  (zkCallback-622-thread-1-processing-n:127.0.0.1:47848_bed%2Fa) [n:127.0.0.1:47848_bed%2Fa    ] o.a.s.c.c.ZkStateReader Updating data for [collection1] from [1] to [2]
   [junit4]   2> 580763 INFO  (coreLoadExecutor-1955-thread-1-processing-n:127.0.0.1:47848_bed%2Fa) [n:127.0.0.1:47848_bed%2Fa c:collection1   x:collection1] o.a.s.c.ZkController waiting to find shard id in clusterstate for collection1
   [junit4]   2> 580763 INFO  (coreLoadExecutor-1955-thread-1-processing-n:127.0.0.1:47848_bed%2Fa) [n:127.0.0.1:47848_bed%2Fa c:collection1   x:collection1] o.a.s.c.ZkController Check for collection zkNode:collection1
   [junit4]   2> 580764 INFO  (coreLoadExecutor-1955-thread-1-processing-n:127.0.0.1:47848_bed%2Fa) [n:127.0.0.1:47848_bed%2Fa c:collection1   x:collection1] o.a.s.c.ZkController Collection zkNode exists
   [junit4]   2> 580764 INFO  (coreLoadExecutor-1955-thread-1-processing-n:127.0.0.1:47848_bed%2Fa) [n:127.0.0.1:47848_bed%2Fa c:collection1   x:collection1] o.a.s.c.c.ZkStateReader Load collection config from: [/collections/collection1]
   [junit4]   2> 580764 INFO  (coreLoadExecutor-1955-thread-1-processing-n:127.0.0.1:47848_bed%2Fa) [n:127.0.0.1:47848_bed%2Fa c:collection1   x:collection1] o.a.s.c.c.ZkStateReader path=[/collections/collection1] [configName]=[conf1] specified config exists in ZooKeeper
   [junit4]   2> 580764 INFO  (coreLoadExecutor-1955-thread-1-processing-n:127.0.0.1:47848_bed%2Fa) [n:127.0.0.1:47848_bed%2Fa c:collection1   x:collection1] o.a.s.c.SolrResourceLoader new SolrResourceLoader for directory: '/x1/jenkins/jenkins-slave/workspace/Lucene-Solr-Tests-master/solr/build/solr-core/test/J2/temp/solr.cloud.FullSolrCloudDistribCmdsTest_F5FD9807FBEA7D1A-001/shard-1-001/cores/collection1'
   [junit4]   2> 580764 INFO  (coreLoadExecutor-1955-thread-1-processing-n:127.0.0.1:47848_bed%2Fa) [n:127.0.0.1:47848_bed%2Fa c:collection1   x:collection1] o.a.s.c.SolrResourceLoader JNDI not configured for solr (NoInitialContextEx)
   [junit4]   2> 580764 INFO  (coreLoadExecutor-1955-thread-1-processing-n:127.0.0.1:47848_bed%2Fa) [n:127.0.0.1:47848_bed%2Fa c:collection1   x:collection1] o.a.s.c.SolrResourceLoader solr home defaulted to 'solr/' (could not find system property or JNDI)
   [junit4]   2> 580766 INFO  (coreLoadExecutor-1955-thread-1-processing-n:127.0.0.1:47848_bed%2Fa) [n:127.0.0.1:47848_bed%2Fa c:collection1   x:collection1] o.a.s.c.Config loaded config solrconfig.xml with version 0 
   [junit4]   2> 580771 INFO  (coreLoadExecutor-1955-thread-1-processing-n:127.0.0.1:47848_bed%2Fa) [n:127.0.0.1:47848_bed%2Fa c:collection1   x:collection1] o.a.s.c.SolrConfig current version of requestparams : -1
   [junit4]   2> 580774 INFO  (coreLoadExecutor-1955-thread-1-processing-n:127.0.0.1:47848_bed%2Fa) [n:127.0.0.1:47848_bed%2Fa c:collection1   x:collection1] o.a.s.c.SolrConfig Using Lucene MatchVersion: 7.0.0
   [junit4]   2> 580795 INFO  (coreLoadExecutor-1955-thread-1-processing-n:127.0.0.1:47848_bed%2Fa) [n:127.0.0.1:47848_bed%2Fa c:collection1   x:collection1] o.a.s.c.SolrConfig Loaded SolrConfig: solrconfig.xml
   [junit4]   2> 580801 INFO  (coreLoadExecutor-1955-thread-1-processing-n:127.0.0.1:47848_bed%2Fa) [n:127.0.0.1:47848_bed%2Fa c:collection1   x:collection1] o.a.s.s.IndexSchema [collection1] Schema name=test
   [junit4]   2> 580922 INFO  (coreLoadExecutor-1955-thread-1-processing-n:127.0.0.1:47848_bed%2Fa) [n:127.0.0.1:47848_bed%2Fa c:collection1   x:collection1] o.a.s.s.IndexSchema default search field in schema is text
   [junit4]   2> 580923 INFO  (coreLoadExecutor-1955-thread-1-processing-n:127.0.0.1:47848_bed%2Fa) [n:127.0.0.1:47848_bed%2Fa c:collection1   x:collection1] o.a.s.s.IndexSchema unique key field: id
   [junit4]   2> 580923 INFO  (coreLoadExecutor-1955-thread-1-processing-n:127.0.0.1:47848_bed%2Fa) [n:127.0.0.1:47848_bed%2Fa c:collection1   x:collection1] o.a.s.s.FileExchangeRateProvider Reloading exchange rates from file currency.xml
   [junit4]   2> 580926 INFO  (coreLoadExecutor-1955-thread-1-processing-n:127.0.0.1:47848_bed%2Fa) [n:127.0.0.1:47848_bed%2Fa c:collection1   x:collection1] o.a.s.s.FileExchangeRateProvider Reloading exchange rates from file currency.xml
   [junit4]   2> 580945 INFO  (coreLoadExecutor-1955-thread-1-processing-n:127.0.0.1:47848_bed%2Fa) [n:127.0.0.1:47848_bed%2Fa c:collection1   x:collection1] o.a.s.c.ConfigSetProperties Did not find ConfigSet properties, assuming default properties: Can't find resource 'configsetprops.json' in classpath or '/configs/conf1', cwd=/x1/jenkins/jenkins-slave/workspace/Lucene-Solr-Tests-master/solr/build/solr-core/test/J2
   [junit4]   2> 580945 INFO  (coreLoadExecutor-1955-thread

[...truncated too long message...]

.c.LeaderElector 
   [junit4]   2> java.lang.RuntimeException: org.apache.zookeeper.KeeperException$SessionExpiredException: KeeperErrorCode = Session expired for /overseer
   [junit4]   2> 	at org.apache.solr.cloud.Overseer.createOverseerNode(Overseer.java:1061)
   [junit4]   2> 	at org.apache.solr.cloud.Overseer.getStateUpdateQueue(Overseer.java:925)
   [junit4]   2> 	at org.apache.solr.cloud.Overseer.getStateUpdateQueue(Overseer.java:912)
   [junit4]   2> 	at org.apache.solr.cloud.ShardLeaderElectionContext.runLeaderProcess(ElectionContext.java:314)
   [junit4]   2> 	at org.apache.solr.cloud.LeaderElector.runIamLeaderProcess(LeaderElector.java:170)
   [junit4]   2> 	at org.apache.solr.cloud.LeaderElector.checkIfIamLeader(LeaderElector.java:135)
   [junit4]   2> 	at org.apache.solr.cloud.LeaderElector.joinElection(LeaderElector.java:307)
   [junit4]   2> 	at org.apache.solr.cloud.LeaderElector.joinElection(LeaderElector.java:216)
   [junit4]   2> 	at org.apache.solr.cloud.ShardLeaderElectionContext.rejoinLeaderElection(ElectionContext.java:670)
   [junit4]   2> 	at org.apache.solr.cloud.ShardLeaderElectionContext.runLeaderProcess(ElectionContext.java:340)
   [junit4]   2> 	at org.apache.solr.cloud.LeaderElector.runIamLeaderProcess(LeaderElector.java:170)
   [junit4]   2> 	at org.apache.solr.cloud.LeaderElector.checkIfIamLeader(LeaderElector.java:135)
   [junit4]   2> 	at org.apache.solr.cloud.LeaderElector.access$200(LeaderElector.java:56)
   [junit4]   2> 	at org.apache.solr.cloud.LeaderElector$ElectionWatcher.process(LeaderElector.java:348)
   [junit4]   2> 	at org.apache.solr.common.cloud.SolrZkClient$3.lambda$process$0(SolrZkClient.java:266)
   [junit4]   2> 	at java.util.concurrent.Executors$RunnableAdapter.call(Executors.java:511)
   [junit4]   2> 	at java.util.concurrent.FutureTask.run(FutureTask.java:266)
   [junit4]   2> 	at org.apache.solr.common.util.ExecutorUtil$MDCAwareThreadPoolExecutor.lambda$execute$0(ExecutorUtil.java:229)
   [junit4]   2> 	at java.util.concurrent.ThreadPoolExecutor.runWorker(ThreadPoolExecutor.java:1142)
   [junit4]   2> 	at java.util.concurrent.ThreadPoolExecutor$Worker.run(ThreadPoolExecutor.java:617)
   [junit4]   2> 	at java.lang.Thread.run(Thread.java:745)
   [junit4]   2> Caused by: org.apache.zookeeper.KeeperException$SessionExpiredException: KeeperErrorCode = Session expired for /overseer
   [junit4]   2> 	at org.apache.zookeeper.KeeperException.create(KeeperException.java:127)
   [junit4]   2> 	at org.apache.zookeeper.KeeperException.create(KeeperException.java:51)
   [junit4]   2> 	at org.apache.zookeeper.ZooKeeper.create(ZooKeeper.java:783)
   [junit4]   2> 	at org.apache.solr.common.cloud.SolrZkClient$9.execute(SolrZkClient.java:383)
   [junit4]   2> 	at org.apache.solr.common.cloud.SolrZkClient$9.execute(SolrZkClient.java:380)
   [junit4]   2> 	at org.apache.solr.common.cloud.ZkCmdExecutor.retryOperation(ZkCmdExecutor.java:60)
   [junit4]   2> 	at org.apache.solr.common.cloud.SolrZkClient.create(SolrZkClient.java:380)
   [junit4]   2> 	at org.apache.solr.cloud.Overseer.createOverseerNode(Overseer.java:1052)
   [junit4]   2> 	... 20 more
   [junit4]   2> 610824 WARN  (zkCallback-649-thread-1-processing-n:127.0.0.1:43298_bed%2Fa) [n:127.0.0.1:43298_bed%2Fa    ] o.a.s.c.c.ZkStateReader ZooKeeper watch triggered, but Solr cannot talk to ZK: [KeeperErrorCode = Session expired for /live_nodes]
   [junit4]   2> 610826 INFO  (TEST-FullSolrCloudDistribCmdsTest.test-seed#[F5FD9807FBEA7D1A]) [    ] o.e.j.s.ServerConnector Stopped ServerConnector@267b630a{HTTP/1.1,[http/1.1]}{127.0.0.1:0}
   [junit4]   2> 610826 INFO  (TEST-FullSolrCloudDistribCmdsTest.test-seed#[F5FD9807FBEA7D1A]) [    ] o.e.j.s.h.ContextHandler Stopped o.e.j.s.ServletContextHandler@cebada6{/bed/a,null,UNAVAILABLE}
   [junit4]   2> 610828 INFO  (TEST-FullSolrCloudDistribCmdsTest.test-seed#[F5FD9807FBEA7D1A]) [    ] o.a.s.c.ZkTestServer connecting to 127.0.0.1:51324 51324
   [junit4]   2> 610997 INFO  (Thread-1842) [    ] o.a.s.c.ZkTestServer connecting to 127.0.0.1:51324 51324
   [junit4]   2> 610998 WARN  (Thread-1842) [    ] o.a.s.c.ZkTestServer Watch limit violations: 
   [junit4]   2> Maximum concurrent create/delete watches above limit:
   [junit4]   2> 
   [junit4]   2> 	8	/solr/aliases.json
   [junit4]   2> 	7	/solr/security.json
   [junit4]   2> 	7	/solr/configs/conf1
   [junit4]   2> 
   [junit4]   2> Maximum concurrent data watches above limit:
   [junit4]   2> 
   [junit4]   2> 	8	/solr/clusterstate.json
   [junit4]   2> 	6	/solr/collections/collection1/state.json
   [junit4]   2> 
   [junit4]   2> Maximum concurrent children watches above limit:
   [junit4]   2> 
   [junit4]   2> 	8	/solr/live_nodes
   [junit4]   2> 	8	/solr/collections
   [junit4]   2> 	5	/solr/overseer/collection-queue-work
   [junit4]   2> 	4	/solr/overseer/queue
   [junit4]   2> 	2	/solr/overseer/queue-work
   [junit4]   2> 
   [junit4]   2> NOTE: reproduce with: ant test  -Dtestcase=FullSolrCloudDistribCmdsTest -Dtests.method=test -Dtests.seed=F5FD9807FBEA7D1A -Dtests.multiplier=2 -Dtests.slow=true -Dtests.locale=es-CR -Dtests.timezone=Atlantic/Bermuda -Dtests.asserts=true -Dtests.file.encoding=UTF-8
   [junit4] FAILURE 34.3s J2 | FullSolrCloudDistribCmdsTest.test <<<
   [junit4]    > Throwable #1: java.lang.AssertionError: expected:<1> but was:<0>
   [junit4]    > 	at __randomizedtesting.SeedInfo.seed([F5FD9807FBEA7D1A:7DA9A7DD551610E2]:0)
   [junit4]    > 	at org.apache.solr.cloud.FullSolrCloudDistribCmdsTest.addUpdateDelete(FullSolrCloudDistribCmdsTest.java:479)
   [junit4]    > 	at org.apache.solr.cloud.FullSolrCloudDistribCmdsTest.test(FullSolrCloudDistribCmdsTest.java:81)
   [junit4]    > 	at org.apache.solr.BaseDistributedSearchTestCase$ShardsRepeatRule$ShardsFixedStatement.callStatement(BaseDistributedSearchTestCase.java:996)
   [junit4]    > 	at org.apache.solr.BaseDistributedSearchTestCase$ShardsRepeatRule$ShardsStatement.evaluate(BaseDistributedSearchTestCase.java:971)
   [junit4]    > 	at java.lang.Thread.run(Thread.java:745)
   [junit4]   2> 611001 INFO  (SUITE-FullSolrCloudDistribCmdsTest-seed#[F5FD9807FBEA7D1A]-worker) [    ] o.a.s.SolrTestCaseJ4 ###deleteCore
   [junit4]   2> NOTE: leaving temporary files on disk at: /x1/jenkins/jenkins-slave/workspace/Lucene-Solr-Tests-master/solr/build/solr-core/test/J2/temp/solr.cloud.FullSolrCloudDistribCmdsTest_F5FD9807FBEA7D1A-001
   [junit4]   2> Mar 21, 2016 11:32:52 PM com.carrotsearch.randomizedtesting.ThreadLeakControl checkThreadLeaks
   [junit4]   2> WARNING: Will linger awaiting termination of 1 leaked thread(s).
   [junit4]   2> NOTE: test params are: codec=Asserting(Lucene60): {rnd_b=FST50, _version_=BlockTreeOrds(blocksize=128), a_t=Lucene50(blocksize=128), id=FST50}, docValues:{}, maxPointsInLeafNode=1888, maxMBSortInHeap=4.488119816457395, sim=ClassicSimilarity, locale=es-CR, timezone=Atlantic/Bermuda
   [junit4]   2> NOTE: Linux 3.13.0-52-generic amd64/Oracle Corporation 1.8.0_74 (64-bit)/cpus=4,threads=1,free=204489064,total=527433728
   [junit4]   2> NOTE: All tests run in this JVM: [FacetPivotSmallTest, CollectionStateFormat2Test, SampleTest, TestConfigSets, TestRuleBasedAuthorizationPlugin, TestUseDocValuesAsStored2, TestPerFieldSimilarity, DirectSolrConnectionTest, TestDistributedMissingSort, SolrCoreCheckLockOnStartupTest, ClusterStateTest, SharedFSAutoReplicaFailoverTest, TestReversedWildcardFilterFactory, SolrCloudExampleTest, TestFastWriter, TestXIncludeConfig, TestZkChroot, BJQParserTest, BadComponentTest, TestJmxIntegration, DistribJoinFromCollectionTest, TestScoreJoinQPScore, TestIndexSearcher, HighlighterMaxOffsetTest, TestRequestStatusCollectionAPI, BadIndexSchemaTest, CleanupOldIndexTest, AssignTest, TestGeoJSONResponseWriter, ScriptEngineTest, SuggesterWFSTTest, BlockCacheTest, DirectUpdateHandlerOptimizeTest, QueryParsingTest, BlockJoinFacetSimpleTest, TestCloudDeleteByQuery, TestCollapseQParserPlugin, TestDefaultStatsCache, HdfsRestartWhileUpdatingTest, SuggestComponentTest, SolrTestCaseJ4Test, SimpleFacetsTest, TestManagedSynonymFilterFactory, ConnectionManagerTest, CoreAdminRequestStatusTest, VersionInfoTest, TestSolrDynamicMBean, TestSuggestSpellingConverter, TestNoOpRegenerator, UnloadDistributedZkTest, XmlUpdateRequestHandlerTest, StressHdfsTest, CursorMarkTest, TestBlobHandler, TestReqParamsAPI, DistributedFacetPivotSmallAdvancedTest, LeaderElectionTest, ReplicationFactorTest, CurrencyFieldXmlFileTest, TestGroupingSearch, SliceStateTest, FieldAnalysisRequestHandlerTest, TestSchemaNameResource, HdfsDirectoryTest, CircularListTest, TestTestInjection, FullSolrCloudDistribCmdsTest]
   [junit4] Completed [207/581 (1!)] on J2 in 35.36s, 1 test, 1 failure <<< FAILURES!

[...truncated 1221 lines...]
BUILD FAILED
/x1/jenkins/jenkins-slave/workspace/Lucene-Solr-Tests-master/build.xml:740: The following error occurred while executing this line:
/x1/jenkins/jenkins-slave/workspace/Lucene-Solr-Tests-master/build.xml:684: The following error occurred while executing this line:
/x1/jenkins/jenkins-slave/workspace/Lucene-Solr-Tests-master/build.xml:59: The following error occurred while executing this line:
/x1/jenkins/jenkins-slave/workspace/Lucene-Solr-Tests-master/solr/build.xml:233: The following error occurred while executing this line:
/x1/jenkins/jenkins-slave/workspace/Lucene-Solr-Tests-master/solr/common-build.xml:529: The following error occurred while executing this line:
/x1/jenkins/jenkins-slave/workspace/Lucene-Solr-Tests-master/lucene/common-build.xml:1457: The following error occurred while executing this line:
/x1/jenkins/jenkins-slave/workspace/Lucene-Solr-Tests-master/lucene/common-build.xml:1014: There were test failures: 581 suites (10 ignored), 2324 tests, 1 failure, 86 ignored (70 assumptions) [seed: F5FD9807FBEA7D1A]

Total time: 58 minutes 36 seconds
Build step 'Invoke Ant' marked build as failure
Archiving artifacts
Recording test results
Email was triggered for: Failure - Any
Sending email for trigger: Failure - Any



Mime
View raw message