lucene-dev mailing list archives

Site index · List index
Message view « Date » · « Thread »
Top « Date » · « Thread »
From Policeman Jenkins Server <jenk...@thetaphi.de>
Subject [JENKINS] Lucene-Solr-master-MacOSX (64bit/jdk1.8.0) - Build # 3172 - Failure!
Date Mon, 28 Mar 2016 20:15:39 GMT
Build: http://jenkins.thetaphi.de/job/Lucene-Solr-master-MacOSX/3172/
Java: 64bit/jdk1.8.0 -XX:-UseCompressedOops -XX:+UseConcMarkSweepGC

4 tests failed.
FAILED:  org.apache.lucene.search.TestLatLonPointQueries.testRandomMedium

Error Message:
invalid latitude NaN; must be between -90.0 and 90.0

Stack Trace:
java.lang.IllegalArgumentException: invalid latitude NaN; must be between -90.0 and 90.0
	at __randomizedtesting.SeedInfo.seed([85823F5A06971967:385C08F247F27A01]:0)
	at org.apache.lucene.spatial.util.GeoUtils.checkLatitude(GeoUtils.java:66)
	at org.apache.lucene.document.LatLonPoint.encodeLatitude(LatLonPoint.java:140)
	at org.apache.lucene.search.TestLatLonPointQueries.quantizeLat(TestLatLonPointQueries.java:47)
	at org.apache.lucene.spatial.util.BaseGeoPointTestCase.verify(BaseGeoPointTestCase.java:730)
	at org.apache.lucene.spatial.util.BaseGeoPointTestCase.doTestRandom(BaseGeoPointTestCase.java:665)
	at org.apache.lucene.spatial.util.BaseGeoPointTestCase.testRandomMedium(BaseGeoPointTestCase.java:587)
	at sun.reflect.NativeMethodAccessorImpl.invoke0(Native Method)
	at sun.reflect.NativeMethodAccessorImpl.invoke(NativeMethodAccessorImpl.java:62)
	at sun.reflect.DelegatingMethodAccessorImpl.invoke(DelegatingMethodAccessorImpl.java:43)
	at java.lang.reflect.Method.invoke(Method.java:498)
	at com.carrotsearch.randomizedtesting.RandomizedRunner.invoke(RandomizedRunner.java:1764)
	at com.carrotsearch.randomizedtesting.RandomizedRunner$8.evaluate(RandomizedRunner.java:871)
	at com.carrotsearch.randomizedtesting.RandomizedRunner$9.evaluate(RandomizedRunner.java:907)
	at com.carrotsearch.randomizedtesting.RandomizedRunner$10.evaluate(RandomizedRunner.java:921)
	at org.apache.lucene.util.TestRuleSetupTeardownChained$1.evaluate(TestRuleSetupTeardownChained.java:49)
	at org.apache.lucene.util.AbstractBeforeAfterRule$1.evaluate(AbstractBeforeAfterRule.java:45)
	at org.apache.lucene.util.TestRuleThreadAndTestName$1.evaluate(TestRuleThreadAndTestName.java:48)
	at org.apache.lucene.util.TestRuleIgnoreAfterMaxFailures$1.evaluate(TestRuleIgnoreAfterMaxFailures.java:64)
	at org.apache.lucene.util.TestRuleMarkFailure$1.evaluate(TestRuleMarkFailure.java:47)
	at com.carrotsearch.randomizedtesting.rules.StatementAdapter.evaluate(StatementAdapter.java:36)
	at com.carrotsearch.randomizedtesting.ThreadLeakControl$StatementRunner.run(ThreadLeakControl.java:367)
	at com.carrotsearch.randomizedtesting.ThreadLeakControl.forkTimeoutingTask(ThreadLeakControl.java:809)
	at com.carrotsearch.randomizedtesting.ThreadLeakControl$3.evaluate(ThreadLeakControl.java:460)
	at com.carrotsearch.randomizedtesting.RandomizedRunner.runSingleTest(RandomizedRunner.java:880)
	at com.carrotsearch.randomizedtesting.RandomizedRunner$5.evaluate(RandomizedRunner.java:781)
	at com.carrotsearch.randomizedtesting.RandomizedRunner$6.evaluate(RandomizedRunner.java:816)
	at com.carrotsearch.randomizedtesting.RandomizedRunner$7.evaluate(RandomizedRunner.java:827)
	at org.apache.lucene.util.AbstractBeforeAfterRule$1.evaluate(AbstractBeforeAfterRule.java:45)
	at com.carrotsearch.randomizedtesting.rules.StatementAdapter.evaluate(StatementAdapter.java:36)
	at org.apache.lucene.util.TestRuleStoreClassName$1.evaluate(TestRuleStoreClassName.java:41)
	at com.carrotsearch.randomizedtesting.rules.NoShadowingOrOverridesOnMethodsRule$1.evaluate(NoShadowingOrOverridesOnMethodsRule.java:40)
	at com.carrotsearch.randomizedtesting.rules.NoShadowingOrOverridesOnMethodsRule$1.evaluate(NoShadowingOrOverridesOnMethodsRule.java:40)
	at com.carrotsearch.randomizedtesting.rules.StatementAdapter.evaluate(StatementAdapter.java:36)
	at com.carrotsearch.randomizedtesting.rules.StatementAdapter.evaluate(StatementAdapter.java:36)
	at com.carrotsearch.randomizedtesting.rules.StatementAdapter.evaluate(StatementAdapter.java:36)
	at org.apache.lucene.util.TestRuleAssertionsRequired$1.evaluate(TestRuleAssertionsRequired.java:53)
	at org.apache.lucene.util.TestRuleMarkFailure$1.evaluate(TestRuleMarkFailure.java:47)
	at org.apache.lucene.util.TestRuleIgnoreAfterMaxFailures$1.evaluate(TestRuleIgnoreAfterMaxFailures.java:64)
	at org.apache.lucene.util.TestRuleIgnoreTestSuites$1.evaluate(TestRuleIgnoreTestSuites.java:54)
	at com.carrotsearch.randomizedtesting.rules.StatementAdapter.evaluate(StatementAdapter.java:36)
	at com.carrotsearch.randomizedtesting.ThreadLeakControl$StatementRunner.run(ThreadLeakControl.java:367)
	at java.lang.Thread.run(Thread.java:745)


FAILED:  org.apache.lucene.search.TestLatLonPointQueries.testAllLatEqual

Error Message:
invalid latitude NaN; must be between -90.0 and 90.0

Stack Trace:
java.lang.IllegalArgumentException: invalid latitude NaN; must be between -90.0 and 90.0
	at __randomizedtesting.SeedInfo.seed([85823F5A06971967:381769D40F5A3B6A]:0)
	at org.apache.lucene.spatial.util.GeoUtils.checkLatitude(GeoUtils.java:66)
	at org.apache.lucene.document.LatLonPoint.encodeLatitude(LatLonPoint.java:140)
	at org.apache.lucene.search.TestLatLonPointQueries.quantizeLat(TestLatLonPointQueries.java:47)
	at org.apache.lucene.spatial.util.BaseGeoPointTestCase.verify(BaseGeoPointTestCase.java:730)
	at org.apache.lucene.spatial.util.BaseGeoPointTestCase.testAllLatEqual(BaseGeoPointTestCase.java:419)
	at sun.reflect.NativeMethodAccessorImpl.invoke0(Native Method)
	at sun.reflect.NativeMethodAccessorImpl.invoke(NativeMethodAccessorImpl.java:62)
	at sun.reflect.DelegatingMethodAccessorImpl.invoke(DelegatingMethodAccessorImpl.java:43)
	at java.lang.reflect.Method.invoke(Method.java:498)
	at com.carrotsearch.randomizedtesting.RandomizedRunner.invoke(RandomizedRunner.java:1764)
	at com.carrotsearch.randomizedtesting.RandomizedRunner$8.evaluate(RandomizedRunner.java:871)
	at com.carrotsearch.randomizedtesting.RandomizedRunner$9.evaluate(RandomizedRunner.java:907)
	at com.carrotsearch.randomizedtesting.RandomizedRunner$10.evaluate(RandomizedRunner.java:921)
	at org.apache.lucene.util.TestRuleSetupTeardownChained$1.evaluate(TestRuleSetupTeardownChained.java:49)
	at org.apache.lucene.util.AbstractBeforeAfterRule$1.evaluate(AbstractBeforeAfterRule.java:45)
	at org.apache.lucene.util.TestRuleThreadAndTestName$1.evaluate(TestRuleThreadAndTestName.java:48)
	at org.apache.lucene.util.TestRuleIgnoreAfterMaxFailures$1.evaluate(TestRuleIgnoreAfterMaxFailures.java:64)
	at org.apache.lucene.util.TestRuleMarkFailure$1.evaluate(TestRuleMarkFailure.java:47)
	at com.carrotsearch.randomizedtesting.rules.StatementAdapter.evaluate(StatementAdapter.java:36)
	at com.carrotsearch.randomizedtesting.ThreadLeakControl$StatementRunner.run(ThreadLeakControl.java:367)
	at com.carrotsearch.randomizedtesting.ThreadLeakControl.forkTimeoutingTask(ThreadLeakControl.java:809)
	at com.carrotsearch.randomizedtesting.ThreadLeakControl$3.evaluate(ThreadLeakControl.java:460)
	at com.carrotsearch.randomizedtesting.RandomizedRunner.runSingleTest(RandomizedRunner.java:880)
	at com.carrotsearch.randomizedtesting.RandomizedRunner$5.evaluate(RandomizedRunner.java:781)
	at com.carrotsearch.randomizedtesting.RandomizedRunner$6.evaluate(RandomizedRunner.java:816)
	at com.carrotsearch.randomizedtesting.RandomizedRunner$7.evaluate(RandomizedRunner.java:827)
	at org.apache.lucene.util.AbstractBeforeAfterRule$1.evaluate(AbstractBeforeAfterRule.java:45)
	at com.carrotsearch.randomizedtesting.rules.StatementAdapter.evaluate(StatementAdapter.java:36)
	at org.apache.lucene.util.TestRuleStoreClassName$1.evaluate(TestRuleStoreClassName.java:41)
	at com.carrotsearch.randomizedtesting.rules.NoShadowingOrOverridesOnMethodsRule$1.evaluate(NoShadowingOrOverridesOnMethodsRule.java:40)
	at com.carrotsearch.randomizedtesting.rules.NoShadowingOrOverridesOnMethodsRule$1.evaluate(NoShadowingOrOverridesOnMethodsRule.java:40)
	at com.carrotsearch.randomizedtesting.rules.StatementAdapter.evaluate(StatementAdapter.java:36)
	at com.carrotsearch.randomizedtesting.rules.StatementAdapter.evaluate(StatementAdapter.java:36)
	at com.carrotsearch.randomizedtesting.rules.StatementAdapter.evaluate(StatementAdapter.java:36)
	at org.apache.lucene.util.TestRuleAssertionsRequired$1.evaluate(TestRuleAssertionsRequired.java:53)
	at org.apache.lucene.util.TestRuleMarkFailure$1.evaluate(TestRuleMarkFailure.java:47)
	at org.apache.lucene.util.TestRuleIgnoreAfterMaxFailures$1.evaluate(TestRuleIgnoreAfterMaxFailures.java:64)
	at org.apache.lucene.util.TestRuleIgnoreTestSuites$1.evaluate(TestRuleIgnoreTestSuites.java:54)
	at com.carrotsearch.randomizedtesting.rules.StatementAdapter.evaluate(StatementAdapter.java:36)
	at com.carrotsearch.randomizedtesting.ThreadLeakControl$StatementRunner.run(ThreadLeakControl.java:367)
	at java.lang.Thread.run(Thread.java:745)


FAILED:  org.apache.lucene.search.TestLatLonPointQueries.testRandomTiny

Error Message:
invalid latitude NaN; must be between -90.0 and 90.0

Stack Trace:
java.lang.IllegalArgumentException: invalid latitude NaN; must be between -90.0 and 90.0
	at __randomizedtesting.SeedInfo.seed([85823F5A06971967:CCC5E11C58B621CB]:0)
	at org.apache.lucene.spatial.util.GeoUtils.checkLatitude(GeoUtils.java:66)
	at org.apache.lucene.document.LatLonPoint.encodeLatitude(LatLonPoint.java:140)
	at org.apache.lucene.search.TestLatLonPointQueries.quantizeLat(TestLatLonPointQueries.java:47)
	at org.apache.lucene.spatial.util.BaseGeoPointTestCase.verify(BaseGeoPointTestCase.java:730)
	at org.apache.lucene.spatial.util.BaseGeoPointTestCase.doTestRandom(BaseGeoPointTestCase.java:665)
	at org.apache.lucene.spatial.util.BaseGeoPointTestCase.testRandomTiny(BaseGeoPointTestCase.java:583)
	at sun.reflect.NativeMethodAccessorImpl.invoke0(Native Method)
	at sun.reflect.NativeMethodAccessorImpl.invoke(NativeMethodAccessorImpl.java:62)
	at sun.reflect.DelegatingMethodAccessorImpl.invoke(DelegatingMethodAccessorImpl.java:43)
	at java.lang.reflect.Method.invoke(Method.java:498)
	at com.carrotsearch.randomizedtesting.RandomizedRunner.invoke(RandomizedRunner.java:1764)
	at com.carrotsearch.randomizedtesting.RandomizedRunner$8.evaluate(RandomizedRunner.java:871)
	at com.carrotsearch.randomizedtesting.RandomizedRunner$9.evaluate(RandomizedRunner.java:907)
	at com.carrotsearch.randomizedtesting.RandomizedRunner$10.evaluate(RandomizedRunner.java:921)
	at org.apache.lucene.util.TestRuleSetupTeardownChained$1.evaluate(TestRuleSetupTeardownChained.java:49)
	at org.apache.lucene.util.AbstractBeforeAfterRule$1.evaluate(AbstractBeforeAfterRule.java:45)
	at org.apache.lucene.util.TestRuleThreadAndTestName$1.evaluate(TestRuleThreadAndTestName.java:48)
	at org.apache.lucene.util.TestRuleIgnoreAfterMaxFailures$1.evaluate(TestRuleIgnoreAfterMaxFailures.java:64)
	at org.apache.lucene.util.TestRuleMarkFailure$1.evaluate(TestRuleMarkFailure.java:47)
	at com.carrotsearch.randomizedtesting.rules.StatementAdapter.evaluate(StatementAdapter.java:36)
	at com.carrotsearch.randomizedtesting.ThreadLeakControl$StatementRunner.run(ThreadLeakControl.java:367)
	at com.carrotsearch.randomizedtesting.ThreadLeakControl.forkTimeoutingTask(ThreadLeakControl.java:809)
	at com.carrotsearch.randomizedtesting.ThreadLeakControl$3.evaluate(ThreadLeakControl.java:460)
	at com.carrotsearch.randomizedtesting.RandomizedRunner.runSingleTest(RandomizedRunner.java:880)
	at com.carrotsearch.randomizedtesting.RandomizedRunner$5.evaluate(RandomizedRunner.java:781)
	at com.carrotsearch.randomizedtesting.RandomizedRunner$6.evaluate(RandomizedRunner.java:816)
	at com.carrotsearch.randomizedtesting.RandomizedRunner$7.evaluate(RandomizedRunner.java:827)
	at org.apache.lucene.util.AbstractBeforeAfterRule$1.evaluate(AbstractBeforeAfterRule.java:45)
	at com.carrotsearch.randomizedtesting.rules.StatementAdapter.evaluate(StatementAdapter.java:36)
	at org.apache.lucene.util.TestRuleStoreClassName$1.evaluate(TestRuleStoreClassName.java:41)
	at com.carrotsearch.randomizedtesting.rules.NoShadowingOrOverridesOnMethodsRule$1.evaluate(NoShadowingOrOverridesOnMethodsRule.java:40)
	at com.carrotsearch.randomizedtesting.rules.NoShadowingOrOverridesOnMethodsRule$1.evaluate(NoShadowingOrOverridesOnMethodsRule.java:40)
	at com.carrotsearch.randomizedtesting.rules.StatementAdapter.evaluate(StatementAdapter.java:36)
	at com.carrotsearch.randomizedtesting.rules.StatementAdapter.evaluate(StatementAdapter.java:36)
	at com.carrotsearch.randomizedtesting.rules.StatementAdapter.evaluate(StatementAdapter.java:36)
	at org.apache.lucene.util.TestRuleAssertionsRequired$1.evaluate(TestRuleAssertionsRequired.java:53)
	at org.apache.lucene.util.TestRuleMarkFailure$1.evaluate(TestRuleMarkFailure.java:47)
	at org.apache.lucene.util.TestRuleIgnoreAfterMaxFailures$1.evaluate(TestRuleIgnoreAfterMaxFailures.java:64)
	at org.apache.lucene.util.TestRuleIgnoreTestSuites$1.evaluate(TestRuleIgnoreTestSuites.java:54)
	at com.carrotsearch.randomizedtesting.rules.StatementAdapter.evaluate(StatementAdapter.java:36)
	at com.carrotsearch.randomizedtesting.ThreadLeakControl$StatementRunner.run(ThreadLeakControl.java:367)
	at java.lang.Thread.run(Thread.java:745)


FAILED:  org.apache.lucene.search.TestLatLonPointQueries.testAllLonEqual

Error Message:
invalid latitude NaN; must be between -90.0 and 90.0

Stack Trace:
java.lang.IllegalArgumentException: invalid latitude NaN; must be between -90.0 and 90.0
	at __randomizedtesting.SeedInfo.seed([85823F5A06971967:1488CEA7F63D5973]:0)
	at org.apache.lucene.spatial.util.GeoUtils.checkLatitude(GeoUtils.java:66)
	at org.apache.lucene.document.LatLonPoint.encodeLatitude(LatLonPoint.java:140)
	at org.apache.lucene.search.TestLatLonPointQueries.quantizeLat(TestLatLonPointQueries.java:47)
	at org.apache.lucene.spatial.util.BaseGeoPointTestCase.verify(BaseGeoPointTestCase.java:730)
	at org.apache.lucene.spatial.util.BaseGeoPointTestCase.testAllLonEqual(BaseGeoPointTestCase.java:468)
	at sun.reflect.NativeMethodAccessorImpl.invoke0(Native Method)
	at sun.reflect.NativeMethodAccessorImpl.invoke(NativeMethodAccessorImpl.java:62)
	at sun.reflect.DelegatingMethodAccessorImpl.invoke(DelegatingMethodAccessorImpl.java:43)
	at java.lang.reflect.Method.invoke(Method.java:498)
	at com.carrotsearch.randomizedtesting.RandomizedRunner.invoke(RandomizedRunner.java:1764)
	at com.carrotsearch.randomizedtesting.RandomizedRunner$8.evaluate(RandomizedRunner.java:871)
	at com.carrotsearch.randomizedtesting.RandomizedRunner$9.evaluate(RandomizedRunner.java:907)
	at com.carrotsearch.randomizedtesting.RandomizedRunner$10.evaluate(RandomizedRunner.java:921)
	at org.apache.lucene.util.TestRuleSetupTeardownChained$1.evaluate(TestRuleSetupTeardownChained.java:49)
	at org.apache.lucene.util.AbstractBeforeAfterRule$1.evaluate(AbstractBeforeAfterRule.java:45)
	at org.apache.lucene.util.TestRuleThreadAndTestName$1.evaluate(TestRuleThreadAndTestName.java:48)
	at org.apache.lucene.util.TestRuleIgnoreAfterMaxFailures$1.evaluate(TestRuleIgnoreAfterMaxFailures.java:64)
	at org.apache.lucene.util.TestRuleMarkFailure$1.evaluate(TestRuleMarkFailure.java:47)
	at com.carrotsearch.randomizedtesting.rules.StatementAdapter.evaluate(StatementAdapter.java:36)
	at com.carrotsearch.randomizedtesting.ThreadLeakControl$StatementRunner.run(ThreadLeakControl.java:367)
	at com.carrotsearch.randomizedtesting.ThreadLeakControl.forkTimeoutingTask(ThreadLeakControl.java:809)
	at com.carrotsearch.randomizedtesting.ThreadLeakControl$3.evaluate(ThreadLeakControl.java:460)
	at com.carrotsearch.randomizedtesting.RandomizedRunner.runSingleTest(RandomizedRunner.java:880)
	at com.carrotsearch.randomizedtesting.RandomizedRunner$5.evaluate(RandomizedRunner.java:781)
	at com.carrotsearch.randomizedtesting.RandomizedRunner$6.evaluate(RandomizedRunner.java:816)
	at com.carrotsearch.randomizedtesting.RandomizedRunner$7.evaluate(RandomizedRunner.java:827)
	at org.apache.lucene.util.AbstractBeforeAfterRule$1.evaluate(AbstractBeforeAfterRule.java:45)
	at com.carrotsearch.randomizedtesting.rules.StatementAdapter.evaluate(StatementAdapter.java:36)
	at org.apache.lucene.util.TestRuleStoreClassName$1.evaluate(TestRuleStoreClassName.java:41)
	at com.carrotsearch.randomizedtesting.rules.NoShadowingOrOverridesOnMethodsRule$1.evaluate(NoShadowingOrOverridesOnMethodsRule.java:40)
	at com.carrotsearch.randomizedtesting.rules.NoShadowingOrOverridesOnMethodsRule$1.evaluate(NoShadowingOrOverridesOnMethodsRule.java:40)
	at com.carrotsearch.randomizedtesting.rules.StatementAdapter.evaluate(StatementAdapter.java:36)
	at com.carrotsearch.randomizedtesting.rules.StatementAdapter.evaluate(StatementAdapter.java:36)
	at com.carrotsearch.randomizedtesting.rules.StatementAdapter.evaluate(StatementAdapter.java:36)
	at org.apache.lucene.util.TestRuleAssertionsRequired$1.evaluate(TestRuleAssertionsRequired.java:53)
	at org.apache.lucene.util.TestRuleMarkFailure$1.evaluate(TestRuleMarkFailure.java:47)
	at org.apache.lucene.util.TestRuleIgnoreAfterMaxFailures$1.evaluate(TestRuleIgnoreAfterMaxFailures.java:64)
	at org.apache.lucene.util.TestRuleIgnoreTestSuites$1.evaluate(TestRuleIgnoreTestSuites.java:54)
	at com.carrotsearch.randomizedtesting.rules.StatementAdapter.evaluate(StatementAdapter.java:36)
	at com.carrotsearch.randomizedtesting.ThreadLeakControl$StatementRunner.run(ThreadLeakControl.java:367)
	at java.lang.Thread.run(Thread.java:745)




Build Log:
[...truncated 8366 lines...]
   [junit4] Suite: org.apache.lucene.search.TestLatLonPointQueries
   [junit4]   2> NOTE: reproduce with: ant test  -Dtestcase=TestLatLonPointQueries -Dtests.method=testRandomMedium
-Dtests.seed=85823F5A06971967 -Dtests.slow=true -Dtests.locale=fr-CA -Dtests.timezone=America/Indiana/Knox
-Dtests.asserts=true -Dtests.file.encoding=UTF-8
   [junit4] ERROR   0.04s J1 | TestLatLonPointQueries.testRandomMedium <<<
   [junit4]    > Throwable #1: java.lang.IllegalArgumentException: invalid latitude NaN;
must be between -90.0 and 90.0
   [junit4]    > 	at __randomizedtesting.SeedInfo.seed([85823F5A06971967:385C08F247F27A01]:0)
   [junit4]    > 	at org.apache.lucene.spatial.util.GeoUtils.checkLatitude(GeoUtils.java:66)
   [junit4]    > 	at org.apache.lucene.document.LatLonPoint.encodeLatitude(LatLonPoint.java:140)
   [junit4]    > 	at org.apache.lucene.search.TestLatLonPointQueries.quantizeLat(TestLatLonPointQueries.java:47)
   [junit4]    > 	at org.apache.lucene.spatial.util.BaseGeoPointTestCase.verify(BaseGeoPointTestCase.java:730)
   [junit4]    > 	at org.apache.lucene.spatial.util.BaseGeoPointTestCase.doTestRandom(BaseGeoPointTestCase.java:665)
   [junit4]    > 	at org.apache.lucene.spatial.util.BaseGeoPointTestCase.testRandomMedium(BaseGeoPointTestCase.java:587)
   [junit4]    > 	at java.lang.Thread.run(Thread.java:745)
   [junit4] IGNOR/A 0.01s J1 | TestLatLonPointQueries.testRandomDistanceHuge
   [junit4]    > Assumption #1: 'nightly' test group is disabled (@Nightly())
   [junit4]   2> NOTE: reproduce with: ant test  -Dtestcase=TestLatLonPointQueries -Dtests.method=testAllLatEqual
-Dtests.seed=85823F5A06971967 -Dtests.slow=true -Dtests.locale=fr-CA -Dtests.timezone=America/Indiana/Knox
-Dtests.asserts=true -Dtests.file.encoding=UTF-8
   [junit4] ERROR   0.01s J1 | TestLatLonPointQueries.testAllLatEqual <<<
   [junit4]    > Throwable #1: java.lang.IllegalArgumentException: invalid latitude NaN;
must be between -90.0 and 90.0
   [junit4]    > 	at __randomizedtesting.SeedInfo.seed([85823F5A06971967:381769D40F5A3B6A]:0)
   [junit4]    > 	at org.apache.lucene.spatial.util.GeoUtils.checkLatitude(GeoUtils.java:66)
   [junit4]    > 	at org.apache.lucene.document.LatLonPoint.encodeLatitude(LatLonPoint.java:140)
   [junit4]    > 	at org.apache.lucene.search.TestLatLonPointQueries.quantizeLat(TestLatLonPointQueries.java:47)
   [junit4]    > 	at org.apache.lucene.spatial.util.BaseGeoPointTestCase.verify(BaseGeoPointTestCase.java:730)
   [junit4]    > 	at org.apache.lucene.spatial.util.BaseGeoPointTestCase.testAllLatEqual(BaseGeoPointTestCase.java:419)
   [junit4]    > 	at java.lang.Thread.run(Thread.java:745)
   [junit4]   2> NOTE: reproduce with: ant test  -Dtestcase=TestLatLonPointQueries -Dtests.method=testRandomTiny
-Dtests.seed=85823F5A06971967 -Dtests.slow=true -Dtests.locale=fr-CA -Dtests.timezone=America/Indiana/Knox
-Dtests.asserts=true -Dtests.file.encoding=UTF-8
   [junit4] ERROR   0.00s J1 | TestLatLonPointQueries.testRandomTiny <<<
   [junit4]    > Throwable #1: java.lang.IllegalArgumentException: invalid latitude NaN;
must be between -90.0 and 90.0
   [junit4]    > 	at __randomizedtesting.SeedInfo.seed([85823F5A06971967:CCC5E11C58B621CB]:0)
   [junit4]    > 	at org.apache.lucene.spatial.util.GeoUtils.checkLatitude(GeoUtils.java:66)
   [junit4]    > 	at org.apache.lucene.document.LatLonPoint.encodeLatitude(LatLonPoint.java:140)
   [junit4]    > 	at org.apache.lucene.search.TestLatLonPointQueries.quantizeLat(TestLatLonPointQueries.java:47)
   [junit4]    > 	at org.apache.lucene.spatial.util.BaseGeoPointTestCase.verify(BaseGeoPointTestCase.java:730)
   [junit4]    > 	at org.apache.lucene.spatial.util.BaseGeoPointTestCase.doTestRandom(BaseGeoPointTestCase.java:665)
   [junit4]    > 	at org.apache.lucene.spatial.util.BaseGeoPointTestCase.testRandomTiny(BaseGeoPointTestCase.java:583)
   [junit4]    > 	at java.lang.Thread.run(Thread.java:745)
   [junit4] IGNOR/A 0.00s J1 | TestLatLonPointQueries.testRandomBig
   [junit4]    > Assumption #1: 'nightly' test group is disabled (@Nightly())
   [junit4]   2> NOTE: reproduce with: ant test  -Dtestcase=TestLatLonPointQueries -Dtests.method=testAllLonEqual
-Dtests.seed=85823F5A06971967 -Dtests.slow=true -Dtests.locale=fr-CA -Dtests.timezone=America/Indiana/Knox
-Dtests.asserts=true -Dtests.file.encoding=UTF-8
   [junit4] ERROR   0.01s J1 | TestLatLonPointQueries.testAllLonEqual <<<
   [junit4]    > Throwable #1: java.lang.IllegalArgumentException: invalid latitude NaN;
must be between -90.0 and 90.0
   [junit4]    > 	at __randomizedtesting.SeedInfo.seed([85823F5A06971967:1488CEA7F63D5973]:0)
   [junit4]    > 	at org.apache.lucene.spatial.util.GeoUtils.checkLatitude(GeoUtils.java:66)
   [junit4]    > 	at org.apache.lucene.document.LatLonPoint.encodeLatitude(LatLonPoint.java:140)
   [junit4]    > 	at org.apache.lucene.search.TestLatLonPointQueries.quantizeLat(TestLatLonPointQueries.java:47)
   [junit4]    > 	at org.apache.lucene.spatial.util.BaseGeoPointTestCase.verify(BaseGeoPointTestCase.java:730)
   [junit4]    > 	at org.apache.lucene.spatial.util.BaseGeoPointTestCase.testAllLonEqual(BaseGeoPointTestCase.java:468)
   [junit4]    > 	at java.lang.Thread.run(Thread.java:745)
   [junit4]   2> NOTE: leaving temporary files on disk at: /Users/jenkins/workspace/Lucene-Solr-master-MacOSX/lucene/build/sandbox/test/J1/temp/lucene.search.TestLatLonPointQueries_85823F5A06971967-001
   [junit4]   2> NOTE: test params are: codec=Asserting(Lucene60): {string=PostingsFormat(name=Direct),
id=PostingsFormat(name=Direct)}, docValues:{field=DocValuesFormat(name=Memory), id=DocValuesFormat(name=Asserting),
point=DocValuesFormat(name=SimpleText)}, maxPointsInLeafNode=844, maxMBSortInHeap=4.546763557316951,
sim=RandomSimilarity(queryNorm=true,coord=no): {}, locale=fr-CA, timezone=America/Indiana/Knox
   [junit4]   2> NOTE: Mac OS X 10.11.3 x86_64/Oracle Corporation 1.8.0_72 (64-bit)/cpus=3,threads=1,free=35462608,total=54788096
   [junit4]   2> NOTE: All tests run in this JVM: [TestBigIntegerPoint, TestPayloadSpanUtil,
TestLatLonPointQueries]
   [junit4] Completed [12/15 (1!)] on J1 in 10.37s, 42 tests, 4 errors, 2 skipped <<<
FAILURES!

[...truncated 24 lines...]
BUILD FAILED
/Users/jenkins/workspace/Lucene-Solr-master-MacOSX/build.xml:740: The following error occurred
while executing this line:
/Users/jenkins/workspace/Lucene-Solr-master-MacOSX/build.xml:684: The following error occurred
while executing this line:
/Users/jenkins/workspace/Lucene-Solr-master-MacOSX/build.xml:59: The following error occurred
while executing this line:
/Users/jenkins/workspace/Lucene-Solr-master-MacOSX/lucene/build.xml:476: The following error
occurred while executing this line:
/Users/jenkins/workspace/Lucene-Solr-master-MacOSX/lucene/common-build.xml:2187: The following
error occurred while executing this line:
/Users/jenkins/workspace/Lucene-Solr-master-MacOSX/lucene/module-build.xml:58: The following
error occurred while executing this line:
/Users/jenkins/workspace/Lucene-Solr-master-MacOSX/lucene/common-build.xml:1457: The following
error occurred while executing this line:
/Users/jenkins/workspace/Lucene-Solr-master-MacOSX/lucene/common-build.xml:1014: There were
test failures: 15 suites, 118 tests, 4 errors, 3 ignored (3 assumptions) [seed: 85823F5A06971967]

Total time: 22 minutes 43 seconds
Build step 'Invoke Ant' marked build as failure
Archiving artifacts
[WARNINGS] Skipping publisher since build result is FAILURE
Recording test results
Email was triggered for: Failure - Any
Sending email for trigger: Failure - Any



Mime
View raw message