lucene-dev mailing list archives

Site index · List index
Message view « Date » · « Thread »
Top « Date » · « Thread »
From Policeman Jenkins Server <jenk...@thetaphi.de>
Subject [JENKINS] Lucene-Solr-6.x-Solaris (64bit/jdk1.8.0) - Build # 38 - Still Failing!
Date Mon, 28 Mar 2016 18:04:27 GMT
Build: http://jenkins.thetaphi.de/job/Lucene-Solr-6.x-Solaris/38/
Java: 64bit/jdk1.8.0 -XX:-UseCompressedOops -XX:+UseG1GC

2 tests failed.
FAILED:  org.apache.solr.cloud.ChaosMonkeyNothingIsSafeTest.test

Error Message:
document count mismatch.  control=264 sum(shards)=265 cloudClient=265

Stack Trace:
java.lang.AssertionError: document count mismatch.  control=264 sum(shards)=265 cloudClient=265
	at __randomizedtesting.SeedInfo.seed([5C68465A4A64CE01:D43C7980E498A3F9]:0)
	at org.junit.Assert.fail(Assert.java:93)
	at org.apache.solr.cloud.AbstractFullDistribZkTestBase.checkShardConsistency(AbstractFullDistribZkTestBase.java:1317)
	at org.apache.solr.cloud.ChaosMonkeyNothingIsSafeTest.test(ChaosMonkeyNothingIsSafeTest.java:226)
	at sun.reflect.NativeMethodAccessorImpl.invoke0(Native Method)
	at sun.reflect.NativeMethodAccessorImpl.invoke(NativeMethodAccessorImpl.java:62)
	at sun.reflect.DelegatingMethodAccessorImpl.invoke(DelegatingMethodAccessorImpl.java:43)
	at java.lang.reflect.Method.invoke(Method.java:498)
	at com.carrotsearch.randomizedtesting.RandomizedRunner.invoke(RandomizedRunner.java:1764)
	at com.carrotsearch.randomizedtesting.RandomizedRunner$8.evaluate(RandomizedRunner.java:871)
	at com.carrotsearch.randomizedtesting.RandomizedRunner$9.evaluate(RandomizedRunner.java:907)
	at com.carrotsearch.randomizedtesting.RandomizedRunner$10.evaluate(RandomizedRunner.java:921)
	at org.apache.solr.BaseDistributedSearchTestCase$ShardsRepeatRule$ShardsFixedStatement.callStatement(BaseDistributedSearchTestCase.java:996)
	at org.apache.solr.BaseDistributedSearchTestCase$ShardsRepeatRule$ShardsStatement.evaluate(BaseDistributedSearchTestCase.java:971)
	at com.carrotsearch.randomizedtesting.rules.SystemPropertiesRestoreRule$1.evaluate(SystemPropertiesRestoreRule.java:57)
	at org.apache.lucene.util.TestRuleSetupTeardownChained$1.evaluate(TestRuleSetupTeardownChained.java:49)
	at org.apache.lucene.util.AbstractBeforeAfterRule$1.evaluate(AbstractBeforeAfterRule.java:45)
	at org.apache.lucene.util.TestRuleThreadAndTestName$1.evaluate(TestRuleThreadAndTestName.java:48)
	at org.apache.lucene.util.TestRuleIgnoreAfterMaxFailures$1.evaluate(TestRuleIgnoreAfterMaxFailures.java:64)
	at org.apache.lucene.util.TestRuleMarkFailure$1.evaluate(TestRuleMarkFailure.java:47)
	at com.carrotsearch.randomizedtesting.rules.StatementAdapter.evaluate(StatementAdapter.java:36)
	at com.carrotsearch.randomizedtesting.ThreadLeakControl$StatementRunner.run(ThreadLeakControl.java:367)
	at com.carrotsearch.randomizedtesting.ThreadLeakControl.forkTimeoutingTask(ThreadLeakControl.java:809)
	at com.carrotsearch.randomizedtesting.ThreadLeakControl$3.evaluate(ThreadLeakControl.java:460)
	at com.carrotsearch.randomizedtesting.RandomizedRunner.runSingleTest(RandomizedRunner.java:880)
	at com.carrotsearch.randomizedtesting.RandomizedRunner$5.evaluate(RandomizedRunner.java:781)
	at com.carrotsearch.randomizedtesting.RandomizedRunner$6.evaluate(RandomizedRunner.java:816)
	at com.carrotsearch.randomizedtesting.RandomizedRunner$7.evaluate(RandomizedRunner.java:827)
	at com.carrotsearch.randomizedtesting.rules.StatementAdapter.evaluate(StatementAdapter.java:36)
	at com.carrotsearch.randomizedtesting.rules.SystemPropertiesRestoreRule$1.evaluate(SystemPropertiesRestoreRule.java:57)
	at org.apache.lucene.util.AbstractBeforeAfterRule$1.evaluate(AbstractBeforeAfterRule.java:45)
	at com.carrotsearch.randomizedtesting.rules.StatementAdapter.evaluate(StatementAdapter.java:36)
	at org.apache.lucene.util.TestRuleStoreClassName$1.evaluate(TestRuleStoreClassName.java:41)
	at com.carrotsearch.randomizedtesting.rules.NoShadowingOrOverridesOnMethodsRule$1.evaluate(NoShadowingOrOverridesOnMethodsRule.java:40)
	at com.carrotsearch.randomizedtesting.rules.NoShadowingOrOverridesOnMethodsRule$1.evaluate(NoShadowingOrOverridesOnMethodsRule.java:40)
	at com.carrotsearch.randomizedtesting.rules.StatementAdapter.evaluate(StatementAdapter.java:36)
	at com.carrotsearch.randomizedtesting.rules.StatementAdapter.evaluate(StatementAdapter.java:36)
	at com.carrotsearch.randomizedtesting.rules.StatementAdapter.evaluate(StatementAdapter.java:36)
	at org.apache.lucene.util.TestRuleAssertionsRequired$1.evaluate(TestRuleAssertionsRequired.java:53)
	at org.apache.lucene.util.TestRuleMarkFailure$1.evaluate(TestRuleMarkFailure.java:47)
	at org.apache.lucene.util.TestRuleIgnoreAfterMaxFailures$1.evaluate(TestRuleIgnoreAfterMaxFailures.java:64)
	at org.apache.lucene.util.TestRuleIgnoreTestSuites$1.evaluate(TestRuleIgnoreTestSuites.java:54)
	at com.carrotsearch.randomizedtesting.rules.StatementAdapter.evaluate(StatementAdapter.java:36)
	at com.carrotsearch.randomizedtesting.ThreadLeakControl$StatementRunner.run(ThreadLeakControl.java:367)
	at java.lang.Thread.run(Thread.java:745)


FAILED:  org.apache.solr.update.AutoCommitTest.testMaxDocs

Error Message:
Exception during query

Stack Trace:
java.lang.RuntimeException: Exception during query
	at __randomizedtesting.SeedInfo.seed([5C68465A4A64CE01:E5E99085668ECA8B]:0)
	at org.apache.solr.SolrTestCaseJ4.assertQ(SolrTestCaseJ4.java:765)
	at org.apache.solr.update.AutoCommitTest.testMaxDocs(AutoCommitTest.java:198)
	at sun.reflect.NativeMethodAccessorImpl.invoke0(Native Method)
	at sun.reflect.NativeMethodAccessorImpl.invoke(NativeMethodAccessorImpl.java:62)
	at sun.reflect.DelegatingMethodAccessorImpl.invoke(DelegatingMethodAccessorImpl.java:43)
	at java.lang.reflect.Method.invoke(Method.java:498)
	at com.carrotsearch.randomizedtesting.RandomizedRunner.invoke(RandomizedRunner.java:1764)
	at com.carrotsearch.randomizedtesting.RandomizedRunner$8.evaluate(RandomizedRunner.java:871)
	at com.carrotsearch.randomizedtesting.RandomizedRunner$9.evaluate(RandomizedRunner.java:907)
	at com.carrotsearch.randomizedtesting.RandomizedRunner$10.evaluate(RandomizedRunner.java:921)
	at com.carrotsearch.randomizedtesting.rules.SystemPropertiesRestoreRule$1.evaluate(SystemPropertiesRestoreRule.java:57)
	at org.apache.lucene.util.TestRuleSetupTeardownChained$1.evaluate(TestRuleSetupTeardownChained.java:49)
	at org.apache.lucene.util.AbstractBeforeAfterRule$1.evaluate(AbstractBeforeAfterRule.java:45)
	at org.apache.lucene.util.TestRuleThreadAndTestName$1.evaluate(TestRuleThreadAndTestName.java:48)
	at org.apache.lucene.util.TestRuleIgnoreAfterMaxFailures$1.evaluate(TestRuleIgnoreAfterMaxFailures.java:64)
	at org.apache.lucene.util.TestRuleMarkFailure$1.evaluate(TestRuleMarkFailure.java:47)
	at com.carrotsearch.randomizedtesting.rules.StatementAdapter.evaluate(StatementAdapter.java:36)
	at com.carrotsearch.randomizedtesting.ThreadLeakControl$StatementRunner.run(ThreadLeakControl.java:367)
	at com.carrotsearch.randomizedtesting.ThreadLeakControl.forkTimeoutingTask(ThreadLeakControl.java:809)
	at com.carrotsearch.randomizedtesting.ThreadLeakControl$3.evaluate(ThreadLeakControl.java:460)
	at com.carrotsearch.randomizedtesting.RandomizedRunner.runSingleTest(RandomizedRunner.java:880)
	at com.carrotsearch.randomizedtesting.RandomizedRunner$5.evaluate(RandomizedRunner.java:781)
	at com.carrotsearch.randomizedtesting.RandomizedRunner$6.evaluate(RandomizedRunner.java:816)
	at com.carrotsearch.randomizedtesting.RandomizedRunner$7.evaluate(RandomizedRunner.java:827)
	at com.carrotsearch.randomizedtesting.rules.StatementAdapter.evaluate(StatementAdapter.java:36)
	at com.carrotsearch.randomizedtesting.rules.SystemPropertiesRestoreRule$1.evaluate(SystemPropertiesRestoreRule.java:57)
	at org.apache.lucene.util.AbstractBeforeAfterRule$1.evaluate(AbstractBeforeAfterRule.java:45)
	at com.carrotsearch.randomizedtesting.rules.StatementAdapter.evaluate(StatementAdapter.java:36)
	at org.apache.lucene.util.TestRuleStoreClassName$1.evaluate(TestRuleStoreClassName.java:41)
	at com.carrotsearch.randomizedtesting.rules.NoShadowingOrOverridesOnMethodsRule$1.evaluate(NoShadowingOrOverridesOnMethodsRule.java:40)
	at com.carrotsearch.randomizedtesting.rules.NoShadowingOrOverridesOnMethodsRule$1.evaluate(NoShadowingOrOverridesOnMethodsRule.java:40)
	at com.carrotsearch.randomizedtesting.rules.StatementAdapter.evaluate(StatementAdapter.java:36)
	at com.carrotsearch.randomizedtesting.rules.StatementAdapter.evaluate(StatementAdapter.java:36)
	at com.carrotsearch.randomizedtesting.rules.StatementAdapter.evaluate(StatementAdapter.java:36)
	at org.apache.lucene.util.TestRuleAssertionsRequired$1.evaluate(TestRuleAssertionsRequired.java:53)
	at org.apache.lucene.util.TestRuleMarkFailure$1.evaluate(TestRuleMarkFailure.java:47)
	at org.apache.lucene.util.TestRuleIgnoreAfterMaxFailures$1.evaluate(TestRuleIgnoreAfterMaxFailures.java:64)
	at org.apache.lucene.util.TestRuleIgnoreTestSuites$1.evaluate(TestRuleIgnoreTestSuites.java:54)
	at com.carrotsearch.randomizedtesting.rules.StatementAdapter.evaluate(StatementAdapter.java:36)
	at com.carrotsearch.randomizedtesting.ThreadLeakControl$StatementRunner.run(ThreadLeakControl.java:367)
	at java.lang.Thread.run(Thread.java:745)
Caused by: java.lang.RuntimeException: REQUEST FAILED: xpath=//result[@numFound=1]
	xml response was: <?xml version="1.0" encoding="UTF-8"?>
<response>
<lst name="responseHeader"><int name="status">0</int><int name="QTime">4</int></lst><result name="response" numFound="0" start="0"></result>
</response>

	request was:q=id:14&qt=standard&start=0&rows=20&version=2.2
	at org.apache.solr.SolrTestCaseJ4.assertQ(SolrTestCaseJ4.java:758)
	... 40 more




Build Log:
[...truncated 10840 lines...]
   [junit4] Suite: org.apache.solr.cloud.ChaosMonkeyNothingIsSafeTest
   [junit4]   2> Creating dataDir: /export/home/jenkins/workspace/Lucene-Solr-6.x-Solaris/solr/build/solr-core/test/J0/temp/solr.cloud.ChaosMonkeyNothingIsSafeTest_5C68465A4A64CE01-001/init-core-data-001
   [junit4]   2> 572085 INFO  (SUITE-ChaosMonkeyNothingIsSafeTest-seed#[5C68465A4A64CE01]-worker) [    ] o.a.s.BaseDistributedSearchTestCase Setting hostContext system property: /
   [junit4]   2> 572091 INFO  (TEST-ChaosMonkeyNothingIsSafeTest.test-seed#[5C68465A4A64CE01]) [    ] o.a.s.c.ZkTestServer STARTING ZK TEST SERVER
   [junit4]   2> 572091 INFO  (Thread-1784) [    ] o.a.s.c.ZkTestServer client port:0.0.0.0/0.0.0.0:0
   [junit4]   2> 572091 INFO  (Thread-1784) [    ] o.a.s.c.ZkTestServer Starting server
   [junit4]   2> 572191 INFO  (TEST-ChaosMonkeyNothingIsSafeTest.test-seed#[5C68465A4A64CE01]) [    ] o.a.s.c.ZkTestServer start zk server on port:59139
   [junit4]   2> 572191 INFO  (TEST-ChaosMonkeyNothingIsSafeTest.test-seed#[5C68465A4A64CE01]) [    ] o.a.s.c.c.SolrZkClient Using default ZkCredentialsProvider
   [junit4]   2> 572192 INFO  (TEST-ChaosMonkeyNothingIsSafeTest.test-seed#[5C68465A4A64CE01]) [    ] o.a.s.c.c.ConnectionManager Waiting for client to connect to ZooKeeper
   [junit4]   2> 572195 INFO  (zkCallback-472-thread-1) [    ] o.a.s.c.c.ConnectionManager Watcher org.apache.solr.common.cloud.ConnectionManager@6f03189b name:ZooKeeperConnection Watcher:127.0.0.1:59139 got event WatchedEvent state:SyncConnected type:None path:null path:null type:None
   [junit4]   2> 572195 INFO  (TEST-ChaosMonkeyNothingIsSafeTest.test-seed#[5C68465A4A64CE01]) [    ] o.a.s.c.c.ConnectionManager Client is connected to ZooKeeper
   [junit4]   2> 572195 INFO  (TEST-ChaosMonkeyNothingIsSafeTest.test-seed#[5C68465A4A64CE01]) [    ] o.a.s.c.c.SolrZkClient Using default ZkACLProvider
   [junit4]   2> 572195 INFO  (TEST-ChaosMonkeyNothingIsSafeTest.test-seed#[5C68465A4A64CE01]) [    ] o.a.s.c.c.SolrZkClient makePath: /solr
   [junit4]   2> 572199 INFO  (TEST-ChaosMonkeyNothingIsSafeTest.test-seed#[5C68465A4A64CE01]) [    ] o.a.s.c.c.SolrZkClient Using default ZkCredentialsProvider
   [junit4]   2> 572199 INFO  (TEST-ChaosMonkeyNothingIsSafeTest.test-seed#[5C68465A4A64CE01]) [    ] o.a.s.c.c.ConnectionManager Waiting for client to connect to ZooKeeper
   [junit4]   2> 572201 INFO  (zkCallback-473-thread-1) [    ] o.a.s.c.c.ConnectionManager Watcher org.apache.solr.common.cloud.ConnectionManager@794eae48 name:ZooKeeperConnection Watcher:127.0.0.1:59139/solr got event WatchedEvent state:SyncConnected type:None path:null path:null type:None
   [junit4]   2> 572201 INFO  (TEST-ChaosMonkeyNothingIsSafeTest.test-seed#[5C68465A4A64CE01]) [    ] o.a.s.c.c.ConnectionManager Client is connected to ZooKeeper
   [junit4]   2> 572201 INFO  (TEST-ChaosMonkeyNothingIsSafeTest.test-seed#[5C68465A4A64CE01]) [    ] o.a.s.c.c.SolrZkClient Using default ZkACLProvider
   [junit4]   2> 572201 INFO  (TEST-ChaosMonkeyNothingIsSafeTest.test-seed#[5C68465A4A64CE01]) [    ] o.a.s.c.c.SolrZkClient makePath: /collections/collection1
   [junit4]   2> 572205 INFO  (TEST-ChaosMonkeyNothingIsSafeTest.test-seed#[5C68465A4A64CE01]) [    ] o.a.s.c.c.SolrZkClient makePath: /collections/collection1/shards
   [junit4]   2> 572207 INFO  (TEST-ChaosMonkeyNothingIsSafeTest.test-seed#[5C68465A4A64CE01]) [    ] o.a.s.c.c.SolrZkClient makePath: /collections/control_collection
   [junit4]   2> 572209 INFO  (TEST-ChaosMonkeyNothingIsSafeTest.test-seed#[5C68465A4A64CE01]) [    ] o.a.s.c.c.SolrZkClient makePath: /collections/control_collection/shards
   [junit4]   2> 572212 INFO  (TEST-ChaosMonkeyNothingIsSafeTest.test-seed#[5C68465A4A64CE01]) [    ] o.a.s.c.AbstractZkTestCase put /export/home/jenkins/workspace/Lucene-Solr-6.x-Solaris/solr/core/src/test-files/solr/collection1/conf/solrconfig-tlog.xml to /configs/conf1/solrconfig.xml
   [junit4]   2> 572212 INFO  (TEST-ChaosMonkeyNothingIsSafeTest.test-seed#[5C68465A4A64CE01]) [    ] o.a.s.c.c.SolrZkClient makePath: /configs/conf1/solrconfig.xml
   [junit4]   2> 572216 INFO  (TEST-ChaosMonkeyNothingIsSafeTest.test-seed#[5C68465A4A64CE01]) [    ] o.a.s.c.AbstractZkTestCase put /export/home/jenkins/workspace/Lucene-Solr-6.x-Solaris/solr/core/src/test-files/solr/collection1/conf/schema15.xml to /configs/conf1/schema.xml
   [junit4]   2> 572216 INFO  (TEST-ChaosMonkeyNothingIsSafeTest.test-seed#[5C68465A4A64CE01]) [    ] o.a.s.c.c.SolrZkClient makePath: /configs/conf1/schema.xml
   [junit4]   2> 572219 INFO  (TEST-ChaosMonkeyNothingIsSafeTest.test-seed#[5C68465A4A64CE01]) [    ] o.a.s.c.AbstractZkTestCase put /export/home/jenkins/workspace/Lucene-Solr-6.x-Solaris/solr/core/src/test-files/solr/collection1/conf/solrconfig.snippet.randomindexconfig.xml to /configs/conf1/solrconfig.snippet.randomindexconfig.xml
   [junit4]   2> 572219 INFO  (TEST-ChaosMonkeyNothingIsSafeTest.test-seed#[5C68465A4A64CE01]) [    ] o.a.s.c.c.SolrZkClient makePath: /configs/conf1/solrconfig.snippet.randomindexconfig.xml
   [junit4]   2> 572221 INFO  (TEST-ChaosMonkeyNothingIsSafeTest.test-seed#[5C68465A4A64CE01]) [    ] o.a.s.c.AbstractZkTestCase put /export/home/jenkins/workspace/Lucene-Solr-6.x-Solaris/solr/core/src/test-files/solr/collection1/conf/stopwords.txt to /configs/conf1/stopwords.txt
   [junit4]   2> 572222 INFO  (TEST-ChaosMonkeyNothingIsSafeTest.test-seed#[5C68465A4A64CE01]) [    ] o.a.s.c.c.SolrZkClient makePath: /configs/conf1/stopwords.txt
   [junit4]   2> 572224 INFO  (TEST-ChaosMonkeyNothingIsSafeTest.test-seed#[5C68465A4A64CE01]) [    ] o.a.s.c.AbstractZkTestCase put /export/home/jenkins/workspace/Lucene-Solr-6.x-Solaris/solr/core/src/test-files/solr/collection1/conf/protwords.txt to /configs/conf1/protwords.txt
   [junit4]   2> 572224 INFO  (TEST-ChaosMonkeyNothingIsSafeTest.test-seed#[5C68465A4A64CE01]) [    ] o.a.s.c.c.SolrZkClient makePath: /configs/conf1/protwords.txt
   [junit4]   2> 572227 INFO  (TEST-ChaosMonkeyNothingIsSafeTest.test-seed#[5C68465A4A64CE01]) [    ] o.a.s.c.AbstractZkTestCase put /export/home/jenkins/workspace/Lucene-Solr-6.x-Solaris/solr/core/src/test-files/solr/collection1/conf/currency.xml to /configs/conf1/currency.xml
   [junit4]   2> 572227 INFO  (TEST-ChaosMonkeyNothingIsSafeTest.test-seed#[5C68465A4A64CE01]) [    ] o.a.s.c.c.SolrZkClient makePath: /configs/conf1/currency.xml
   [junit4]   2> 572230 INFO  (TEST-ChaosMonkeyNothingIsSafeTest.test-seed#[5C68465A4A64CE01]) [    ] o.a.s.c.AbstractZkTestCase put /export/home/jenkins/workspace/Lucene-Solr-6.x-Solaris/solr/core/src/test-files/solr/collection1/conf/enumsConfig.xml to /configs/conf1/enumsConfig.xml
   [junit4]   2> 572230 INFO  (TEST-ChaosMonkeyNothingIsSafeTest.test-seed#[5C68465A4A64CE01]) [    ] o.a.s.c.c.SolrZkClient makePath: /configs/conf1/enumsConfig.xml
   [junit4]   2> 572232 INFO  (TEST-ChaosMonkeyNothingIsSafeTest.test-seed#[5C68465A4A64CE01]) [    ] o.a.s.c.AbstractZkTestCase put /export/home/jenkins/workspace/Lucene-Solr-6.x-Solaris/solr/core/src/test-files/solr/collection1/conf/open-exchange-rates.json to /configs/conf1/open-exchange-rates.json
   [junit4]   2> 572232 INFO  (TEST-ChaosMonkeyNothingIsSafeTest.test-seed#[5C68465A4A64CE01]) [    ] o.a.s.c.c.SolrZkClient makePath: /configs/conf1/open-exchange-rates.json
   [junit4]   2> 572235 INFO  (TEST-ChaosMonkeyNothingIsSafeTest.test-seed#[5C68465A4A64CE01]) [    ] o.a.s.c.AbstractZkTestCase put /export/home/jenkins/workspace/Lucene-Solr-6.x-Solaris/solr/core/src/test-files/solr/collection1/conf/mapping-ISOLatin1Accent.txt to /configs/conf1/mapping-ISOLatin1Accent.txt
   [junit4]   2> 572235 INFO  (TEST-ChaosMonkeyNothingIsSafeTest.test-seed#[5C68465A4A64CE01]) [    ] o.a.s.c.c.SolrZkClient makePath: /configs/conf1/mapping-ISOLatin1Accent.txt
   [junit4]   2> 572239 INFO  (TEST-ChaosMonkeyNothingIsSafeTest.test-seed#[5C68465A4A64CE01]) [    ] o.a.s.c.AbstractZkTestCase put /export/home/jenkins/workspace/Lucene-Solr-6.x-Solaris/solr/core/src/test-files/solr/collection1/conf/old_synonyms.txt to /configs/conf1/old_synonyms.txt
   [junit4]   2> 572239 INFO  (TEST-ChaosMonkeyNothingIsSafeTest.test-seed#[5C68465A4A64CE01]) [    ] o.a.s.c.c.SolrZkClient makePath: /configs/conf1/old_synonyms.txt
   [junit4]   2> 572241 INFO  (TEST-ChaosMonkeyNothingIsSafeTest.test-seed#[5C68465A4A64CE01]) [    ] o.a.s.c.AbstractZkTestCase put /export/home/jenkins/workspace/Lucene-Solr-6.x-Solaris/solr/core/src/test-files/solr/collection1/conf/synonyms.txt to /configs/conf1/synonyms.txt
   [junit4]   2> 572241 INFO  (TEST-ChaosMonkeyNothingIsSafeTest.test-seed#[5C68465A4A64CE01]) [    ] o.a.s.c.c.SolrZkClient makePath: /configs/conf1/synonyms.txt
   [junit4]   2> 572394 INFO  (TEST-ChaosMonkeyNothingIsSafeTest.test-seed#[5C68465A4A64CE01]) [    ] o.a.s.SolrTestCaseJ4 Writing core.properties file to /export/home/jenkins/workspace/Lucene-Solr-6.x-Solaris/solr/build/solr-core/test/J0/temp/solr.cloud.ChaosMonkeyNothingIsSafeTest_5C68465A4A64CE01-001/control-001/cores/collection1
   [junit4]   2> 572395 INFO  (TEST-ChaosMonkeyNothingIsSafeTest.test-seed#[5C68465A4A64CE01]) [    ] o.e.j.s.Server jetty-9.3.8.v20160314
   [junit4]   2> 572397 INFO  (TEST-ChaosMonkeyNothingIsSafeTest.test-seed#[5C68465A4A64CE01]) [    ] o.e.j.s.h.ContextHandler Started o.e.j.s.ServletContextHandler@6257c467{/,null,AVAILABLE}
   [junit4]   2> 572399 INFO  (TEST-ChaosMonkeyNothingIsSafeTest.test-seed#[5C68465A4A64CE01]) [    ] o.e.j.s.ServerConnector Started ServerConnector@4be918b1{HTTP/1.1,[http/1.1]}{127.0.0.1:63674}
   [junit4]   2> 572399 INFO  (TEST-ChaosMonkeyNothingIsSafeTest.test-seed#[5C68465A4A64CE01]) [    ] o.e.j.s.Server Started @575688ms
   [junit4]   2> 572399 INFO  (TEST-ChaosMonkeyNothingIsSafeTest.test-seed#[5C68465A4A64CE01]) [    ] o.a.s.c.s.e.JettySolrRunner Jetty properties: {solr.data.dir=/export/home/jenkins/workspace/Lucene-Solr-6.x-Solaris/solr/build/solr-core/test/J0/temp/solr.cloud.ChaosMonkeyNothingIsSafeTest_5C68465A4A64CE01-001/tempDir-001/control/data, hostContext=/, hostPort=63674, coreRootDirectory=/export/home/jenkins/workspace/Lucene-Solr-6.x-Solaris/solr/build/solr-core/test/J0/temp/solr.cloud.ChaosMonkeyNothingIsSafeTest_5C68465A4A64CE01-001/control-001/cores}
   [junit4]   2> 572399 INFO  (TEST-ChaosMonkeyNothingIsSafeTest.test-seed#[5C68465A4A64CE01]) [    ] o.a.s.s.SolrDispatchFilter SolrDispatchFilter.init(): sun.misc.Launcher$AppClassLoader@6d06d69c
   [junit4]   2> 572399 INFO  (TEST-ChaosMonkeyNothingIsSafeTest.test-seed#[5C68465A4A64CE01]) [    ] o.a.s.c.SolrResourceLoader new SolrResourceLoader for directory: '/export/home/jenkins/workspace/Lucene-Solr-6.x-Solaris/solr/build/solr-core/test/J0/temp/solr.cloud.ChaosMonkeyNothingIsSafeTest_5C68465A4A64CE01-001/control-001'
   [junit4]   2> 572400 INFO  (TEST-ChaosMonkeyNothingIsSafeTest.test-seed#[5C68465A4A64CE01]) [    ] o.a.s.c.SolrResourceLoader JNDI not configured for solr (NoInitialContextEx)
   [junit4]   2> 572400 INFO  (TEST-ChaosMonkeyNothingIsSafeTest.test-seed#[5C68465A4A64CE01]) [    ] o.a.s.c.SolrResourceLoader solr home defaulted to 'solr/' (could not find system property or JNDI)
   [junit4]   2> 572400 INFO  (TEST-ChaosMonkeyNothingIsSafeTest.test-seed#[5C68465A4A64CE01]) [    ] o.a.s.c.c.SolrZkClient Using default ZkCredentialsProvider
   [junit4]   2> 572402 INFO  (TEST-ChaosMonkeyNothingIsSafeTest.test-seed#[5C68465A4A64CE01]) [    ] o.a.s.c.c.ConnectionManager Waiting for client to connect to ZooKeeper
   [junit4]   2> 572404 INFO  (zkCallback-474-thread-1) [    ] o.a.s.c.c.ConnectionManager Watcher org.apache.solr.common.cloud.ConnectionManager@660e0cee name:ZooKeeperConnection Watcher:127.0.0.1:59139/solr got event WatchedEvent state:SyncConnected type:None path:null path:null type:None
   [junit4]   2> 572404 INFO  (TEST-ChaosMonkeyNothingIsSafeTest.test-seed#[5C68465A4A64CE01]) [    ] o.a.s.c.c.ConnectionManager Client is connected to ZooKeeper
   [junit4]   2> 572404 INFO  (TEST-ChaosMonkeyNothingIsSafeTest.test-seed#[5C68465A4A64CE01]) [    ] o.a.s.c.c.SolrZkClient Using default ZkACLProvider
   [junit4]   2> 572406 INFO  (TEST-ChaosMonkeyNothingIsSafeTest.test-seed#[5C68465A4A64CE01]) [    ] o.a.s.s.SolrDispatchFilter Loading solr.xml from SolrHome (not found in ZooKeeper)
   [junit4]   2> 572406 INFO  (TEST-ChaosMonkeyNothingIsSafeTest.test-seed#[5C68465A4A64CE01]) [    ] o.a.s.c.SolrXmlConfig Loading container configuration from /export/home/jenkins/workspace/Lucene-Solr-6.x-Solaris/solr/build/solr-core/test/J0/temp/solr.cloud.ChaosMonkeyNothingIsSafeTest_5C68465A4A64CE01-001/control-001/solr.xml
   [junit4]   2> 572410 INFO  (TEST-ChaosMonkeyNothingIsSafeTest.test-seed#[5C68465A4A64CE01]) [    ] o.a.s.c.CorePropertiesLocator Config-defined core root directory: /export/home/jenkins/workspace/Lucene-Solr-6.x-Solaris/solr/build/solr-core/test/J0/temp/solr.cloud.ChaosMonkeyNothingIsSafeTest_5C68465A4A64CE01-001/control-001/cores
   [junit4]   2> 572410 INFO  (TEST-ChaosMonkeyNothingIsSafeTest.test-seed#[5C68465A4A64CE01]) [    ] o.a.s.c.CoreContainer New CoreContainer 890765126
   [junit4]   2> 572410 INFO  (TEST-ChaosMonkeyNothingIsSafeTest.test-seed#[5C68465A4A64CE01]) [    ] o.a.s.c.CoreContainer Loading cores into CoreContainer [instanceDir=/export/home/jenkins/workspace/Lucene-Solr-6.x-Solaris/solr/build/solr-core/test/J0/temp/solr.cloud.ChaosMonkeyNothingIsSafeTest_5C68465A4A64CE01-001/control-001]
   [junit4]   2> 572410 WARN  (TEST-ChaosMonkeyNothingIsSafeTest.test-seed#[5C68465A4A64CE01]) [    ] o.a.s.c.CoreContainer Couldn't add files from /export/home/jenkins/workspace/Lucene-Solr-6.x-Solaris/solr/build/solr-core/test/J0/temp/solr.cloud.ChaosMonkeyNothingIsSafeTest_5C68465A4A64CE01-001/control-001/lib to classpath: /export/home/jenkins/workspace/Lucene-Solr-6.x-Solaris/solr/build/solr-core/test/J0/temp/solr.cloud.ChaosMonkeyNothingIsSafeTest_5C68465A4A64CE01-001/control-001/lib
   [junit4]   2> 572411 INFO  (TEST-ChaosMonkeyNothingIsSafeTest.test-seed#[5C68465A4A64CE01]) [    ] o.a.s.h.c.HttpShardHandlerFactory created with socketTimeout : 90000,urlScheme : ,connTimeout : 15000,maxConnectionsPerHost : 20,maxConnections : 10000,corePoolSize : 0,maximumPoolSize : 2147483647,maxThreadIdleTime : 5,sizeOfQueue : -1,fairnessPolicy : false,useRetries : false,
   [junit4]   2> 572412 INFO  (TEST-ChaosMonkeyNothingIsSafeTest.test-seed#[5C68465A4A64CE01]) [    ] o.a.s.u.UpdateShardHandler Creating UpdateShardHandler HTTP client with params: socketTimeout=340000&connTimeout=45000&retry=true
   [junit4]   2> 572413 INFO  (TEST-ChaosMonkeyNothingIsSafeTest.test-seed#[5C68465A4A64CE01]) [    ] o.a.s.l.LogWatcher SLF4J impl is org.slf4j.impl.Log4jLoggerFactory
   [junit4]   2> 572413 INFO  (TEST-ChaosMonkeyNothingIsSafeTest.test-seed#[5C68465A4A64CE01]) [    ] o.a.s.l.LogWatcher Registering Log Listener [Log4j (org.slf4j.impl.Log4jLoggerFactory)]
   [junit4]   2> 572413 INFO  (TEST-ChaosMonkeyNothingIsSafeTest.test-seed#[5C68465A4A64CE01]) [    ] o.a.s.c.ZkContainer Zookeeper client=127.0.0.1:59139/solr
   [junit4]   2> 572413 INFO  (TEST-ChaosMonkeyNothingIsSafeTest.test-seed#[5C68465A4A64CE01]) [    ] o.a.s.c.ZkController zkHost includes chroot
   [junit4]   2> 572413 INFO  (TEST-ChaosMonkeyNothingIsSafeTest.test-seed#[5C68465A4A64CE01]) [    ] o.a.s.c.c.SolrZkClient Using default ZkCredentialsProvider
   [junit4]   2> 572414 INFO  (TEST-ChaosMonkeyNothingIsSafeTest.test-seed#[5C68465A4A64CE01]) [    ] o.a.s.c.c.ConnectionManager Waiting for client to connect to ZooKeeper
   [junit4]   2> 572417 INFO  (zkCallback-477-thread-1) [    ] o.a.s.c.c.ConnectionManager Watcher org.apache.solr.common.cloud.ConnectionManager@12e56665 name:ZooKeeperConnection Watcher:127.0.0.1:59139 got event WatchedEvent state:SyncConnected type:None path:null path:null type:None
   [junit4]   2> 572418 INFO  (TEST-ChaosMonkeyNothingIsSafeTest.test-seed#[5C68465A4A64CE01]) [    ] o.a.s.c.c.ConnectionManager Client is connected to ZooKeeper
   [junit4]   2> 572419 INFO  (TEST-ChaosMonkeyNothingIsSafeTest.test-seed#[5C68465A4A64CE01]) [    ] o.a.s.c.c.SolrZkClient Using default ZkACLProvider
   [junit4]   2> 572420 INFO  (TEST-ChaosMonkeyNothingIsSafeTest.test-seed#[5C68465A4A64CE01]) [n:127.0.0.1:63674_    ] o.a.s.c.c.ConnectionManager Waiting for client to connect to ZooKeeper
   [junit4]   2> 572422 INFO  (zkCallback-478-thread-1-processing-n:127.0.0.1:63674_) [n:127.0.0.1:63674_    ] o.a.s.c.c.ConnectionManager Watcher org.apache.solr.common.cloud.ConnectionManager@7ac7fcae name:ZooKeeperConnection Watcher:127.0.0.1:59139/solr got event WatchedEvent state:SyncConnected type:None path:null path:null type:None
   [junit4]   2> 572423 INFO  (TEST-ChaosMonkeyNothingIsSafeTest.test-seed#[5C68465A4A64CE01]) [n:127.0.0.1:63674_    ] o.a.s.c.c.ConnectionManager Client is connected to ZooKeeper
   [junit4]   2> 572423 INFO  (TEST-ChaosMonkeyNothingIsSafeTest.test-seed#[5C68465A4A64CE01]) [n:127.0.0.1:63674_    ] o.a.s.c.c.SolrZkClient makePath: /overseer/queue
   [junit4]   2> 572425 INFO  (TEST-ChaosMonkeyNothingIsSafeTest.test-seed#[5C68465A4A64CE01]) [n:127.0.0.1:63674_    ] o.a.s.c.c.SolrZkClient makePath: /overseer/collection-queue-work
   [junit4]   2> 572428 INFO  (TEST-ChaosMonkeyNothingIsSafeTest.test-seed#[5C68465A4A64CE01]) [n:127.0.0.1:63674_    ] o.a.s.c.c.SolrZkClient makePath: /overseer/collection-map-running
   [junit4]   2> 572431 INFO  (TEST-ChaosMonkeyNothingIsSafeTest.test-seed#[5C68465A4A64CE01]) [n:127.0.0.1:63674_    ] o.a.s.c.c.SolrZkClient makePath: /overseer/collection-map-completed
   [junit4]   2> 572433 INFO  (TEST-ChaosMonkeyNothingIsSafeTest.test-seed#[5C68465A4A64CE01]) [n:127.0.0.1:63674_    ] o.a.s.c.c.SolrZkClient makePath: /overseer/collection-map-failure
   [junit4]   2> 572435 INFO  (TEST-ChaosMonkeyNothingIsSafeTest.test-seed#[5C68465A4A64CE01]) [n:127.0.0.1:63674_    ] o.a.s.c.c.SolrZkClient makePath: /live_nodes
   [junit4]   2> 572438 INFO  (TEST-ChaosMonkeyNothingIsSafeTest.test-seed#[5C68465A4A64CE01]) [n:127.0.0.1:63674_    ] o.a.s.c.c.SolrZkClient makePath: /aliases.json
   [junit4]   2> 572440 INFO  (TEST-ChaosMonkeyNothingIsSafeTest.test-seed#[5C68465A4A64CE01]) [n:127.0.0.1:63674_    ] o.a.s.c.c.SolrZkClient makePath: /clusterstate.json
   [junit4]   2> 572442 INFO  (TEST-ChaosMonkeyNothingIsSafeTest.test-seed#[5C68465A4A64CE01]) [n:127.0.0.1:63674_    ] o.a.s.c.c.SolrZkClient makePath: /security.json
   [junit4]   2> 572443 INFO  (TEST-ChaosMonkeyNothingIsSafeTest.test-seed#[5C68465A4A64CE01]) [n:127.0.0.1:63674_    ] o.a.s.c.c.ZkStateReader Updating cluster state from ZooKeeper... 
   [junit4]   2> 572445 INFO  (TEST-ChaosMonkeyNothingIsSafeTest.test-seed#[5C68465A4A64CE01]) [n:127.0.0.1:63674_    ] o.a.s.c.c.ZkStateReader Updated live nodes from ZooKeeper... (0) -> (0)
   [junit4]   2> 572448 INFO  (TEST-ChaosMonkeyNothingIsSafeTest.test-seed#[5C68465A4A64CE01]) [n:127.0.0.1:63674_    ] o.a.s.c.c.SolrZkClient makePath: /overseer_elect
   [junit4]   2> 572450 INFO  (TEST-ChaosMonkeyNothingIsSafeTest.test-seed#[5C68465A4A64CE01]) [n:127.0.0.1:63674_    ] o.a.s.c.c.SolrZkClient makePath: /overseer_elect/election
   [junit4]   2> 572451 INFO  (TEST-ChaosMonkeyNothingIsSafeTest.test-seed#[5C68465A4A64CE01]) [n:127.0.0.1:63674_    ] o.a.s.c.Overseer Overseer (id=null) closing
   [junit4]   2> 572452 INFO  (TEST-ChaosMonkeyNothingIsSafeTest.test-seed#[5C68465A4A64CE01]) [n:127.0.0.1:63674_    ] o.a.s.c.LeaderElector Joined leadership election with path: /overseer_elect/election/95629169519624196-127.0.0.1:63674_-n_0000000000
   [junit4]   2> 572452 INFO  (TEST-ChaosMonkeyNothingIsSafeTest.test-seed#[5C68465A4A64CE01]) [n:127.0.0.1:63674_    ] o.a.s.c.OverseerElectionContext I am going to be the leader 127.0.0.1:63674_
   [junit4]   2> 572452 INFO  (TEST-ChaosMonkeyNothingIsSafeTest.test-seed#[5C68465A4A64CE01]) [n:127.0.0.1:63674_    ] o.a.s.c.c.SolrZkClient makePath: /overseer_elect/leader
   [junit4]   2> 572455 INFO  (TEST-ChaosMonkeyNothingIsSafeTest.test-seed#[5C68465A4A64CE01]) [n:127.0.0.1:63674_    ] o.a.s.c.Overseer Overseer (id=95629169519624196-127.0.0.1:63674_-n_0000000000) starting
   [junit4]   2> 572457 INFO  (TEST-ChaosMonkeyNothingIsSafeTest.test-seed#[5C68465A4A64CE01]) [n:127.0.0.1:63674_    ] o.a.s.c.c.SolrZkClient makePath: /overseer/queue-work
   [junit4]   2> 572466 INFO  (TEST-ChaosMonkeyNothingIsSafeTest.test-seed#[5C68465A4A64CE01]) [n:127.0.0.1:63674_    ] o.a.s.c.OverseerAutoReplicaFailoverThread Starting OverseerAutoReplicaFailoverThread autoReplicaFailoverWorkLoopDelay=10000 autoReplicaFailoverWaitAfterExpiration=30000 autoReplicaFailoverBadNodeExpiration=60000
   [junit4]   2> 572467 INFO  (OverseerCollectionConfigSetProcessor-95629169519624196-127.0.0.1:63674_-n_0000000000) [n:127.0.0.1:63674_    ] o.a.s.c.OverseerTaskProcessor Process current queue of overseer operations
   [junit4]   2> 572468 INFO  (TEST-ChaosMonkeyNothingIsSafeTest.test-seed#[5C68465A4A64CE01]) [n:127.0.0.1:63674_    ] o.a.s.c.ZkController Register node as live in ZooKeeper:/live_nodes/127.0.0.1:63674_
   [junit4]   2> 572468 INFO  (OverseerStateUpdate-95629169519624196-127.0.0.1:63674_-n_0000000000) [n:127.0.0.1:63674_    ] o.a.s.c.Overseer Starting to work on the main queue
   [junit4]   2> 572469 INFO  (TEST-ChaosMonkeyNothingIsSafeTest.test-seed#[5C68465A4A64CE01]) [n:127.0.0.1:63674_    ] o.a.s.c.c.SolrZkClient makePath: /live_nodes/127.0.0.1:63674_
   [junit4]   2> 572472 INFO  (zkCallback-478-thread-1-processing-n:127.0.0.1:63674_) [n:127.0.0.1:63674_    ] o.a.s.c.c.ZkStateReader A live node change: [WatchedEvent state:SyncConnected type:NodeChildrenChanged path:/live_nodes], has occurred - updating... (live nodes size: [0])
   [junit4]   2> 572472 INFO  (OverseerStateUpdate-95629169519624196-127.0.0.1:63674_-n_0000000000) [n:127.0.0.1:63674_    ] o.a.s.c.c.ZkStateReader Updated live nodes from ZooKeeper... (0) -> (1)
   [junit4]   2> 572473 INFO  (zkCallback-478-thread-1-processing-n:127.0.0.1:63674_) [n:127.0.0.1:63674_    ] o.a.s.c.c.ZkStateReader Updated live nodes from ZooKeeper... (1) -> (1)
   [junit4]   2> 572492 INFO  (TEST-ChaosMonkeyNothingIsSafeTest.test-seed#[5C68465A4A64CE01]) [n:127.0.0.1:63674_    ] o.a.s.c.CoreContainer Security conf doesn't exist. Skipping setup for authorization module.
   [junit4]   2> 572492 INFO  (TEST-ChaosMonkeyNothingIsSafeTest.test-seed#[5C68465A4A64CE01]) [n:127.0.0.1:63674_    ] o.a.s.c.CoreContainer No authentication plugin used.
   [junit4]   2> 572493 INFO  (TEST-ChaosMonkeyNothingIsSafeTest.test-seed#[5C68465A4A64CE01]) [n:127.0.0.1:63674_    ] o.a.s.c.CorePropertiesLocator Looking for core definitions underneath /export/home/jenkins/workspace/Lucene-Solr-6.x-Solaris/solr/build/solr-core/test/J0/temp/solr.cloud.ChaosMonkeyNothingIsSafeTest_5C68465A4A64CE01-001/control-001/cores
   [junit4]   2> 572495 INFO  (TEST-ChaosMonkeyNothingIsSafeTest.test-seed#[5C68465A4A64CE01]) [n:127.0.0.1:63674_    ] o.a.s.c.CoreDescriptor Created CoreDescriptor: {name=collection1, config=solrconfig.xml, transient=false, schema=schema.xml, loadOnStartup=true, configSetProperties=configsetprops.json, collection=control_collection, coreNodeName=, dataDir=data/, shard=}
   [junit4]   2> 572495 INFO  (TEST-ChaosMonkeyNothingIsSafeTest.test-seed#[5C68465A4A64CE01]) [n:127.0.0.1:63674_    ] o.a.s.c.CorePropertiesLocator Found core collection1 in /export/home/jenkins/workspace/Lucene-Solr-6.x-Solaris/solr/build/solr-core/test/J0/temp/solr.cloud.ChaosMonkeyNothingIsSafeTest_5C68465A4A64CE01-001/control-001/cores/collection1
   [junit4]   2> 572495 INFO  (TEST-ChaosMonkeyNothingIsSafeTest.test-seed#[5C68465A4A64CE01]) [n:127.0.0.1:63674_    ] o.a.s.c.CorePropertiesLocator Found 1 core definitions
   [junit4]   2> 572497 INFO  (TEST-ChaosMonkeyNothingIsSafeTest.test-seed#[5C68465A4A64CE01]) [n:127.0.0.1:63674_    ] o.a.s.s.SolrDispatchFilter user.dir=/export/home/jenkins/workspace/Lucene-Solr-6.x-Solaris/solr/build/solr-core/test/J0
   [junit4]   2> 572497 INFO  (TEST-ChaosMonkeyNothingIsSafeTest.test-seed#[5C68465A4A64CE01]) [n:127.0.0.1:63674_    ] o.a.s.s.SolrDispatchFilter SolrDispatchFilter.init() done
   [junit4]   2> 572497 INFO  (coreLoadExecutor-1324-thread-1-processing-n:127.0.0.1:63674_) [n:127.0.0.1:63674_ c:control_collection   x:collection1] o.a.s.c.ZkController publishing state=down
   [junit4]   2> 572497 INFO  (coreLoadExecutor-1324-thread-1-processing-n:127.0.0.1:63674_) [n:127.0.0.1:63674_ c:control_collection   x:collection1] o.a.s.c.ZkController numShards not found on descriptor - reading it from system property
   [junit4]   2> 572500 INFO  (OverseerStateUpdate-95629169519624196-127.0.0.1:63674_-n_0000000000) [n:127.0.0.1:63674_    ] o.a.s.c.Overseer processMessage: queueSize: 1, message = {
   [junit4]   2>   "core":"collection1",
   [junit4]   2>   "roles":null,
   [junit4]   2>   "base_url":"http://127.0.0.1:63674",
   [junit4]   2>   "node_name":"127.0.0.1:63674_",
   [junit4]   2>   "numShards":"1",
   [junit4]   2>   "state":"down",
   [junit4]   2>   "shard":null,
   [junit4]   2>   "collection":"control_collection",
   [junit4]   2>   "operation":"state"} current state version: 0
   [junit4]   2> 572501 INFO  (coreLoadExecutor-1324-thread-1-processing-n:127.0.0.1:63674_) [n:127.0.0.1:63674_ c:control_collection   x:collection1] o.a.s.c.ZkController look for our core node name
   [junit4]   2> 572501 INFO  (OverseerStateUpdate-95629169519624196-127.0.0.1:63674_-n_0000000000) [n:127.0.0.1:63674_    ] o.a.s.c.o.ReplicaMutator Update state numShards=1 message={
   [junit4]   2>   "core":"collection1",
   [junit4]   2>   "roles":null,
   [junit4]   2>   "base_url":"http://127.0.0.1:63674",
   [junit4]   2>   "node_name":"127.0.0.1:63674_",
   [junit4]   2>   "numShards":"1",
   [junit4]   2>   "state":"down",
   [junit4]   2>   "shard":null,
   [junit4]   2>   "collection":"control_collection",
   [junit4]   2>   "operation":"state"}
   [junit4]   2> 572502 INFO  (OverseerStateUpdate-95629169519624196-127.0.0.1:63674_-n_0000000000) [n:127.0.0.1:63674_    ] o.a.s.c.o.ClusterStateMutator building a new cName: control_collection
   [junit4]   2> 572503 INFO  (OverseerStateUpdate-95629169519624196-127.0.0.1:63674_-n_0000000000) [n:127.0.0.1:63674_    ] o.a.s.c.o.ReplicaMutator Assigning new node to shard shard=shard1
   [junit4]   2> 572505 INFO  (zkCallback-478-thread-1-processing-n:127.0.0.1:63674_) [n:127.0.0.1:63674_    ] o.a.s.c.c.ZkStateReader A cluster state change: [WatchedEvent state:SyncConnected type:NodeDataChanged path:/clusterstate.json], has occurred - updating... (live nodes size: [1])
   [junit4]   2> 573502 INFO  (coreLoadExecutor-1324-thread-1-processing-n:127.0.0.1:63674_) [n:127.0.0.1:63674_ c:control_collection   x:collection1] o.a.s.c.ZkController waiting to find shard id in clusterstate for collection1
   [junit4]   2> 573502 INFO  (coreLoadExecutor-1324-thread-1-processing-n:127.0.0.1:63674_) [n:127.0.0.1:63674_ c:control_collection   x:collection1] o.a.s.c.ZkController Check for collection zkNode:control_collection
   [junit4]   2> 573503 INFO  (coreLoadExecutor-1324-thread-1-processing-n:127.0.0.1:63674_) [n:127.0.0.1:63674_ c:control_collection   x:collection1] o.a.s.c.ZkController Collection zkNode exists
   [junit4]   2> 573503 INFO  (coreLoadExecutor-1324-thread-1-processing-n:127.0.0.1:63674_) [n:127.0.0.1:63674_ c:control_collection   x:collection1] o.a.s.c.c.ZkStateReader Load collection config from: [/collections/control_collection]
   [junit4]   2> 573504 INFO  (coreLoadExecutor-1324-thread-1-processing-n:127.0.0.1:63674_) [n:127.0.0.1:63674_ c:control_collection   x:collection1] o.a.s.c.c.ZkStateReader path=[/collections/control_collection] [configName]=[conf1] specified config exists in ZooKeeper
   [junit4]   2> 573504 INFO  (coreLoadExecutor-1324-thread-1-processing-n:127.0.0.1:63674_) [n:127.0.0.1:63674_ c:control_collection   x:collection1] o.a.s.c.SolrResourceLoader new SolrResourceLoader for directory: '/export/home/jenkins/workspace/Lucene-Solr-6.x-Solaris/solr/build/solr-core/test/J0/temp/solr.cloud.ChaosMonkeyNothingIsSafeTest_5C68465A4A64CE01-001/control-001/cores/collection1'
   [junit4]   2> 573504 INFO  (coreLoadExecutor-1324-thread-1-processing-n:127.0.0.1:63674_) [n:127.0.0.1:63674_ c:control_collection   x:collection1] o.a.s.c.SolrResourceLoader JNDI not configured for solr (NoInitialContextEx)
   [junit4]   2> 573504 INFO  (coreLoadExecutor-1324-thread-1-processing-n:127.0.0.1:63674_) [n:127.0.0.1:63674_ c:control_collection   x:collection1] o.a.s.c.SolrResourceLoader solr home defaulted to 'solr/' (could not find system property or JNDI)
   [junit4]   2> 573506 INFO  (coreLoadExecutor-1324-thread-1-processing-n:127.0.0.1:63674_) [n:127.0.0.1:63674_ c:control_collection   x:collection1] o.a.s.c.Config loaded config solrconfig.xml with version 0 
   [junit4]   2> 573512 INFO  (coreLoadExecutor-1324-thread-1-processing-n:127.0.0.1:63674_) [n:127.0.0.1:63674_ c:control_collection   x:collection1] o.a.s.c.SolrConfig current version of requestparams : -1
   [junit4]   2> 573516 INFO  (coreLoadExecutor-1324-thread-1-processing-n:127.0.0.1:63674_) [n:127.0.0.1:63674_ c:control_collection   x:collection1] o.a.s.c.SolrConfig Using Lucene MatchVersion: 6.1.0
   [junit4]   2> 573552 INFO  (coreLoadExecutor-1324-thread-1-processing-n:127.0.0.1:63674_) [n:127.0.0.1:63674_ c:control_collection   x:collection1] o.a.s.c.SolrConfig Loaded SolrConfig: solrconfig.xml
   [junit4]   2> 573557 INFO  (coreLoadExecutor-1324-thread-1-processing-n:127.0.0.1:63674_) [n:127.0.0.1:63674_ c:control_collection   x:collection1] o.a.s.s.IndexSchema [collection1] Schema name=test
   [junit4]   2> 573624 INFO  (coreLoadExecutor-1324-thread-1-processing-n:127.0.0.1:63674_) [n:127.0.0.1:63674_ c:control_collection   x:collection1] o.a.s.s.IndexSchema default search field in schema is text
   [junit4]   2> 573624 INFO  (coreLoadExecutor-1324-thread-1-processing-n:127.0.0.1:63674_) [n:127.0.0.1:63674_ c:control_collection   x:collection1] o.a.s.s.IndexSchema unique key field: id
   [junit4]   2> 573625 INFO  (coreLoadExecutor-1324-thread-1-processing-n:127.0.0.1:63674_) [n:127.0.0.1:63674_ c:control_collection   x:collection1] o.a.s.s.FileExchangeRateProvider Reloading exchange rates from file currency.xml
   [junit4]   2> 573628 INFO  (coreLoadExecutor-1324-thread-1-processing-n:127.0.0.1:63674_) [n:127.0.0.1:63674_ c:control_collection   x:collection1] o.a.s.s.FileExchangeRateProvider Reloading exchange rates from file currency.xml
   [junit4]   2> 573652 INFO  (coreLoadExecutor-1324-thread-1-processing-n:127.0.0.1:63674_) [n:127.0.0.1:63674_ c:control_collection   x:collection1] o.a.s.c.ConfigSetProperties Did not find ConfigSet properties, assuming default properties: Can't find resource 'configsetprops.json' in classpath or '/configs/conf1', cwd=/export/home/jenkins/workspace/Lucene-Solr-6.x-Solaris/solr/build/solr-core/test/J0
   [junit4]   2> 573652 INFO  (coreLoadExecutor-1324-thread-1-processing-n:127.0.0.1:63674_) [n:127.0.0.1:63674_ c:control_collection   x:collection1] o.a.s.c.CoreContainer Creating SolrCore 'collection1' using configuration from collection control_collection
   [junit4]   2> 573653 INFO  (coreLoadExecutor-1324-thread-1-processing-n:127.0.0.1:63674_) [n:127.0.0.1:63674_ c:control_collection s:shard1 r:core_node1 x:collection1] o.a.s.c.SolrCore solr.StandardDirectoryFactory
   [junit4]   2> 573659 INFO  (coreLoadExecutor-1324-thread-1-processing-n:127.0.0.1:63674_) [n:127.0.0.1:63674_ c:control_collection s:shard1 r:core_node1 x:collection1] o.a.s.c.SolrCore [[collection1] ] Opening new SolrCore at [/export/home/jenkins/workspace/Lucene-Solr-6.x-Solaris/solr/build/solr-core/test/J0/temp/solr.cloud.ChaosMonkeyNothingIsSafeTest_5C68465A4A64CE01-001/control-001/cores/collection1], dataDir=[/export/home/jenkins/workspace/Lucene-Solr-6.x-Solaris/solr/build/solr-core/test/J0/temp/solr.cloud.ChaosMonkeyNothingIsSafeTest_5C68465A4A64CE01-001/control-001/cores/collection1/data/]
   [junit4]   2> 573659 INFO  (coreLoadExecutor-1324-thread-1-processing-n:127.0.0.1:63674_) [n:127.0.0.1:63674_ c:control_collection s:shard1 r:core_node1 x:collection1] o.a.s.c.JmxMonitoredMap JMX monitoring is enabled. Adding Solr mbeans to JMX Server: com.sun.jmx.mbeanserver.JmxMBeanServer@433a3700
   [junit4]   2> 573660 INFO  (coreLoadExecutor-1324-thread-1-processing-n:127.0.0.1:63674_) [n:127.0.0.1:63674_ c:control_collection s:shard1 r:core_node1 x:collection1] o.a.s.c.CachingDirectoryFactory return new directory for /export/home/jenkins/workspace/Lucene-Solr-6.x-Solaris/solr/build/solr-core/test/J0/temp/solr.cloud.ChaosMonkeyNothingIsSafeTest_5C68465A4A64CE01-001/control-001/cores/collection1/data
   [junit4]   2> 573660 INFO  (coreLoadExecutor-1324-thread-1-processing-n:127.0.0.1:63674_) [n:127.0.0.1:63674_ c:control_collection s:shard1 r:core_node1 x:collection1] o.a.s.c.SolrCore New index directory detected: old=null new=/export/home/jenkins/workspace/Lucene-Solr-6.x-Solaris/solr/build/solr-core/test/J0/temp/solr.cloud.ChaosMonkeyNothingIsSafeTest_5C68465A4A64CE01-001/control-001/cores/collection1/data/index/
   [junit4]   2> 573660 WARN  (coreLoadExecutor-1324-thread-1-processing-n:127.0.0.1:63674_) [n:127.0.0.1:63674_ c:control_collection s:shard1 r:core_node1 x:collection1] o.a.s.c.SolrCore [collection1] Solr index directory '/export/home/jenkins/workspace/Lucene-Solr-6.x-Solaris/solr/build/solr-core/test/J0/temp/solr.cloud.ChaosMonkeyNothingIsSafeTest_5C68465A4A64CE01-001/control-001/cores/collection1/data/index' doesn't exist. Creating new index...
   [junit4]   2> 573660 INFO  (coreLoadExecutor-1324-thread-1-processing-n:127.0.0.1:63674_) [n:127.0.0.1:63674_ c:control_collection s:shard1 r:core_node1 x:collection1] o.a.s.c.CachingDirectoryFactory return new directory for /export/home/jenkins/workspace/Lucene-Solr-6.x-Solaris/solr/build/solr-core/test/J0/temp/solr.cloud.ChaosMonkeyNothingIsSafeTest_5C68465A4A64CE01-001/control-001/cores/collection1/data/index
   [junit4]   2> 573661 INFO  (coreLoadExecutor-1324-thread-1-processing-n:127.0.0.1:63674_) [n:127.0.0.1:63674_ c:control_collection s:shard1 r:core_node1 x:collection1] o.a.s.u.RandomMergePolicy RandomMergePolicy wrapping class org.apache.lucene.index.AlcoholicMergePolicy: [AlcoholicMergePolicy: minMergeSize=0, mergeFactor=10, maxMergeSize=690051320, maxMergeSizeForForcedMerge=9223372036854775807, calibrateSizeByDeletes=true, maxMergeDocs=2147483647, maxCFSSegmentSizeMB=8.796093022207999E12, noCFSRatio=0.1]
   [junit4]   2> 573682 INFO  (coreLoadExecutor-1324-thread-1-processing-n:127.0.0.1:63674_) [n:127.0.0.1:63674_ c:control_collection s:shard1 r:core_node1 x:collection1] o.a.s.c.SolrDeletionPolicy SolrDeletionPolicy.onCommit: commits: num=1
   [junit4]   2> 	commit{dir=/export/home/jenkins/workspace/Lucene-Solr-6.x-Solaris/solr/build/solr-core/test/J0/temp/solr.cloud.ChaosMonkeyNothingIsSafeTest_5C68465A4A64CE01-001/control-001/cores/collection1/data/index,segFN=segments_1,generation=1}
   [junit4]   2> 573682 INFO  (coreLoadExecutor-1324-thread-1-processing-n:127.0.0.1:63674_) [n:127.0.0.1:63674_ c:control_collection s:shard1 r:core_node1 x:collection1] o.a.s.c.SolrDeletionPolicy newest commit generation = 1
   [junit4]   2> 573683 INFO  (OldIndexDirectoryCleanupThreadForCore-collection1) [n:127.0.0.1:63674_ c:control_collection s:shard1 r:core_node1 x:collection1] o.a.s.c.SolrCore Looking for old index directories to cleanup for core collection1 in /export/home/jenkins/workspace/Lucene-Solr-6.x-Solaris/solr/build/solr-core/test/J0/temp/solr.cloud.ChaosMonkeyNothingIsSafeTest_5C68465A4A64CE01-001/control-001/cores/collection1/data/
   [junit4]   2> 573685 INFO  (coreLoadExecutor-1324-thread-1-processing-n:127.0.0.1:63674_) [n:127.0.0.1:63674_ c:control_collection s:shard1 r:core_node1 x:collection1] o.a.s.u.p.UpdateRequestProcessorChain creating updateRequestProcessorChain "nodistrib"
   [junit4]   2> 573686 INFO  (coreLoadExecutor-1324-thread-1-processing-n:127.0.0.1:63674_) [n:127.0.0.1:63674_ c:control_collection s:shard1 r:core_node1 x:collection1] o.a.s.u.p.UpdateRequestProcessorChain creating updateRequestProcessorChain "dedupe"
   [junit4]   2> 573686 INFO  (coreLoadExecutor-1324-thread-1-processing-n:127.0.0.1:63674_) [n:127.0.0.1:63674_ c:control_collection s:shard1 r:core_node1 x:collection1] o.a.s.u.p.UpdateRequestProcessorChain inserting DistributedUpdateProcessorFactory into updateRequestProcessorChain "dedupe"
   [junit4]   2> 573686 INFO  (coreLoadExecutor-1324-thread-1-processing-n:127.0.0.1:63674_) [n:127.0.0.1:63674_ c:control_collection s:shard1 r:core_node1 x:collection1] o.a.s.u.p.UpdateRequestProcessorChain creating updateRequestProcessorChain "stored_sig"
   [junit4]   2> 573686 INFO  (coreLoadExecutor-1324-thread-1-processing-n:127.0.0.1:63674_) [n:127.0.0.1:63674_ c:control_collection s:shard1 r:core_node1 x:collection1] o.a.s.u.p.UpdateRequestProcessorChain inserting DistributedUpdateProcessorFactory into updateRequestProcessorChain "stored_sig"
   [junit4]   2> 573686 INFO  (coreLoadExecutor-1324-thread-1-processing-n:127.0.0.1:63674_) [n:127.0.0.1:63674_ c:control_collection s:shard1 r:core_node1 x:collection1] o.a.s.u.p.UpdateRequestProcessorChain creating updateRequestProcessorChain "distrib-dup-test-chain-explicit"
   [junit4]   2> 573686 INFO  (coreLoadExecutor-1324-thread-1-processing-n:127.0.0.1:63674_) [n:127.0.0.1:63674_ c:control_collection s:shard1 r:core_node1 x:collection1] o.a.s.u.p.UpdateRequestProcessorChain creating updateRequestProcessorChain "distrib-dup-test-chain-implicit"
   [junit4]   2> 573686 INFO  (coreLoadExecutor-1324-thread-1-processing-n:127.0.0.1:63674_) [n:127.0.0.1:63674_ c:control_collection s:shard1 r:core_node1 x:collection1] o.a.s.u.p.UpdateRequestProcessorChain inserting DistributedUpdateProcessorFactory into updateRequestProcessorChain "distrib-dup-test-chain-implicit"
   [junit4]   2> 573686 INFO  (coreLoadExecutor-1324-thread-1-processing-n:127.0.0.1:63674_) [n:127.0.0.1:63674_ c:control_collection s:shard1 r:core_node1 x:collection1] o.a.s.c.SolrCore no updateRequestProcessorChain defined as default, creating implicit default
   [junit4]   2> 573686 WARN  (coreLoadExecutor-1324-thread-1-processing-n:127.0.0.1:63674_) [n:127.0.0.1:63674_ c:control_collection s:shard1 r:core_node1 x:collection1] o.a.s.c.RequestHandlers INVALID paramSet a in requestHandler {type = requestHandler,name = /dump,class = DumpRequestHandler,args = {defaults={a=A,b=B}}}
   [junit4]   2> 573688 INFO  (coreLoadExecutor-1324-thread-1-processing-n:127.0.0.1:63674_) [n:127.0.0.1:63674_ c:control_collection s:shard1 r:core_node1 x:collection1] o.a.s.h.l.XMLLoader xsltCacheLifetimeSeconds=60
   [junit4]   2> 573689 INFO  (coreLoadExecutor-1324-thread-1-processing-n:127.0.0.1:63674_) [n:127.0.0.1:63674_ c:control_collection s:shard1 r:core_node1 x:collection1] o.a.s.h.l.XMLLoader xsltCacheLifetimeSeconds=60
   [junit4]   2> 573690 INFO  (coreLoadExecutor-1324-thread-1-processing-n:127.0.0.1:63674_) [n:127.0.0.1:63674_ c:control_collection s:shard1 r:core_node1 x:collection1] o.a.s.h.l.XMLLoader xsltCacheLifetimeSeconds=60
   [junit4]   2> 573691 INFO  (coreLoadExecutor-1324-thread-1-processing-n:127.0.0.1:63674_) [n:127.0.0.1:63674_ c:control_collection s:shard1 r:core_node1 x:collection1] o.a.s.h.l.XMLLoader xsltCacheLifetimeSeconds=60
   [junit4]   2> 573694 INFO  (coreLoadExecutor-1324-thread-1-processing-n:127.0.0.1:63674_) [n:127.0.0.1:63674_ c:control_collection s:shard1 r:core_node1 x:collection1] o.a.s.c.RequestHandlers Registered paths: /admin/mbeans,standard,/dump,/update/csv,/sql,/update/json/docs,/admin/luke,/export,/admin/segments,/get,/admin/system,/replication,/admin/properties,/config,/stream,/schema,/admin/plugins,/admin/logging,/update/json,/admin/ping,/admin/threads,/update,/admin/file
   [junit4]   2> 573695 INFO  (coreLoadExecutor-1324-thread-1-processing-n:127.0.0.1:63674_) [n:127.0.0.1:63674_ c:control_collection s:shard1 r:core_node1 x:collection1] o.a.s.c.SolrCore Using default statsCache cache: org.apache.solr.search.stats.LocalStatsCache
   [junit4]   2> 573695 INFO  (coreLoadExecutor-1324-thread-1-processing-n:127.0.0.1:63674_) [n:127.0.0.1:63674_ c:control_collection s:shard1 r:core_node1 x:collection1] o.a.s.u.UpdateHandler Using UpdateLog implementation: org.apache.solr.update.UpdateLog
   [junit4]   2> 573695 INFO  (coreLoadExecutor-1324-thread-1-processing-n:127.0.0.1:63674_) [n:127.0.0.1:63674_ c:control_collection s:shard1 r:core_node1 x:collection1] o.a.s.u.UpdateLog Initializing UpdateLog: dataDir= defaultSyncLevel=FLUSH numRecordsToKeep=100 maxNumLogsToKeep=10 numVersionBuckets=65536
   [junit4]   2> 573698 INFO  (coreLoadExecutor-1324-thread-1-processing-n:127.0.0.1:63674_) [n:127.0.0.1:63674_ c:control_collection s:shard1 r:core_node1 x:collection1] o.a.s.u.CommitTracker Hard AutoCommit: if uncommited for 15000ms; 
   [junit4]   2> 573698 INFO  (coreLoadExecutor-1324-thread-1-processing-n:127.0.0.1:63674_) [n:127.0.0.1:63674_ c:control_collection s:shard1 r:core_node1 x:collection1] o.a.s.u.CommitTracker Soft AutoCommit: disabled
   [junit4]   2> 573698 INFO  (coreLoadExecutor-1324-thread-1-processing-n:127.0.0.1:63674_) [n:127.0.0.1:63674_ c:control_collection s:shard1 r:core_node1 x:collection1] o.a.s.u.RandomMergePolicy RandomMergePolicy wrapping class org.apache.lucene.index.LogDocMergePolicy: [LogDocMergePolicy: minMergeSize=1000, mergeFactor=37, maxMergeSize=9223372036854775807, maxMergeSizeForForcedMerge=9223372036854775807, calibrateSizeByDeletes=false, maxMergeDocs=2147483647, maxCFSSegmentSizeMB=8.796093022207999E12, noCFSRatio=0.0]
   [junit4]   2> 573699 INFO  (coreLoadExecutor-1324-thread-1-processing-n:127.0.0.1:63674_) [n:127.0.0.1:63674_ c:control_collection s:shard1 r:core_node1 x:collection1] o.a.s.c.SolrDeletionPolicy SolrDeletionPolicy.onInit: commits: num=1
   [junit4]   2> 	commit{dir=/export/home/jenkins/workspace/Lucene-Solr-6.x-Solaris/solr/build/solr-core/test/J0/temp/solr.cloud.ChaosMonkeyNothingIsSafeTest_5C68465A4A64CE01-001/control-001/cores/collection1/data/index,segFN=segments_1,generation=1}
   [junit4]   2> 573699 INFO  (coreLoadExecutor-1324-thread-1-processing-n:127.0.0.1:63674_) [n:127.0.0.1:63674_ c:control_collection s:shard1 r:core_node1 x:collection1] o.a.s.c.SolrDeletionPolicy newest commit generation = 1
   [junit4]   2> 573699 INFO  (coreLoadExecutor-1324-thread-1-processing-n:127.0.0.1:63674_) [n:127.0.0.1:63674_ c:control_collection s:shard1 r:core_node1 x:collection1] o.a.s.s.SolrIndexSearcher Opening [Searcher@7d5c85b7[collection1] main]
   [junit4]   2> 573699 INFO  (coreLoadExecutor-1324-thread-1-processing-n:127.0.0.1:63674_) [n:127.0.0.1:63674_ c:control_collection s:shard1 r:core_node1 x:collection1] o.a.s.c.c.ZkStateReader Load collection config from: [/collections/control_collection]
   [junit4]   2> 573700 INFO  (coreLoadExecutor-1324-thread-1-processing-n:127.0.0.1:63674_) [n:127.0.0.1:63674_ c:control_collection s:shard1 r:core_node1 x:collection1] o.a.s.c.c.ZkStateReader path=[/collections/control_collection] [configName]=[conf1] specified config exists in ZooKeeper
   [junit4]   2> 573700 INFO  (coreLoadExecutor-1324-thread-1-processing-n:127.0.0.1:63674_) [n:127.0.0.1:63674_ c:control_collection s:shard1 r:core_node1 x:collection1] o.a.s.r.ManagedResourceStorage Setting up ZooKeeper-based storage for the RestManager with znodeBase: /configs/conf1
   [junit4]   2> 573701 INFO  (coreLoadExecutor-1324-thread-1-processing-n:127.0.0.1:63674_) [n:127.0.0.1:63674_ c:control_collection s:shard1 r:core_node1 x:collection1] o.a.s.r.ManagedResourceStorage Configured ZooKeeperStorageIO with znodeBase: /configs/conf1
   [junit4]   2> 573701 INFO  (coreLoadExecutor-1324-thread-1-processing-n:127.0.0.1:63674_) [n:127.0.0.1:63674_ c:control_collection s:shard1 r:core_node1 x:collection1] o.a.s.r.RestManager Initializing RestManager with initArgs: {}
   [junit4]   2> 573701 INFO  (coreLoadExecutor-1324-thread-1-processing-n:127.0.0.1:63674_) [n:127.0.0.1:63674_ c:control_collection s:shard1 r:core_node1 x:collection1] o.a.s.r.ManagedResourceStorage Reading _rest_managed.json using ZooKeeperStorageIO:path=/configs/conf1
   [junit4]   2> 573702 INFO  (coreLoadExecutor-1324-thread-1-processing-n:127.0.0.1:63674_) [n:127.0.0.1:63674_ c:control_collection s:shard1 r:core_node1 x:collection1] o.a.s.r.ManagedResourceStorage No data found for znode /configs/conf1/_rest_managed.json
   [junit4]   2> 573702 INFO  (coreLoadExecutor-1324-thread-1-processing-n:127.0.0.1:63674_) [n:127.0.0.1:63674_ c:control_collection s:shard1 r:core_node1 x:collection1] o.a.s.r.ManagedResourceStorage Loaded null at path _rest_managed.json using ZooKeeperStorageIO:path=/configs/conf1
   [junit4]   2> 573702 INFO  (coreLoadExecutor-1324-thread-1-processing-n:127.0.0.1:63674_) [n:127.0.0.1:63674_ c:control_collection s:shard1 r:core_node1 x:collection1] o.a.s.r.RestManager Initializing 0 registered ManagedResources
   [junit4]   2> 573703 INFO  (coreLoadExecutor-1324-thread-1-processing-n:127.0.0.1:63674_) [n:127.0.0.1:63674_ c:control_collection s:shard1 r:core_node1 x:collection1] o.a.s.h.ReplicationHandler Commits will be reserved for  10000
   [junit4]   2> 573703 INFO  (searcherExecutor-1325-thread-1-processing-n:127.0.0.1:63674_ x:collection1 s:shard1 c:control_collection r:core_node1) [n:127.0.0.1:63674_ c:control_collection s:shard1 r:core_node1 x:collection1] o.a.s.c.SolrCore [collection1] Registered new searcher Searcher@7d5c85b7[collection1] main{ExitableDirectoryReader(UninvertingDirectoryReader())}
   [junit4]   2> 573703 INFO  (coreLoadExecutor-1324-thread-1-processing-n:127.0.0.1:63674_) [n:127.0.0.1:63674_ c:control_collection s:shard1 r:core_node1 x:collection1] o.a.s.u.UpdateLog Looking up max value of version field to seed version buckets
   [junit4]   2> 573703 INFO  (coreLoadExecutor-1324-thread-1-processing-n:127.0.0.1:63674_) [n:127.0.0.1:63674_ c:control_collection s:shard1 r:core_node1 x:collection1] o.a.s.u.VersionInfo Refreshing highest value of _version_ for 65536 version buckets from index
   [junit4]   2> 573704 INFO  (coreLoadExecutor-1324-thread-1-processing-n:127.0.0.1:63674_) [n:127.0.0.1:63674_ c:control_collection s:shard1 r:core_node1 x:collection1] o.a.s.u.VersionInfo No terms found for _version_, cannot seed version bucket highest value from index
   [junit4]   2> 573704 INFO  (coreLoadExecutor-1324-thread-1-processing-n:127.0.0.1:63674_) [n:127.0.0.1:63674_ c:control_collection s:shard1 r:core_node1 x:collection1] o.a.s.u.UpdateLog Could not find max version in index or recent updates, using new clock 1530066714004291584
   [junit4]   2> 573705 INFO  (coreLoadExecutor-1324-thread-1-processing-n:127.0.0.1:63674_) [n:127.0.0.1:63674_ c:control_collection s:shard1 r:core_node1 x:collection1] o.a.s.u.UpdateLog Took 1.0ms to seed version buckets with highest version 1530066714004291584
   [junit4]   2> 573705 INFO  (coreLoadExecutor-1324-thread-1-processing-n:127.0.0.1:63674_) [n:127.0.0.1:63674_ c:control_collection s:shard1 r:core_node1 x:collection1] o.a.s.c.ZkController watch zkdir /configs/conf1
   [junit4]   2> 573706 INFO  (coreLoadExecutor-1324-thread-1-processing-n:127.0.0.1:63674_) [n:127.0.0.1:63674_ c:control_collection s:shard1 r:core_node1 x:collection1] o.a.s.c.CoreContainer registering core: collection1
   [junit4]   2> 573707 INFO  (coreZkRegister-1318-thread-1-processing-n:127.0.0.1:63674_ x:collection1 s:shard1 c:control_collection r:core_node1) [n:127.0.0.1:63674_ c:control_collection s:shard1 r:core_node1 x:collection1] o.a.s.c.ZkController Register replica - core:collection1 address:http://127.0.0.1:63674 collection:control_collection shard:shard1
   [junit4]   2> 573708 INFO  (coreZkRegister-1318-thread-1-processing-n:127.0.0.1:63674_ x:collection1 s:shard1 c:control_collection r:core_node1) [n:127.0.0.1:63674_ c:control_collection s:shard1 r:core_node1 x:collection1] o.a.s.c.c.SolrZkClient makePath: /collections/control_collection/leader_elect/shard1/election
   [junit4]   2> 573713 INFO  (coreZkRegister-1318-thread-1-processing-n:127.0.0.1:63674_ x:collection1 s:shard1 c:control_collection r:core_node1) [n:127.0.0.1:63674_ c:control_collection s:shard1 r:core_node1 x:collection1] o.a.s.c.LeaderElector Joined leadership election with path: /collections/control_collection/leader_elect/shard1/election/95629169519624196-core_node1-n_0000000000
   [junit4]   2> 573714 INFO  (coreZkRegister-1318-thread-1-processing-n:127.0.0.1:63674_ x:collection1 s:shard1 c:control_collection r:core_node1) [n:127.0.0.1:63674_ c:control_collection s:shard1 r:core_node1 x:collection1] o.a.s.c.ShardLeaderElectionContext Running the leader process for shard=shard1 and weAreReplacement=false and leaderVoteWait=10000
   [junit4]   2> 573717 INFO  (coreZkRegister-1318-thread-1-processing-n:127.0.0.1:63674_ x:collection1 s:shard1 c:control_collection r:core_node1) [n:127.0.0.1:63674_ c:control_collection s:shard1 r:core_node1 x:collection1] o.a.s.c.ShardLeaderElectionContext Enough replicas found to continue.
   [junit4]   2> 573717 INFO  (coreZkRegister-1318-thread-1-processing-n:127.0.0.1:63674_ x:collection1 s:shard1 c:control_collection r:core_node1) [n:127.0.0.1:63674_ c:control_collection s:shard1 r:core_node1 x:collection1] o.a.s.c.ShardLeaderElectionContext I may be the new leader - try and sync
   [junit4]   2> 573717 INFO  (coreZkRegister-1318-thread-1-processing-n:127.0.0.1:63674_ x:collection1 s:shard1 c:control_collection r:core_node1) [n:127.0.0.1:63674_ c:control_collection s:shard1 r:core_node1 x:collection1] o.a.s.c.SyncStrategy Sync replicas to http://127.0.0.1:63674/collection1/
   [junit4]   2> 573717 INFO  (OverseerStateUpdate-95629169519624196-127.0.0.1:63674_-n_0000000000) [n:127.0.0.1:63674_    ] o.a.s.c.Overseer processMessage: queueSize: 1, message = {
   [junit4]   2>   "operation":"leader",
   [junit4]   2>   "shard":"shard1",
   [junit4]   2>   "collection":"control_collection"} current state version: 1
   [junit4]   2> 573717 INFO  (coreZkRegister-1318-thread-1-processing-n:127.0.0.1:63674_ x:collection1 s:shard1 c:control_collection r:core_node1) [n:127.0.0.1:63674_ c:control_collection s:shard1 r:core_node1 x:collection1] o.a.s.c.SyncStrategy Sync Success - now sync replicas to me
   [junit4]   2> 573717 INFO  (coreZkRegister-1318-thread-1-processing-n:127.0.0.1:63674_ x:collection1 s:shard1 c:control_collection r:core_node1) [n:127.0.0.1:63674_ c:control_collection s:shard1 r:core_node1 x:collection1] o.a.s.c.SyncStrategy http://127.0.0.1:63674/collection1/ has no replicas
   [junit4]   2> 573719 INFO  (coreZkRegister-1318-thread-1-processing-n:127.0.0.1:63674_ x:collection1 s:shard1 c:control_collection r:core_node1) [n:127.0.0.1:63674_ c:control_collection s:shard1 r:core_node1 x:collection1] o.a.s.c.c.SolrZkClient makePath: /collections/control_collection/leaders/shard1
   [junit4]   2> 573723 INFO  (coreZkRegister-1318-thread-1-processing-n:127.0.0.1:63674_ x:collection1 s:shard1 c:control_collection r:core_node1) [n:127.0.0.1:63674_ c:control_collection s:shard1 r:core_node1 x:collection1] o.a.s.c.ShardLeaderElectionContextBase Creating leader registration node /collections/control_collection/leaders/shard1/leader after winning as /collections/control_collection/leader_elect/shard1/election/95629169519624196-core_node1-n_0000000000
   [junit4]   2> 573728 INFO  (coreZkRegister-1318-thread-1-processing-n:127.0.0.1:63674_ x:collection1 s:shard1 c:control_collection r:core_node1) [n:127.0.0.1:63674_ c:control_collection s:shard1 r:core_node1 x:collection1] o.a.s.c.ShardLeaderElectionContext I am the new leader: http://127.0.0.1:63674/collection1/ shard1
   [junit4]   2> 573730 INFO  (OverseerStateUpdate-95629169519624196-127.0.0.1:63674_-n_0000000000) [n:127.0.0.1:63674_    ] o.a.s.c.Overseer processMessage: queueSize: 1, message = {
   [junit4]   2>   "operation":"leader",
   [junit4]   2>   "shard":"shard1",
   [junit4]   2>   "collection":"control_collection",
   [junit4]   2>   "base_url":"http://127.0.0.1:63674",
   [junit4]   2>   "core":"collection1",
   [junit4]   2>   "state":"active"} current state version: 1
   [junit4]   2> 573834 INFO  (zkCallback-478-thread-1-processing-n:127.0.0.1:63674_) [n:127.0.0.1:63674_    ] o.a.s.c.c.ZkStateReader A cluster state change: [WatchedEvent state:SyncConnected type:NodeDataChanged path:/clusterstate.json], has occurred - updating... (live nodes size: [1])
   [junit4]   2> 573882 INFO  (coreZkRegister-1318-thread-1-processing-n:127.0.0.1:63674_ x:collection1 s:shard1 c:control_collection r:core_node1) [n:127.0.0.1:63674_ c:control_collection s:shard1 r:core_node1 x:collection1] o.a.s.c.ZkController We are http://127.0.0.1:63674/collection1/ and leader is http://127.0.0.1:63674/collection1/
   [junit4]   2> 573882 INFO  (coreZkRegister-1318-thread-1-processing-n:127.0.0.1:63674_ x:collection1 s:shard1 c:control_collection r:core_node1) [n:127.0.0.1:63674_ c:control_collection s:shard1 r:core_node1 x:collection1] o.a.s.c.ZkController No LogReplay needed for core=collection1 baseURL=http://127.0.0.1:63674
   [junit4]   2> 573882 INFO  (coreZkRegister-1318-thread-1-processing-n:127.0.0.1:63674_ x:collection1 s:shard1 c:control_collection r:core_node1) [n:127.0.0.1:63674_ c:control_collection s:shard1 r:core_node1 x:collection1] o.a.s.c.ZkController I am the leader, no recovery necessary
   [junit4]   2> 573882 INFO  (coreZkRegister-1318-thread-1-processing-n:127.0.0.1:63674_ x:collection1 s:shard1 c:control_collection r:core_node1) [n:127.0.0.1:63674_ c:control_collection s:shard1 r:core_node1 x:collection1] o.a.s.c.ZkController publishing state=active
   [junit4]   2> 573882 INFO  (coreZkRegister-1318-thread-1-processing-n:127.0.0.1:63674_ x:collection1 s:shard1 c:control_collection r:core_node1) [n:127.0.0.1:63674_ c:control_collection s:shard1 r:core_node1 x:collection1] o.a.s.c.ZkController numShards not found on descriptor - reading it from system property
   [junit4]   2> 573885 INFO  (OverseerStateUpdate-95629169519624196-127.0.0.1:63674_-n_0000000000) [n:127.0.0.1:63674_    ] o.a.s.c.Overseer processMessage: queueSize: 1, message = {
   [junit4]   2>   "core":"collection1",
   [junit4]   2>   "core_node_name":"core_node1",
   [junit4]   2>   "roles":null,
   [junit4]   2>   "base_url":"http://127.0.0.1:63674",
   [junit4]   2>   "node_name":"127.0.0.1:63674_",
   [junit4]   2>   "numShards":"1",
   [junit4]   2>   "state":"active",
   [junit4]   2>   "shard":"shard1",
   [junit4]   2>   "collection":"control_collection",
   [junit4]   2>   "operation":"state"} current state version: 2
   [junit4]   2> 573885 INFO  (OverseerStateUpdate-95629169519624196-127.0.0.1:63674_-n_0000000000) [n:127.0.0.1:63674_    ] o.a.s.c.o.ReplicaMutator Update state numShards=1 message={
   [junit4]   2>   "core":"collection1",
   [junit4]   2>   "core_node_name":"core_node1",
   [junit4]   2>   "roles":null,
   [junit4]   2>   "base_url":"http://127.0.0.1:63674",
   [junit4]   2>   "node_name":"127.0.0.1:63674_",
   [junit4]   2>   "numShards":"1",
   [junit4]   2>   "state":"active",
   [junit4]   2>   "shard":"shard1",
   [junit4]   2>   "collection":"control_collection",
   [junit4]   2>   "operation":"state"}
   [junit4]   2> 573989 INFO  (zkCallback-478-thread-1-processing-n:127.0.0.1:63674_) [n:127.0.0.1:63674_    ] o.a.s.c.c.ZkStateReader A cluster state change: [WatchedEvent state:SyncConnected type:NodeDataChanged path:/clusterstate.json], has occurred - updating... (live nodes size: [1])
   [junit4]   2> 573999 INFO  (TEST-ChaosMonkeyNothingIsSafeTest.test-seed#[5C68465A4A64CE01]) [    ] o.a.s.c.c.SolrZkClient Using default ZkCredentialsProvider
   [junit4]   2> 573999 INFO  (TEST-ChaosMonkeyNothingIsSafeTest.test-seed#[5C68465A4A64CE01]) [    ] o.a.s.c.c.ConnectionManager Waiting for client to connect to ZooKeeper
   [junit4]   2> 574002 INFO  (zkCallback-480-thread-1) [    ] o.a.s.c.c.ConnectionManager Watcher org.apache.solr.common.cloud.ConnectionManager@563524b4 name:ZooKeeperConnection Watcher:127.0.0.1:59139/solr got event WatchedEvent state:SyncConnected type:None path:null path:null type:None
   [junit4]   2> 574003 INFO  (TEST-ChaosMonkeyNothingIsSafeTest.test-seed#[5C68465A4A64CE01]) [    ] o.a.s.c.c.ConnectionManager Client is connected to ZooKeeper
   [junit4]   2> 574003 INFO  (TEST-ChaosMonkeyNothingIsSafeTest.test-seed#[5C68465A4A64CE01]) [    ] o.a.s.c.c.SolrZkClient Using default ZkACLProvider
   [junit4]   2> 574003 INFO  (TEST-ChaosMonkeyNothingIsSafeTest.test-seed#[5C68465A4A64CE01]) [    ] o.a.s.c.c.ZkStateReader Updating cluster state from ZooKeeper... 
   [junit4]   2> 574005 INFO  (TEST-ChaosMonkeyNothingIsSafeTest.test-seed#[5C68465A4A64CE01]) [    ] o.a.s.c.c.ZkStateReader Updated live nodes from ZooKeeper... (0) -> (1)
   [junit4]   2> 574006 INFO  (TEST-ChaosMonkeyNothingIsSafeTest.test-seed#[5C68465A4A64CE01]) [    ] o.a.s.c.ChaosMonkey monkey: init - expire sessions:false cause connection loss:false
   [junit4]   2> 574006 INFO  (TEST-ChaosMonkeyNothingIsSafeTest.test-seed#[5C68465A4A64CE01]) [    ] o.a.s.c.AbstractFullDistribZkTestBase Creating collection1 with stateFormat=2
   [junit4]   2> 574006 INFO  (TEST-ChaosMonkeyNothingIsSafeTest.test-seed#[5C68465A4A64CE01]) [    ] o.a.s.c.c.SolrZkClient Using default ZkCredentialsProvider
   [junit4]   2> 574007 INFO  (TEST-ChaosMonkeyNothingIsSafeTest.test-seed#[5C68465A4A64CE01]) [    ] o.a.s.c.c.ConnectionManager Waiting for client to connect to ZooKeeper
   [junit4]   2> 574009 INFO  (zkCallback-481-thread-1) [    ] o.a.s.c.c.ConnectionManager Watcher org.apache.solr.common.cloud.ConnectionManager@12e57337 name:ZooKeeperConnection Watcher:127.0.0.1:59139/solr got event WatchedEvent state:SyncConnected type:None path:null path:null type:None
   [junit4]   2> 574009 INFO  (TEST-ChaosMonkeyNothingIsSafeTest.test-seed#[5C68465A4A64CE01]) [    ] o.a.s.c.c.ConnectionManager Client is connected to ZooKeeper
   [junit4]   2> 574009 INFO  (TEST-ChaosMonkeyNothingIsSafeTest.test-seed#[5C68465A4A64CE01]) [    ] o.a.s.c.c.SolrZkClient Using default ZkACLProvider
   [junit4]   2> 574012 INFO  (OverseerStateUpdate-95629169519624196-127.0.0.1:63674_-n_0000000000) [n:127.0.0.1:63674_    ] o.a.s.c.Overseer processMessage: queueSize: 1, message = {
   [junit4]   2>   "operation":"create",
   [junit4]   2>   "name":"collection1",
   [junit4]   2>   "numShards":"2",
   [junit4]   2>   "stateFormat":"2"} current state version: 3
   [junit4]   2> 574012 INFO  (OverseerStateUpdate-95629169519624196-127.0.0.1:63674_-n_0000000000) [n:127.0.0.1:63674_    ] o.a.s.c.o.ClusterStateMutator building a new cName: collection1
   [junit4]   2> 574117 INFO  (OverseerStateUpdate-95629169519624196-127.0.0.1:63674_-n_0000000000) [n:127.0.0.1:63674_    ] o.a.s.c.o.ZkStateWriter going to create_collection /collections/collection1/state.json
   [junit4]   2> 574145 INFO  (TEST-ChaosMonkeyNothingIsSafeTest.test-seed#[5C68465A4A64CE01]) [    ] o.a.s.SolrTestCaseJ4 Writing core.properties file to /export/home/jenkins/workspace/Lucene-Solr-6.x-Solaris/solr/build/solr-core/test/J0/temp/solr.cloud.ChaosMonkeyNothingIsSafeTest_5C68465A4A64CE01-001/shard-1-001/cores/collection1
   [junit4]   2> 574145 INFO  (TEST-ChaosMonkeyNothingIsSafeTest.test-seed#[5C68465A4A64CE01]) [    ] o.a.s.c.AbstractFullDistribZkTestBase create jetty 1 in directory /export/home/jenkins/workspace/Lucene-Solr-6.x-Solaris/solr/build/solr-core/test/J0/temp/solr.cloud.ChaosMonkeyNothingIsSafeTest_5C68465A4A64CE01-001/shard-1-001
   [junit4]   2> 574146 INFO  (TEST-ChaosMonkeyNothingIsSafeTest.test-seed#[5C68465A4A64CE01]) [    ] o.e.j.s.Server jetty-9.3.8.v20160314
   [junit4]   2> 574148 INFO  (TEST-ChaosMonkeyNothingIsSafeTest.test-seed#[5C68465A4A64CE01]) [    ] o.e.j.s.h.ContextHandler Started o.e.j.s.ServletContextHandler@454ed7e9{/,null,AVAILABLE}
   [junit4]   2> 574149 INFO  (TEST-ChaosMonkeyNothingIsSafeTest.test-seed#[5C68465A4A64CE01]) [    ] o.e.j.s.ServerConnector Started ServerConnector@28831526{HTTP/1.1,[http/1.1]}{127.0.0.1:35771}
   [junit4]   2> 574149 INFO  (TEST-ChaosMonkeyNothingIsSafeTest.test-seed#[5C68465A4A64CE01]) [    ] o.e.j.s.Server Started @577438ms
   [junit4]   2> 574149 INFO  (TEST-ChaosMonkeyNothingIsSafeTest.test-seed#[5C68465A4A64CE01]) [    ] o.a.s.c.s.e.JettySolrRunner Jetty properties: {solr.data.dir=/export/home/jenkins/workspace/Lucene-Solr-6.x-Solaris/solr/build/solr-core/test/J0/temp/solr.cloud.ChaosMonkeyNothingIsSafeTest_5C68465A4A64CE01-001/tempDir-001/jetty1, solrconfig=solrconfig.xml, hostContext=/, hostPort=35771, coreRootDirectory=/export/home/jenkins/workspace/Lucene-Solr-6.x-Solaris/solr/build/solr-core/test/J0/../../../../../../../../../../export/home/jenkins/workspace/Lucene-Solr-6.x-Solaris/solr/build/solr-core/test/J0/temp/solr.cloud.ChaosMonkeyNothingIsSafeTest_5C68465A4A64CE01-001/shard-1-001/cores}
   [junit4]   2> 574150 INFO  (TEST-ChaosMonkeyNothingIsSafeTest.test-seed#[5C68465A4A64CE01]) [    ] o.a.s.s.SolrDispatchFilter SolrDispatchFilter.init(): sun.misc.Launcher$AppClassLoader@6d06d69c
   [junit4]   2> 574150 INFO  (TEST-ChaosMonkeyNothingIsSafeTest.test-seed#[5C68465A4A64CE01]) [    ] o.a.s.c.SolrResourceLoader new SolrResourceLoader for directory: '/export/home/jenkins/workspace/Lucene-Solr-6.x-Solaris/solr/build/solr-core/test/J0/temp/solr.cloud.ChaosMonkeyNothingIsSafeTest_5C68465A4A64CE01-001/shard-1-001'
   [junit4]   2> 574150 INFO  (TEST-ChaosMonkeyNothingIsSafeTest.test-seed#[5C68465A4A64CE01]) [    ] o.a.s.c.SolrResourceLoader JNDI not configured for solr (NoInitialContextEx)
   [junit4]   2> 574150 INFO  (TEST-ChaosMonkeyNothingIsSafeTest.test-seed#[5C68465A4A64CE01]) [    ] o.a.s.c.SolrResourceLoader solr home defaulted to 'solr/' (could not find system property or JNDI)
   [junit4]   2> 574150 INFO  (TEST-ChaosMonkeyNothingIsSafeTest.test-seed#[5C68465A4A64CE01]) [    ] o.a.s.c.c.SolrZkClient Using default ZkCredentialsProvider
   [junit4]   2> 574151 INFO  (TEST-ChaosMonkeyNothingIsSafeTest.test-seed#[5C68465A4A64CE01]) [    ] o.a.s.c.c.ConnectionManager Waiting for client to connect to ZooKeeper
   [junit4]   2> 574152 INFO  (zkCallback-482-thread-1) [    ] o.a.s.c.c.ConnectionManager Watcher org.apache.solr.common.cloud.ConnectionManager@55edce9b name:ZooKeeperConnection Watcher:127.0.0.1:59139/solr got event WatchedEvent state:SyncConnected type:None path:null path:null type:None
   [junit4]   2> 574153 INFO  (TEST-ChaosMonkeyNothingIsSafeTest.test-seed#[5C68465A4A64CE01]) [    ] o.a.s.c.c.ConnectionManager Client is connected to ZooKeeper
   [junit4]   2> 574153 INFO  (TEST-ChaosMonkeyNothingIsSafeTest.test-seed#[5C68465A4A64CE01]) [    ] o.a.s.c.c.SolrZkClient Using default ZkACLProvider
   [junit4]   2> 574155 INFO  (TEST-ChaosMonkeyNothingIsSafeTest.test-seed#[5C68465A4A64CE01]) [    ] o.a.s.s.SolrDispatchFilter Loading solr.xml from SolrHome (not found in ZooKeeper)
   [junit4]   2> 574155 INFO  (TEST-ChaosMonkeyNothingIsSafeTest.test-seed#[5C68465A4A64CE01]) [    ] o.a.s.c.SolrXmlConfig Loading container configuration from /export/home/jenkins/workspace/Lucene-Solr-6.x-Solaris/solr/build/solr-core/test/J0/temp/solr.cloud.ChaosMonkeyNothingIsSafeTest_5C68465A4A64CE01-001/shard-1-001/solr.xml
   [junit4]   2> 574160 INFO  (TEST-ChaosMonkeyNothingIsSafeTest.test-seed#[5C68465A4A64CE01]) [    ] o.a.s.c.CorePropertiesLocator Config-defined core root directory: /export/home/jenkins/workspace/Lucene-Solr-6.x-Solaris/solr/build/solr-core/test/J0/../../../../../../../../../../export/home/jenkins/workspace/Lucene-Solr-6.x-Solaris/solr/build/solr-core/test/J0/temp/solr.cloud.ChaosMonkeyNothingIsSafeTest_5C68465A4A64CE01-001/shard-1-001/cores
   [junit4]   2> 574160 INFO  (TEST-ChaosMonkeyNothingIsSafeTest.test-seed#[5C68465A4A64CE01]) [    ] o.a.s.c.CoreContainer New CoreContainer 2037242787
   [junit4]   2> 574160 INFO  (TEST-ChaosMonkeyNothingIsSafeTest.test-seed#[5C68465A4A64CE01]) [    ] o.a.s.c.CoreContainer Loading cores into CoreContainer [instanceDir=/export/home/jenkins/workspace/Lucene-Solr-6.x-Solaris/solr/build/solr-core/test/J0/temp/solr.cloud.ChaosMonkeyNothingIsSafeTest_5C68465A4A64CE01-001/shard-1-001]
   [junit4]   2> 574160 WARN  (TEST-ChaosMonkeyNothingIsSafeTest.test-seed#[5C68465A4A64CE01]) [    ] o.a.s.c.CoreContainer Couldn't add files from /export/home/jenkins/workspace/Lucene-Solr-6.x-Solaris/solr/build/solr-core/test/J0/temp/solr.cloud.ChaosMonkeyNothingIsSafeTest_5C68465A4A64CE01-001/shard-1-001/lib to classpath: /export/home/jenkins/workspace/Lucene-Solr-6.x-Solaris/solr/build/solr-core/test/J0/temp/solr.cloud.ChaosMonkeyNothingIsSafeTest_5C68465A4A64CE01-001/shard-1-001/lib
   [junit4]   2> 574161 INFO  (TEST-ChaosMonkeyNothingIsSafeTest.test-seed#[5C68465A4A64CE01]) [    ] o.a.s.h.c.HttpShardHandlerFactory created with socketTimeout : 90000,urlScheme : ,connTimeout : 15000,maxConnectionsPerHost : 20,maxConnections : 10000,corePoolSize : 0,maximumPoolSize : 2147483647,maxThreadIdleTime : 5,sizeOfQueue : -1,fairnessPolicy : false,useRetries : false,
   [junit4]   2> 574162 INFO  (TEST-ChaosMonkeyNothingIsSafeTest.test-seed#[5C68465A4A64CE01]) [    ] o.a.s.u.UpdateShardHandler Creating UpdateShardHandler HTTP client with params: socketTimeout=340000&connTimeout=45000&retry=true
   [junit4]   2> 574162 INFO  (TEST-ChaosMonkeyNothingIsSafeTest.test-seed#[5C68465A4A64CE01]) [    ] o.a.s.l.LogWatcher SLF4J impl is org.slf4j.impl.Log4jLoggerFactory
   [junit4]   2> 574162 INFO  (TEST-ChaosMonkeyNothingIsSafeTest.test-seed#[5C68465A4A64CE01]) [    ] o.a.s.l.LogWatcher Registering Log Listener [Log4j (org.slf4j.impl.Log4jLoggerFactory)]
   [junit4]   2> 574162 INFO  (TEST-ChaosMonkeyNothingIsSafeTest.test-seed#[5C68465A4A64CE01]) [    ] o.a.s.c.ZkContainer Zookeeper client=127.0.0.1:59139/solr
   [junit4]   2> 574162 INFO  (TEST-ChaosMonkeyNothingIsSafeTest.test-seed#[5C68465A4A64CE01]) [    ] o.a.s.c.ZkController zkHost includes chroot
   [junit4]   2> 574162 INFO  (TEST-ChaosMonkeyNothingIsSafeTest.test-seed#[5C68465A4A64CE01]) [    ] o.a.s.c.c.SolrZkClient Using default ZkCredentialsProvider
   [junit4]   2> 574163 INFO  (TEST-ChaosMonkeyNothingIsSafeTest.test-seed#[5C68465A4A64CE01]) [    ] o.a.s.c.c.ConnectionManager Waiting for client to connect to ZooKeeper
   [junit4]   2> 574165 INFO  (zkCallback-485-thread-1) [    ] o.a.s.c.c.ConnectionManager Watcher org.apache.solr.common.cloud.ConnectionManager@7c79aaef name:ZooKeeperConnection Watcher:127.0.0.1:59139 got event WatchedEvent state:SyncConnected type:None path:null path:null type:None
   [junit4]   2> 574166 INFO  (TEST-ChaosMonkeyNothingIsSafeTest.test-seed#[5C68465A4A64CE01]) [    ] o.a.s.c.c.ConnectionManager Client is connected to ZooKeeper
   [junit4]   2> 574167 INFO  (TEST-ChaosMonkeyNothingIsSafeTest.test-seed#[5C68465A4A64CE01]) [    ] o.a.s.c.c.SolrZkClient Using default ZkACLProvider
   [junit4]   2> 574168 INFO  (TEST-ChaosMonkeyNothingIsSafeTest.test-seed#[5C68465A4A64CE01]) [n:127.0.0.1:35771_    ] o.a.s.c.c.ConnectionManager Waiting for client to connect to ZooKeeper
   [junit4]   2> 574171 INFO  (zkCallback-486-thread-1-processing-n:127.0.0.1:35771_) [n:127.0.0.1:35771_    ] o.a.s.c.c.ConnectionManager Watcher org.apache.solr.common.cloud.ConnectionManager@5997eea6 name:ZooKeeperConnection Watcher:127.0.0.1:59139/solr got event WatchedEvent state:SyncConnected type:None path:null path:null type:None
   [junit4]   2> 574171 INFO  (TEST-ChaosMonkeyNothingIsSafeTest.test-seed#[5C68465A4A64CE01]) [n:127.0.0.1:35771_    ] o.a.s.c.c.ConnectionManager Client is connected to ZooKeeper
   [junit4]   2> 574181 INFO  (TEST-ChaosMonkeyNothingIsSafeTest.test-seed#[5C68465A4A64CE01]) [n:127.0.0.1:35771_    ] o.a.s.c.c.ZkStateReader Updating cluster state from ZooKeeper... 
   [junit4]   2> 574184 INFO  (TEST-ChaosMonkeyNothingIsSafeTest.test-seed#[5C68465A4A64CE01]) [n:127.0.0.1:35771_    ] o.a.s.c.c.ZkStateReader Updated live nodes from ZooKeeper... (0) -> (1)
   [junit4]   2> 574188 INFO  (TEST-ChaosMonkeyNothingIsSafeTest.test-seed#[5C68465A4A64CE01]) [n:127.0.0.1:35771_    ] o.a.s.c.Overseer Overseer (id=null) closing
   [junit4]   2> 574188 INFO  (TEST-ChaosMonkeyNothingIsSafeTest.test-seed#[5C68465A4A64CE01]) [n:127.0.0.1:35771_    ] o.a.s.c.LeaderElector Joined leadership election with path: /overseer_elect/election/95629169519624201-127.0.0.1:35771_-n_0000000001
   [junit4]   2> 574190 INFO  (TEST-ChaosMonkeyNothingIsSafeTest.test-seed#[5C68465A4A64CE01]) [n:127.0.0.1:35771_    ] o.a.s.c.LeaderElector Watching path /overseer_elect/election/95629169519624196-127.0.0.1:63674_-n_0000000000 to know if I could be the leader
   [junit4]   2> 574190 INFO  (TEST-ChaosMonkeyNothingIsSafeTest.test-seed#[5C68465A4A64CE01]) [n:127.0.0.1:35771_    ] o.a.s.c.ZkController Publish node=127.0.0.1:35771_ as DOWN
   [junit4]   2> 574193 INFO  (OverseerStateUpdate-95629169519624196-127.0.0.1:63674_-n_0000000000) [n:127.0.0.1:63674_    ] o.a.s.c.Overseer processMessage: queueSize: 1, message = {
   [junit4]   2>   "operation":"downnode",
   [junit4]   2>   "node_name":"127.0.0.1:35771_"} current state version: 3
   [junit4]   2> 574193 INFO  (OverseerStateUpdate-95629169519624196-127.0.0.1:63674_-n_0000000000) [n:127.0.0.1:63674_    ] o.a.s.c.o.NodeMutator DownNode state invoked for node: 127.0.0.1:35771_
   [junit4]   2> 574195 INFO  (OverseerStateUpdate-95629169519624196-127.0.0.1:63674_-n_0000000000) [n:127.0.0.1:63674_    ] o.a.s.c.o.ZkStateWriter going to update_collection /collections/collection1/state.json version: 0
   [junit4]   2> 574301 INFO  (zkCallback-480-thread-1) [    ] o.a.s.c.c.ZkStateReader A cluster state change: [WatchedEvent state:SyncConnected type:NodeDataChanged path:/clusterstate.json], has occurred - updating... (live nodes size: [1])
   [junit4]   2> 574301 INFO  (zkCallback-478-thread-1-processing-n:127.0.0.1:63674_) [n:127.0.0.1:63674_    ] o.a.s.c.c.ZkStateReader A cluster state change: [WatchedEvent state:SyncConnected type:NodeDataChanged path:/clusterstate.json], has occurred - updating... (live nodes size: [1])
   [junit4]   2> 574302 INFO  (zkCallback-486-thread-1-processing-n:127.0.0.1:35771_) [n:127.0.0.1:35771_    ] o.a.s.c.c.ZkStateReader A cluster state change: [WatchedEvent state:SyncConnected type:NodeDataChanged path:/clusterstate.json], has occurred - updating... (live nodes size: [1])
   [junit4]   2> 575195 INFO  (TEST-ChaosMonkeyNothingIsSafeTest.test-seed#[5C68465A4A64CE01]) [n:127.0.0.1:35771_    ] o.a.s.c.ZkController Register node as live in ZooKeeper:/live_nodes/127.0.0.1:35771_
   [junit4]   2> 575196 INFO  (TEST-ChaosMonkeyNothingIsSafeTest.test-seed#[5C68465A4A64CE01]) [n:127.0.0.1:35771_    ] o.a.s.c.c.SolrZkClient makePath: /live_nodes/127.0.0.1:35771_
   [junit4]   2> 575198 INFO  (zkCallback-480-thread-1) [    ] o.a.s.c.c.ZkStateReader A live node change: [WatchedEvent state:SyncConnected type:NodeChildrenChanged path:/live_nodes], has occurred - updating... (live nodes size: [1])
   [junit4]   2> 575198 INFO  (zkCallback-478-thread-1-processing-n:127.0.0.1:63674_) [n:127.0.0.1:63674_    ] o.a.s.c.c.ZkStateReader A live node change: [WatchedEvent state:SyncConnected type:NodeChildrenChanged path:/live_nodes], has occurred - updating... (live nodes size: [1])
   [junit4]   2> 575198 INFO  (zkCallback-486-thread-1-processing-n:127.0.0.1:35771_) [n:127.0.0.1:35771_    ] o.a.s.c.c.ZkStateReader A live node change: [WatchedEvent state:SyncConnected type:NodeChildrenChanged path:/live_nodes], has occurred - updating... (live nodes size: [1])
   [junit4]   2> 575199 INFO  (zkCallback-480-thread-1) [    ] o.a.s.c.c.ZkStateReader Updated live nodes from ZooKeeper... (1) -> (2)
   [junit4]   2> 575199 INFO  (zkCallback-478-thread-1-processing-n:127.0.0.1:63674_) [n:127.0.0.1:63674_    ] o.a.s.c.c.ZkStateReader Updated live nodes from ZooKeeper... (1) -> (2)
   [junit4]   2> 575200 INFO  (zkCallback-486-thread-1-processing-n:127.0.0.1:35771_) [n:127.0.0.1:35771_    ] o.a.s.c.c.ZkStateReader Updated live nodes from ZooKeeper... (1) -> (2)
   [junit4]   2> 575224 INFO  (TEST-ChaosMonkeyNothingIsSafeTest.test-seed#[5C68465A4A64CE01]) [n:127.0.0.1:35771_    ] o.a.s.c.CoreContainer Security conf doesn't exist. Skipping setup for authorization module.
   [junit4]   2> 575224 INFO  (TEST-ChaosMonkeyNothingIsSafeTest.test-seed#[5C68465A4A64CE01]) [n:127.0.0.1:35771_    ] o.a.s.c.CoreContainer No authentication plugin used.
   [junit4]   2> 575225 INFO  (TEST-ChaosMonkeyNothingIsSafeTest.test-seed#[5C68465A4A64CE01]) [n:127.0.0.1:35771_    ] o.a.s.c.CorePropertiesLocator Looking for core definitions underneath /export/home/jenkins/workspace/Lucene-Solr-6.x-Solaris/solr/build/solr-core/test/J0/../../../../../../../../../../export/home/jenkins/workspace/Lucene-Solr-6.x-Solaris/solr/build/solr-core/test/J0/temp/solr.cloud.ChaosMonkeyNothingIsSafeTest_5C68465A4A64CE01-001/shard-1-001/cores
   [junit4]   2> 575226 INFO  (TEST-ChaosMonkeyNothingIsSafeTest.test-seed#[5C68465A4A64CE01]) [n:127.0.0.1:35771_    ] o.a.s.c.CoreDescriptor Created CoreDescriptor: {name=collection1, config=solrconfig.xml, transient=false, schema=schema.xml, loadOnStartup=true, configSetProperties=configsetprops.json, collection=collection1, coreNodeName=, dataDir=data/, shard=}
   [junit4]   2> 575227 INFO  (TEST-ChaosMonkeyNothingIsSafeTest.test-seed#[5C68465A4A64CE01]) [n:127.0.0.1:35771_    ] o.a.s.c.CorePropertiesLocator Found core collection1 in /export/home/jenkins/workspace/Lucene-Solr-6.x-Solaris/solr/build/solr-core/test/J0/../../../../../../../../../../export/home/jenkins/workspace/Lucene-Solr-6.x-Solaris/solr/build/solr-core/test/J0/temp/solr.cloud.ChaosMonkeyNothingIsSafeTest_5C68465A4A64CE01-001/shard-1-001/cores/collection1
   [junit4]   2> 575227 INFO  (TEST-ChaosMonkeyNothingIsSafeTest.test-seed#[5C68465A4A64CE01]) [n:127.0.0.1:35771_    ] o.a.s.c.CorePropertiesLocator Found 1 core definitions
   [junit4]   2> 575228 INFO  (TEST-ChaosMonkeyNothingIsSafeTest.test-seed#[5C68465A4A64CE01]) [n:127.0.0.1:35771_    ] o.a.s.s.SolrDispatchFilter user.dir=/export/home/jenkins/workspace/Lucene-Solr-6.x-Solaris/solr/build/solr-core/test/J0
   [junit4]   2> 575228 INFO  (TEST-ChaosMonkeyNothingIsSafeTest.test-seed#[5C68465A4A64CE01]) [n:127.0.0.1:35771_    ] o.a.s.s.SolrDispatchFilter SolrDispatchFilter.init() done
   [junit4]   2> 575229 INFO  (coreLoadExecutor-1335-thread-1-processing-n:127.0.0.1:35771_) [n:127.0.0.1:35771_ c:collection1   x:collection1] o.a.s.c.ZkController publishing state=down
   [junit4]   2> 575229 INFO  (coreLoadExecutor-1335-thread-1-processing-n:127.0.0.1:35771_) [n:127.0.0.1:35771_ c:collection1   x:collection1] o.a.s.c.ZkController numShards not found on descriptor - reading it from system property
   [junit4]   2> 575231 INFO  (coreLoadExecutor-1335-thread-1-processing-n:127.0.0.1:35771_) [n:127.0.0.1:35771_ c:collection1   x:collection1] o.a.s.c.ZkController Registering watch for collection collection1
   [junit4]   2> 575231 INFO  (coreLoadExecutor-1335-thread-1-processing-n:127.0.0.1:35771_) [n:127.0.0.1:35771_ c:collection1   x:collection1] o.a.s.c.c.ZkStateReader addZkWatch [collection1]
   [junit4]   2> 575231 INFO  (OverseerStateUpdate-95629169519624196-127.0.0.1:63674_-n_0000000000) [n:127.0.0.1:63674_    ] o.a.s.c.Overseer processMessage: queueSize: 1, message = {
   [junit4]   2>   "core":"collection1",
   [junit4]   2>   "roles":null,
   [junit4]   2>   "base_url":"http://127.0.0.1:35771",
   [junit4]   2>   "node_name":"127.0.0.1:35771_",
   [junit4]   2>   "numShards":"2",
   [junit4]   2>   "state":"down",
   [junit4]   2>   "shard":null,
   [junit4]   2>   "collection":"collection1",
   [junit4]   2>   "operation":"state"} current state version: 4
   [junit4]   2> 575231 INFO  (coreLoadExecutor-1335-thread-1-processing-n:127.0.0.1:35771_) [n:127.0.0.1:35771_ c:collection1   x:collection1] o.a.s.c.c.ZkStateReader Add data for [collection1] ver [1]
   [junit4]   2> 575231 INFO  (coreLoadExecutor-1335-thread-1-processing-n:127.0.0.1:35771_) [n:127.0.0.1:35771_ c:collection1   x:collection1] o.a.s.c.ZkController look for our core node name
   [junit4]   2> 575232 INFO  (OverseerStateUpdate-95629169519624196-127.0.0.1:63674_-n_0000000000) [n:127.0.0.1:63674_    ] o.a.s.c.o.ReplicaMutator Update state numShards=2 message={
   [junit4]   2>   "core":"collection1",
   [junit4]   2>   "roles":null,
   [junit4]   2>   "base_url":"http://127.0.0.1:35771",
   [junit4]   2>   "node_name":"127.0.0.1:35771_",
   [junit4]   2>   "numShards":"2",
   [junit4]   2>   "state":"down",
   [junit4]   2>   "shard":null,
   [junit4]   2>   "collection":"collection1",
   [junit4]   2>   "operation":"state"}
   [junit4]   2> 575232 INFO  (OverseerStateUpdate-95629169519624196-127.0.0.1:63674_-n_0000000000) [n:127.0.0.1:63674_    ] o.a.s.c.o.ReplicaMutator Collection already exists with numShards=2
   [junit4]   2> 575232 INFO  (OverseerStateUpdate-95629169519624196-127.0.0.1:63674_-n_0000000000) [n:127.0.0.1:63674_    ] o.a.s.c.o.ReplicaMutator Assigning new node to shard shard=shard2
   [junit4]   2> 575343 INFO  (OverseerStateUpdate-95629169519624196-127.0.0.1:63674_-n_0000000000) [n:127.0.0.1:63674_    ] o.a.s.c.o.ZkStateWriter going to update_collection /collections/collection1/state.json version: 1
   [junit4]   2> 575343 INFO  (zkCallback-486-thread-1-processing-n:127.0.0.1:35771_) [n:127.0.0.1:35771_    ] o.a.s.c.c.ZkStateReader A cluster state change: [WatchedEvent state:SyncConnected type:NodeDataChanged path:/collections/collection1/state.json] for collection [collection1] has occurred - updating... (live nodes size: [2])
   [junit4]   2> 575344 INFO  (zkCallback-486-thread-1-processing-n:127.0.0.1:35771_) [n:127.0.0.1:35771_    ] o.a.s.c.c.ZkStateReader Updating data for [collection1] from [1] to [2]
   [junit4]   2> 576232 INFO  (coreLoadExecutor-1335-thread-1-processing-n:127.0.0.1:35771_) [n:127.0.0.1:35771_ c:collection1   x:collection1] o.a.s.c.ZkController waiting to find shard id in clusterstate for collection1
   [junit4]   2> 576232 INFO  (coreLoadExecutor-1335-thread-1-processing-n:127.0.0.1:35771_) [n:127.0.0.1:35771_ c:collection1   x:collection1] o.a.s.c.ZkController Check for collection zkNode:collection1
   [junit4]   2> 576233 INFO  (coreLoadExecutor-1335-thread-1-processing-n:127.0.0.1:35771_) [n:127.0.0.1:35771_ c:collection1   x:collection1] o.a.s.c.ZkController Collection zkNode exists
   [junit4]   2> 576233 INFO  (coreLoadExecutor-1335-thread-1-processing-n:127.0.0.1:35771_) [n:127.0.0.1:35771_ c:collection1   x:collection1] o.a.s.c.c.ZkStateReader Load collection config from: [/collections/collection1]
   [junit4]   2> 576235 INFO  (coreLoadExecutor-1335-thread-1-processing-n:127.0.0.1:35771_) [n:127.0.0.1:35771_ c:collection1   x:collection1] o.a.s.c.c.ZkStateReader path=[/collections/collection1] [configName]=[conf1] specified config exists in ZooKeeper
   [junit4]   2> 576235 INFO  (coreLoadExecutor-1335-thread-1-processing-n:127.0.0.1:35771_) [n:127.0.0.1:35771_ c:collection1   x:collection1] o.a.s.c.SolrResourceLoader new SolrResourceLoader for directory: '/export/home/jenkins/workspace/Lucene-Solr-6.x-Solaris/solr/build/solr-core/test/J0/temp/solr.cloud.ChaosMonkeyNothingIsSafeTest_5C68465A4A64CE01-001/shard-1-001/cores/collection1'
   [junit4]   2> 576235 INFO  (coreLoadExecutor-1335-thread-1-processing-n:127.0.0.1:35771_) [n:127.0.0.1:35771_ c:collection1   x:collection1] o.a.s.c.SolrResourceLoader JNDI not configured for solr (NoInitialContextEx)
   [junit4]   2> 576235 INFO  (coreLoadExecutor-1335-thread-1-processing-n:127.0.0.1:35771_) [n:127.0.0.1:35771_ c:collection1   x:collection1] o.a.s.c.SolrResourceLoader solr home defaulted to 'solr/' (could not find system property or JNDI)
   [junit4]   2> 576237 INFO  (coreLoadExecutor-1335-thread-1-processing-n:127.0.0.1:35771_) [n:127.0.0.1:35771_ c:collection1   x:collection1] o.a.s.c.Config loaded config solrconfig.xml with version 0 
   [junit4]   2> 576241 INFO  (coreLoadExecutor-1335-thread-1-processing-n:127.0.0.1:35771_) [n:127.0.0.1:35771_ c:collection1   x:collection1] o.a.s.c.SolrConfig current version of requestparams : -1
   [junit4]   2> 576244 INFO  (coreLoadExecutor-1335-thread-1-processing-n:127.0.0.1:35771_) [n:127.0.0.1:35771_ c:collection1   x:collection1] o.a.s.c.SolrConfig Using Lucene MatchVersion

[...truncated too long message...]

ative_deletesById=11,cumulative_deletesByQuery=0,cumulative_errors=0,transaction_logs_total_size=0,transaction_logs_total_number=0}
   [junit4]   2> 1808550 INFO  (coreCloseExecutor-5884-thread-1-processing-x:collection1) [    x:collection1] o.a.s.u.SolrCoreState Closing SolrCoreState
   [junit4]   2> 1808551 INFO  (coreCloseExecutor-5884-thread-1-processing-x:collection1) [    x:collection1] o.a.s.u.DefaultSolrCoreState SolrCoreState ref count has reached 0 - closing IndexWriter
   [junit4]   2> 1808551 INFO  (coreCloseExecutor-5884-thread-1-processing-x:collection1) [    x:collection1] o.a.s.u.DefaultSolrCoreState closing IndexWriter with IndexWriterCloser
   [junit4]   2> 1808551 INFO  (coreCloseExecutor-5884-thread-1-processing-x:collection1) [    x:collection1] o.a.s.u.DirectUpdateHandler2 Committing on IndexWriter close.
   [junit4]   2> 1808551 INFO  (coreCloseExecutor-5884-thread-1-processing-x:collection1) [    x:collection1] o.a.s.c.SolrDeletionPolicy SolrDeletionPolicy.onCommit: commits: num=2
   [junit4]   2> 	commit{dir=MockDirectoryWrapper(RAMDirectory@2163b469 lockFactory=org.apache.lucene.store.SingleInstanceLockFactory@d8c631a),segFN=segments_3,generation=3}
   [junit4]   2> 	commit{dir=MockDirectoryWrapper(RAMDirectory@2163b469 lockFactory=org.apache.lucene.store.SingleInstanceLockFactory@d8c631a),segFN=segments_4,generation=4}
   [junit4]   2> 1808551 INFO  (coreCloseExecutor-5884-thread-1-processing-x:collection1) [    x:collection1] o.a.s.c.SolrDeletionPolicy newest commit generation = 4
   [junit4]   2> 1808552 INFO  (coreCloseExecutor-5884-thread-1-processing-x:collection1) [    x:collection1] o.a.s.c.SolrCore [collection1] Closing main searcher on request.
   [junit4]   2> 1808559 INFO  (coreCloseExecutor-5884-thread-1-processing-x:collection1) [    x:collection1] o.a.s.c.CachingDirectoryFactory Closing MockDirectoryFactory - 2 directories currently being tracked
   [junit4]   2> 1808559 INFO  (coreCloseExecutor-5884-thread-1-processing-x:collection1) [    x:collection1] o.a.s.c.CachingDirectoryFactory looking to close /export/home/jenkins/workspace/Lucene-Solr-6.x-Solaris/solr/build/solr-core/test/J1/temp/solr.update.AutoCommitTest_5C68465A4A64CE01-001/init-core-data-001/index [CachedDir<<refCount=0;path=/export/home/jenkins/workspace/Lucene-Solr-6.x-Solaris/solr/build/solr-core/test/J1/temp/solr.update.AutoCommitTest_5C68465A4A64CE01-001/init-core-data-001/index;done=false>>]
   [junit4]   2> 1808559 INFO  (coreCloseExecutor-5884-thread-1-processing-x:collection1) [    x:collection1] o.a.s.c.CachingDirectoryFactory Closing directory: /export/home/jenkins/workspace/Lucene-Solr-6.x-Solaris/solr/build/solr-core/test/J1/temp/solr.update.AutoCommitTest_5C68465A4A64CE01-001/init-core-data-001/index
   [junit4]   2> 1808559 INFO  (coreCloseExecutor-5884-thread-1-processing-x:collection1) [    x:collection1] o.a.s.c.CachingDirectoryFactory looking to close /export/home/jenkins/workspace/Lucene-Solr-6.x-Solaris/solr/build/solr-core/test/J1/temp/solr.update.AutoCommitTest_5C68465A4A64CE01-001/init-core-data-001 [CachedDir<<refCount=0;path=/export/home/jenkins/workspace/Lucene-Solr-6.x-Solaris/solr/build/solr-core/test/J1/temp/solr.update.AutoCommitTest_5C68465A4A64CE01-001/init-core-data-001;done=false>>]
   [junit4]   2> 1808559 INFO  (coreCloseExecutor-5884-thread-1-processing-x:collection1) [    x:collection1] o.a.s.c.CachingDirectoryFactory Closing directory: /export/home/jenkins/workspace/Lucene-Solr-6.x-Solaris/solr/build/solr-core/test/J1/temp/solr.update.AutoCommitTest_5C68465A4A64CE01-001/init-core-data-001
   [junit4]   2> NOTE: leaving temporary files on disk at: /export/home/jenkins/workspace/Lucene-Solr-6.x-Solaris/solr/build/solr-core/test/J1/temp/solr.update.AutoCommitTest_5C68465A4A64CE01-001
   [junit4]   2> NOTE: test params are: codec=Asserting(Lucene60): {range_facet_l_dv=PostingsFormat(name=Memory doPackFST= true), _version_=PostingsFormat(name=LuceneVarGapFixedInterval), field_t=PostingsFormat(name=Memory doPackFST= true), multiDefault=PostingsFormat(name=LuceneVarGapDocFreqInterval), subject=PostingsFormat(name=LuceneVarGapDocFreqInterval), intDefault=PostingsFormat(name=LuceneVarGapFixedInterval), id=PostingsFormat(name=Memory doPackFST= true), range_facet_i_dv=PostingsFormat(name=LuceneVarGapDocFreqInterval), text=PostingsFormat(name=MockRandom), range_facet_l=PostingsFormat(name=LuceneVarGapDocFreqInterval), timestamp=PostingsFormat(name=LuceneVarGapDocFreqInterval)}, docValues:{range_facet_l_dv=DocValuesFormat(name=Direct), range_facet_i_dv=DocValuesFormat(name=Lucene54), timestamp=DocValuesFormat(name=Lucene54)}, maxPointsInLeafNode=1468, maxMBSortInHeap=5.279855223077647, sim=RandomSimilarity(queryNorm=false,coord=no): {}, locale=de, timezone=Asia/Dubai
   [junit4]   2> NOTE: SunOS 5.11 amd64/Oracle Corporation 1.8.0_72 (64-bit)/cpus=3,threads=1,free=98137920,total=536870912
   [junit4]   2> NOTE: All tests run in this JVM: [ConjunctionSolrSpellCheckerTest, SolrIndexSplitterTest, ChangedSchemaMergeTest, BasicZkTest, TriLevelCompositeIdRoutingTest, ResourceLoaderTest, TestSuggestSpellingConverter, QueryParsingTest, TestConfigReload, HighlighterMaxOffsetTest, TestRawResponseWriter, TestJoin, TestRestManager, DirectUpdateHandlerOptimizeTest, TolerantUpdateProcessorTest, TestFiltering, CollectionsAPIDistributedZkTest, TestFilteredDocIdSet, TestExceedMaxTermLength, BufferStoreTest, OutOfBoxZkACLAndCredentialsProvidersTest, SolrPluginUtilsTest, ZkStateReaderTest, FileBasedSpellCheckerTest, OutputWriterTest, AnalyticsMergeStrategyTest, SuggesterTest, DistribJoinFromCollectionTest, TestRandomFaceting, TestExactSharedStatsCache, HttpPartitionTest, CurrencyFieldOpenExchangeTest, RequestLoggingTest, DataDrivenBlockJoinTest, DateFieldTest, TestFastWriter, TestManagedSchema, TestRandomCollapseQParserPlugin, LeaderInitiatedRecoveryOnCommitTest, TestNRTOpen, OverseerCollectionConfigSetProcessorTest, BinaryUpdateRequestHandlerTest, TestPHPSerializedResponseWriter, TestStressRecovery, TestSchemaVersionResource, SpatialRPTFieldTypeTest, TestOmitPositions, TestBlendedInfixSuggestions, PreAnalyzedUpdateProcessorTest, TestCoreDiscovery, SharedFSAutoReplicaFailoverTest, NumericFieldsTest, CdcrVersionReplicationTest, SuggestComponentTest, SolrXmlInZkTest, DistributedExpandComponentTest, TestJsonFacets, TestClassicSimilarityFactory, TestWriterPerf, TestDefaultSearchFieldResource, DistanceUnitsTest, SpellingQueryConverterTest, SaslZkACLProviderTest, SpellCheckCollatorTest, TestSQLHandler, TestNonDefinedSimilarityFactory, TestSolrQueryParserDefaultOperatorResource, ConfigSetsAPITest, TestSolrQueryParser, SuggesterTSTTest, CollectionsAPISolrJTest, AliasIntegrationTest, DocValuesMissingTest, TestReload, TermVectorComponentDistributedTest, TestSolrDynamicMBean, LoggingHandlerTest, TestPerFieldSimilarityWithDefaultOverride, TestIndexSearcher, VersionInfoTest, TestCloudManagedSchema, OverseerStatusTest, NotRequiredUniqueKeyTest, ZkSolrClientTest, TestOverriddenPrefixQueryForCustomFieldType, TestDynamicFieldResource, TestQueryUtils, OpenExchangeRatesOrgProviderTest, TestFuzzyAnalyzedSuggestions, TestTrie, TestReRankQParserPlugin, RecoveryAfterSoftCommitTest, TestExpandComponent, CoreAdminHandlerTest, DistributedTermsComponentTest, TestMissingGroups, TestLMJelinekMercerSimilarityFactory, HdfsCollectionsAPIDistributedZkTest, UpdateRequestProcessorFactoryTest, TestCloudSchemaless, BasicDistributedZk2Test, CollectionReloadTest, MigrateRouteKeyTest, SynonymTokenizerTest, TestDistributedMissingSort, TestSolrConfigHandlerConcurrent, EchoParamsTest, TestFieldTypeResource, TestExclusionRuleCollectionAccess, TestCloudDeleteByQuery, MinimalSchemaTest, TestStandardQParsers, SearchHandlerTest, TestManagedResource, DebugComponentTest, TestReversedWildcardFilterFactory, SuggesterWFSTTest, TestSimpleQParserPlugin, TestInitQParser, TestBinaryResponseWriter, SmileWriterTest, DistributedVersionInfoTest, TestJettySolrRunner, TestCollationField, TestSolrJ, SolrCmdDistributorTest, DistributedFacetPivotSmallTest, TestTestInjection, SparseHLLTest, TestMacros, CSVRequestHandlerTest, FileUtilsTest, TestUniqueKeyFieldResource, DirectoryFactoryTest, ShardRoutingCustomTest, TestFastOutputStream, TestReqParamsAPI, ConvertedLegacyTest, DateMathParserTest, TestFoldingMultitermQuery, FieldAnalysisRequestHandlerTest, TestZkChroot, CacheHeaderTest, SegmentsInfoRequestHandlerTest, BasicDistributedZkTest, ChaosMonkeySafeLeaderTest, OpenCloseCoreStressTest, OverseerTest, LeaderElectionIntegrationTest, LeaderElectionTest, TestRandomDVFaceting, AutoCommitTest]
   [junit4] Completed [303/585 (2!)] on J1 in 12.13s, 3 tests, 1 error <<< FAILURES!

[...truncated 921 lines...]
BUILD FAILED
/export/home/jenkins/workspace/Lucene-Solr-6.x-Solaris/build.xml:740: The following error occurred while executing this line:
/export/home/jenkins/workspace/Lucene-Solr-6.x-Solaris/build.xml:684: The following error occurred while executing this line:
/export/home/jenkins/workspace/Lucene-Solr-6.x-Solaris/build.xml:59: The following error occurred while executing this line:
/export/home/jenkins/workspace/Lucene-Solr-6.x-Solaris/solr/build.xml:233: The following error occurred while executing this line:
/export/home/jenkins/workspace/Lucene-Solr-6.x-Solaris/solr/common-build.xml:529: The following error occurred while executing this line:
/export/home/jenkins/workspace/Lucene-Solr-6.x-Solaris/lucene/common-build.xml:1457: The following error occurred while executing this line:
/export/home/jenkins/workspace/Lucene-Solr-6.x-Solaris/lucene/common-build.xml:1014: There were test failures: 585 suites (10 ignored), 2364 tests, 1 error, 1 failure, 86 ignored (70 assumptions) [seed: 5C68465A4A64CE01]

Total time: 77 minutes 58 seconds
Build step 'Invoke Ant' marked build as failure
Archiving artifacts
[WARNINGS] Skipping publisher since build result is FAILURE
Recording test results
Email was triggered for: Failure - Any
Sending email for trigger: Failure - Any



Mime
View raw message