lucene-dev mailing list archives

Site index · List index
Message view « Date » · « Thread »
Top « Date » · « Thread »
From Policeman Jenkins Server <jenk...@thetaphi.de>
Subject [JENKINS-EA] Lucene-Solr-trunk-Linux (64bit/jdk-9-ea+107) - Build # 16084 - Still Failing!
Date Thu, 03 Mar 2016 08:49:51 GMT
Build: http://jenkins.thetaphi.de/job/Lucene-Solr-trunk-Linux/16084/
Java: 64bit/jdk-9-ea+107 -XX:-UseCompressedOops -XX:+UseG1GC

1 tests failed.
FAILED:  org.apache.lucene.codecs.lucene50.TestLucene50NormsFormat.testByteRange

Error Message:
Unable to unmap the mapped buffer: MMapIndexInput(path="/home/jenkins/workspace/Lucene-Solr-trunk-Linux/lucene/build/backward-codecs/test/J1/temp/lucene.codecs.lucene50.TestLucene50NormsFormat_B9A00E586F6576C9-001/index-MMapDirectory-001/_11.si")

Stack Trace:
java.io.IOException: Unable to unmap the mapped buffer: MMapIndexInput(path="/home/jenkins/workspace/Lucene-Solr-trunk-Linux/lucene/build/backward-codecs/test/J1/temp/lucene.codecs.lucene50.TestLucene50NormsFormat_B9A00E586F6576C9-001/index-MMapDirectory-001/_11.si")
	at __randomizedtesting.SeedInfo.seed([B9A00E586F6576C9:70DF376A0FF3365C]:0)
	at org.apache.lucene.store.MMapDirectory.lambda$unmapHackImpl$1(MMapDirectory.java:384)
	at org.apache.lucene.store.ByteBufferIndexInput.freeBuffer(ByteBufferIndexInput.java:376)
	at org.apache.lucene.store.ByteBufferIndexInput.close(ByteBufferIndexInput.java:355)
	at org.apache.lucene.util.LuceneTestCase.slowFileExists(LuceneTestCase.java:2695)
	at org.apache.lucene.store.MockDirectoryWrapper.openInput(MockDirectoryWrapper.java:732)
	at org.apache.lucene.store.FilterDirectory.openInput(FilterDirectory.java:94)
	at org.apache.lucene.index.IndexWriter.slowFileExists(IndexWriter.java:4814)
	at org.apache.lucene.index.IndexWriter.filesExist(IndexWriter.java:4351)
	at org.apache.lucene.index.IndexWriter.startCommit(IndexWriter.java:4422)
	at org.apache.lucene.index.IndexWriter.prepareCommitInternal(IndexWriter.java:2876)
	at org.apache.lucene.index.IndexWriter.commitInternal(IndexWriter.java:2989)
	at org.apache.lucene.index.IndexWriter.commit(IndexWriter.java:2956)
	at org.apache.lucene.index.RandomIndexWriter.commit(RandomIndexWriter.java:288)
	at org.apache.lucene.index.BaseNormsFormatTestCase.doTestNormsVersusDocValues(BaseNormsFormatTestCase.java:262)
	at org.apache.lucene.index.BaseNormsFormatTestCase.testByteRange(BaseNormsFormatTestCase.java:52)
	at sun.reflect.NativeMethodAccessorImpl.invoke0(Native Method)
	at sun.reflect.NativeMethodAccessorImpl.invoke(NativeMethodAccessorImpl.java:62)
	at sun.reflect.DelegatingMethodAccessorImpl.invoke(DelegatingMethodAccessorImpl.java:43)
	at java.lang.reflect.Method.invoke(Method.java:520)
	at com.carrotsearch.randomizedtesting.RandomizedRunner.invoke(RandomizedRunner.java:1764)
	at com.carrotsearch.randomizedtesting.RandomizedRunner$8.evaluate(RandomizedRunner.java:871)
	at com.carrotsearch.randomizedtesting.RandomizedRunner$9.evaluate(RandomizedRunner.java:907)
	at com.carrotsearch.randomizedtesting.RandomizedRunner$10.evaluate(RandomizedRunner.java:921)
	at org.apache.lucene.util.TestRuleSetupTeardownChained$1.evaluate(TestRuleSetupTeardownChained.java:49)
	at org.apache.lucene.util.AbstractBeforeAfterRule$1.evaluate(AbstractBeforeAfterRule.java:45)
	at org.apache.lucene.util.TestRuleThreadAndTestName$1.evaluate(TestRuleThreadAndTestName.java:48)
	at org.apache.lucene.util.TestRuleIgnoreAfterMaxFailures$1.evaluate(TestRuleIgnoreAfterMaxFailures.java:64)
	at org.apache.lucene.util.TestRuleMarkFailure$1.evaluate(TestRuleMarkFailure.java:47)
	at com.carrotsearch.randomizedtesting.rules.StatementAdapter.evaluate(StatementAdapter.java:36)
	at com.carrotsearch.randomizedtesting.ThreadLeakControl$StatementRunner.run(ThreadLeakControl.java:367)
	at com.carrotsearch.randomizedtesting.ThreadLeakControl.forkTimeoutingTask(ThreadLeakControl.java:809)
	at com.carrotsearch.randomizedtesting.ThreadLeakControl$3.evaluate(ThreadLeakControl.java:460)
	at com.carrotsearch.randomizedtesting.RandomizedRunner.runSingleTest(RandomizedRunner.java:880)
	at com.carrotsearch.randomizedtesting.RandomizedRunner$5.evaluate(RandomizedRunner.java:781)
	at com.carrotsearch.randomizedtesting.RandomizedRunner$6.evaluate(RandomizedRunner.java:816)
	at com.carrotsearch.randomizedtesting.RandomizedRunner$7.evaluate(RandomizedRunner.java:827)
	at org.apache.lucene.util.AbstractBeforeAfterRule$1.evaluate(AbstractBeforeAfterRule.java:45)
	at com.carrotsearch.randomizedtesting.rules.StatementAdapter.evaluate(StatementAdapter.java:36)
	at org.apache.lucene.util.TestRuleStoreClassName$1.evaluate(TestRuleStoreClassName.java:41)
	at com.carrotsearch.randomizedtesting.rules.NoShadowingOrOverridesOnMethodsRule$1.evaluate(NoShadowingOrOverridesOnMethodsRule.java:40)
	at com.carrotsearch.randomizedtesting.rules.NoShadowingOrOverridesOnMethodsRule$1.evaluate(NoShadowingOrOverridesOnMethodsRule.java:40)
	at com.carrotsearch.randomizedtesting.rules.StatementAdapter.evaluate(StatementAdapter.java:36)
	at com.carrotsearch.randomizedtesting.rules.StatementAdapter.evaluate(StatementAdapter.java:36)
	at com.carrotsearch.randomizedtesting.rules.StatementAdapter.evaluate(StatementAdapter.java:36)
	at org.apache.lucene.util.TestRuleAssertionsRequired$1.evaluate(TestRuleAssertionsRequired.java:53)
	at org.apache.lucene.util.TestRuleMarkFailure$1.evaluate(TestRuleMarkFailure.java:47)
	at org.apache.lucene.util.TestRuleIgnoreAfterMaxFailures$1.evaluate(TestRuleIgnoreAfterMaxFailures.java:64)
	at org.apache.lucene.util.TestRuleIgnoreTestSuites$1.evaluate(TestRuleIgnoreTestSuites.java:54)
	at com.carrotsearch.randomizedtesting.rules.StatementAdapter.evaluate(StatementAdapter.java:36)
	at com.carrotsearch.randomizedtesting.ThreadLeakControl$StatementRunner.run(ThreadLeakControl.java:367)
	at java.lang.Thread.run(Thread.java:804)
Caused by: java.lang.IncompatibleClassChangeError: Found class jdk.internal.ref.Cleaner, but
interface was expected
	at org.apache.lucene.store.MMapDirectory.lambda$unmapHackImpl$0(MMapDirectory.java:377)
	at java.security.AccessController.doPrivileged(Native Method)
	at org.apache.lucene.store.MMapDirectory.lambda$unmapHackImpl$1(MMapDirectory.java:375)
	... 50 more




Build Log:
[...truncated 4240 lines...]
   [junit4] Suite: org.apache.lucene.codecs.lucene50.TestLucene50NormsFormat
   [junit4]   2> NOTE: reproduce with: ant test  -Dtestcase=TestLucene50NormsFormat -Dtests.method=testByteRange
-Dtests.seed=B9A00E586F6576C9 -Dtests.multiplier=3 -Dtests.slow=true -Dtests.locale=fo-FO
-Dtests.timezone=Africa/Lubumbashi -Dtests.asserts=true -Dtests.file.encoding=US-ASCII
   [junit4] ERROR   2.29s J1 | TestLucene50NormsFormat.testByteRange <<<
   [junit4]    > Throwable #1: java.io.IOException: Unable to unmap the mapped buffer:
MMapIndexInput(path="/home/jenkins/workspace/Lucene-Solr-trunk-Linux/lucene/build/backward-codecs/test/J1/temp/lucene.codecs.lucene50.TestLucene50NormsFormat_B9A00E586F6576C9-001/index-MMapDirectory-001/_11.si")
   [junit4]    > 	at __randomizedtesting.SeedInfo.seed([B9A00E586F6576C9:70DF376A0FF3365C]:0)
   [junit4]    > 	at org.apache.lucene.store.MMapDirectory.lambda$unmapHackImpl$1(MMapDirectory.java:384)
   [junit4]    > 	at org.apache.lucene.store.ByteBufferIndexInput.freeBuffer(ByteBufferIndexInput.java:376)
   [junit4]    > 	at org.apache.lucene.store.ByteBufferIndexInput.close(ByteBufferIndexInput.java:355)
   [junit4]    > 	at org.apache.lucene.util.LuceneTestCase.slowFileExists(LuceneTestCase.java:2695)
   [junit4]    > 	at org.apache.lucene.store.MockDirectoryWrapper.openInput(MockDirectoryWrapper.java:732)
   [junit4]    > 	at org.apache.lucene.store.FilterDirectory.openInput(FilterDirectory.java:94)
   [junit4]    > 	at org.apache.lucene.index.IndexWriter.slowFileExists(IndexWriter.java:4814)
   [junit4]    > 	at org.apache.lucene.index.IndexWriter.filesExist(IndexWriter.java:4351)
   [junit4]    > 	at org.apache.lucene.index.IndexWriter.startCommit(IndexWriter.java:4422)
   [junit4]    > 	at org.apache.lucene.index.IndexWriter.prepareCommitInternal(IndexWriter.java:2876)
   [junit4]    > 	at org.apache.lucene.index.IndexWriter.commitInternal(IndexWriter.java:2989)
   [junit4]    > 	at org.apache.lucene.index.IndexWriter.commit(IndexWriter.java:2956)
   [junit4]    > 	at org.apache.lucene.index.RandomIndexWriter.commit(RandomIndexWriter.java:288)
   [junit4]    > 	at org.apache.lucene.index.BaseNormsFormatTestCase.doTestNormsVersusDocValues(BaseNormsFormatTestCase.java:262)
   [junit4]    > 	at org.apache.lucene.index.BaseNormsFormatTestCase.testByteRange(BaseNormsFormatTestCase.java:52)
   [junit4]    > 	at java.lang.Thread.run(Thread.java:804)
   [junit4]    > Caused by: java.lang.IncompatibleClassChangeError: Found class jdk.internal.ref.Cleaner,
but interface was expected
   [junit4]    > 	at org.apache.lucene.store.MMapDirectory.lambda$unmapHackImpl$0(MMapDirectory.java:377)
   [junit4]    > 	at java.security.AccessController.doPrivileged(Native Method)
   [junit4]    > 	at org.apache.lucene.store.MMapDirectory.lambda$unmapHackImpl$1(MMapDirectory.java:375)
   [junit4]    > 	... 50 more
   [junit4] IGNOR/A 0.01s J1 | TestLucene50NormsFormat.testNCommonBig
   [junit4]    > Assumption #1: 'nightly' test group is disabled (@Nightly())
   [junit4] IGNOR/A 0.00s J1 | TestLucene50NormsFormat.testMergeStability
   [junit4]    > Assumption #1: The MockRandom PF randomizes content on the fly, so we
can't check it
   [junit4]   2> NOTE: leaving temporary files on disk at: /home/jenkins/workspace/Lucene-Solr-trunk-Linux/lucene/build/backward-codecs/test/J1/temp/lucene.codecs.lucene50.TestLucene50NormsFormat_B9A00E586F6576C9-001
   [junit4]   2> NOTE: test params are: codec=Asserting(Lucene60), sim=ClassicSimilarity,
locale=fo-FO, timezone=Africa/Lubumbashi
   [junit4]   2> NOTE: Linux 3.19.0-51-generic amd64/Oracle Corporation 9-ea (64-bit)/cpus=12,threads=1,free=415290152,total=526385152
   [junit4]   2> NOTE: All tests run in this JVM: [TestLucene50NormsFormat]
   [junit4] Completed [2/3 (1!)] on J1 in 16.68s, 19 tests, 1 error, 2 skipped <<<
FAILURES!

[...truncated 20 lines...]
BUILD FAILED
/home/jenkins/workspace/Lucene-Solr-trunk-Linux/build.xml:740: The following error occurred
while executing this line:
/home/jenkins/workspace/Lucene-Solr-trunk-Linux/build.xml:684: The following error occurred
while executing this line:
/home/jenkins/workspace/Lucene-Solr-trunk-Linux/build.xml:59: The following error occurred
while executing this line:
/home/jenkins/workspace/Lucene-Solr-trunk-Linux/lucene/build.xml:476: The following error
occurred while executing this line:
/home/jenkins/workspace/Lucene-Solr-trunk-Linux/lucene/common-build.xml:2187: The following
error occurred while executing this line:
/home/jenkins/workspace/Lucene-Solr-trunk-Linux/lucene/module-build.xml:58: The following
error occurred while executing this line:
/home/jenkins/workspace/Lucene-Solr-trunk-Linux/lucene/common-build.xml:1457: The following
error occurred while executing this line:
/home/jenkins/workspace/Lucene-Solr-trunk-Linux/lucene/common-build.xml:1014: There were test
failures: 3 suites, 151 tests, 1 error, 11 ignored (11 assumptions) [seed: B9A00E586F6576C9]

Total time: 12 minutes 47 seconds
Build step 'Invoke Ant' marked build as failure
Archiving artifacts
[WARNINGS] Skipping publisher since build result is FAILURE
Recording test results
Email was triggered for: Failure - Any
Sending email for trigger: Failure - Any



Mime
View raw message