lucene-dev mailing list archives

Site index · List index
Message view « Date » · « Thread »
Top « Date » · « Thread »
From Policeman Jenkins Server <jenk...@thetaphi.de>
Subject [JENKINS] Lucene-Solr-6.x-Linux (32bit/jdk1.8.0_72) - Build # 280 - Still Failing!
Date Mon, 28 Mar 2016 20:13:48 GMT
Build: http://jenkins.thetaphi.de/job/Lucene-Solr-6.x-Linux/280/
Java: 32bit/jdk1.8.0_72 -server -XX:+UseConcMarkSweepGC

4 tests failed.
FAILED:  org.apache.lucene.search.TestLatLonPointQueries.testAllLatEqual

Error Message:
invalid latitude NaN; must be between -90.0 and 90.0

Stack Trace:
java.lang.IllegalArgumentException: invalid latitude NaN; must be between -90.0 and 90.0
	at __randomizedtesting.SeedInfo.seed([5289A66A157C81BF:EF1CF0E41CB1A3B2]:0)
	at org.apache.lucene.spatial.util.GeoUtils.checkLatitude(GeoUtils.java:66)
	at org.apache.lucene.document.LatLonPoint.encodeLatitude(LatLonPoint.java:140)
	at org.apache.lucene.search.TestLatLonPointQueries.quantizeLat(TestLatLonPointQueries.java:47)
	at org.apache.lucene.spatial.util.BaseGeoPointTestCase.verify(BaseGeoPointTestCase.java:730)
	at org.apache.lucene.spatial.util.BaseGeoPointTestCase.testAllLatEqual(BaseGeoPointTestCase.java:419)
	at sun.reflect.NativeMethodAccessorImpl.invoke0(Native Method)
	at sun.reflect.NativeMethodAccessorImpl.invoke(NativeMethodAccessorImpl.java:62)
	at sun.reflect.DelegatingMethodAccessorImpl.invoke(DelegatingMethodAccessorImpl.java:43)
	at java.lang.reflect.Method.invoke(Method.java:498)
	at com.carrotsearch.randomizedtesting.RandomizedRunner.invoke(RandomizedRunner.java:1764)
	at com.carrotsearch.randomizedtesting.RandomizedRunner$8.evaluate(RandomizedRunner.java:871)
	at com.carrotsearch.randomizedtesting.RandomizedRunner$9.evaluate(RandomizedRunner.java:907)
	at com.carrotsearch.randomizedtesting.RandomizedRunner$10.evaluate(RandomizedRunner.java:921)
	at org.apache.lucene.util.TestRuleSetupTeardownChained$1.evaluate(TestRuleSetupTeardownChained.java:49)
	at org.apache.lucene.util.AbstractBeforeAfterRule$1.evaluate(AbstractBeforeAfterRule.java:45)
	at org.apache.lucene.util.TestRuleThreadAndTestName$1.evaluate(TestRuleThreadAndTestName.java:48)
	at org.apache.lucene.util.TestRuleIgnoreAfterMaxFailures$1.evaluate(TestRuleIgnoreAfterMaxFailures.java:64)
	at org.apache.lucene.util.TestRuleMarkFailure$1.evaluate(TestRuleMarkFailure.java:47)
	at com.carrotsearch.randomizedtesting.rules.StatementAdapter.evaluate(StatementAdapter.java:36)
	at com.carrotsearch.randomizedtesting.ThreadLeakControl$StatementRunner.run(ThreadLeakControl.java:367)
	at com.carrotsearch.randomizedtesting.ThreadLeakControl.forkTimeoutingTask(ThreadLeakControl.java:809)
	at com.carrotsearch.randomizedtesting.ThreadLeakControl$3.evaluate(ThreadLeakControl.java:460)
	at com.carrotsearch.randomizedtesting.RandomizedRunner.runSingleTest(RandomizedRunner.java:880)
	at com.carrotsearch.randomizedtesting.RandomizedRunner$5.evaluate(RandomizedRunner.java:781)
	at com.carrotsearch.randomizedtesting.RandomizedRunner$6.evaluate(RandomizedRunner.java:816)
	at com.carrotsearch.randomizedtesting.RandomizedRunner$7.evaluate(RandomizedRunner.java:827)
	at org.apache.lucene.util.AbstractBeforeAfterRule$1.evaluate(AbstractBeforeAfterRule.java:45)
	at com.carrotsearch.randomizedtesting.rules.StatementAdapter.evaluate(StatementAdapter.java:36)
	at org.apache.lucene.util.TestRuleStoreClassName$1.evaluate(TestRuleStoreClassName.java:41)
	at com.carrotsearch.randomizedtesting.rules.NoShadowingOrOverridesOnMethodsRule$1.evaluate(NoShadowingOrOverridesOnMethodsRule.java:40)
	at com.carrotsearch.randomizedtesting.rules.NoShadowingOrOverridesOnMethodsRule$1.evaluate(NoShadowingOrOverridesOnMethodsRule.java:40)
	at com.carrotsearch.randomizedtesting.rules.StatementAdapter.evaluate(StatementAdapter.java:36)
	at com.carrotsearch.randomizedtesting.rules.StatementAdapter.evaluate(StatementAdapter.java:36)
	at com.carrotsearch.randomizedtesting.rules.StatementAdapter.evaluate(StatementAdapter.java:36)
	at org.apache.lucene.util.TestRuleAssertionsRequired$1.evaluate(TestRuleAssertionsRequired.java:53)
	at org.apache.lucene.util.TestRuleMarkFailure$1.evaluate(TestRuleMarkFailure.java:47)
	at org.apache.lucene.util.TestRuleIgnoreAfterMaxFailures$1.evaluate(TestRuleIgnoreAfterMaxFailures.java:64)
	at org.apache.lucene.util.TestRuleIgnoreTestSuites$1.evaluate(TestRuleIgnoreTestSuites.java:54)
	at com.carrotsearch.randomizedtesting.rules.StatementAdapter.evaluate(StatementAdapter.java:36)
	at com.carrotsearch.randomizedtesting.ThreadLeakControl$StatementRunner.run(ThreadLeakControl.java:367)
	at java.lang.Thread.run(Thread.java:745)


FAILED:  org.apache.lucene.search.TestLatLonPointQueries.testRandomMedium

Error Message:
invalid latitude NaN; must be between -90.0 and 90.0

Stack Trace:
java.lang.IllegalArgumentException: invalid latitude NaN; must be between -90.0 and 90.0
	at __randomizedtesting.SeedInfo.seed([5289A66A157C81BF:EF5791C25419E2D9]:0)
	at org.apache.lucene.spatial.util.GeoUtils.checkLatitude(GeoUtils.java:66)
	at org.apache.lucene.document.LatLonPoint.encodeLatitude(LatLonPoint.java:140)
	at org.apache.lucene.search.TestLatLonPointQueries.quantizeLat(TestLatLonPointQueries.java:47)
	at org.apache.lucene.spatial.util.BaseGeoPointTestCase.verify(BaseGeoPointTestCase.java:730)
	at org.apache.lucene.spatial.util.BaseGeoPointTestCase.doTestRandom(BaseGeoPointTestCase.java:665)
	at org.apache.lucene.spatial.util.BaseGeoPointTestCase.testRandomMedium(BaseGeoPointTestCase.java:587)
	at sun.reflect.NativeMethodAccessorImpl.invoke0(Native Method)
	at sun.reflect.NativeMethodAccessorImpl.invoke(NativeMethodAccessorImpl.java:62)
	at sun.reflect.DelegatingMethodAccessorImpl.invoke(DelegatingMethodAccessorImpl.java:43)
	at java.lang.reflect.Method.invoke(Method.java:498)
	at com.carrotsearch.randomizedtesting.RandomizedRunner.invoke(RandomizedRunner.java:1764)
	at com.carrotsearch.randomizedtesting.RandomizedRunner$8.evaluate(RandomizedRunner.java:871)
	at com.carrotsearch.randomizedtesting.RandomizedRunner$9.evaluate(RandomizedRunner.java:907)
	at com.carrotsearch.randomizedtesting.RandomizedRunner$10.evaluate(RandomizedRunner.java:921)
	at org.apache.lucene.util.TestRuleSetupTeardownChained$1.evaluate(TestRuleSetupTeardownChained.java:49)
	at org.apache.lucene.util.AbstractBeforeAfterRule$1.evaluate(AbstractBeforeAfterRule.java:45)
	at org.apache.lucene.util.TestRuleThreadAndTestName$1.evaluate(TestRuleThreadAndTestName.java:48)
	at org.apache.lucene.util.TestRuleIgnoreAfterMaxFailures$1.evaluate(TestRuleIgnoreAfterMaxFailures.java:64)
	at org.apache.lucene.util.TestRuleMarkFailure$1.evaluate(TestRuleMarkFailure.java:47)
	at com.carrotsearch.randomizedtesting.rules.StatementAdapter.evaluate(StatementAdapter.java:36)
	at com.carrotsearch.randomizedtesting.ThreadLeakControl$StatementRunner.run(ThreadLeakControl.java:367)
	at com.carrotsearch.randomizedtesting.ThreadLeakControl.forkTimeoutingTask(ThreadLeakControl.java:809)
	at com.carrotsearch.randomizedtesting.ThreadLeakControl$3.evaluate(ThreadLeakControl.java:460)
	at com.carrotsearch.randomizedtesting.RandomizedRunner.runSingleTest(RandomizedRunner.java:880)
	at com.carrotsearch.randomizedtesting.RandomizedRunner$5.evaluate(RandomizedRunner.java:781)
	at com.carrotsearch.randomizedtesting.RandomizedRunner$6.evaluate(RandomizedRunner.java:816)
	at com.carrotsearch.randomizedtesting.RandomizedRunner$7.evaluate(RandomizedRunner.java:827)
	at org.apache.lucene.util.AbstractBeforeAfterRule$1.evaluate(AbstractBeforeAfterRule.java:45)
	at com.carrotsearch.randomizedtesting.rules.StatementAdapter.evaluate(StatementAdapter.java:36)
	at org.apache.lucene.util.TestRuleStoreClassName$1.evaluate(TestRuleStoreClassName.java:41)
	at com.carrotsearch.randomizedtesting.rules.NoShadowingOrOverridesOnMethodsRule$1.evaluate(NoShadowingOrOverridesOnMethodsRule.java:40)
	at com.carrotsearch.randomizedtesting.rules.NoShadowingOrOverridesOnMethodsRule$1.evaluate(NoShadowingOrOverridesOnMethodsRule.java:40)
	at com.carrotsearch.randomizedtesting.rules.StatementAdapter.evaluate(StatementAdapter.java:36)
	at com.carrotsearch.randomizedtesting.rules.StatementAdapter.evaluate(StatementAdapter.java:36)
	at com.carrotsearch.randomizedtesting.rules.StatementAdapter.evaluate(StatementAdapter.java:36)
	at org.apache.lucene.util.TestRuleAssertionsRequired$1.evaluate(TestRuleAssertionsRequired.java:53)
	at org.apache.lucene.util.TestRuleMarkFailure$1.evaluate(TestRuleMarkFailure.java:47)
	at org.apache.lucene.util.TestRuleIgnoreAfterMaxFailures$1.evaluate(TestRuleIgnoreAfterMaxFailures.java:64)
	at org.apache.lucene.util.TestRuleIgnoreTestSuites$1.evaluate(TestRuleIgnoreTestSuites.java:54)
	at com.carrotsearch.randomizedtesting.rules.StatementAdapter.evaluate(StatementAdapter.java:36)
	at com.carrotsearch.randomizedtesting.ThreadLeakControl$StatementRunner.run(ThreadLeakControl.java:367)
	at java.lang.Thread.run(Thread.java:745)


FAILED:  org.apache.lucene.search.TestLatLonPointQueries.testRandomTiny

Error Message:
invalid latitude NaN; must be between -90.0 and 90.0

Stack Trace:
java.lang.IllegalArgumentException: invalid latitude NaN; must be between -90.0 and 90.0
	at __randomizedtesting.SeedInfo.seed([5289A66A157C81BF:1BCE782C4B5DB913]:0)
	at org.apache.lucene.spatial.util.GeoUtils.checkLatitude(GeoUtils.java:66)
	at org.apache.lucene.document.LatLonPoint.encodeLatitude(LatLonPoint.java:140)
	at org.apache.lucene.search.TestLatLonPointQueries.quantizeLat(TestLatLonPointQueries.java:47)
	at org.apache.lucene.spatial.util.BaseGeoPointTestCase.verify(BaseGeoPointTestCase.java:730)
	at org.apache.lucene.spatial.util.BaseGeoPointTestCase.doTestRandom(BaseGeoPointTestCase.java:665)
	at org.apache.lucene.spatial.util.BaseGeoPointTestCase.testRandomTiny(BaseGeoPointTestCase.java:583)
	at sun.reflect.NativeMethodAccessorImpl.invoke0(Native Method)
	at sun.reflect.NativeMethodAccessorImpl.invoke(NativeMethodAccessorImpl.java:62)
	at sun.reflect.DelegatingMethodAccessorImpl.invoke(DelegatingMethodAccessorImpl.java:43)
	at java.lang.reflect.Method.invoke(Method.java:498)
	at com.carrotsearch.randomizedtesting.RandomizedRunner.invoke(RandomizedRunner.java:1764)
	at com.carrotsearch.randomizedtesting.RandomizedRunner$8.evaluate(RandomizedRunner.java:871)
	at com.carrotsearch.randomizedtesting.RandomizedRunner$9.evaluate(RandomizedRunner.java:907)
	at com.carrotsearch.randomizedtesting.RandomizedRunner$10.evaluate(RandomizedRunner.java:921)
	at org.apache.lucene.util.TestRuleSetupTeardownChained$1.evaluate(TestRuleSetupTeardownChained.java:49)
	at org.apache.lucene.util.AbstractBeforeAfterRule$1.evaluate(AbstractBeforeAfterRule.java:45)
	at org.apache.lucene.util.TestRuleThreadAndTestName$1.evaluate(TestRuleThreadAndTestName.java:48)
	at org.apache.lucene.util.TestRuleIgnoreAfterMaxFailures$1.evaluate(TestRuleIgnoreAfterMaxFailures.java:64)
	at org.apache.lucene.util.TestRuleMarkFailure$1.evaluate(TestRuleMarkFailure.java:47)
	at com.carrotsearch.randomizedtesting.rules.StatementAdapter.evaluate(StatementAdapter.java:36)
	at com.carrotsearch.randomizedtesting.ThreadLeakControl$StatementRunner.run(ThreadLeakControl.java:367)
	at com.carrotsearch.randomizedtesting.ThreadLeakControl.forkTimeoutingTask(ThreadLeakControl.java:809)
	at com.carrotsearch.randomizedtesting.ThreadLeakControl$3.evaluate(ThreadLeakControl.java:460)
	at com.carrotsearch.randomizedtesting.RandomizedRunner.runSingleTest(RandomizedRunner.java:880)
	at com.carrotsearch.randomizedtesting.RandomizedRunner$5.evaluate(RandomizedRunner.java:781)
	at com.carrotsearch.randomizedtesting.RandomizedRunner$6.evaluate(RandomizedRunner.java:816)
	at com.carrotsearch.randomizedtesting.RandomizedRunner$7.evaluate(RandomizedRunner.java:827)
	at org.apache.lucene.util.AbstractBeforeAfterRule$1.evaluate(AbstractBeforeAfterRule.java:45)
	at com.carrotsearch.randomizedtesting.rules.StatementAdapter.evaluate(StatementAdapter.java:36)
	at org.apache.lucene.util.TestRuleStoreClassName$1.evaluate(TestRuleStoreClassName.java:41)
	at com.carrotsearch.randomizedtesting.rules.NoShadowingOrOverridesOnMethodsRule$1.evaluate(NoShadowingOrOverridesOnMethodsRule.java:40)
	at com.carrotsearch.randomizedtesting.rules.NoShadowingOrOverridesOnMethodsRule$1.evaluate(NoShadowingOrOverridesOnMethodsRule.java:40)
	at com.carrotsearch.randomizedtesting.rules.StatementAdapter.evaluate(StatementAdapter.java:36)
	at com.carrotsearch.randomizedtesting.rules.StatementAdapter.evaluate(StatementAdapter.java:36)
	at com.carrotsearch.randomizedtesting.rules.StatementAdapter.evaluate(StatementAdapter.java:36)
	at org.apache.lucene.util.TestRuleAssertionsRequired$1.evaluate(TestRuleAssertionsRequired.java:53)
	at org.apache.lucene.util.TestRuleMarkFailure$1.evaluate(TestRuleMarkFailure.java:47)
	at org.apache.lucene.util.TestRuleIgnoreAfterMaxFailures$1.evaluate(TestRuleIgnoreAfterMaxFailures.java:64)
	at org.apache.lucene.util.TestRuleIgnoreTestSuites$1.evaluate(TestRuleIgnoreTestSuites.java:54)
	at com.carrotsearch.randomizedtesting.rules.StatementAdapter.evaluate(StatementAdapter.java:36)
	at com.carrotsearch.randomizedtesting.ThreadLeakControl$StatementRunner.run(ThreadLeakControl.java:367)
	at java.lang.Thread.run(Thread.java:745)


FAILED:  org.apache.lucene.search.TestLatLonPointQueries.testAllLonEqual

Error Message:
invalid latitude NaN; must be between -90.0 and 90.0

Stack Trace:
java.lang.IllegalArgumentException: invalid latitude NaN; must be between -90.0 and 90.0
	at __randomizedtesting.SeedInfo.seed([5289A66A157C81BF:C3835797E5D6C1AB]:0)
	at org.apache.lucene.spatial.util.GeoUtils.checkLatitude(GeoUtils.java:66)
	at org.apache.lucene.document.LatLonPoint.encodeLatitude(LatLonPoint.java:140)
	at org.apache.lucene.search.TestLatLonPointQueries.quantizeLat(TestLatLonPointQueries.java:47)
	at org.apache.lucene.spatial.util.BaseGeoPointTestCase.verify(BaseGeoPointTestCase.java:730)
	at org.apache.lucene.spatial.util.BaseGeoPointTestCase.testAllLonEqual(BaseGeoPointTestCase.java:468)
	at sun.reflect.NativeMethodAccessorImpl.invoke0(Native Method)
	at sun.reflect.NativeMethodAccessorImpl.invoke(NativeMethodAccessorImpl.java:62)
	at sun.reflect.DelegatingMethodAccessorImpl.invoke(DelegatingMethodAccessorImpl.java:43)
	at java.lang.reflect.Method.invoke(Method.java:498)
	at com.carrotsearch.randomizedtesting.RandomizedRunner.invoke(RandomizedRunner.java:1764)
	at com.carrotsearch.randomizedtesting.RandomizedRunner$8.evaluate(RandomizedRunner.java:871)
	at com.carrotsearch.randomizedtesting.RandomizedRunner$9.evaluate(RandomizedRunner.java:907)
	at com.carrotsearch.randomizedtesting.RandomizedRunner$10.evaluate(RandomizedRunner.java:921)
	at org.apache.lucene.util.TestRuleSetupTeardownChained$1.evaluate(TestRuleSetupTeardownChained.java:49)
	at org.apache.lucene.util.AbstractBeforeAfterRule$1.evaluate(AbstractBeforeAfterRule.java:45)
	at org.apache.lucene.util.TestRuleThreadAndTestName$1.evaluate(TestRuleThreadAndTestName.java:48)
	at org.apache.lucene.util.TestRuleIgnoreAfterMaxFailures$1.evaluate(TestRuleIgnoreAfterMaxFailures.java:64)
	at org.apache.lucene.util.TestRuleMarkFailure$1.evaluate(TestRuleMarkFailure.java:47)
	at com.carrotsearch.randomizedtesting.rules.StatementAdapter.evaluate(StatementAdapter.java:36)
	at com.carrotsearch.randomizedtesting.ThreadLeakControl$StatementRunner.run(ThreadLeakControl.java:367)
	at com.carrotsearch.randomizedtesting.ThreadLeakControl.forkTimeoutingTask(ThreadLeakControl.java:809)
	at com.carrotsearch.randomizedtesting.ThreadLeakControl$3.evaluate(ThreadLeakControl.java:460)
	at com.carrotsearch.randomizedtesting.RandomizedRunner.runSingleTest(RandomizedRunner.java:880)
	at com.carrotsearch.randomizedtesting.RandomizedRunner$5.evaluate(RandomizedRunner.java:781)
	at com.carrotsearch.randomizedtesting.RandomizedRunner$6.evaluate(RandomizedRunner.java:816)
	at com.carrotsearch.randomizedtesting.RandomizedRunner$7.evaluate(RandomizedRunner.java:827)
	at org.apache.lucene.util.AbstractBeforeAfterRule$1.evaluate(AbstractBeforeAfterRule.java:45)
	at com.carrotsearch.randomizedtesting.rules.StatementAdapter.evaluate(StatementAdapter.java:36)
	at org.apache.lucene.util.TestRuleStoreClassName$1.evaluate(TestRuleStoreClassName.java:41)
	at com.carrotsearch.randomizedtesting.rules.NoShadowingOrOverridesOnMethodsRule$1.evaluate(NoShadowingOrOverridesOnMethodsRule.java:40)
	at com.carrotsearch.randomizedtesting.rules.NoShadowingOrOverridesOnMethodsRule$1.evaluate(NoShadowingOrOverridesOnMethodsRule.java:40)
	at com.carrotsearch.randomizedtesting.rules.StatementAdapter.evaluate(StatementAdapter.java:36)
	at com.carrotsearch.randomizedtesting.rules.StatementAdapter.evaluate(StatementAdapter.java:36)
	at com.carrotsearch.randomizedtesting.rules.StatementAdapter.evaluate(StatementAdapter.java:36)
	at org.apache.lucene.util.TestRuleAssertionsRequired$1.evaluate(TestRuleAssertionsRequired.java:53)
	at org.apache.lucene.util.TestRuleMarkFailure$1.evaluate(TestRuleMarkFailure.java:47)
	at org.apache.lucene.util.TestRuleIgnoreAfterMaxFailures$1.evaluate(TestRuleIgnoreAfterMaxFailures.java:64)
	at org.apache.lucene.util.TestRuleIgnoreTestSuites$1.evaluate(TestRuleIgnoreTestSuites.java:54)
	at com.carrotsearch.randomizedtesting.rules.StatementAdapter.evaluate(StatementAdapter.java:36)
	at com.carrotsearch.randomizedtesting.ThreadLeakControl$StatementRunner.run(ThreadLeakControl.java:367)
	at java.lang.Thread.run(Thread.java:745)




Build Log:
[...truncated 8441 lines...]
   [junit4] Suite: org.apache.lucene.search.TestLatLonPointQueries
   [junit4] IGNOR/A 0.01s J2 | TestLatLonPointQueries.testRandomBig
   [junit4]    > Assumption #1: 'nightly' test group is disabled (@Nightly())
   [junit4]   2> NOTE: reproduce with: ant test  -Dtestcase=TestLatLonPointQueries -Dtests.method=testAllLatEqual
-Dtests.seed=5289A66A157C81BF -Dtests.multiplier=3 -Dtests.slow=true -Dtests.locale=es-CR
-Dtests.timezone=Europe/Andorra -Dtests.asserts=true -Dtests.file.encoding=US-ASCII
   [junit4] ERROR   0.03s J2 | TestLatLonPointQueries.testAllLatEqual <<<
   [junit4]    > Throwable #1: java.lang.IllegalArgumentException: invalid latitude NaN;
must be between -90.0 and 90.0
   [junit4]    > 	at __randomizedtesting.SeedInfo.seed([5289A66A157C81BF:EF1CF0E41CB1A3B2]:0)
   [junit4]    > 	at org.apache.lucene.spatial.util.GeoUtils.checkLatitude(GeoUtils.java:66)
   [junit4]    > 	at org.apache.lucene.document.LatLonPoint.encodeLatitude(LatLonPoint.java:140)
   [junit4]    > 	at org.apache.lucene.search.TestLatLonPointQueries.quantizeLat(TestLatLonPointQueries.java:47)
   [junit4]    > 	at org.apache.lucene.spatial.util.BaseGeoPointTestCase.verify(BaseGeoPointTestCase.java:730)
   [junit4]    > 	at org.apache.lucene.spatial.util.BaseGeoPointTestCase.testAllLatEqual(BaseGeoPointTestCase.java:419)
   [junit4]    > 	at java.lang.Thread.run(Thread.java:745)
   [junit4]   2> NOTE: reproduce with: ant test  -Dtestcase=TestLatLonPointQueries -Dtests.method=testRandomMedium
-Dtests.seed=5289A66A157C81BF -Dtests.multiplier=3 -Dtests.slow=true -Dtests.locale=es-CR
-Dtests.timezone=Europe/Andorra -Dtests.asserts=true -Dtests.file.encoding=US-ASCII
   [junit4] ERROR   0.04s J2 | TestLatLonPointQueries.testRandomMedium <<<
   [junit4]    > Throwable #1: java.lang.IllegalArgumentException: invalid latitude NaN;
must be between -90.0 and 90.0
   [junit4]    > 	at __randomizedtesting.SeedInfo.seed([5289A66A157C81BF:EF5791C25419E2D9]:0)
   [junit4]    > 	at org.apache.lucene.spatial.util.GeoUtils.checkLatitude(GeoUtils.java:66)
   [junit4]    > 	at org.apache.lucene.document.LatLonPoint.encodeLatitude(LatLonPoint.java:140)
   [junit4]    > 	at org.apache.lucene.search.TestLatLonPointQueries.quantizeLat(TestLatLonPointQueries.java:47)
   [junit4]    > 	at org.apache.lucene.spatial.util.BaseGeoPointTestCase.verify(BaseGeoPointTestCase.java:730)
   [junit4]    > 	at org.apache.lucene.spatial.util.BaseGeoPointTestCase.doTestRandom(BaseGeoPointTestCase.java:665)
   [junit4]    > 	at org.apache.lucene.spatial.util.BaseGeoPointTestCase.testRandomMedium(BaseGeoPointTestCase.java:587)
   [junit4]    > 	at java.lang.Thread.run(Thread.java:745)
   [junit4]   2> NOTE: reproduce with: ant test  -Dtestcase=TestLatLonPointQueries -Dtests.method=testRandomTiny
-Dtests.seed=5289A66A157C81BF -Dtests.multiplier=3 -Dtests.slow=true -Dtests.locale=es-CR
-Dtests.timezone=Europe/Andorra -Dtests.asserts=true -Dtests.file.encoding=US-ASCII
   [junit4] ERROR   0.00s J2 | TestLatLonPointQueries.testRandomTiny <<<
   [junit4]    > Throwable #1: java.lang.IllegalArgumentException: invalid latitude NaN;
must be between -90.0 and 90.0
   [junit4]    > 	at __randomizedtesting.SeedInfo.seed([5289A66A157C81BF:1BCE782C4B5DB913]:0)
   [junit4]    > 	at org.apache.lucene.spatial.util.GeoUtils.checkLatitude(GeoUtils.java:66)
   [junit4]    > 	at org.apache.lucene.document.LatLonPoint.encodeLatitude(LatLonPoint.java:140)
   [junit4]    > 	at org.apache.lucene.search.TestLatLonPointQueries.quantizeLat(TestLatLonPointQueries.java:47)
   [junit4]    > 	at org.apache.lucene.spatial.util.BaseGeoPointTestCase.verify(BaseGeoPointTestCase.java:730)
   [junit4]    > 	at org.apache.lucene.spatial.util.BaseGeoPointTestCase.doTestRandom(BaseGeoPointTestCase.java:665)
   [junit4]    > 	at org.apache.lucene.spatial.util.BaseGeoPointTestCase.testRandomTiny(BaseGeoPointTestCase.java:583)
   [junit4]    > 	at java.lang.Thread.run(Thread.java:745)
   [junit4]   2> NOTE: reproduce with: ant test  -Dtestcase=TestLatLonPointQueries -Dtests.method=testAllLonEqual
-Dtests.seed=5289A66A157C81BF -Dtests.multiplier=3 -Dtests.slow=true -Dtests.locale=es-CR
-Dtests.timezone=Europe/Andorra -Dtests.asserts=true -Dtests.file.encoding=US-ASCII
   [junit4] ERROR   0.03s J2 | TestLatLonPointQueries.testAllLonEqual <<<
   [junit4]    > Throwable #1: java.lang.IllegalArgumentException: invalid latitude NaN;
must be between -90.0 and 90.0
   [junit4]    > 	at __randomizedtesting.SeedInfo.seed([5289A66A157C81BF:C3835797E5D6C1AB]:0)
   [junit4]    > 	at org.apache.lucene.spatial.util.GeoUtils.checkLatitude(GeoUtils.java:66)
   [junit4]    > 	at org.apache.lucene.document.LatLonPoint.encodeLatitude(LatLonPoint.java:140)
   [junit4]    > 	at org.apache.lucene.search.TestLatLonPointQueries.quantizeLat(TestLatLonPointQueries.java:47)
   [junit4]    > 	at org.apache.lucene.spatial.util.BaseGeoPointTestCase.verify(BaseGeoPointTestCase.java:730)
   [junit4]    > 	at org.apache.lucene.spatial.util.BaseGeoPointTestCase.testAllLonEqual(BaseGeoPointTestCase.java:468)
   [junit4]    > 	at java.lang.Thread.run(Thread.java:745)
   [junit4] IGNOR/A 0.00s J2 | TestLatLonPointQueries.testRandomDistanceHuge
   [junit4]    > Assumption #1: 'nightly' test group is disabled (@Nightly())
   [junit4]   2> NOTE: leaving temporary files on disk at: /home/jenkins/workspace/Lucene-Solr-6.x-Linux/lucene/build/sandbox/test/J2/temp/lucene.search.TestLatLonPointQueries_5289A66A157C81BF-001
   [junit4]   2> NOTE: test params are: codec=Asserting(Lucene60): {string=PostingsFormat(name=MockRandom),
id=PostingsFormat(name=MockRandom)}, docValues:{field=DocValuesFormat(name=Memory), id=DocValuesFormat(name=Direct),
point=DocValuesFormat(name=Asserting)}, maxPointsInLeafNode=805, maxMBSortInHeap=5.394334415865066,
sim=RandomSimilarity(queryNorm=false,coord=yes): {}, locale=es-CR, timezone=Europe/Andorra
   [junit4]   2> NOTE: Linux 4.2.0-34-generic i386/Oracle Corporation 1.8.0_72 (32-bit)/cpus=12,threads=1,free=34664216,total=64880640
   [junit4]   2> NOTE: All tests run in this JVM: [TestSlowFuzzyQuery, TestInetAddressPoint,
TestPayloadSpanUtil, TestFieldCacheTermsFilter, TestDocValuesNumbersQuery, TestLatLonPointQueries]
   [junit4] Completed [14/15 (1!)] on J2 in 17.88s, 42 tests, 4 errors, 2 skipped <<<
FAILURES!

[...truncated 17 lines...]
BUILD FAILED
/home/jenkins/workspace/Lucene-Solr-6.x-Linux/build.xml:740: The following error occurred
while executing this line:
/home/jenkins/workspace/Lucene-Solr-6.x-Linux/build.xml:684: The following error occurred
while executing this line:
/home/jenkins/workspace/Lucene-Solr-6.x-Linux/build.xml:59: The following error occurred while
executing this line:
/home/jenkins/workspace/Lucene-Solr-6.x-Linux/lucene/build.xml:476: The following error occurred
while executing this line:
/home/jenkins/workspace/Lucene-Solr-6.x-Linux/lucene/common-build.xml:2187: The following
error occurred while executing this line:
/home/jenkins/workspace/Lucene-Solr-6.x-Linux/lucene/module-build.xml:58: The following error
occurred while executing this line:
/home/jenkins/workspace/Lucene-Solr-6.x-Linux/lucene/common-build.xml:1457: The following
error occurred while executing this line:
/home/jenkins/workspace/Lucene-Solr-6.x-Linux/lucene/common-build.xml:1014: There were test
failures: 15 suites, 118 tests, 4 errors, 3 ignored (3 assumptions) [seed: 5289A66A157C81BF]

Total time: 21 minutes 53 seconds
Build step 'Invoke Ant' marked build as failure
Archiving artifacts
[WARNINGS] Skipping publisher since build result is FAILURE
Recording test results
Email was triggered for: Failure - Any
Sending email for trigger: Failure - Any



Mime
View raw message